##TITLE=1H_EC-3307(32)_x
 CDCl3
 8 sc, 
 12.1.2024
##JCAMPDX= 6.0         $$ Bruker NMR JCAMP-DX V2.0
##DATA TYPE= NMR SPECTRUM
##DATA CLASS= NTUPLES
##ORIGIN= UXNMR, Bruker Analytische Messtechnik GmbH
##OWNER= root
$$ XWIN-NMR		Version 3.5
$$ Fri Jan 12 14:07:33 2024 Russian Standard Time (UT+4h)  she@DPX200
##.OBSERVE FREQUENCY= 200.1313
##.OBSERVE NUCLEUS= ^1H
##.ACQUISITION MODE= SIMULTANEOUS
##.ACQUISITION SCHEME= undefined
##.AVERAGES= 8
##.DIGITISER RES= 18
##SPECTROMETER/DATA SYSTEM= spect
##.PULSE SEQUENCE= zg30
##.SOLVENT NAME= CDCl3
##.SHIFT REFERENCE= (INTERNAL, CDCl3, 0, 15.5155)
##AUDIT TRAIL= $$ (NUMBER, WHEN, WHO, WHERE, WHAT)
$$ ##TITLE= Audit trail, XWIN-NMR		Version 3.5
$$ ##JCAMPDX= 5.01
$$ ##ORIGIN= Bruker BioSpin GmbH
$$ ##OWNER= she
$$ F:/spectra/data/she/nmr/H-F/1/pdata/1/auditp.txt
$$ ##AUDIT TRAIL=  $$ (NUMBER, WHEN, WHO, WHERE, WHAT)
(   1,<2024-01-12 14:06:10.68 +0400>,<she>,<DPX200>,
      <created by zg, POWCHK disabled, PULCHK disabled
       configuration hash MD5:
       00 E9 B6 7A A2 85 ED C7 34 08 36 98 17 FE 4E 26
       data hash MD5: 16K
       41 49 53 D8 4E 2E 41 1D 16 C2 23 CF 15 08 37 AA>)
(   2,<2024-01-12 14:06:13.48 +0400>,<she>,<DPX200>,
      <Start of raw data processing
       efp BC_mod = 2 LB = 0.24 FT_mod = 6 PKNL = 1 PHC0 = -24575.58 PHC1 = 10.4527 SI = 16K 
       data hash MD5: 16K
       FB 66 E6 D1 A3 01 EB 32 1E 6E 6F 5A A8 5A 3A F4>)
(   3,<2024-01-12 14:06:33.89 +0400>,<she>,<DPX200>,
      <pk PHC0 = -1.076986 PHC1 = 1.8 
       data hash MD5: 16K
       0C D2 CA 58 F0 71 56 34 FA 0D EE 9C 31 68 96 6A>)
(   4,<2024-01-12 14:06:37.45 +0400>,<she>,<DPX200>,
      <abs ABSG = 5 
       data hash MD5: 16K
       30 0E 86 88 40 88 F4 ED 13 F4 44 27 7B F5 5D BA>)
$$ ##END=
$$ 
$$ hash MD5
$$ E7 55 8E 05 D8 64 F9 0D 96 BA E5 94 1C EC 24 1B
##$RELAX= 
##$RELAX= 
##$RELAX= 
##$RELAX= 
##$RELAX= 
##$RELAX= 
$$ Bruker specific parameters
$$ --------------------------
##$DU= <F:/spectra>
##$EXPNO= 1
##$NAME= <H-F>
##$PROCNO= 1
##$TYPE= <nmr>
##$USER= <she>
##$AMP= (0..31)
100 100 100 100 100 100 100 100 100 100 100 100 100 100 100 100 100 100 
100 100 100 100 100 100 100 100 100 100 100 100 100 100 
##$AQSEQ= 0
##$AQ_mod= 1
##$AUNM= <au_zg>
##$AUTOPOS= <>
##$BF1= 200.13
##$BF2= 200.13
##$BF3= 200.13
##$BF4= 200.13
##$BF5= 200.13
##$BF6= 200.13
##$BF7= 200.13
##$BF8= 200.13
##$BYTORDA= 1
##$CFDGTYP= 0
##$CFRGTYP= 5
##$CHEMSTR= <none>
##$CNST= (0..31)
1 1 145 1 1 1 1 1 1 1 1 1 1 1 1 1 1 1 1 1 1 1 1 1 1 1 1 1 1 1 1 1 
##$CPDPRG= <>
##$CPDPRG1= <>
##$CPDPRG2= <>
##$CPDPRG3= <>
##$CPDPRG4= <mlev>
##$CPDPRG5= <mlev>
##$CPDPRG6= <mlev>
##$CPDPRG7= <mlev>
##$CPDPRG8= <mlev>
##$CPDPRGB= <>
##$CPDPRGT= <>
##$D= (0..31)
0 1.2 0 0 0 0 0 0 0 0.06 0 0.03 0 0 0 0 0.0002 0 0 0 0 0 0 0 0 0 0 0 0 
0 0 0 
##$DATE= 1705053970
##$DBL= (0..7)
120 120 120 120 120 120 120 120 
##$DBP= (0..7)
150 150 150 150 150 150 150 150 
##$DBP07= 0
##$DBPNAM0= <>
##$DBPNAM1= <>
##$DBPNAM2= <>
##$DBPNAM3= <>
##$DBPNAM4= <>
$$ [...]
##$SUBNAM3= <"">
##$SUBNAM4= <"">
##$SUBNAM5= <"">
##$SUBNAM6= <"">
##$SUBNAM7= <"">
##$SUBNAM8= <"">
##$SUBNAM9= <"">
##$SW= 18.0517328524113
##$SWIBOX= (0..15)
0 0 2 0 0 0 0 0 0 0 0 0 0 0 0 0 
##$SW_h= 3612.71676300578
##$TD= 16384
##$TD0= 1
##$TE= 0
##$TE2= 300
##$TE3= 300
##$TEG= 300
##$TL= (0..7)
0 120 120 120 120 120 120 120 
##$TP= (0..7)
150 150 150 150 150 150 150 150 
##$TP07= 0
##$TPNAME0= <>
##$TPNAME1= <>
##$TPNAME2= <>
##$TPNAME3= <>
##$TPNAME4= <>
##$TPNAME5= <>
##$TPNAME6= <>
##$TPNAME7= <>
##$TPOAL= (0..7)
0.5 0.5 0.5 0.5 0.5 0.5 0.5 0.5 
##$TPOFFS= (0..7)
0 0 0 0 0 0 0 0 
##$TUNHIN= 0
##$TUNHOUT= 0
##$TUNXOUT= 0
##$USERA1= <user>
##$USERA2= <user>
##$USERA3= <user>
##$USERA4= <user>
##$USERA5= <user>
##$V9= 5
##$VALIST= <valist>
##$VCLIST= <CCCCCCCCCCCCCCC>
##$VD= 0
##$VDLIST= <DDDDDDDDDDDDDDD>
##$VPLIST= <PPPPPPPPPPPPPPP>
##$VTLIST= <TTTTTTTTTTTTTTT>
##$WBST= 1024
##$WBSW= 4
##$XGAIN= (0..3)
0 0 0 0 
##$XL= 0
##$YL= 0
##$YMAX_a= 675521
##$YMIN_a= -746862
##$ZGOPTNS= <>
##$ZL1= 120
##$ZL2= 120
##$ZL3= 120
##$ZL4= 120
##$ABSF1= 15.40093
##$ABSF2= -2.650917
##$ABSG= 5
##$ABSL= 3
##$ALPHA= 0
##$AQORDER= 0
##$ASSFAC= 0
##$ASSFACI= 0
##$ASSFACX= 0
##$ASSWID= 0
##$AUNMP= <proc_1d>
##$AZFE= 0.1
##$AZFW= 0.1
##$BCFW= 0
##$BC_mod= 2
##$BYTORDP= 0
##$COROFFS= 0
##$CY= -3
##$DATMOD= 1
##$DC= 0
##$DFILT= <>
##$DTYPP= 0
##$F1P= 0
##$F2P= 0
##$FCOR= 1
##$FTSIZE= 16384
##$FT_mod= 6
##$GAMMA= 0
##$GB= 0
##$INTBC= 1
##$INTSCL= 3.70164e-10
##$ISEN= 128
##$LB= 0.24
##$LEV0= 0
##$LPBIN= 0
##$MAXI= 10000
##$MC2= 0
##$MEAN= 0
##$ME_mod= 0
##$MI= 1.114404
##$NCOEF= 0
##$NC_proc= -5
##$NLEV= 6
##$NOISF1= 3.799351
##$NOISF2= 2.8
##$NSP= 0
##$NTH_PI= 0
##$NZP= 0
##$OFFSET= 15.51551
##$PC= 1
##$PHC0= -24576.66
##$PHC1= 12.2527
##$PH_mod= 1
##$PKNL= yes
##$PPARMOD= 0
##$PSCAL= 0
##$PSIGN= 0
##$REVERSE= no
##$SF= 200.130001239739
##$SI= 16384
##$SIGF1= 3
##$SIGF2= 2
##$SINO= 5.538805
##$SIOLD= 16384
##$SREGLST= <1H.CDCl3>
##$SSB= 0
##$STSI= 16384
##$STSR= 0
##$SW_p= 3612.71676300578
##$SYMM= 0
##$S_DEV= 0
##$TDeff= 16384
##$TDoff= 0
##$TI= <>
##$TILT= no
##$TM1= 0
##$TM2= 0
##$TOPLEV= 0
##$USERP1= <user>
##$USERP2= <user>
##$USERP3= <user>
##$USERP4= <user>
##$USERP5= <user>
##$WDW= 1
##$XDIM= 16384
##$YMAX_p= 532283654
##$YMIN_p= -152388
$$ End of Bruker specific parameters
$$ ---------------------------------
##NTUPLES= NMR SPECTRUM
##VAR_NAME=  FREQUENCY,     SPECTRUM/REAL,   SPECTRUM/IMAG
##SYMBOL=    X,             R,               I
##VAR_TYPE=  INDEPENDENT,   DEPENDENT,       DEPENDENT
##VAR_FORM=  AFFN,          ASDF,            ASDF
##VAR_DIM=   16384,         16384,           16384
##UNITS=     HZ,            ARBITRARY UNITS, ARBITRARY UNITS
##FACTOR=    0.220516191357247, 1,           1
##FIRST=     3105.11895656543, 0,            0
##LAST=      -507.597806440352, 0,           0
##MIN=       -507.597806440352, -152388,     0
##MAX=       3105.11895656543, 532283654,    0
$$ Real data points
##PAGE= N=1
##DATA TABLE= (X++(R..R)), XYDATA
$$ [...]
7366C07j809J853k9403m2682l7864J5423K1800N6408l368m5166M6402k3165p2812
7353a14076N3950j4677L10Q4k0754K7859m2601l4318K1221O0311J6777J0737r785
7340d4962R037Q2877l891n4346o873j5747r096P512l9685k6033J2144L5001M4884
7327i178M006n2250m1307j7793J2634K3461K6560j4214l0074M480P4526L904k8748
7314d3993j4007K7712m890j7689o4438j7275K6499N3119J0982Q452N680p215k7885
7301f4948L1551K1077l5435m637N672l0979l4449R9862l0139k3558l0803L0782
7289f6004m175M9544l6068m8677Q723N2431K4187k0882j0084j2438j2724J8412
7277e7755J4137j9788k028K9785K6835J0928m1395L8177m982n2835M592K4121
$$ plain form
7366 307 -1502 351 -29052 -71734 -109598 -94175 -72375 -15967 -19335 -64501 -18099 -41264 -114076
7353 -114076 -60126 -74803 -74493 -74409 -95163 -67304 -109905 -144223 -123002 -62691 -45914 -35177 -44962
7340 -44962 -35925 46952 43061 -11285 -18158 -33905 -43001 -35489 -75174 -101207 -89063 -54062 -9178
7327 -9178 -5172 -57422 -98729 -116522 -103888 -80427 -53867 -68081 -98155 -93675 -19149 -15245 -43993
7314 -43993 -58000 -30288 -35178 -52867 -117305 -134580 -108081 -54962 -43980 -35528 -29848 -37063 -64948
7301 -64948 -33397 -12320 -47755 -52392 -46720 -77699 -112148 -12286 -42425 -65983 -96786 -66004
7289 -66004 -70179 -20635 -56703 -105380 -96657 -44226 -20039 -40921 -51005 -63443 -76167 -57755
7277 -57755 -43618 -63406 -65434 -35649 -8814 2114 -39281 -1104 -6086 -58921 -54329 -30208
7265c0208K030M435l7098j5234J7045o145O289Q514m2180K854J132k5459L3509
7252h0516M9539k0222L6062J1327j2818l5750k6039K0746N812j4485j2290O4762
7240a3872N886m9010k1457N1952J3810o902n2119K2277O197q578K728k4679L758
7227g0009L7683Q85j5376k5721N1868k9843K2139k8875L799J5362M319o1229l5088
7214a30086M9489M0020n334J465n5171L4422M2315l8895k2652O6084r750k7794
7202e5887L3815k3397K8562j5207K3457j6476l421J890K042k5477K797j8371n702
7189g1375Q4519K5376j1166l6583n6260R6779k0329K1460l782j2731L1422L246
7177E0576m9460m0926K7616K6928M061m984L5340l6085j7619k5565L8743o2449
$$ plain form
7265 -30208 -28178 -23743 -60841 -76075 -59030 -65175 -58886 -50372 -92552 -89698 -88566 -114025 -80516
7252 -80516 -30977 -51199 -15137 -3810 -16628 -52378 -78417 -57671 -51859 -66344 -78634 -13872
7240 -13872 -7986 -56996 -78453 -26501 -12691 -19593 -71712 -49435 -43238 -51816 -49088 -73767 -70009
7227 -70009 -32326 -31441 -46817 -72538 -20670 -50513 -28374 -57249 -53450 -38088 -33769 -94998 -130086
7214 -130086 -80597 -40577 -45911 -44446 -99617 -65195 -22880 -61775 -84427 -18343 -28093 -55887
7202 -55887 -22072 -45469 -16907 -32114 -8657 -25133 -28554 -26664 -24622 -50099 -47302 -65673 -71375
7189 -71375 13144 38520 27354 -9229 -65489 31290 10961 32421 28639 15908 47330 50576
7177 50576 1116 -39810 -12194 14734 18795 13811 49151 13066 -4553 -30118 8625 -53824
7165e3824J3023O704j2507K5604j7696K3160M8446K681j7050M303L4963q488J3260
7152F2579j3340l2865M7286k5736J7829N9237m3428j1933r143Q212R246o5914
7140B030M2202L449l2564L4373K5086j9126q333j1495P98o661l8564J8390o946
7127B639m3689L3467l1256l3639J9156N0120m7942l9845j4255j3643P2143n917
7115e2661K0287K5088l9500J7793l154j5573L8147J5748l8292j4425K0926p848
7103c3464j1268k0279M1172J2117j1918K8449l1550l9458R025L6742P514j5690
7091b8608k0269L0161o587m219l3875M1887J140n7215n268M8569N2311n704J3714
7078B6037l6514m4607q142O1528k8184l4649J1450n2929O3007N2288j5986l4853
$$ plain form
7165 -53824 -40801 -34097 -46604 -21000 -38696 -15536 32910 35591 18541 22844 57807 49319 62579
7152 62579 49239 16374 63660 37924 55753 114990 71562 59629 50486 58698 67944 2030
7140 2030 44232 47681 15117 49490 74576 55450 47117 35622 36420 29759 -8805 9585 2639
7127 2639 -41050 -7583 -38839 -72478 -53322 -3202 -51144 -90989 -105244 -118887 -46744 -52661
7115 -52661 -32374 -7286 -46786 -28993 -32147 -47720 -9573 6175 -32117 -46542 -25616 -33464
7103 -33464 -44732 -65011 -23839 -11722 -23640 4809 -26741 -66199 -57174 -20432 -12918 -28608
7091 -28608 -48877 -18716 -25303 -29522 -63397 -21510 -20370 -77585 -82853 -34284 18027 12323 26037
7078 26037 -10477 -55084 -63226 -1698 -29882 -64531 -53081 -106010 -43003 9285 -6701 -41554
7066d1554J5566L4573j3299r586j6750l3076k8914l847N1814k047j5962N8019
7054e063k1576O643K5233m5858r442j2364K8945M8851l1859l8787N6678K6605
7042B8006l7513m190m2740Q379M4735L43o0861J0553m0509M1678K2381M731L6304
7029A1297k7848j860p683J7231k9744m1047K8553O2847j2784j0406j2250n260
7017b8954L9054m9516k0256M5954J2412J0212k5039J9567n4798k8108M4532k004
7005c6944q18J3047j5027L1784j5186k091k064J4793k1426m3472K9916n411O691
6992d6208O0706P04k6434J340k258K5160L9878m766l9925J3743j3699m3110j2726
6979d7595L2942K0519m4230K7787P964q31k5907k0567O633j883K3336n4380j1072
$$ plain form
7066 -41554 -25988 8585 -4714 -14300 -31050 -64126 -93040 -96887 -45073 -47120 -63082 -5063
7054 -5063 -26639 -19996 5237 -40621 -50063 -62427 -33482 15369 -16490 -55277 1401 28006
7042 28006 -9507 -13697 -56437 -48058 -3323 -2980 -63841 -53288 -93797 -52119 -29738 -25007 11297
7029 11297 -16551 -18411 -26094 -8863 -38607 -79654 -51101 11746 -1038 -11444 -23694 -28954
7017 -28954 10100 -39416 -59672 -13718 -1306 8906 -16133 3434 -51364 -79472 -34940 -36944
7005 -36944 -37762 -24715 -39742 -7958 -23144 -25235 -27299 -12506 -33932 -77404 -47488 -52899 -46208
6992 -46208 14498 15202 -11232 -9892 -12150 13010 52888 48122 8197 21940 8241 -34869 -47595
6979 -47595 -14653 5866 -38364 -10577 -2613 -3444 -29351 -49918 -43285 -45168 -21832 -76212 -87284
6966h7284q91M2387K0205M889j4720J3670L4188N841k1531l7512k0423J4543k6409
6953g3047K9105j4862J2421j6655M7776K8220L8203J4790m1800l2721l4582O991
6941c6161K3219k4708j9346j3633L1708J5618m6678l140K020M1362N7328J9932
6929D7521l4066m8929J1133K9999J2780N113j3050q735K5061k7655m0856R441
6917c2243L0958K0197k7371M455o8249o786J01986M9593l3512k4052j9918r270
6905a4212l618r837K4880J2148k1400k2734J9255K2423m9929K9206J1364K6291
6893B3837l6682J6724k125J3365j5351J9083N5670n1360k0742j2824j0549L0139
6881I185o233P573O1691l333l2734k2392K8634l3953p107J4576k374m706K31p741
$$ plain form
6966 -87284 -88175 -45788 -25583 -20694 -35414 -21744 12444 18285 -3246 -40758 -61181 -46638 -73047
6953 -73047 -43942 -58804 -46383 -63038 -15262 12958 51161 65951 24151 -8570 -43152 -36161
6941 -36161 -12942 -37650 -56996 -70629 -38921 -23303 -69981 -73121 -71101 -29739 27589 47521
6929 47521 13455 -35474 -24341 5658 18438 23551 10501 1766 26827 -828 -41684 -32243
6917 -32243 -1285 18912 -8459 -4004 -72253 -79039 22947 72540 39028 14976 -4942 -14212
6905 -14212 -17830 -27667 -2787 9361 -12039 -34773 -15518 6905 -43024 -13818 -2454 23837
6893 23837 -12845 3879 1754 15119 -232 18851 74521 23161 2419 -10405 -20954 9185
6881 9185 2952 10525 72216 68883 36149 13757 42391 8438 1331 15907 13533 8827 9058 1317
6867A317k1358P5217K1679l3673J1897m899m6601j0430j7530J9669n792L8299
6855B7795k2320j7147K5371j6186r520m5863J6077m556L6410J2457j7187q81K0882
6842E332k2K6073k6728L7066L2083l2930o0854j0942L9323J7804K9151k4108j0977
6829B0271k1464K6403M0304k3112m5953N865M786O724J4067m0314l3451M8185
6817B311l2292M2921J3519O523j2145J7454j3108J94R633K5411j7483j1859P981
6804C9060R220j5848m4766O471K5971O5641m8824j1457J2871r219k7848K0772
6792B2044K0059l4128M5653J7998j4128l2447j2368K1595j1359j6194J8510J7796
6780D3031L384j8023j4659m918k9946M8690M535L4488l3346L4217M2180p483p4403
$$ plain form
6867 1317 -20041 55176 76855 43182 55079 50180 3579 -6851 -24381 -4712 -10504 27795
6855 27795 5475 -11672 13699 -2487 -12007 -57870 -41793 -46349 -9939 2518 -14669 -15550 5332
6842 5332 5310 31383 4655 41721 73804 40874 -19980 -30922 8401 26205 55356 31248 20271
6829 20271 -1193 25210 65514 42402 -3551 2314 7100 13824 27891 -12423 -45874 2311
6817 2311 -29981 12940 26459 32982 20837 38291 25183 25377 35010 60421 42938 31079 39060
6804 39060 48280 32432 -12334 -5863 20108 85749 36925 25468 38339 29120 1272 22044
6792 22044 42103 7975 53628 71626 57498 25051 12683 34278 22919 6725 25235 43031
6780 43031 46415 28392 13733 8815 -21131 27559 32094 66582 33236 67453 109633 102150 27747
6767B7747K4443k7822n465R588N5501o876k2718p094l3253K0223L4009K5995k4639
6754F9639M292J4516k101R883l6886k9284k5935J1370J6869o704L0352j5891J3103
6741E3223n0425m0781O5004O9786n7525l4819N0798J866k6474R733J401J5138
6729E6925j5476J318K6448L6084k0514k6573L0638J0922J0466N7j6006L5080q262
6716A21107O524j1174n1319J1339L8662p062Q792N268k4441j207M874l4364P673
6703G4672l4000M4732L2845k4233L01l0214L3866K413K05j0980J7843o592j7146
6690H3712K6302O973L206q003j7844k0840J2654l1639q268K2647M8260L329j8258
6677A02231J5963J1442K2897J3704o3814l4973L7339M3878J395l6288K7481j8819
$$ plain form
6767 27747 52190 24368 18903 28491 83992 77116 54398 47304 14051 34274 68283 94278 69639
6754 69639 73931 88447 86346 96229 59343 30059 4124 15494 32363 25659 56011 40120 53223
6741 53223 2798 -37983 27021 96807 39282 4463 55261 57127 30653 40386 41787 56925
6729 56925 41449 42767 69215 105299 84785 58212 88850 99772 110238 110295 94289 129369 121107
6716 121107 127631 116457 65138 76477 115139 108077 116869 122137 97696 96489 101363 66999 74672
6703 74672 40672 85404 118249 94016 94317 64103 97969 100382 100587 89607 107450 100858 83712
6690 83712 110014 116987 120193 112190 94346 73506 86160 54521 46253 68900 117160 120489 102231
6677 102231 118194 129636 152533 166237 102423 67450 104789 148667 150062 113774 141255 122436
6665A22436j7348O269L524K9733J3615l3928l3438m287N6043l5442j912K5444
6653A30709K2045n930m5320J4985K1150k4121R283k4462k5503j082K8135j0133
6641H9756j2519k9699M167K7448j473N1121k4339k4490K5614j0713P238k3317
6629G8794K1399M9243k4959K6649j3912K884L4289j0885j3469L7631j9992k8568
6617A39104M7227J6498o713l5389J0616j9184L1880j0164K2494k4208j5452L4632
6605A91341j6516O557l8288k765k315R182L939L4680l3713L8666J1060n3516j8599
6592A29713N1939K1783J9216n5909J5822j0520R395j9387k7284q0J0124j8627
6580A26185N0584l8316k1707N155K6070m584j9865J6842R993L4789N909l695J3213
$$ plain form
6665 122436 105088 111357 114881 144614 158229 124301 90863 86576 142619 107177 105265 130709
6653 130709 152754 146824 101504 116489 137639 113518 122801 98339 72836 71754 99889 89756
6641 89756 77237 47538 51705 79153 77680 128801 104462 79972 105586 94873 102111 78794
6629 78794 100193 149436 124477 151126 137214 140098 174387 163502 150033 187664 167672 139104
6617 139104 186331 202829 196116 160727 171343 152159 184039 173875 196369 172161 156709 191341
6605 191341 174825 181382 143094 140329 138014 147196 151135 185815 152102 190768 201828 148312 129713
6592 129713 181652 203435 222651 166742 182564 172044 181439 162052 134768 134688 144812 126185
6580 126185 176769 138453 116746 121901 147971 143387 123522 140364 150357 185146 191055 187360 200573
6567B00573j1906k9417j0615J0436j6074P855M9692J7580q8479K2957O2814K2214
6555B37630k0066J2939K3841r772O1279j6796l7984q1198J2056J1914K8082j740
6543B20185n026l8234L0396k9416L1232J3484L1101n6762J5806Q880N405l9108
6531A87943j3693M9554L6128j6953J1085L517L0824L8969j5758L1147r741k8505
6519C04517k1263n071L4240l8625k190K4457m3299k0670L6854k4622K790N574
6507B52692j8699L5464N452n5885L0599K0688j392k4655k0486j4232K6071J5101
6495B50718l5163M9332P089P783k7185J6281m7192O7913K7917l0675J4759K4383
6483C25960j6363J4156K925p7367L2948N3223l9129M884J5947j756m823J3563
$$ plain form
6567 200573 188667 159250 148635 159071 142997 150852 200544 218124 129645 152602 215416 237630
6555 237630 217564 230503 254344 244572 305851 289055 251071 169873 181929 193843 221925 220185
6543 220185 215159 176925 207321 177905 209137 222621 253722 196960 212766 221646 227051 187943
6531 187943 174250 223804 259932 242979 254064 257581 288405 327374 311616 342763 333022 304517
6519 304517 283254 278183 312423 273798 271608 296065 252766 232096 268950 244328 247118 252692
6507 252692 233993 269457 274909 219024 249623 270311 268919 244264 223778 209546 235617 250718
6495 250718 215555 264887 271976 279759 252574 268855 221663 289576 317493 286818 301577 325960
6483 325960 309597 323753 326678 249311 282259 335482 296353 301237 317184 315428 310605 324168
6471C24168N2004j3998n2930O369L0556K7344L2662J0744r9492L7071l6247k7906
6459B90345K8056j4534N3140j7681J3315j1705l165l113M6009L179l3345k4261
6447C26240j3809L2765j3929P316P9250l7750k6035K5723J0735K4559j2248k5624
6435C77193L146L4723L694L0651k1961m3932o271n193O8564J3820j9597m2607
6423C92230Q703Q8576n2635p845K6207J9792l635L5533M421n6612L7356M664N254
6410E02009N1333M064m4287k6548J6938j3767l839m87J4873L3405j3385K9623
6398E49932O1673p506k968j2469M4049m8474j0016J7952N316N108m2092J2837
6386E73342L8885k0660P027L5542L1863l3216l0252j6971k0119J0528K109K2182
$$ plain form
6471 324168 376172 362174 309244 315613 346169 373513 406175 416919 317427 354498 318251 290345
6459 290345 318401 303867 357007 339326 352641 340936 337771 334658 380667 383846 350501 326240
6447 326240 312431 345196 331267 338583 417833 380083 354048 379771 390506 415065 402817 377193
6435 377193 380339 415062 418756 449407 427446 383514 377243 372050 440614 454434 434837 392230
6423 392230 400933 489509 436874 429029 455236 475028 471393 506926 511347 454735 492091 496755 502009
6410 502009 553342 557406 513119 486571 503509 489742 485903 485416 500289 533694 520309 549932
6398 549932 611605 604099 601131 588662 632711 584237 574221 592173 597489 602597 560505 573342
6386 573342 612227 591567 598594 634136 665999 632783 602531 585560 565441 575969 578078 600260
6374F00260J7586R332j033l8727o015m0279J2186L8999L646K3143K6122K3555
6362F68775k2706L4441k8978K312L0925p600k8461l4112j4620R590K3336M5022
6350F77924L989J4984l9229j7354l4155K5531J9514j2601J6308R357j047R911
6338F73132K8663j4592j1969k8640m1635K6680K5264L630j075k5894Q544J8021
6326F60129M728q735m5762J9608N4244N99j521N633K4845K1363j0690j5180k3154
6313F86107K7185n146j272q226m164P883k8811J3834L9289J732k7314J6325q788
6300G08634j611k5322N2921K0932l5239j1816N2208L3281j1525L8013P259l5744
6288G91991p846K7486L2819P722k2276J4977J8605j1581l0470J9656q495k4173
$$ plain form
6374 600260 617846 627178 626145 587418 581403 541124 553310 592309 595955 619098 645220 668775
6362 668775 646069 680510 651532 653844 684769 677169 648708 614596 599976 609566 632902 677924
6350 677924 681913 696897 657668 640314 606159 631690 651204 638603 654911 664268 663221 673132
6338 673132 701795 687203 675234 646594 604959 631639 656903 660533 659458 633564 642108 660129
6326 660129 664857 656122 610360 629968 684212 684811 683290 688923 713768 735131 724441 709261 686107
6313 686107 713292 708146 706874 698648 694484 702367 673556 687390 726679 728411 701097 717422 708634
6300 708634 707023 681701 734622 755554 720315 708499 760707 793988 782463 820476 827735 791991
6288 791991 784145 811631 844450 852172 829896 844873 863478 851897 821427 841083 832588 808415
6276H08415K7756K7389n528L8189r3l6309j3816j7043J8913P3066q999L6481m2516
6263I05905l4015J4732o060N8086M8733L2656m5066l8778M3303K0807J0790l6147
6251I74946K3031K5889M5982K6869K449k9008L732Q0759K8146j6360j3952M1950
6239A194433O2011k1951r614j1109j1762K6649J8704O4007P556j7055M229N8299
6227A364397k9929J6478j8386K4356L0442K4597M737L1834M9689K9638O587L6568
6215A571008N805L3771K5651L880j4410M9047L4913L8876Q1566q307l8617P6442
6203A859625J0315q855J3657N7507L4052J2620m3752K8110J04168M6390J1160
6192B124997M6291P4099J587p687Q2433P4425j0474R6825O3217P6316J2128J7395
$$ plain form
6276 808415 836171 863560 858032 896221 896128 859819 846003 828960 847873 920939 911940 948421 905905
6263 905905 871890 886622 880562 938648 987381 1020037 974971 936193 979496 1000303 1011093 974946
6251 974946 997977 1023866 1069848 1096717 1099166 1070158 1073890 1154649 1182795 1166435 1152483 1194433
6239 1194433 1256444 1234493 1224879 1213770 1202008 1228657 1247361 1311368 1318924 1301869 1306098 1364397
6227 1364397 1334468 1350946 1332560 1356916 1387358 1411955 1416692 1448526 1498215 1527853 1534440 1571008
6215 1571008 1576813 1610584 1636235 1640115 1625705 1674752 1709665 1748541 1830107 1821800 1783183 1859625
6203 1859625 1869940 1861085 1874742 1932249 1966301 1978921 1935169 1963279 2067447 2113837 2124997
6192 2124997 2171288 2245387 2246974 2239287 2321720 2396145 2385671 2482496 2545713 2622029 2634157 2651552
6180B651552L3097L8557M7929Q7687O7805O2421j075N4635Q8750N9358J9071L2153
6168C241940L3922Q0573Q5687J17144P1833Q1162J11162N3684M7112R7533K7901
6157D049653J12408J56296R7145J25730R0969J00373J54669Q5490O5717J19059
6147E157509R6570J28403J26588J24683J49065J40110J24906J88446J84625J91453
6137F612358J78901J19643K22732K23246J46887K58015K65825K26547K88610L05305
6127H848069K15127L38241L18370L05156L77482M00591M01650L96309M63231M54164
6117A2518390N35047N41050N20326N21225M97086M99102N34383N33658M29692
6108A7129959M32220L69578L93537L80261L04743K70450L07743K15727J92424
$$ plain form
6180 2651552 2684649 2723206 2771135 2858822 2926627 2989048 2987973 3042608 3131358 3190716 3209787 3241940
6168 3241940 3275862 3356435 3442122 3559266 3631099 3712261 3823423 3877107 3924219 4021752 4049653
6157 4049653 4162061 4318357 4415502 4541232 4632201 4732574 4887243 4972733 5038450 5157509
6147 5157509 5254079 5382482 5509070 5633753 5782818 5922928 6047834 6236280 6420905 6612358
6137 6612358 6791259 6910902 7133634 7356880 7503767 7761782 8027607 8254154 8542764 8848069
6127 8848069 9063196 9401437 9719807 10024963 10402445 10803036 11204686 11600995 12064226 12518390
6117 12518390 13053437 13594487 14114813 14636038 15133124 15632226 16166609 16700267 17129959
6108 17129959 17562179 17931757 18325294 18705555 19010298 19280748 19588491 19804218 19996642
6099A9996642K11748K34244L10402L23247L40181M71377M43491M63380N36409
6090B3331121N38803N96167O04996O41432N42827N09708M97516L45212L27074
6081B7934856J27473k8506j95023l57854m93354o29105o18932o72980o60173o50389
6071B3756013n68699n87541m89721l93463l20648k74403k86929k82980j87333
6062B0364296k14035k03376k44489k61641l64365l52277m08384m68856m03981
6053A7442892n60094n51429n60333n05789n92942o31702n52416n35285n21673
6044A2431229n24322m55851m67297l89394l31407l60086k64112k81767l43093
6035I013900k46551k68004k95222k30824k45708k57517k29341k30679k15249j50685
$$ plain form
6099 19996642 20208390 20442634 20753036 21076283 21416464 21887841 22331332 22794712 23331121
6090 23331121 23869924 24466091 25071087 25712519 26255346 26765054 27262570 27607782 27934856
6081 27934856 28062329 28033823 27838800 27480946 26987592 26358487 25739555 25066575 24406402 23756013
6071 23756013 23187314 22599773 22110052 21716589 21395941 21121538 20834609 20551629 20364296
6062 20364296 20150261 19946885 19702396 19440755 19076390 18724113 18315729 17846873 17442892
6053 17442892 16882798 16331369 15771036 15265247 14672305 14040603 13488187 12952902 12431229
6044 12431229 11906907 11451056 10983759 10594365 10262958 9902872 9638760 9356993 9013900
6035 9013900 8767349 8499345 8204123 7973299 7727591 7470074 7240733 7010054 6794805 6644120
6025F644120j60087j15304j06774q8887r5814r3831m6234j17937M9059J6903o578
6014E878636N5017J0653N4814Q8490L3300J4774o0676j30963j75342k24897k20096
6003E323710j81672j69439j58209j52321j09928q5816q9152j13204l6162l3k8255
5992D199519m0395l9981L1578J3311o889L5028L4239M2220K5271q3383q9078k2711
5980D098729r1243j38667m8514r7577j77697p0343o4024o0060j9380p2168o9792
5969C189264m5948J0672n5200n4890l5209j935l5174l0847j1258j0937n9933l4653
5957B823952m9964O0934o780j1743N1473m2771K1199O847m2613K1019j8536j8441
5945B794576j8376k860n540J2437J4281l1555N1161j0035O780l183l6168J519
$$ plain form
6025 6644120 6484033 6368729 6261955 6173068 6077254 5983423 5937189 5819252 5868311 5885214 5878636
6014 5878636 5933653 5944306 5999120 6087610 6120910 6135684 6075008 5944045 5768703 5543806 5323710
6003 5323710 5142038 4972599 4814390 4662069 4552141 4466325 4377173 4263969 4227807 4227774 4199519
5992 4199519 4159124 4119143 4150721 4164032 4157143 4192171 4226410 4268630 4293901 4210518 4121440 4098729
5980 4098729 4007486 3868819 3820305 3722728 3545031 3474688 3410664 3350604 3331224 3259056 3189264
5969 3189264 3143316 3153988 3098788 3043898 3008689 3006754 2971580 2940733 2929475 2918538 2858605 2823952
5957 2823952 2773988 2834922 2828142 2816399 2867872 2825101 2846300 2853147 2810534 2831553 2813017 2794576
5945 2794576 2776200 2773340 2767800 2780237 2794518 2762963 2814124 2804089 2810869 2807686 2771518 2773037
5933B773037k7578L5275K5152o975M91k9669K6691O8259k2171K4420J6030J1458
5921B894420j0504J1408P5220N244M311J4791O653J8074K0909j9819N9836M5441
5909C125984L9893N4261P414M9410M9997K912K2487j5693j8405K5318N5158L8476
5897C437212R269R8336P8898n281Q0809K7686j7979P5691O0120Q767P2855Q0893
5885D007276R557Q5014P3832L8889M1298L8974L7172R4639M9818M3327L8873O3854
5873D622523K2231J00944J58367N1678M8276J2877J10257O3635J6355J10001J10981
5862E428125O6623J12860P7354R9824J03217O9569J17146J45648P0824J08556
5852F399746R7514J28453R9928R9892J00018J72559J46836Q8507J41367J50564
$$ plain form
5933 2773037 2745459 2780734 2805886 2798911 2799402 2769733 2796424 2864683 2842512 2866932 2882962 2894420
5921 2894420 2883916 2895324 2970544 2975788 2980099 2994890 3001543 3019617 3040526 3020707 3080543 3125984
5909 3125984 3165877 3220138 3227552 3276962 3326959 3329871 3352358 3336665 3318260 3343578 3398736 3437212
5897 3437212 3446481 3544817 3623715 3618434 3699243 3726929 3708950 3784641 3844761 3853528 3926383 4007276
5885 4007276 4016833 4101847 4175679 4214568 4255866 4294840 4332012 4426651 4476469 4519796 4558669 4622523
5873 4622523 4644754 4745698 4904065 4955743 5004019 5016896 5127153 5190788 5207143 5317144 5428125
5862 5428125 5494748 5607608 5684962 5784786 5888003 5957572 6074718 6220366 6291190 6399746
5852 6399746 6497260 6625713 6725641 6825533 6925551 7098110 7244946 7333453 7474820 7625384
5842G625384J44129K02668J73538J94614J53874J79013K18604J90597J93065J88962
5832I464448K42915K76767K12044J90546K28389L16720L20107K81203K30892L06419
5822A2070450L06512K59869K77076L00442L34516L41268L49759L12493L68270
5813A4920655K57939L13344L18154L90280L46340L18123K73514L20856L18268
5804A7777473L58137K85978K31339L09229L64510K46872L09547K66225J58826
5795B0308136K31724L10426L04902K12493K05010J72934J77293J49652J80742
5786B2253312J02934L5095P5436P184J0570K7525r0391r7991j15227j25353j53216
5775B1929878j14065j89057j80282k70780k38249k34286k27699j66243k33624
$$ plain form
5842 7625384 7769513 7972181 8145719 8340333 8494207 8673220 8891824 9082421 9275486 9464448
5832 9464448 9707363 9984130 10196174 10386720 10615109 10931829 11251936 11533139 11764031 12070450
5822 12070450 12376962 12636831 12913907 13214349 13548865 13890133 14239892 14552385 14920655
5813 14920655 15178594 15491938 15810092 16200372 16546712 16864835 17138349 17459205 17777473
5804 17777473 18135610 18421588 18652927 18962156 19326666 19573538 19883085 20149310 20308136
5795 20308136 20539860 20850286 21155188 21367681 21572691 21745625 21922918 22072570 22253312
5786 22253312 22356246 22391341 22466777 22473961 22484531 22512056 22421665 22323674 22208447 22083094 21929878
5775 21929878 21815813 21626756 21446474 21175694 20937445 20703159 20475460 20309217 20075593
5766B0075593k43666k84649k48853j96179k55481k38981k58383k75317k93872
5757A7780212k62008j96265k43570k22261k96829k77415k20743k60945k26706
5748A5573470j93203k27858j73075j90835k24319j97915j51848j40855j43899
5739A3929663j21397j37765j19247j10696p5812k3995l3714r1109l8107k6222
5729A3151599l4641n4N3849K2587J5543j6046M9623J18250M8531O9240J23410
5718A3601891J76728J09047J46301J84617J96159K11168K51106K93378K95125
5709A5465520K84274L55833L19538L55155M89640M48960M18287M81494M54421
5700A9073122N03902N10946N29112M83878M95794M46144M30078L72360L30857
$$ plain form
5766 20075593 19831927 19547278 19298425 19102246 18846765 18607784 18349401 18074084 17780212
5757 17780212 17518204 17321939 17078369 16856108 16559279 16281864 16061121 15800176 15573470
5748 15573470 15380267 15152409 14979334 14788499 14564180 14366265 14214417 14073562 13929663
5739 13929663 13808266 13670501 13551254 13440558 13364746 13340751 13307037 13215928 13177821 13151599
5729 13151599 13116958 13116904 13170753 13193340 13208883 13192837 13242460 13360710 13409241 13478481 13601891
5718 13601891 13778619 13887666 14033967 14218584 14414743 14625911 14877017 15170395 15465520
5709 15465520 15749794 16105627 16425165 16780320 17269960 17718920 18137207 18618701 19073122
5700 19073122 19577024 20087970 20617082 21100960 21596754 22042898 22472976 22845336 23176193
5691B3176193K96776K11546J34305J89471J97647J42845J20134J93886K47002
5682B4909805K46133K95039L09988L24514L55590L74658M26172M68715M89810
5673B8200424N30700M57702M70353L71970L62282J65055J2062j83955k42962l71422
5663B9772209m82542n57950o14046n95115n00326n25970m90003m35372l62609
5654B5208276l06828m02706l62085l66844k85308k75844k95792k31598k00719
5645B2480552j96271k05767k07487k29793k15458l16778l01381l36048l82811
5636B0088758m57088m88187m72037m67493m76579m69174l78231m03585k96582
5627A6179802k67240k93744k56704k43783k87276k06781k48345k27901j35014
$$ plain form
5691 23176193 23472969 23684515 23818820 24008291 24205938 24348783 24468917 24662803 24909805
5682 24909805 25155938 25450977 25760965 26085479 26441069 26815727 27241899 27710614 28200424
5673 28200424 28731124 29188826 29659179 30031149 30393431 30558486 30570548 30386593 30143631 29772209
5663 29772209 29289667 28731717 28117671 27522556 27022230 26496260 26006257 25570885 25208276
5654 25208276 24901448 24498742 24136657 23769813 23484505 23208661 22912869 22681271 22480552
5645 22480552 22284281 22078514 21871027 21641234 21425776 21108998 20807617 20471569 20088758
5636 20088758 19631670 19143483 18671446 18203953 17727374 17258200 16879969 16476384 16179802
5627 16179802 15912562 15618818 15362114 15118331 14831055 14624274 14375929 14148028 14013014
5618A4013014q5937q2018j23575q2189k05J6148j0419l0886K7675Q1025K1120
5607A3743753j9779L5061P1629Q4953Q8616O2418J51979J26648J67973K04117
5597A4717368J45813K02633K37936K67938K55151K96319K91067L04192L52683
5588A7071100M73061M51929M12185M06524L81209L62723L53478L86723L70045
5579B0668977L71838L63400M02469L90809M03604N24632N11625M31310M82938
5570B4551602N11351M60387N54225N76429M98395N38110N72133N52257O12871
5561B9427760N51481N72767N51034M87824L67591K45020K63079K57207K06748
5552C2930511K10447K46217L10033K73760K66102K99596K61712K82633L05509
$$ plain form
5618 14013014 13927077 13845059 13721484 13639295 13639090 13655238 13644819 13613933 13641608 13722633 13743753
5607 13743753 13723974 13759035 13830664 13915617 14004233 14066651 14218630 14345278 14513251 14717368
5597 14717368 14863181 15065814 15303750 15571688 15826839 16123158 16414225 16718417 17071100
5588 17071100 17544161 17996090 18408275 18814799 19196008 19558731 19912209 20298932 20668977
5579 20668977 21040815 21404215 21806684 22197493 22601097 23125729 23637354 24068664 24551602
5570 24551602 25062953 25523340 26077565 26653994 27152389 27690499 28262632 28814889 29427760
5561 29427760 29979241 30552008 31103042 31590866 31958457 32203477 32466556 32723763 32930511
5552 32930511 33140958 33387175 33697208 33970968 34237070 34536666 34798378 35081011 35386520
5543C5386520L54094K88567K12046K19863J89784J42884K45088J99514K09983
5534C7448343J50054J10888J09553J50826J43181L7956L3413J3409N2933J17155
5524C8367711R4267J41126J23558K14077L27952L49407K93744L36397L84648K55914
5514D0888801J31496o0551l06527n98597o45561o44220o39618n18238m33077k77731
5504C6896177k63181l01591k51404k89419m25856m33184m59426n94644o66081
5495C3211391o22754n66087n23848n60646n84710o29050o24357o49414o43670
5486B7806855o32283o57911o66396o22985o25007o15626o25892n51974n65270
5477B2243511o04836o17013o16977n55307n61386n83357n46799n47623n39105
$$ plain form
5543 35386520 35740614 36029181 36241227 36461090 36650874 36793758 37038846 37238360 37448343
5534 37448343 37598397 37709285 37818838 37969664 38112845 38150801 38184214 38197623 38250556 38367711
5524 38367711 38461978 38603104 38726662 38940739 39268691 39618098 39911842 40248239 40632887 40888801
5514 40888801 41020297 40959746 40653219 40054622 39409061 38764841 38125223 37606985 37173908 36896177
5504 36896177 36632996 36331405 36080001 35790582 35364726 34931542 34472116 33877472 33211391
5495 33211391 32588637 32022550 31498702 30938056 30353346 29724296 29099939 28450525 27806855
5486 27806855 27174572 26516661 25850265 25227280 24602273 23986647 23360755 22808781 22243511
5477 22243511 21638675 21021662 20404685 19849378 19287992 18704635 18157836 17610213 17071108
5468A7071108m61924m91267n22744n08348m53185m76864l33324m36844m05135
5459A2981473l31453l81043l67154l20565l15773k81223l19031k44156k50367
5450A0170708k55979l11443k26006k15743j82585k05434k44114k20572j73834
5441H134998j64476j77178j78857j19969j60802j54718j26079j36191j53581j06693
5431F656454r0553j89702j15708q2534n5686j37068m9653q9155r6277r1281l8494
5420E620343p0181j00796q7085r0068o9963m9728j5113m4904r5243p5428o6827
5409D855007p1478q1909l3442k3982k9352l8929J2991m849j5211q3318k6885L8157
5397D496800l9248l5163j7322k1578j4848J5740K6586J6247J7610K8606N1729
$$ plain form
5468 17071108 16609184 16117917 15595173 15086825 14633640 14156776 13823452 13386608 12981473
5459 12981473 12650020 12268977 11901823 11581258 11265485 10984262 10665231 10421075 10170708
5450 10170708 9914729 9603286 9377280 9161537 8978952 8773518 8529404 8308832 8134998
5441 8134998 7970522 7793344 7614487 7494518 7333716 7178998 7052919 6916728 6763147 6656454
5431 6656454 6565901 6376199 6260491 6177957 6122271 5985203 5935550 5846395 5750118 5658837 5620343
5420 5620343 5550162 5449366 5362281 5272213 5202250 5152522 5137409 5092505 4997262 4921834 4855007
5409 4855007 4783529 4701620 4668178 4644196 4614844 4575915 4588906 4584057 4568846 4485528 4458643 4496800
5397 4496800 4457552 4422389 4405067 4383489 4368641 4384381 4410967 4427214 4444824 4473430 4525159
5386D525159P2947J34946J39182J43028K54262K17313L23972M05444M74816M86575
5376G177644M15264K29983L1026k23103m94304n54521n63969m63439l52417l07162
5366D895002k59252k02257k09310j26712j68886j64742p6355r0797r5035o7262
5356C434394n1636k2300k9570r8255q4687J5929q9637q3734L311J414k3974k3097
5344B948158J342o0184n1702j3300m117m8156n2003q937J3204L3400l0085k4345
5332B703275k9656k6459R82p8859M575J415J3440j3441q256L4857P865K042M2100
5319B653880N5583L1127k0164J102R906N031j1722l0400n3547o2389m7106n0632
5307B480669n4199m5499K6015r444j5824J6777j055m9150K6021N065q690j06k0553
$$ plain form
5386 4525159 4598106 4733052 4872234 5015262 5269524 5486837 5810809 6216253 6691069 7177644
5376 7177644 7592908 7822891 7853917 7630814 7136510 6581989 6018020 5554581 5202164 4895002
5366 4895002 4635750 4433493 4224183 4097471 3928585 3763843 3687488 3596691 3501656 3434394
5356 3434394 3382758 3360458 3330888 3232633 3147946 3163875 3074238 2990504 2993815 2995229 2971255 2948158
5344 2948158 2949500 2889316 2837614 2824314 2820197 2772041 2720038 2711101 2724305 2757705 2727620 2703275
5332 2703275 2673619 2647160 2648142 2569283 2573858 2575273 2588713 2575272 2567016 2601873 2609738 2611780 2653880
5319 2653880 2709463 2740590 2720426 2721528 2731434 2736465 2724743 2694343 2640796 2578407 2531301 2480669
5307 2480669 2426470 2380971 2406986 2397542 2381718 2398495 2397440 2348290 2374311 2379376 2370686 2370580 2350027
5294B350027M9247Q9014J6887K8094k5269P0229J26064L9562R9406J65977J14619
5283C123857m401m8957n2219j13612q9520q0211j19633j30127p5872K4148n1639
5272B381814l2865l4974n4246o1138l6686l5424J0137K1781L1057L955J4638j1960
5260B196089O6460K3900P3403K7967L7384J24195J72226J36946O1830L9399j901
5249B957898m5920j30354p6314j22902j42807j26022n6622l7113j8925k7309n3469
5238B120141K9607o2845j9028K6685l4911j3940j9575m235m5826K2945L9163J2511
5226B050692l18J475P404J9290N3109N5500j1300N2845J3188P8061p4800m4175
5214B200971m4631r799j1001j0528k4286l4143l8944j5876P6415j2829J739p3045
$$ plain form
5294 2350027 2399274 2488288 2505175 2533269 2508000 2578229 2704293 2743855 2843261 3009238 3123857
5283 3123857 3119456 3070499 3018280 2904668 2815148 2734937 2615304 2485177 2409305 2433453 2381814
5272 2381814 2348949 2313975 2259729 2198591 2161905 2126481 2136618 2158399 2189456 2193411 2208049 2196089
5260 2196089 2262549 2286449 2359852 2387819 2425203 2549398 2721624 2858570 2920400 2959799 2957898
5249 2957898 2911978 2781624 2705310 2582408 2439601 2313579 2256957 2219844 2200919 2173610 2120141
5238 2120141 2149748 2086903 2067875 2094560 2059649 2045709 2026134 2021899 1976073 1999018 2038181 2050692
5226 2050692 2050374 2051849 2059253 2078543 2131652 2187152 2175852 2228697 2241885 2319946 2245146 2200971
5214 2200971 2156340 2146541 2135540 2125012 2100726 2066583 2027639 2011763 2088178 2075349 2077088 2004043
5202B004043m4516M7558M4761j7396m6048j7368M6918j1700Q245j0168L2665r605
5190B027389j7621R03J8975k029l0694M0096M8853K1932K4006m6527J9069N7398
5178B161750M8316N2589K3078k0122L903J4263N2979P8341k8931j0438N305K3326
5166B404359K3509K6795o0416l1799K3453K4926K8834j7715r487Q056J1769K1118
5154B453402O283K3582M2890L6195K2809K4271L6177J5424Q0220K3700l5967j647
5142B727339L3276L9537R313L3587Q1981K0562L557j3244m42j7691l2022L9906
5130B925659K206j986O1001N0758m8102k1722K4968O5920M2969K9982J8653j6310
5118C133996J5755J7759J9386L7873O8669J5038K6178k4848M8850N1149J9592
$$ plain form
5202 2004043 1959527 2007085 2051846 2034450 1988402 1971034 2017952 2006252 2014497 2004329 2036994 2027389
5190 2027389 2009768 2010671 2029646 2027617 1996923 2037019 2085872 2107804 2131810 2085283 2104352 2161750
5178 2161750 2210066 2262655 2285733 2265611 2269514 2283777 2336756 2415097 2386166 2375728 2381033 2404359
5166 2404359 2427868 2454663 2394247 2362448 2385901 2410827 2439661 2421946 2412459 2420515 2432284 2453402
5154 2453402 2459685 2483267 2526157 2562352 2585161 2609432 2645609 2661033 2741253 2764953 2728986 2727339
5142 2727339 2760615 2800152 2809465 2843052 2925033 2945595 2949152 2935908 2935466 2917775 2885753 2925659
5130 2925659 2927865 2925879 2986880 3037638 2989536 2967814 2992782 3058702 3101671 3131653 3150306 3133996
5118 3133996 3149751 3167510 3186896 3224769 3293438 3308476 3334654 3309806 3358656 3409805 3429397
5107C429397Q3203O9762N0064L6542L9918J2605N1279N1103O9718L7409L4384
5096C965384L4070L1393P3171P9327Q5575L9675M1750P7190O6442O0531R9027
5085D653535L3802Q5136J23514N4499N6028J22863J20527N1217O0951Q0909O7825
5074E510806J9044J01528J06672J14067N1049O5231J22036Q1186O0123J65585
5064F397327J53427N4187J03662J78112J40293R3718J61432J23721R0435J21164
5054G617478J40867J54043J51739J74611K14809J74889J22241J84795J28616J25671
5044I189759K02557J78537K02112K00946K50109K06503J42046K11520K31642K02065
5034A1217796K20327K37764K17689K04281K07293K14767K54452K24238J36936
$$ plain form
5107 3429397 3512600 3582362 3632426 3668968 3708886 3721491 3772770 3823873 3893591 3931000 3965384
5096 3965384 3999454 4030847 4104018 4183345 4268920 4308595 4350345 4427535 4493977 4554508 4653535
5085 4653535 4687337 4772473 4895987 4950486 5006514 5129377 5249904 5301121 5362072 5442981 5510806
5074 5510806 5529850 5631378 5738050 5852117 5903166 5968397 6090433 6171619 6231742 6397327
5064 6397327 6550754 6604941 6708603 6886715 7027008 7120726 7282158 7405879 7496314 7617478
5054 7617478 7758345 7912388 8064127 8238738 8453547 8628436 8750677 8935472 9064088 9189759
5044 9189759 9392316 9570853 9772965 9973911 10224020 10430523 10572569 10784089 11015731 11217796
5034 11217796 11438123 11675887 11893576 12097857 12305150 12519917 12774369 12998607 13135543
5025A3135543J95299K29073K05673J84847K44141K12214K32382J93756J81453
5016A5014381J89340J62855J74922J80761J37681J74899J91585J25926R1164J60594
5006A6604108R0708P7294J36435J01951O9653Q3030K3539P3369J03032J0148r283
4995A7363984l5816P3096k6355m4146k5494K7792k7980p1417o6620o8420j35268
4984A6963356p4774p4360j34139j65466j22478j16802j88794j40864k22277j89187
4974A5534215j71788j84846j81265k52585k03098j67179j86771k48866k82409
4965A3655408j80938j15331k30155k66240j93920k02101k28591j89024k61190
4956A1787918k21086k42414j88892j88215k42632j77049j50137j61820k38583
$$ plain form
5025 13135543 13330842 13559915 13765588 13950435 14194576 14406790 14639172 14832928 15014381
5016 15014381 15203721 15366576 15541498 15722259 15859940 16034839 16226424 16352350 16443514 16604108
5006 16604108 16694816 16772110 16908545 17010496 17080149 17163179 17186718 17260087 17363119 17373267 17363984
4995 17363984 17328168 17401264 17374909 17330763 17305269 17333061 17305081 17233664 17167044 17098624 16963356
4984 16963356 16888582 16814222 16680083 16514617 16392139 16275337 16086543 15945679 15723402 15534215
4974 15534215 15362427 15177581 14996316 14743731 14540633 14373454 14186683 13937817 13655408
4965 13655408 13474470 13359139 13128984 12862744 12668824 12466723 12238132 12049108 11787918
4956 11787918 11566832 11324418 11135526 10947311 10704679 10527630 10377493 10215673 9977090
4947I977090k22345j87423k06700k29195r8430j65269k12359j72519j17982j53238
4937H211630j34538j05983j15401j24817j15287j30445j31189j02042j27029o8303
4927G056596q0667q4607n5237o0520j29982j41525m6630m2937j16665J4327k8250
4916F283903q0654j06064n5880N755r2192o6863k4981m1301Q920j1735k0260q4253
4904E714395J5523L616r0962n3748m3933K0964p063m6544j1233N6506o270J6232
4892E567483J2325K505j7783L5760L0765Q232L0151j6194J1954K4690Q9959N7853
4880E837700Q723L5817Q2970L5002j9566L2490Q9064O6739N2609R0593J16950
4869F429091Q5543Q6983J42281J46956K08422K49792K63146L48813M72321L32492
$$ plain form
4947 9977090 9754745 9567322 9360622 9131427 9032997 8867728 8655369 8482850 8364868 8211630
4937 8211630 8077092 7971109 7855708 7730891 7615604 7485159 7353970 7251928 7124899 7056596
4927 7056596 6975929 6891322 6836085 6775565 6645583 6504058 6457428 6414491 6297826 6312153 6283903
4916 6283903 6203249 6097185 6041305 6047060 5954868 5888005 5863024 5821723 5830643 5818908 5798648 5714395
4904 5714395 5729918 5733534 5642572 5588824 5544891 5565855 5558792 5512248 5501015 5557521 5551251 5567483
4892 5567483 5579808 5582313 5564530 5600290 5631055 5639287 5669438 5653244 5665198 5689888 5779847 5837700
4880 5837700 5846423 5882240 5965210 6000212 5980646 6013136 6102200 6168939 6221548 6312141 6429091
4869 6429091 6514634 6601617 6743898 6890854 7099276 7349068 7612214 7961027 8433348 8765840
4859H765840K09572Q2540j35476k77884l07775l46220k87123j76276j48888j22392
4849G255918p8420j9064j7310L516o846q31M2425j8427L7539L2256Q564M0942
4837G280262Q2867P9160J5720M0158J30658J10061O2756P6951J38168J80554Q2510
4826H279825Q3728J00780R7620J82757K11480J43247J56458J69124J57365J91680
4816I774064K00434K11199K87766K15149K26492L11735L12007K69483K61588L36559
4806A2406476M01897M82360M69990M31842M28890N81803N51414O02156O17592
4797A6974420O29473O34753O92676O95856P28626O33696O67038O52948O62832
4788B2972318O14900N60957N45330N17490M76489M19161M40099L76878M10739
$$ plain form
4859 8765840 8975412 9057952 8922476 8644592 8336817 7990597 7703474 7527198 7378310 7255918
4849 7255918 7177498 7158434 7141124 7144640 7137794 7136963 7179388 7160961 7198500 7230756 7239320 7280262
4837 7280262 7363129 7442289 7458009 7498167 7628825 7738886 7801642 7878593 8016761 8197315 8279825
4826 8279825 8363553 8464333 8561953 8744710 8956190 9099437 9255895 9425019 9582384 9774064
4816 9774064 9974498 10185697 10473463 10688612 10915104 11226839 11538846 11808329 12069917 12406476
4806 12406476 12808373 13290733 13760723 14192565 14621455 15203258 15754672 16356828 16974420
4797 16974420 17603893 18238646 18931322 19627178 20355804 20989500 21656538 22309486 22972318
4788 22972318 23587218 24148175 24693505 25210995 25687484 26106645 26546744 26923622 27334361
4779B7334361M05627M50749L98442M75910N74855N90864O42110O84999O75841
4770C2233758P03136P88192P52741P52689O85636N95133N11537M01495L75680
4761C7799997J30210P2628o3344k05716l19671m16086m72789m42398m41276m36727
4751C5204828m43964l93231l91958k50081j37030n3914k6223J0079J50515K61614
4741C3930635K18889K96142L96413L93286L85472M25348M20544L99407L88862
4732C7254998L74429L34868J95431J81947O7074O2758k8620j38592k20836l07605
4722C7775852l34560l77283m35442m19310l39245k88039k54886k25768n2573M1914
4712C5090660J38591J98144L57528M97131O30253P27866P45221P74860Q78183
$$ plain form
4779 27334361 27739988 28190737 28589179 29065089 29639944 30230808 30872918 31557917 32233758
4770 32233758 32936894 33725086 34477827 35230516 35916152 36511285 37022822 37424317 37799997
4761 37799997 37930207 38002835 37939491 37733775 37414104 36998018 36525229 36082831 35641555 35204828
4751 35204828 34760864 34367633 33975675 33725594 33588564 33534650 33508427 33518506 33669021 33930635
4741 33930635 34149524 34445666 34842079 35235365 35620837 36046185 36466729 36866136 37254998
4732 37254998 37629427 37964295 38159726 38341673 38408747 38471505 38442885 38304293 38083457 37775852
4722 37775852 37441292 37064009 36628567 36209257 35870012 35581973 35327087 35101319 35048746 35090660
4712 35090660 35229251 35427395 35784923 36282054 36912307 37640173 38385394 39160254 40038437
4703D0038437Q29558Q52163P29348N53031M74681J58893o4981l11818n63497o88331
4693D2007484p21704q24911q43721q63997q25341q99836q48484q13412q81667
4684C4484411r27080p99170p68134o96033n54339m67632m40584m96933m55324
4675B8879182n48031n53837o51137p31653q36385r09096r62343j057150j058677
4666B1570873j017142j020939j008345r40541r05501r02016p55550o54883p14982
4657A3650974o72977n98498n24956m94565m38690m09897l32221l95211l43603
4648I440356k90103l00062k39219k50752k14358k51707k05887j66107j59436k18116
4638G144609j48461j73346j07716q2939j05899j45320j85036j27878j29184j23592
$$ plain form
4703 40038437 40867995 41720158 42449506 43002537 43477218 43636111 43571130 43259312 42695815 42007484
4693 42007484 41285780 40460869 39617148 38753151 37927810 37027974 36179490 35366078 34484411
4684 34484411 33557331 32758161 31990027 31293994 30739655 30272023 29831439 29334506 28879182
4675 28879182 28331151 27777314 27126177 26394524 25558139 24649043 23686700 22629550 21570873
4666 21570873 20553731 19532792 18524447 17583906 16678405 15776389 15020839 14365956 13650974
4657 13650974 12977997 12379499 11854543 11359978 10921288 10511391 10179170 9783959 9440356
4648 9440356 9150253 8850191 8610972 8360220 8145862 7894155 7688268 7522161 7362725 7144609
4638 7144609 6996148 6822802 6715086 6632147 6526248 6380928 6195892 6068014 5938830 5815238
4628E815238j21650m1715j00674j15336j07205q7603l2003j54149j04105m6948
4618D903850n7026p2989q4468l9239l8484m2573j34741r7091Q287j7397o4757
4607D263372p0553j12402q2248m1420M7843n7904l3789k6623o8433q1863l9796
4596C696184q101k7778l3190N135k0456L1267l3707m3227k7810j5537K9722j1432
4584C541070M426l7762m2957n1536j3031J7317k4485o838q069r337m2472K6510
4572C352836j0452K3580L5883j2876r351J5246r345M4649L2798Q682L8074J49144
4560C658868J24249J00995J53251K68025K19217K09358J76289J24893n836j09156
4550D920153j76546k58427k47037k61663k48495j34693q7857o2853l5971j11733
$$ plain form
4628 5815238 5693588 5651873 5551199 5435863 5328658 5241055 5209052 5054903 4950798 4903850
4618 4903850 4846824 4773835 4689367 4650128 4611644 4569071 4434330 4337239 4345526 4328129 4263372
4607 4263372 4192819 4080417 3998169 3956749 4004592 3946688 3912899 3886276 3817843 3735980 3696184
4596 3696184 3688083 3660305 3627115 3632250 3611794 3643061 3609354 3566127 3538317 3522780 3552502 3541070
4584 3541070 3545496 3507734 3464777 3413241 3400210 3417527 3393042 3386204 3378135 3368798 3326326 3352836
4572 3352836 3342384 3365964 3401847 3388971 3379620 3394866 3385521 3430170 3462968 3471650 3509724 3658868
4560 3658868 3783117 3884112 4037363 4305388 4524605 4733963 4910252 5035145 5029309 4920153
4550 4920153 4743607 4485180 4238143 3976480 3727985 3593292 3505435 3442582 3406611 3294878
4540C294878m0511J5254r5525q6271k3500n2774k7249J4285p617j5545l575m4542
4528B927308j545n5589K3051k1327j7390l4258o1208o4275L5663l3063J7753J5210
4516B730330N659K7131N5001K2750K1567m1685r3069j3237k6619m4852M0682l4986
4504B648672Q1075q465k1025O2519R5285K0958L0488K9504j0171j6305J4046M2415
4492B968996P1465M4179K0365j8798Q08k7152L0140J2453n4154N8037K3119K9596
4480C159054K9901J9861r256o835M143J3089L8029j3500O1896M5455M4199Q5952
4468C471988M7162P3804K9619K7469o884j1567N1716l3275M3215M1641M2711K2992
4456C800591L7755N2726L3196J9414R8104j7197N6881K4341o7738N6093K3018
$$ plain form
4540 3294878 3254367 3269621 3174096 3087825 3064325 3011551 2984302 2998587 2990970 2975425 2971850 2927308
4528 2927308 2925763 2870174 2893225 2871898 2854508 2820250 2759042 2694767 2730430 2697367 2715120 2730330
4516 2730330 2735989 2763120 2818121 2840871 2862438 2820753 2727684 2714447 2687828 2642976 2683658 2648672
4504 2648672 2729747 2721282 2700257 2762776 2858061 2879019 2909507 2939011 2928840 2912535 2926581 2968996
4492 2968996 3040461 3084640 3105005 3086207 3087015 3059863 3090003 3102456 3048302 3106339 3129458 3159054
4480 3159054 3188955 3208816 3199560 3192725 3196868 3209957 3247986 3234486 3296382 3341837 3386036 3471988
4468 3471988 3519150 3592954 3622573 3650042 3643158 3631591 3683307 3650032 3693247 3734888 3777599 3800591
4456 3800591 3838346 3891072 3924268 3943682 4041786 4024589 4081470 4105811 4038073 4094166 4117184
4445D117184M2213P2217M3062N7216O9273J8110K7788K8443Q9486J57239J80777
4434D903008Q8944N3006O6253n1984k4035O2473m490K2984K9113O326J21564J16819
4422E389981R6104J09049O4450M8496K5726M7271L4794P3558l1387L0562J7385
4411E905989N7979n82q44J7893J0091P3191R4118K9236O3295M7286J31312J01202
4399F530166J08868Q9184P3534J05920R8833R0523J48897J18276J19510J39123
4389G622834J62744J02457J06850P8935J00107P0896J22123J12446J85937J29390
4379H794719J05990J5732J58367J57171J85205J31243J44622J67609J46828Q7414
4369A0094900J46891J51772K13060K31661K31154K53081K76316K44038J77663
$$ plain form
4445 4117184 4159397 4231614 4274676 4331892 4401165 4419275 4447063 4475506 4564992 4722231 4903008
4434 4903008 4991952 5044958 5111211 5059227 5035192 5097665 5093175 5116159 5145272 5151598 5273162 5389981
4422 5389981 5486085 5595134 5659584 5708080 5733806 5781077 5815871 5889429 5858042 5888604 5905989
4411 5905989 5963968 5963386 5962542 5980435 5990526 6063717 6157835 6187071 6250366 6297652 6428964 6530166
4399 6530166 6639034 6728218 6801752 6907672 7006505 7097028 7245925 7364201 7483711 7622834
4389 7622834 7785578 7888035 7994885 8073820 8173927 8244823 8366946 8479392 8665329 8794719
4379 8794719 8900709 8916441 9074808 9231979 9417184 9548427 9693049 9860658 10007486 10094900
4369 10094900 10241791 10393563 10606623 10838284 11069438 11322519 11598835 11842873 12020536
4360A2020536J98576J83782K16015K73812K95065K53418K36477M01821M11399
4351A4490901M27331M30197L79143R4107j9855j4222Q1990J49259J89663J54246
4341A6362760J83157J73931K64520L45470L17952K77560K84223K46016J81361
4332A8636950K45709K39918K40503L10374L48273M01139M53977M29120L82106
4323B1688069L95779M47327N14498N92468O38336O95691Q31398Q77243Q24950
4314B7505759R47142R41236R75405R47082J002364J101718J193220J211400J255967
4305C7081293J254230J297629J385648J488331J435084J434879J214794J123516
4297D7715404J076807J349850J406745J732528J733066J804138J768277K068500
$$ plain form
4360 12020536 12219112 12402894 12618909 12892721 13187786 13441204 13677681 14079502 14490901
4351 14490901 14918232 15348429 15727572 15821679 15801824 15787602 15869592 16018851 16208514 16362760
4341 16362760 16545917 16719848 16984368 17329838 17647790 17925350 18209573 18455589 18636950
4332 18636950 18882659 19122577 19363080 19673454 20021727 20422866 20876843 21305963 21688069
4323 21688069 22083848 22531175 23045673 23638141 24276477 24972168 25803566 26680809 27505759
4314 27505759 28452901 29394137 30369542 31316624 32318988 33420706 34613926 35825326 37081293
4305 37081293 38335523 39633152 41018800 42507131 43942215 45377094 46591888 47715404
4297 47715404 48792211 50142061 51548806 53281334 55014400 56818538 58586815 60655315
4289F0655315K178832K446235K444615K751749K891331L287800L456293M092909
4281H4205079M682480N796380O461136P614731Q609315J0514872J2438267J5525951
4273A55848211J8715896K4277878L1634379M4088764N8469160P4398070P5332746
4266D82765104M9518550j2951516p3442359q7331490p2926774m9837022l4856027
4259B00938466k4623959j8850200j4243142j1396829q780802p270045n734149
4252A10039340m878319m274323m196277l577228l182873k509180k109411j764147
4244H3547582j854901j531786j512680j405680j447349j323707j336906j216912
4236G1917661j229442j246979j440676j495927j585764j454599j407707j240470
$$ plain form
4289 60655315 62834147 65280382 67724997 70476746 73368077 76655877 80112170 84205079
4281 84205079 88887559 94683939 101145075 108759806 117369121 127883993 140322260 155848211
4273 155848211 174564107 198841985 230476364 274565128 333034288 407432358 482765104
4266 482765104 532283654 519332138 445889779 358558289 285631515 235794493 200938466
4259 200938466 176314507 157464307 143221165 131824336 123043534 115773489 110039340
4252 110039340 105161021 100886698 96690421 93113193 89930320 87421140 85311729 83547582
4244 83547582 81692681 80160895 78648215 77242535 75795186 74471479 73134573 71917661
4236 71917661 70688219 69441240 68000564 66504637 64918873 63464274 62056567 60816097
4228F0816097j226302j286493j353315j401076j335775j361807j361201j382164
4220E0107964j480288j429359j411847j335105j250569j229613j253721j108996
4212C9608466j071966j044907r74895j037555r97920r72882q98429p96935p88631
4203C1024346p46013p10582p02836o69200o68204n66267n05717m07525m73242
4194B5574760m19570l71240k48825l61626l39288l38420k68298j87528q2806j69658
4184B2787501j09957j41395j54054j73168j09162j51045q3845j41903j00358k5442
4174B1597172O648n8854l1844n5080K8572O5688K4073J05231J38302O9587J34689
4163B2024184N8587L0844Q8112K36901K27918L07501L08496K74381K82050L72677
$$ plain form
4228 60816097 59589795 58303302 56949987 55548911 54213136 52851329 51490128 50107964
4220 50107964 48627676 47198317 45786470 44451365 43200796 41971183 40717462 39608466
4212 39608466 38536500 37491593 36516698 35479143 34481223 33508341 32609912 31812977 31024346
4203 31024346 30278333 29567751 28864915 28195715 27527511 26961244 26455527 26048002 25574760
4194 25574760 25155190 24783950 24535125 24173499 23834211 23495791 23227493 23039965 22957159 22787501
4184 22787501 22677544 22536149 22382095 22208927 22099765 21948720 21864875 21722972 21622614 21597172
4174 21597172 21603820 21544966 21513122 21458042 21486614 21552302 21576375 21681606 21819908 21889495 22024184
4163 22024184 22082771 22113615 22201727 22438628 22666546 22974047 23282543 23556924 23838974 24211651
4153B4211651L54589M85502L93134M19264M31827L13091K23342K62474K11969
4144B7306843K68082L10370M17922N47178N85488N34053N84927O30438P15852
4135C1901153O86839P67199P94519P86705Q35690Q72188R18613R02898R33019
4126C9398823J023056J054997J069892J205990J239623J314136J360491J436138
4118D9103146J469275J442355J607662J688264J760844J765060J884881J919564
4110F2641051K004784K086524K125585K137812K087530K007038J955361J874760
4102G8920445J730101J574167J513929J262727J070017R51040O98192N25263L57266
4093H8603147Q4372j50345l52281n51935p36369q88118j056762j190792j412591
$$ plain form
4153 24211651 24566240 25051742 25444876 25864140 26295967 26609058 26832400 27094874 27306843
4144 27306843 27574925 27885295 28303217 28850395 29435883 29969936 30554863 31185301 31901153
4135 31901153 32587992 33355191 34149710 34936415 35772105 36644293 37562906 38465804 39398823
4126 39398823 40421879 41476876 42546768 43752758 44992381 46306517 47667008 49103146
4118 49103146 50572421 52014776 53622438 55310702 57071546 58836606 60721487 62641051
4110 62641051 64645835 66732359 68857944 70995756 73083286 75090324 77045685 78920445
4102 78920445 80650546 82224713 83738642 85001369 86071386 87022426 87720618 88245881 88603147
4093 88603147 88687519 88537174 88184893 87632958 86896589 86008471 84951709 83760917 82348326
4084H2348326j480827j521984j728580j758420j761692j744799j829766j720828
4076F8801430j683287j601640j616903j475978j490765j413576j262068j259264
4068E6997949j107686j044443r35941q95103q19534o67945o15422n09671n56240
4059D9845964n17664m67808m24276m34731m48195m00218l76682l68241l27804
4050D6080345l19513k77743k86582k61534j92175j45943j69569j33538o6752j5297
4040D4211699n6062O9054M3149N5464J35206J23200K59431L73516L57135L25467
4030D5897259L54961L44637L02207K78344K48109K69210K68503K14807J35067
4021D8313104J68926J77283J88848J55959K14376K90664K78141L22398L78206
$$ plain form
4084 82348326 80867499 79345515 77616935 75858515 74096823 72352024 70522258 68801430
4076 68801430 67118143 65516503 63899600 62423622 60932857 59519281 58257213 56997949
4068 56997949 55890263 54845820 53909879 53014776 52195242 51527297 50911875 50402204 49845964
4059 49845964 49328300 48860492 48436216 48001485 47553290 47153072 46776390 46408149 46080345
4050 46080345 45760832 45483089 45196507 44934973 44742798 44596855 44427286 44293748 44226996 44211699
4040 44211699 44155637 44224691 44267840 44323304 44458510 44581710 44841141 45214657 45571792 45897259
4030 45897259 46252220 46596857 46899064 47177408 47425517 47694727 47963230 48178037 48313104
4021 48313104 48482030 48659313 48848161 49004120 49218496 49509160 49787301 50109699 50487905
4012E0487905L36135M06784M51502L58539L13392L53163K57756R7474o7400j17550
4002E2877700k57053k21089k54205k25161k41462j49771j87974j57472j61701
3993E1021812k04158p9958m8036p201n9824j40824j68208j50705j60132k09934
3983D9792832j98102j87261j96827k14377k43960m20308n57183p28014r25528
3974D6121272j028178j029473j059470r85680r04242p96914o75862o92579o01205
3965C8347669n79900n38807n69562n10017n14805n00912m67892m68707m61540
3956C3735527m38252m60082m34733m20785l79419m46266m95334n27480n60642
3947B9572534n64909n22876n45865n25159n35735m74226m78855m35814l84658
$$ plain form
4012 50487905 50824040 51230824 51682326 52040865 52354257 52707420 52965176 53062650 52995250 52877700
4002 52877700 52620647 52399558 52145353 51920192 51678730 51528959 51340985 51183513 51021812
3993 51021812 50817654 50737696 50689660 50682459 50622635 50481811 50313603 50162898 50002766 49792832
3983 49792832 49594730 49407469 49210642 48996265 48752305 48331997 47774814 47046800 46121272
3974 46121272 45093094 44063621 43004151 42018471 41114229 40317315 39641453 38948874 38347669
3965 38347669 37767769 37228962 36659400 36149383 35634578 35133666 34665774 34197067 33735527
3956 33735527 33297275 32837193 32402460 31981675 31602256 31155990 30660656 30133176 29572534
3947 29572534 29007625 28484749 27938884 27413725 26877990 26403764 25924909 25489095 25104437
3938B5104437m26092m01698l78494l67869l71931l91176l20215l36367k85340
3929B1825255k81072k80847k64389k79028k95298k66228k89015k44668k45246
3920A9379464k01154k73090k29473k06323k64550j80967k02634k59968j03706
3911A7457599j46777j34291r8756p8159j30295j30985r6348l3609n0496n9587
3901A6498296r8656m5784J7817J2878O4242P6512J10977N1274L3543J41398J96999
3890A7059496J44195J31339R9066J68257J83558K01208K55565K33828J90186K16170
3880A8882868J67338K62429K38688K45889K43182K38574K86821K17179K52292
3871B1035260K64802K52088K72092K93649K69075K80054L06517L21604L04605
$$ plain form
3938 25104437 24678345 24276647 23898153 23530284 23158353 22767177 22446962 22110595 21825255
3929 21825255 21544183 21263336 20998947 20719919 20424621 20158393 19869378 19624710 19379464
3920 19379464 19178310 18905220 18675747 18469424 18204874 18023907 17821273 17561305 17457599
3911 17457599 17310822 17176531 17077775 16999616 16869321 16738336 16641988 16608379 16557883 16498296
3901 16498296 16399640 16353856 16371673 16384551 16448793 16525305 16636282 16687556 16721099 16862497 17059496
3890 17059496 17203691 17335030 17434096 17602353 17785911 17987119 18242684 18476512 18666698 18882868
3880 18882868 19050206 19312635 19551323 19797212 20040394 20278968 20565789 20782968 21035260
3871 21035260 21300062 21552150 21824242 22117891 22386966 22667020 22973537 23295141 23599746
3862B3599746L04754K91037L65688M42246M24186M10651M46281M69008M97891
3853B7251488N41902M84550N33220N36072O33777P20649P80467Q19753Q35473
3844C3137351R16501J014869J046208J056806J135155J180703J331839J421203
3836D2240635J493750J628624J725888J829792J871466K084778K160600K233967
3828E7269500K301483K346065K406077K383667K398595K395183K373298K221039
3820G6094907K104501K091094J889697J735666J629951J511943J262503J047274
3812H9367536Q33705N10994K80394N1723k32667m88490p56320j031049j271077
3803H7264749j436629j674466j838175j933140k061983k236886k378177k464802
$$ plain form
3862 23599746 23904500 24195537 24561225 25003471 25427657 25838308 26284589 26753597 27251488
3853 27251488 27793390 28277940 28811160 29347232 29981009 30701658 31482125 32301878 33137351
3844 33137351 34053852 35068721 36114929 37171735 38306890 39487593 40819432 42240635
3836 42240635 43734385 45363009 47088897 48918689 50790155 52874933 55035533 57269500
3828 57269500 59570983 61917048 64323125 66706792 69105387 71500570 73873868 76094907
3820 76094907 78199408 80290502 82180199 83915865 85545816 87057759 88320262 89367536
3812 89367536 90201241 90712235 90992629 91044352 90811685 90323195 89566875 88535826 87264749
3803 87264749 85828120 84153654 82315479 80382339 78320356 76083470 73705293 71240491
3795G1240491k492951k478433k500438k476307k527422k497900k385763k345867
3787E1535410k306196k222024k080288k004244j913746j809420j715899j553649
3779C5929944j495759j441835j331900j225098j082136j049331j047716q51287
3771B6404882q20858q18918o75409o95631o47387o14613n44574n68340m74780
3762B0544372m51041l76507m08800l84634l43297l52206l51540l18975k10900
3753A7346472k92895l25370l19450k68324l39833k88586k51567k51376k38222
3744A4770849k91241k72547k87174l00777k98455k82411k73765k75781k56789
3735A2231909k55668k04645k44630k40661k81451k67882k79879k37605j95881
$$ plain form
3795 71240491 68747540 66269107 63768669 61292362 58764940 56267040 53881277 51535410
3787 51535410 49229214 47007190 44926902 42922658 41008912 39199492 37483593 35929944
3779 35929944 34434185 32992350 31660450 30435352 29353216 28303885 27256169 26404882
3771 26404882 25584024 24765106 24089697 23394066 22746679 22132066 21587492 21019152 20544372
3762 20544372 20093331 19716824 19308024 18923390 18580093 18227887 17876347 17557372 17346472
3753 17346472 17053577 16728207 16408757 16140433 15800600 15512014 15260447 15009071 14770849
3744 14770849 14479608 14207061 13919887 13619110 13320655 13038244 12764479 12488698 12231909
3735 12231909 11976241 11771596 11526966 11286305 11004854 10736972 10457093 10219488 10023607
3726A0023607k25411k11680k02631k30266j95831j88360j83755j26585j60823
3717H298265k24505k43398p1231j04633j51332j45883j27829j41568j31355l8320
3707F918211p1342r4681o9063r6591j22986j37260l1963j00334j29039l7303j13528
3696E914121n8492p9534o8240k8060p3112p3408j30423k7915l263j04926n7295
3685E209453p5639l7242p7009m4340j5098R973n3139q0588p1901m8752R401j801
3673D723318n4274r4047j16353j1402k6553k6976o2266j8316j3084k8761n0131
3662D221155p0387j2353j5969k2545o3736m9237K7481l2127k3067q2801n1227
3651C825187j3098k895m2484k4367p3581Q891J7460m8457j0177k7233m1445m5340
$$ plain form
3726 10023607 9798196 9586516 9383885 9153619 8957788 8769428 8585673 8459088 8298265
3717 8298265 8073760 7830362 7759131 7654498 7503166 7357283 7229454 7087886 6956531 6918211
3707 6918211 6846869 6752188 6683125 6586534 6463548 6326288 6294325 6193991 6064952 6027649 5914121
3696 5914121 5855629 5776095 5707855 5679795 5606683 5533275 5402852 5374937 5371674 5266748 5209453
3685 5209453 5133814 5096572 5019563 4975223 4960125 4970098 4916959 4836371 4764470 4715718 4725119 4723318
3673 4723318 4669044 4574997 4458644 4447242 4420689 4393713 4331447 4313131 4300047 4271286 4221155
3662 4221155 4150768 4138415 4122446 4099901 4036165 3986928 4014409 3982282 3959215 3876414 3825187
3651 3825187 3812089 3809194 3766710 3742343 3668762 3677653 3695113 3646656 3636479 3609246 3567801 3522461
3639C522461J7795J4885l1665p0404m3327r533m15M3385J3318l4726m1444o8597
3627C311733J8031k965J7888o4406n7037K8296o004m8838J5241j0401m2473J2647
3615C171712K8863l200J4042K350j6324n1213J1141q0205q738o015l2626K9669
3603C059456L6445j6031K4730K7925K4776J5741J3654p525R854j1845j1507L4188
3591C199861j3868k3559j6570L1079Q416k220m221p93k5850K5278L9266q9669
3579C127150N3966L2745j3249K6160O6997N0366L0070j691M3298K826m4455M6197
3567C420380j7975O2365O3703j6806j631j862M8652P2877k348K7156N2274K700
3555C709485L3045K4510k3863P4273L1302K9662j651N8784L1695L6052O5084O6226
$$ plain form
3639 3522461 3540256 3555141 3523476 3453072 3409745 3400212 3399797 3443182 3456500 3421774 3380330 3311733
3627 3311733 3329764 3326799 3344687 3280281 3223244 3251540 3245536 3196698 3211939 3201538 3159065 3171712
3615 3171712 3200575 3197375 3211417 3213767 3197443 3146230 3157371 3077166 3068428 3062413 3029787 3059456
3603 3059456 3095901 3079870 3104600 3132525 3157301 3173042 3186696 3179171 3189025 3177180 3165673 3199861
3591 3199861 3185993 3162434 3145864 3176943 3185359 3183139 3178918 3178125 3152275 3177553 3216819 3127150
3579 3127150 3181116 3213861 3200612 3226772 3293769 3344135 3374205 3372514 3415812 3418638 3374183 3420380
3567 3420380 3402405 3464770 3528473 3511667 3510036 3508174 3556826 3629703 3627355 3654511 3706785 3709485
3555 3709485 3742530 3767040 3743177 3817450 3848752 3878414 3876763 3935547 3967242 4003294 4068378 4134604
3543D134604J1234K8242J043N2356L0768M2269L1936J8251O8801O4737K9108O581
3531D519930P1815M2906L2184J6756N4431Q1164N1181J2981M0457J2992n701J12782
3519E043878Q2705K7939N8113O7018M7230O1490Q6237J3241p281M5003L1816L3796
3507E591185R4082J00262P4858R854N8061L7179l522J21159J03522L6870J42775
3496F366285J28388J00702k7397N7457J06188N1803R6199J13344N5765J26146
3486G174880Q0381Q0302J60233J40703J36990J11445J58960J52731M2522J60083
3476H399230K08510J67828J19848J44887J82603J85200K42544K05225K38207K21486
3466A0315568J78681K03755K45882K67219K83349K53034L60263M14384M32789
$$ plain form
3543 4134604 4145838 4174080 4175123 4227479 4258247 4300516 4332452 4350703 4419504 4484241 4513349 4519930
3531 4519930 4591745 4634651 4666835 4683591 4738022 4819186 4870367 4883348 4923805 4936797 4931096 5043878
3519 5043878 5126583 5154522 5212635 5279653 5326883 5388373 5474610 5487851 5480570 5525573 5557389 5591185
3507 5591185 5685267 5785529 5860387 5870241 5928302 5965481 5961959 6083118 6186640 6223510 6366285
3496 6366285 6494673 6595375 6567978 6625435 6731623 6783426 6879625 6992969 7048734 7174880
3486 7174880 7255261 7335563 7495796 7636499 7773489 7884934 8043894 8196625 8239147 8399230
3476 8399230 8607740 8775568 8895416 9040303 9222906 9408106 9650650 9855875 10094082 10315568
3466 10315568 10494249 10698004 10943886 11211105 11494454 11747488 12107751 12522135 12954924
3457A2954924N23842N04946N64315O64813P03580Q44029Q55573R50877J010497
3448A9577396J081904J141477J101139J097412R94942R13400Q87781Q03682N47545
3439B8146678J13412o65606j566001k006824k021321j824986j439987j094450
3431A7640915q98521o70816m86513n49529m90287m75796n15775m90236n04620
3422A2558822l83220l61015l86104k93726k39169k60075l10936k00627j49469
3413I974481k03977j58213j07924j39179j82150r3549r3905j22041j20689m9910
3403H702944o3192k2431k8754L9970N8497J57870J86907Q7840o54j71636k76843
3392H670518l43780l27684l69277l46286k77955k63076j66922j70154j20668j35843
$$ plain form
3457 12954924 13478766 13983712 14548027 15212840 15916420 16760449 17616022 18566899 19577396
3448 19577396 20659300 21800777 22901916 23999328 24994270 25907670 26795451 27599133 28146678
3439 28146678 28260090 27594484 26028483 24021659 22000338 20175352 18735365 17640915
3431 17640915 16742394 16071578 15585065 15035536 14545249 14069453 13553678 13063442 12558822
3422 12558822 12175602 11814587 11428483 11134757 10895588 10635513 10324577 10123950 9974481
3413 9974481 9770504 9612291 9504367 9365188 9183038 9089489 8995584 8873543 8752854 8702944
3403 8702944 8639752 8617321 8588567 8628537 8687034 8844904 9031811 9119651 9118997 8947361 8670518
3392 8670518 8326738 7999054 7629777 7283491 7005536 6742460 6575538 6405384 6284716 6148873
3382F148873r6093j60978j14914q9642q3966q785l5320o2482k9107l2549M131
3371E439168O2206J3000m2929R3443J27406J36415J99280J48757J46042J08532
3361F431320R8433J79824K46966L49695K99246M2753k14030n28840n95794n14257
3351E795316l31543k80828k31384j59581j37235n9406q0050r3948K773l728l8681
3340D381705k9169J287j4353m525J497Q2807J10038K17264L10700L58843M17086
3329E833180K93860O2121l64593m77209m69523m47756k98386k60087j39459j41883
3319C590265p8771j17773j02332k7930n7611o2774K3762l6811q3483n7829r2155
3308B896558p1579o2323K3081j0579o3143n2899n2050k8002o0784k879K464q2616
$$ plain form
3382 6148873 6052780 5891802 5776888 5687246 5603280 5594495 5559175 5496693 5467586 5435037 5439168
3371 5439168 5501374 5514374 5471445 5564888 5692294 5828709 6027989 6176746 6322788 6431320
3361 6431320 6529753 6709577 6956543 7306238 7605484 7648237 7434207 6905367 6309573 5795316
3351 5795316 5463773 5182945 4951561 4791980 4654745 4595339 4515289 4421341 4424114 4420386 4381705
3340 4381705 4352536 4353823 4339470 4334945 4336442 4419249 4529287 4746551 5057251 5416094 5833180
3329 5833180 6127040 6189161 5824568 5347359 4877836 4430080 4131694 3871607 3732148 3590265
3319 3590265 3511494 3393721 3291389 3263459 3205848 3143074 3166836 3130025 3046542 2988713 2896558
3308 2896558 2824979 2762656 2785737 2775158 2712015 2659116 2607066 2579064 2518280 2515401 2517865 2435249
3296B435249J4978J6082p0943m5386k2274J8344l8403N8065n5831m5388j3779
3285B250714q257k0718N6102p006J3019k6587p1813O646n2717J573p545j806r524
3272B122081n2698L3809q9383n0238k4398R410N0566m1462k1264n5596J8798K7323
3260A926948l4909n1542L7267l2467j2391L5025l0200j8281J993p099m712j3162
3248A796470l2508K3628l745k8102j8050l0863M9072k8988j9482j6110k1343l4909
3236A635070L865k492k1935Q800L0081k0398j09n5966k5421L6080j3269o9084
3224A505222N1561J7192l2426r085K6552k4072n065K2992j2820M3505k719l059
3212A577778K7217k0328j8434M6677K0337J4525j7644J3429J7300j0689M4283
$$ plain form
3296 2435249 2450227 2466309 2395366 2349980 2327706 2346050 2307647 2365712 2309881 2264493 2250714
3285 2250714 2242457 2221739 2277841 2270835 2283854 2257267 2185454 2192100 2139383 2140956 2133411 2131605 2122081
3272 2122081 2069383 2103192 2013809 1963571 1939173 1948583 1999149 1957687 1936423 1880827 1899625 1926948
3260 1926948 1892039 1840497 1877764 1845297 1832906 1867931 1837731 1819450 1821443 1814344 1809632 1796470
3248 1796470 1763962 1787590 1783845 1755743 1737693 1706830 1755902 1726914 1707432 1691322 1669979 1635070
3236 1635070 1638935 1636443 1614508 1623308 1653389 1632991 1632882 1576916 1551495 1587575 1574306 1505222
3224 1505222 1556783 1573975 1541549 1532464 1559016 1534944 1529879 1552871 1540051 1583556 1580837 1577778
3212 1577778 1604995 1584667 1566233 1612910 1633247 1647772 1630128 1643557 1660857 1650168 1694451
3201A694451N3301N4468j5268J364p5964o147J1176P6735M3232N7093K6784n2000
3189A869225K2335j555L7366R3243l3596J637m801M045J8631R229Q0310J6235
3177B112304L5079M7861R272L9608K7738L478l1068l2309K1835r926K9693K21
3165B253786m225N959K2943N2460K2770L8148J8963N6596P0490M9844Q6767L4825
3153B709326Q9319J5800K3160N1226L2354J3645N3158M5458P5808J6178J0183
3142C135615O5704M6229P9221L2166L964P4654O4867J06766M2387N2036N9448
3131C763057M9906P9134O4091L1294N9151K7143j9202O3825l2244Q0679J38607
3120D305441K0931K8262J9560Q2259J12127R3768K0322J01574J68657J71431J56220
$$ plain form
3201 1694451 1747752 1802220 1786952 1788316 1712352 1706205 1717381 1794116 1837348 1894441 1921225 1869225
3189 1869225 1891560 1890005 1927371 2020614 1987018 1988655 1983854 1987899 2006530 2015759 2096069 2112304
3177 2112304 2147383 2195244 2204516 2244124 2271862 2275340 2244272 2211963 2233798 2223872 2253565 2253786
3165 2253786 2249561 2255520 2278463 2330923 2353693 2391841 2410804 2467400 2537890 2587734 2674501 2709326
3153 2709326 2798645 2814445 2837605 2888831 2921185 2934830 2987988 3033446 3109254 3125432 3135615
3142 3135615 3201319 3247548 3326769 3358935 3362899 3437553 3502420 3609186 3651573 3703609 3763057
3131 3763057 3812963 3892097 3956188 3987482 4046633 4073776 4054574 4118399 4086155 4166834 4305441
3120 4305441 4326372 4354634 4374194 4456453 4568580 4662348 4682670 4784244 4952901 5124332 5280552
3109E280552J74082J84167J95465K05993J85224K02161J25423N6583R9940L357
3099F712947n8039j09243j88819k79636k06403j39962j33885o4629p2964O822
3089E466189L4749M7901O3394J01389J36462R8837J01327J06924J42024N4941
3079F354137Q7892J57727J06637O3312j6771J8753m8361j43955j36362r9796j78902
3068F164311k06810k65382j89244j71714j63028j89177j01417q8271p9301r880
3058D700087R131K1116O137j7775J3090k6950j108j11345r9520l2660j11351r2784
3046D256068j55510j11243j57653k18066j43016j52116k00960j12007j01456o2845
3036B841196j40550r2219j04302o4536r8297k5213p5725m7322m3804p8852J730
$$ plain form
3109 5280552 5454634 5638801 5834266 6040259 6225483 6427644 6553067 6609650 6709590 6712947
3099 6712947 6654908 6545665 6356846 6077210 5870807 5730845 5596960 5532331 5459367 5466189
3089 5466189 5500938 5548839 5612233 5713622 5850084 5948921 6050248 6157172 6299196 6354137
3079 6354137 6442029 6599756 6706393 6769705 6752934 6771687 6723326 6579371 6443009 6343213 6164311
3068 6164311 5957501 5692119 5502875 5331161 5168133 4978956 4877539 4789268 4709967 4700087
3058 4700087 4709218 4730334 4736471 4718696 4731786 4704836 4703728 4592383 4492863 4460203 4348852 4256068
3046 4256068 4100558 3989315 3831662 3613596 3470580 3318464 3117504 3005497 2904041 2841196
3036 2841196 2700646 2608427 2504125 2439589 2341292 2316079 2240354 2193032 2149228 2070376 2072106
3025B072106m1974o2846k3861k3725q0410l8231l8736l7713r7136o2400j886m8967
3013A514221k4278k5783k3488q6783n9115P794m4789o875k0779l4025m4610N1385
3001A202875k6434j03174m4038K7189k593k3317q260L091k3732n2679k4624N7239
2989I81543J0678m9339r586k6910r593n9178K3649q991j3784N2581o5684l504
2977H21882j2711j746m4247k7051R655K642l2710l6405j9743J8873l2998k414
2965F43027L5536p7662j2636L9831l0084J8259J6463l9799J1252N304l7269j8413
2953E53809K5212m0340J2099j9230m013k9822R593L3745p5113k0008m61O4995
2941E10466k9836j4747k1391r750j7784J0291l8822l2799L2368N4020l2682k6662
$$ plain form
3025 2072106 2030132 1967286 1943425 1919700 1839290 1801059 1762323 1724610 1627474 1565074 1563188 1514221
3013 1514221 1489943 1464160 1440672 1353889 1294774 1302568 1257779 1250904 1230125 1196100 1151490 1202875
3001 1202875 1176441 1073267 1029229 1056418 1053825 1030508 1022248 1025339 1001607 948928 924304 981543
2989 981543 992221 942882 933296 906386 896793 837615 861264 852273 838489 891070 825386 821882
2977 821882 809171 807425 763178 736127 745782 748424 715714 679309 659566 678439 645441 643027
2965 643027 678563 600901 588265 628096 598012 616271 632734 592935 604187 609491 572222 553809
2953 553809 579021 538681 550780 531550 527537 497715 507308 541053 465940 445932 445471 510466
2941 510466 480630 465883 444492 434742 416958 427249 388427 355628 387996 442016 409334 382672
2929C82672j6090R744K1539n3n493r898m316k7816k5549j888j209m9051L4195
2916C06787J6623Q173l8218j4753J1185j6743k8098M0272q411q50j4113J5176
2904B77030l0614J159j3139m922j5799M5561k6937k3215Q5163J7757m2360j4852
2892B54832n2784j9608R1345l616j1200m220k9414L2416m848J5867k0316l0118
2880B18336M2127m1359j6282k6393K2087K5074O26j4769p098M4113m9467k9802
2868A67193L7743J8377J3920J150k0064J8834L8957n9170J3163K6976p2375k698
2856A82006O7835p472k5978M942N2104m6396o2258l54K6118M0666n7910R771j6701
2843A66373M1826m5377j2196N8053l980k9336j5060M6861n1946P733K4067K496
$$ plain form
2929 382672 366582 376326 397865 397812 392319 382421 378105 350289 324740 322852 321643 272592 306787
2916 306787 323410 331583 293365 278612 289797 273054 244956 285228 276817 275967 261854 277030
2904 277030 246416 247575 234436 229514 213715 259276 232339 209124 294287 312044 269684 254832
2892 254832 202048 182440 273785 270169 258969 254749 225335 257751 252903 268770 248454 218336
2880 218336 260463 219104 202822 176429 198516 223590 224216 209447 202349 246462 196995 167193
2868 167193 204936 223313 237233 238383 218319 237153 276110 216940 230103 257079 184704 182006
2856 182006 249841 242369 216391 221333 273437 227041 164783 164429 190547 231213 173303 183074 166373
2843 166373 208199 162822 150626 208679 204699 175363 160303 207164 155218 162951 187018 189514
2831A89514r019j2767J8591m818M40J4704l5372L2883K5770p609N2174L1218p1038
2818B24671m7931J2218j5254J6386K0695k4250l3661j817m217K7531M9264n8303
2806A65332J0818N0514l5612n1864J3188j5789n661N833k5093q278k149K4711
2794A25950L8718M4159n4629J9271K5801m477j2458J9394j2738l3302J8352k2547
2782A51494p4324n4367L7826P5518L1839l4185Q509j991j8015m1025K8457m970
2770A04766R755J0307J992L7125l5588J896M5433j341n0488K7530N848J9650M5660
2757B22545m7201n8759k7404L3936K3162k8914L3142K8541n0057k1548J5957m2342
2745H1058k9785L9092K9595p08J0916M899J4704m4325j7285L3820m60n3650m1106
$$ plain form
2831 189514 180495 167728 186319 181501 181941 196645 161273 194156 219926 212317 264491 295709 224671
2818 224671 176740 188958 173704 190090 210785 186535 152874 151057 146840 174371 223635 165332
2806 165332 176150 226664 191052 139188 152376 136587 130926 136759 111666 103388 101239 125950
2794 125950 164668 208827 154198 173469 199270 194793 182335 201729 188991 155689 174041 151494
2782 151494 77170 22803 60629 136147 167986 133801 142310 140319 122304 81279 109736 104766
2770 104766 114521 124828 126820 163945 128357 130253 175686 174345 123857 151387 157235 176885 222545
2757 222545 175344 116585 89181 123117 146279 117365 150507 179048 128991 107443 123400 81058
2745 81058 51273 90365 119960 119252 130168 135067 149771 105446 88161 121981 121521 67871 26765
2732B6765K7101p821J4947J3786K8082m4287o523M7870Q893Q484n7047l223P676
2719F4703j72m0049L2101J5446N5263k508p9163j694K2853l878n0288O0450J533
2706G4597O8552O264j2106j6883p9768N3850K0563k3523j5840l0132K6561J4712
2694H6847j7485j1420J885K2498p561L8630K921l9609j0087m513Q100P079k3184
2681E4101r807M165O579L7036L4227n6051l7975J4475L7625L6503n5968J8295
2669H3205N181l2807n8384L1280J2672O34N363L0568M8178j884p627J0272m0777
2656H5874q562J6124l797l6120j7506M5824J35l8918j2311Q791P868L616J7944
2643F8962Q398o797K2934m6472N5387Q741j0087J6228J3890n992o0077L0164m3158
$$ plain form
2732 26765 53866 46045 60992 74778 102860 58573 52050 99920 108813 117297 60250 57027 64703
2719 64703 64531 24482 56583 72029 127292 124784 45621 43927 66780 62902 12614 73064 74597
2706 74597 143149 149413 137307 120424 40656 94506 115069 91546 75706 45574 72135 86847
2694 86847 69362 57942 59827 82325 74764 113394 116315 76706 66619 62106 70206 77285 54101
2681 54101 44294 48459 55038 92074 126301 70250 32275 46750 84375 120878 64910 83205
2669 83205 88386 55579 -2805 28475 41147 41781 47144 77712 125890 124006 116379 126651 85874
2656 85874 77312 93436 89639 53519 36013 81837 81972 43054 30743 39534 47402 51018 68962
2643 68962 77360 70563 93497 47025 102412 111153 101066 117294 131184 125192 65115 95279 52121
2630E2121K8423k0242N2286m3157M61Q657k2108Q856m0108K008j8471K8182J3657
2617E0565L4391m2929N3715q982k8884J5710N1185l5723j266n27m991o2305o9
2604A9890L2522q03j5782p849Q371O6273Q031m308J2804k7555n996Q848l4710
2591E9736r203M7010k8002N3852J9618p6022j7251M0980k5352J0076N0227K2829
2579A48498J1735m2535m0174j7127L2865N6716K205j0706L6179J6635J4734J932
2567B10957k8998k4640m3077M2457k9634k8407L8778o4747l5938m1883L7496J149
2555C3513R746m311K2706J9238k5592k0307k0719r913N539M9812j5093k9378J8165
2542C3406K5222J7968l2957L613L3931K7728k7906k7811k69j1160m696m8465O3052
$$ plain form
2630 52121 80544 60302 112588 69431 69892 78549 56441 65297 25189 27197 8726 36908 50565
2617 50565 84956 42027 95742 86760 57876 73586 124771 89048 87782 87255 82264 19959 19890
2604 19890 52412 51609 35827 27978 36349 102622 110653 106345 119149 91594 85598 94446 59736
2591 59736 50533 97543 69541 123393 143011 66989 49738 90718 65366 75442 125669 148498
2579 148498 160233 117698 77524 60397 93262 149978 152183 141477 177656 194291 209025 210957
2567 210957 181959 157319 114242 156699 127065 98658 137436 72689 36751 -5132 32364 33513
2555 33513 43259 38948 61654 80892 55300 34993 14274 4361 9900 59712 44619 15241 33406
2542 33406 58628 76596 43639 47252 81183 108911 81005 53194 52925 41765 37069 -11396 51656
2529E1656J5102n1378l7382N1632N6515j6337j9524K783J1656K4459J37j4752
2517G4567l3085J5809j1825R5K7571J799j8142k5207R3347m0594k5707L7490p369
2504H8749J6594l2442N2209n680o5127m946L0738k982P863K6685k9003K5249k4012
2491H3895K0841P7371q0684O017k8261J1771l7761l4410o275L4563j2233L2443
2479F7277M9577l3938k524L4053j7321j7904K4880K9495K152m4844K5340K6488
2467A42731l7044K6953L2157n3635O1821L320m1701n756j5108L3496j1672j8335
2455A17227J4743M7867l231m7771Q52K821L212K9750j0984m2756j2470J3738l7286
2442G5712Q318N3675J5828j8492J407N955O699j5166L1528l190K1799M3040m164
$$ plain form
2529 51656 66758 15380 -22002 29630 86145 69808 50284 53067 64723 89182 89319 74567
2517 74567 41482 57291 45466 45561 73132 74931 56789 31582 124929 84335 58628 96118 88749
2504 88749 105343 72901 125110 119430 54303 49357 80095 77113 84976 111661 82658 107907 83895
2491 83895 104736 182107 101423 107440 79179 90950 53189 18779 12504 47067 34834 67277
2479 67277 116854 82916 80392 114445 97124 79220 104100 133595 135747 90903 116243 142731
2467 142731 105687 132640 164797 111162 172983 176303 134602 128846 113738 147234 135562 117227
2455 117227 131970 179837 176606 128835 129687 132508 135720 165470 154486 111730 99260 112998 75712
2442 75712 84030 137705 153533 135041 136448 142403 149102 133936 165464 162274 184073 227113 222949
2429B22949j2519K469m589k771M3812l4880m0J7072O201O950j7222j6597j3613
2416A97222L2553K6748m194j0006l6225M6665N1324l7244M0843q051r150K6793
2404C17278j9586M0164L5000j3540k3227N0493K617M725j8170j9661P0606Q2054
2392E08753K1755l685l3833J4191K2360k9078o7106M5386j6273K5802L6610K5054
2380E49936L23r439N861K6659k7543P0370n469M3817P3102J0653J8694k7873j3779
2367G15312L3495L2776k812J704J5511J9064P1063j7659p775K334M9533k6033
2355H86513O2906J23705m521L8976N8989R360P5167M7325N1438O8662Q9135J14766
2343A622421N1868M1927L9840P2714P6487J25980O7928L9405J5589N1327P5403
$$ plain form
2429 222949 210430 212899 208310 205539 249351 214471 214431 231503 237704 244654 227432 210835 197222
2416 197222 229775 256523 252329 242323 206098 252763 304087 266843 307686 299635 290485 317278
2404 317278 297692 337856 372856 359316 336089 386582 389199 393924 375754 356093 426699 508753
2392 508753 530508 526823 492990 507181 529541 500463 433357 478743 462470 488272 524882 549936
2380 549936 550259 540820 546681 573340 545797 616167 610698 654515 727617 738270 756964 729091 715312
2367 715312 748807 781583 778771 780475 795986 815050 886113 868454 860679 863013 912546 886513
2355 886513 949419 1073124 1068603 1107579 1166568 1175928 1251095 1298420 1349858 1418520 1507655 1622421
2343 1622421 1674289 1716216 1756056 1828770 1905257 2031237 2099165 2138570 2154159 2205486 2280889
2332B280889R8106R7137N1698J05298R5065J72493Q5500J32797J44021J30426
2322C393430J83233K30908K82592K65725L30016K86224K25870J99710K89829M58678
2312F146215O05323P17233J018513J258586J773046K337537L314920M412448N670592
2303B7254413N006744J282567l939287o327091n609687l818564k527724j781629
2295I539742j378454j037617q14844o63826n17236l27932j30665k19094k65281
2286D184793l98075l53433l72443k66233j46517j61538j85458j32228j72257j29066
2276A867545n8537o0901r1061j0093n2085r0381q6592q8475p4167q799j7399n2742
2264A176313m4103m2954j2772o4011j9520k8615r0076L6606o7273k5288m4454
$$ plain form
2332 2280889 2378995 2476132 2527830 2633128 2728193 2900686 2986186 3118983 3263004 3393430
2322 3393430 3576663 3807571 4090163 4355888 4685904 4972128 5197998 5397708 5687537 6146215
2312 6146215 6751538 7468771 8487284 9745870 11518916 13856453 17171373 21583821 27254413
2303 27254413 32261157 33543724 29604437 23277346 17667659 13849095 11321371 9539742
2295 9539742 8161288 7123671 6308827 5645001 5127765 4799833 4669168 4450074 4184793
2286 4184793 3786718 3433285 3060842 2794609 2648092 2486554 2301096 2168868 1996611 1867545
2276 1867545 1809008 1748107 1657046 1646953 1594868 1504487 1417895 1329420 1255253 1246454 1229055 1176313
2264 1176313 1132210 1089256 1076484 1012473 992953 964338 874262 910868 843595 818307 773853
2253G73853m4425M138J4090j348k3914J1127r1000r3218m3044p480L8155K6701
2241E63635m6811k3074j4073L814L1123j4314j3114m7078l3800q5379M0030L0120
2229C91079k9813k0153r358p866K3974K3588J3010n7123O676j0886n8422P408
2217B72114l5035K3321N8538n8359J878M593m8311k2565K4960L7715K5397l8282
2205B45964k9743J5216m2476J4605P101N383k5969m9258p057k9167K9954K6270
2193A60823j6565o672Q806J9819k7757L5059K0082n3993m4239K2222l2Q016J2736
2180A38305n8344m41K0899J780o817j4273P127m7639J4367M5980k3559K5843j4285
2167H8943k5063K3832K6665K2564r821q765N653P867j6402j1026J3314o373k0633
$$ plain form
2253 773853 729428 733566 747656 746308 722394 733521 642521 549303 506259 498779 536934 563635
2241 563635 516824 493750 479677 483491 514614 500300 487186 440108 406308 320929 360959 391079
2229 391079 361266 341113 331755 323889 347863 371451 384461 327338 334014 323128 264706 272114
2217 272114 237079 260400 318938 260579 262457 267050 218739 196174 221134 258849 284246 245964
2205 245964 216221 231437 188961 203566 210667 216050 190081 140823 133766 104599 134553 160823
2193 160823 144258 137586 146392 166211 138454 173513 193595 139602 95363 117585 117553 125569 138305
2180 138305 79961 79520 100419 102199 95382 81109 88236 40597 54964 100944 77385 103228 88943
2167 88943 63880 87712 114377 136941 127120 118355 124008 131875 115473 104447 117761 111388 90755
2154I0755j3440j2423n4229k035j3923J5759K8463j4939K0213J10L3169J1373
2142H8853o3251P82l157M9728l4110M538L5783k8829J350q987L838K821P2930
2129A22289l0657K4394k8363m974J1750m3607q413K3154p360J2287l7834O715
2117C9381N0952o1540K5925k4910J7689N0034n7552j0326J5600k0243J8655K4908
2105F8573k993k3566N656n894l3981k3339N1154m47K541J9317N27L076l7556j1643
2091A1425O3898j3685k5956K9968L0272j6264m1539l2216n0581J3260L6687K2429
2079B7698l8306N9103J1161l2974R213m2632l781N6848l6572k0202K1429L0361
2067D1346N2583R583k5543O534L236k7423J9110n1402k2219K1543k5717K4622
$$ plain form
2154 90755 77315 64892 10663 8628 -5295 10464 38927 23988 44201 44311 77480 88853
2142 88853 25602 26384 23227 72955 38845 43383 79166 50337 51687 42700 46538 49359 122289
2129 122289 91632 116026 87663 82689 94439 50832 42419 65573 58213 70500 32666 39381
2117 39381 90333 28793 54718 29808 47497 97531 39979 29653 45253 25010 43665 68573
2105 68573 65580 42014 47670 41776 7795 -15544 35610 35163 37704 57021 57548 60624 23068 11425
2091 11425 75323 61638 35682 65650 95922 79658 38119 5903 -44678 -31418 5269 27698
2079 27698 -10608 48495 59656 26682 35895 -6737 -10518 46330 9758 -10444 10985 41346
2067 41346 93929 103512 77969 84503 87739 60316 79426 28024 5805 27348 1631 26253
2055B6253R747K4874m5818J363P8131j5662j9914L0592J0919l8406K4975k9887
2043E7167m4394J2421L3343j833j7923O3252N101J5722M4234L8102j7061l4000
2031A54131l9471o4546K5458J145j5112j5488j5887j7467K2653O4990m893r993
2019H5520l9874l2866n6703k907O6059J6835L139k2270j1172K0096J6348j30n7556
2006a5481M1964K2747j1870l9347J1024J7607k5216J4064M586O24n0514n850J2223
1993b3439k9457L4846K8412p134n0861K0436L773m1252l332M7894p66j9180J3106
1980b6954J210N7898J8573k7570k6071J517k0388J9557M0401j2232l3855K1883
1968A3969j6565L6776j5980m8891J8615L3131j5892o373k6207j621j4386O349
$$ plain form
2055 26253 36000 60874 15056 16419 94550 78888 58974 89566 100485 62079 87054 57167
2043 57167 12773 25194 58537 56704 38781 102033 107134 122856 167090 205192 188131 154131
2031 154131 114660 50114 75572 76717 61605 46117 30230 12763 35416 100406 95513 85520
2019 85520 45646 12780 -43923 -46830 19229 36064 39203 16933 5761 25857 42205 42075 -15481
2006 -15481 26483 49230 37360 -1987 9037 26644 1428 15492 20078 20702 -29812 -35662 -23439
1993 -23439 -52896 -18050 10362 3228 -47633 -27197 -23424 -64676 -68008 -20114 -20880 -40060 -26954
1980 -26954 -25744 32154 50727 23157 -2914 -1397 -21785 -2228 38173 25941 -7914 13969
1968 13969 -2596 34180 18200 -30691 -12076 21055 5163 -1210 -27417 -29038 -43424 -37075
1956c7075J1081j553j2449m801L3701J3176k5524N8961L4427k7953k7007p966
1944G018L7966j7237j5800l1856K062R376j8236K9985N7966R558j8610m2899k0477
1931a1184R019Q19L0333n2692K4140k0429o2383N3662K9374K216L3141j8059j4167
1918C790R414m5668k2095Q072Q3146l4830n1156K8191j8057R355j006J2573k1156
1905c9427j0704k4370K9571K1448K4207l307k0573j9512l3310J9067R853L7353
1893i704L4198k6447k6492j407O288l5277J1332N3460j8498K8893j8681o926j1766
1880b1027q143P2072M783p9032K0126M28q154j6407L2120k1383l4775L8947j0843
1867c1288K773J1463K7502L819m3877k4149P782J6428M0677j3209J03R766L980
$$ plain form
1956 -37075 -25994 -27547 -39996 -44797 -11096 2080 -23444 35517 69944 41991 14984 7018
1944 7018 44984 27747 11947 -19909 -17847 -8471 -26707 3278 61244 70802 52192 9293 -11184
1931 -11184 -2165 -1346 28987 -23705 435 -19994 -82377 -28715 659 2875 36016 17957 3790
1918 3790 13204 -32464 -54559 -46487 36659 1829 -49327 -21136 -39193 -29838 -30844 -18271 -39427
1905 -39427 -50131 -74501 -44930 -23482 725 -2582 -23155 -42667 -75977 -56910 -47057 -9704
1893 -9704 24494 -1953 -28445 -29852 -23564 -58841 -47509 5951 -12547 16346 -2335 -9261 -21027
1880 -21027 -29170 42902 47685 -31347 -11221 -10793 -18947 -35354 -3234 -24617 -59392 -20445 -31288
1867 -31288 -28515 -17052 10450 14269 -29608 -53757 -45975 -29547 11130 -2079 -1976 7790 11770
1854A1770J2421j3333m6867k945J5760P662J716l475J4243r024k626j6063P666
1841b3095N9006L203m8254J4320K407m4609r361L8846J918J868k419L3201J6916
1828D3947l0390l0085O381N304M638l9570K7940k0521m3615J9275L2659m869K3072
1815e834O327K3847m2891n1304K3870J2641M2735K8029j8520n7994K335j3448
1803e0207N3318L4140m6592O277J6019k3109K3678J0931k8625m1079L7524N157
1791b568j5962J3458M7293r224m0880j3574k3949L7356k3241r306L6960m724K2454
1778A4093O533o239m4103k8794K7466L9858P583K1148l1020n1606j1109M1738
1766a4452j2170q0129L2880J2697O0515n4327L7127m338n9428J1642J8015K4336
$$ plain form
1854 11770 24191 10858 -36009 -38954 -23194 -15532 -13816 -17291 -3048 -12072 -14698 -30761 -23095
1841 -23095 35911 39114 -9140 5180 7587 -37022 -46383 -7537 -5619 -3751 -6170 27031 43947
1828 43947 13557 -16528 -10147 -4843 -205 -39775 -11835 -32356 -75971 -56696 -24037 -28906 -5834
1815 -5834 493 24340 -18551 -69855 -45985 -33344 9391 37420 18900 -39094 -36759 -50207
1803 -50207 3111 37251 -9341 -3064 12955 -10154 13524 24455 -4170 -45249 -7725 -2568
1791 -2568 -18530 -5072 42221 32997 -7883 -21457 -45406 -8050 -31291 -40597 -3637 -8361 14093
1778 14093 20626 14387 -29716 -58510 -31044 8814 16397 37545 6525 -45081 -56190 -14452
1766 -14452 -26622 -106751 -73871 -61174 -659 -54986 -17859 -22197 -81625 -69983 -51968 -27632
1754b7632n8157Q0609L4033j3650k9513r122L0011J1453N187l7251l3999j8895
1742f6926K1770j1587J1203K4155N4832k0063m7331J0461k8917M0120l085J1983
1730c385k3143j5518J6950n775M670o201J5586J6913l027n1718N9415o506k766
1717d505j9713M576j4045K901L3600j3364O4194j9272m3146j8538j5373k7414
1705g0099J0572J5998M2570J4066L0224k4363k3839L2338j9332K7254J2654o9292
1693b1249o500K6029k095r604N3201N357J2908j0333m4445M6919j0338n5853k984
1680a8987k913N335n4955P2745q523j5703j8527K1055K6153k9862M2710q8614
1668g0086l4059R0433M277o0640O690Q691j1823M2977Q39J2358m720j8396L951
$$ plain form
1754 -27632 -85789 -5180 28853 15203 -14310 -23432 6579 18032 23219 -14032 -48031 -66926
1742 -66926 -45156 -56743 -45540 -21385 33447 13384 -33947 -23486 -52403 -12283 -15368 -3385
1730 -3385 -26528 -42046 -25096 -30871 -26201 -32402 -16816 97 -2930 -54648 4767 -1739 -4505
1717 -4505 -24218 -19642 -33687 -30786 2814 -10550 53644 34372 -8774 -27312 -42685 -70099
1705 -70099 -59527 -43529 -959 13107 43331 18968 -4871 27467 8135 35389 48043 -21249
1693 -21249 -27749 -1720 -3815 -13419 39782 45139 58047 47714 3269 50188 39850 -16003 -18987
1680 -18987 -21900 -16565 -71520 1225 -7298 -23001 -41528 -20473 5680 -24182 18528 -70086
1668 -70086 -104145 -13712 -9435 -70075 -63385 -54694 -66517 -23540 -22701 -10343 -15063 -33459 -29508
1655b9508J6272m0868K6064L8029j4579m379j0339M8222r583j7631j3617n3916
1643f5833J6970N3180k5857o047J2451r164O172r260K6921M977K2016n643k2578
1630a695l8750J1599N241M3323K0008p4119J6229j537N366m1057L4495k0737M0823
1617h11l2513k1160K4260K708K1534l5550k6996O9182k9949l1731K9403L0708
1605i15J8656k4233j7153K0063r614j2508j1431M0977J8264p929l11k8125M0400
1592B6141J7752m2897O51J8985k4986m2981j7896K7393r225m5534j4005N8605
1580d7997K5991k0520k1844M5224k8198l1387L8217k7496L0733P640L7149j5364
1568g852l427R785K7764o6774j5501L2845K8110j9657q87L7709n4754r522K6252
$$ plain form
1655 -29508 -13236 -54104 -28040 9989 -4590 -8969 -19308 28914 19331 1700 -11917 -65833
1643 -65833 -48863 4317 -21540 -27587 -15136 -24300 -18128 -27388 -467 4510 26526 20883 -1695
1630 -1695 -40445 -28846 -23605 19718 39726 -34393 -18164 -19701 -14335 -55392 -20897 -41634 -811
1617 -811 -33324 -54484 -30224 -27516 -5982 -41532 -68528 654 -29295 -61026 -31623 -915
1605 -915 17741 -6492 -23645 -3582 -13196 -25704 -37135 3842 22106 14177 13866 -14259 26141
1592 26141 43893 996 1647 20632 -4354 -47335 -65231 -37838 -47063 -92597 -106602 -47997
1580 -47997 -22006 -42526 -64370 -19146 -47344 -78731 -40514 -68010 -37277 -29637 7512 -7852
1568 -7852 -11279 -1494 26270 -40504 -56005 -23160 4950 -14707 -15594 22115 -32639 -42161 -15909
1555a5909J6256q767L8914k3555n6840M7751K5187m2160L8745J9763j01485l8390
1543a00490M483L5281L0441P52O941J7790L4924p0652m7542J8858P716j3461P71
1530g4188o276L6378O40K6718N4420m4463J0438J7819j7856L5961l1220l4837
1518b6466J8222o380k8845j7986Q15M0343j7851J7774m7118J8544M9572l3110
1506c2486k5556J357O8219j2162k326j6786O989R746j0151J557K800J7522l6505
1493b7782M9434o411J3120j3313j2119J6199m555j8922l9535P1705M2937p0353
1481D05l8085l1176l7290j7583O7598J2697J6418J7155p229K1845k6806k4125
1469d6176M7937L922j9545k2687K7211J1529j9856J364q737o248J2223m431K4992
$$ plain form
1555 -15909 347 -8420 30494 6939 -49901 -2150 23037 -19123 19622 39385 -62100 -100490
1543 -100490 -96007 -60726 -30285 -29533 -22592 -4802 30122 -40530 -88072 -69214 -61498 -74959 -74188
1530 -74188 -80464 -44086 -43446 -16728 37692 -6771 3667 21486 3630 39591 8371 -26466
1518 -26466 -8244 -14624 -43469 -61455 -60640 -20297 -38148 -20374 -67492 -48948 624 -32486
1506 -32486 -58042 -56685 11534 -628 -2954 -19740 -12751 -3005 -13156 -11599 -8799 8723 -27782
1493 -27782 21652 15241 28361 15048 2929 19128 14573 -4349 -43884 27821 70758 405
1481 405 -37680 -68856 -106146 -123729 -56131 -43434 -27016 -9861 -17090 4755 -22051 -46176
1469 -46176 1761 5683 -13862 -36549 -9338 2191 -17665 -16301 -25038 -31286 -19063 -23494 1498
1456A498K857J4518j0227J397O852k6271j2960j5133L8795K6993n3703J110k0921
1443d5195j9264Q630K8682N8945l4134K0569J404m9974R45L4153j4666p5669L277
1430h2297N4311p653M1850r773N92o917J1300J2544k8363j5036N889K2882l1531
1417c2202j4086K0117K4231M7862p217j9132l2132m2917M2482J9620k0345J7762
1405D043M2510l6741l2953L3581K7849Q159m3578o2651j1239O4950k0690K0672
1393f088n3134K9679k440l3971J1567M1470K5252K390n986m1130n6650O775M7069
1380c5197L7988k4964N854j5303j6315j2212K1696L4896k4188m4870O2964j8130
1368b7781J5508P149J2099M216l4876L4050O102o043K1571j4940l184J6261o780
$$ plain form
1456 1498 4355 18873 8646 10043 16895 -9376 -22336 -37469 1326 28319 -25384 -24274 -45195
1443 -45195 -64459 -55829 -27147 31798 -2336 18233 19637 -30337 -29392 4761 -9905 -85574 -82297
1430 -82297 -27986 -35639 6211 -3562 -2970 -9887 1413 13957 -14406 -29442 -23553 -671 -32202
1417 -32202 -46288 -26171 -1940 45922 38705 19573 -12559 -55476 -12994 6626 -13719 4043
1405 4043 46553 9812 -23141 10440 38289 46448 2870 -59781 -71020 -6070 -26760 -6088
1393 -6088 -59222 -29543 -31983 -65954 -54387 -12917 12335 14725 8739 -32391 -89041 -82266 -35197
1380 -35197 2791 -22173 -16319 -31622 -47937 -60149 -38453 -3557 -27745 -72615 -9651 -27781
1368 -27781 -12273 -5124 6975 11191 -23685 10365 16467 10424 31995 17055 13871 30132 23352
1355B3352o564l2760K6259J3700O058J6712l3191j9367j4710l2110m886j5806
1343g3313J1825K4522N8613j9305l7750p782L9171j8130M4157n527M5586k6048
1331C6019k9422k5360k4533j3221J837L5211R47k2074J4578J0939j4466q029r289
1318d6863J3812Q689j6588L1560k4786j3637J4532L5309O291p079k564K8210K3808
1305E0694m8402r249J3817R986j9158M0163J8475k7028j4515m6311K01J4652L3242
1292A6567k8317l7484MN9125M1440r3315m8826O942O1031J2258p6L4615l1304
1279g340q742K6243K9339k5238k3085k415n942K1328n029J0674j4904n6908J9014
1266d3005Q978l1948P4568L735l2015k1597j1351o074p358n421L5733N1856N5161
$$ plain form
1355 23352 16788 -15972 10287 23987 30045 46757 13566 -5801 -20511 -52621 -57507 -73313
1343 -73313 -61488 -36966 21647 2342 -35408 -43190 -4019 -22149 22008 16481 62067 36019
1331 36019 6597 -18763 -43296 -56517 -54680 -19469 -18522 -40596 -26018 -15079 -29545 -37574 -46863
1318 -46863 -33051 -24362 -40950 -9390 -34176 -47813 -33281 2028 8319 1240 -1324 26886 50694
1305 50694 2292 -6957 6860 16846 -2312 37851 56326 29298 14783 -31528 -31327 -16675 16567
1292 16567 -11750 -49234 -49230 9895 51335 -41980 -90806 -83864 -22833 -10575 -10651 23964 -7340
1279 -7340 -16082 10161 39500 14262 -8823 -11238 -17180 4148 -881 9793 -5111 -62019 -43005
1266 -43005 -34027 -65975 8593 12328 -19687 -41284 -52635 -58709 -66067 -71488 -35755 16101 71262
1253G1262l3404m4927M6032k2588k7422k4278j5356K5840L3887O660m1146K744
1241b2696q4950M8954M1203k6339K7852m2259L0650m93Q089k4536j206K1571j2622
1228c6782N533n1197J5875J7927k3826M0091N3435K9507l0806m5431N032J59N905
1215a4578k113L5730M325K361r313m9335M5718K357j7792k2283J6645K3896k68
1202A5350k1228r249k5187l5971O5241N2604L479n063R764n0902j6690J7846k6661
1189b6667l6063k6811J2480J0094j1112J5554k1542M1334K8781J0327J7286o337
1177G324M5891q365m6129q600K1111K8536K0708n3692k3805O322L1717L0229L3712
1164H4959m2903n9119j5152K7689k1944o4454M697M8186M9242j4305n1003J3984
$$ plain form
1253 71262 37858 -7069 38963 16375 -11047 -35325 -50681 -24841 9046 15706 -25440 -22696
1241 -22696 -107646 -58692 -17489 -43828 -15976 -58235 -27585 -28078 -19989 -44525 -45731 -24160 -36782
1228 -36782 -31249 -82446 -66571 -48644 -72470 -32379 21056 50563 19757 -25674 -20642 -20483 -14578
1215 -14578 -16691 19039 23364 25725 16412 -32923 12795 15152 -2640 -24923 -8278 15618 15350
1202 15350 -5878 -15127 -40314 -76285 -11044 41560 45039 39976 49740 -1162 -17852 -6 -26667
1189 -26667 -62730 -89541 -77061 -66967 -78079 -62525 -84067 -42733 -13952 -3625 13661 7324
1177 7324 53215 44850 -1279 -9879 11232 39768 60476 6784 -17021 -10699 21018 51247 84959
1164 84959 42056 -17063 -32215 -4526 -26470 -90924 -86227 -38041 11201 -3104 -54107 -40123
1152d0123O3076j3676K5226k801k7091Q256m7426l4569N2183n44m6235R163J5796
1139c8765j8609K0855N1057o46k9413L8666k0560m0305J4776J1816M796l644P621
1126b355j6025m4732LO4046j2994r202N689K1194J0617K230p956j9601J106L419
1112d561K4314J458K535O349j9871L1910k8938j2415J1194m4611j4252M6688k5008
1099b5208o761N1228K4592j2710k4179j778j2365k1607N2240J725J3458J6341
1087E4976p933k4844l9602n764L5783k1425r060Q240m7971R182n950J7236m6148
1074h3280P8280j853j1050j6085K5512j5093J2357m3417l006L7722Q560j451j006
1061a3810n237k1268k1301K1862k8800P273N7916j2814L05P856k0007l047J94
$$ plain form
1152 -40123 22953 9277 34503 31702 4611 12867 -34559 -69128 -16945 -17489 -63724 -54561 -38765
1139 -38765 -57374 -36519 14538 13892 -15521 23145 2585 -37720 -22944 -11128 -6332 -9976 -2355
1126 -2355 -18380 -63112 -63109 937 -12057 -21259 -15570 5624 16241 18471 10515 -9086 -7980 -4561
1112 -4561 19753 21211 23746 30095 10224 42134 13196 781 11975 -32636 -46888 -200 -25208
1099 -25208 -31969 19259 43851 31141 6962 5184 -7181 -28788 23452 25177 38635 54976
1087 54976 47043 22199 -17403 -23167 12616 -8809 -17869 -9629 -57600 -48418 -54368 -37132 -83280
1074 -83280 -5000 -6853 -17903 -33988 -8476 -23569 -11212 -54629 -57635 -19913 -11353 -12804 -13810
1061 -13810 -19047 -40315 -61616 -39754 -68554 -61281 -3365 -16179 -15874 -8018 -28025 -31072 -30878
$$ [...]
##END NTUPLES=NMR SPECTRUM
##END=
