##TITLE=1H_EC-3307(32)
 CDCl3
 8 sc, 
 9.1.2024
##JCAMPDX= 6.0         $$ Bruker NMR JCAMP-DX V2.0
##DATA TYPE= NMR SPECTRUM
##DATA CLASS= NTUPLES
##ORIGIN= UXNMR, Bruker Analytische Messtechnik GmbH
##OWNER= root
$$ XWIN-NMR		Version 3.5
$$ Tue Jan  9 14:10:09 2024 Russian Standard Time (UT+4h)  she@DPX200
##.OBSERVE FREQUENCY= 200.1313
##.OBSERVE NUCLEUS= ^1H
##.ACQUISITION MODE= SIMULTANEOUS
##.ACQUISITION SCHEME= undefined
##.AVERAGES= 8
##.DIGITISER RES= 18
##SPECTROMETER/DATA SYSTEM= spect
##.PULSE SEQUENCE= zg30
##.SOLVENT NAME= CDCl3
##.SHIFT REFERENCE= (INTERNAL, CDCl3, 0, 15.467)
##AUDIT TRAIL= $$ (NUMBER, WHEN, WHO, WHERE, WHAT)
$$ ##TITLE= Audit trail, XWIN-NMR		Version 3.5
$$ ##JCAMPDX= 5.01
$$ ##ORIGIN= Bruker BioSpin GmbH
$$ ##OWNER= she
$$ F:/spectra/data/she/nmr/H-F/1/pdata/1/auditp.txt
$$ ##AUDIT TRAIL=  $$ (NUMBER, WHEN, WHO, WHERE, WHAT)
(   1,<2024-01-09 14:09:00.31 +0400>,<she>,<DPX200>,
      <created by zg, POWCHK disabled, PULCHK disabled
       configuration hash MD5:
       00 E9 B6 7A A2 85 ED C7 34 08 36 98 17 FE 4E 26
       data hash MD5: 16K
       D1 A7 F0 53 E8 7B 78 A7 08 41 8D ED 3F C0 27 D9>)
(   2,<2024-01-09 14:09:04.03 +0400>,<she>,<DPX200>,
      <Start of raw data processing
       efp BC_mod = 2 LB = 0.24 FT_mod = 6 PKNL = 1 PHC0 = -24590.42 PHC1 = 13.65273 SI = 16K 
       data hash MD5: 16K
       38 97 E0 C8 D0 1C 16 4C 17 5C 41 C0 6B 0D 4D 8E>)
(   3,<2024-01-09 14:09:22.82 +0400>,<she>,<DPX200>,
      <pk PHC0 = -1.110456 PHC1 = 0.6 
       data hash MD5: 16K
       70 F9 1B 17 EC AC E8 A8 8B 8F 47 CC F6 14 6A C7>)
(   4,<2024-01-09 14:09:26.65 +0400>,<she>,<DPX200>,
      <abs ABSG = 5 
       data hash MD5: 16K
       4C 05 7C CD 71 DD 25 4E EB D9 E5 EC AE 59 2D F5>)
$$ ##END=
$$ 
$$ hash MD5
$$ 4A 95 95 0E 7F 67 0D 4C D6 FE D8 20 B3 EC 7C 7A
##$RELAX= 
##$RELAX= 
##$RELAX= 
##$RELAX= 
##$RELAX= 
##$RELAX= 
$$ Bruker specific parameters
$$ --------------------------
##$DU= <F:/spectra>
##$EXPNO= 1
##$NAME= <H-F>
##$PROCNO= 1
##$TYPE= <nmr>
##$USER= <she>
##$AMP= (0..31)
100 100 100 100 100 100 100 100 100 100 100 100 100 100 100 100 100 100 
100 100 100 100 100 100 100 100 100 100 100 100 100 100 
##$AQSEQ= 0
##$AQ_mod= 1
##$AUNM= <au_zg>
##$AUTOPOS= <>
##$BF1= 200.13
##$BF2= 200.13
##$BF3= 200.13
##$BF4= 200.13
##$BF5= 200.13
##$BF6= 200.13
##$BF7= 200.13
##$BF8= 200.13
##$BYTORDA= 1
##$CFDGTYP= 0
##$CFRGTYP= 5
##$CHEMSTR= <none>
##$CNST= (0..31)
1 1 145 1 1 1 1 1 1 1 1 1 1 1 1 1 1 1 1 1 1 1 1 1 1 1 1 1 1 1 1 1 
##$CPDPRG= <>
##$CPDPRG1= <>
##$CPDPRG2= <>
##$CPDPRG3= <>
##$CPDPRG4= <mlev>
##$CPDPRG5= <mlev>
##$CPDPRG6= <mlev>
##$CPDPRG7= <mlev>
##$CPDPRG8= <mlev>
##$CPDPRGB= <>
##$CPDPRGT= <>
##$D= (0..31)
0 1.2 0 0 0 0 0 0 0 0.06 0 0.03 0 0 0 0 0.0002 0 0 0 0 0 0 0 0 0 0 0 0 
0 0 0 
##$DATE= 1704794939
##$DBL= (0..7)
120 120 120 120 120 120 120 120 
##$DBP= (0..7)
150 150 150 150 150 150 150 150 
##$DBP07= 0
##$DBPNAM0= <>
##$DBPNAM1= <>
##$DBPNAM2= <>
##$DBPNAM3= <>
##$DBPNAM4= <>
$$ [...]
##$SUBNAM3= <"">
##$SUBNAM4= <"">
##$SUBNAM5= <"">
##$SUBNAM6= <"">
##$SUBNAM7= <"">
##$SUBNAM8= <"">
##$SUBNAM9= <"">
##$SW= 18.0517328524113
##$SWIBOX= (0..15)
0 0 2 0 0 0 0 0 0 0 0 0 0 0 0 0 
##$SW_h= 3612.71676300578
##$TD= 16384
##$TD0= 1
##$TE= 0
##$TE2= 300
##$TE3= 300
##$TEG= 300
##$TL= (0..7)
0 120 120 120 120 120 120 120 
##$TP= (0..7)
150 150 150 150 150 150 150 150 
##$TP07= 0
##$TPNAME0= <>
##$TPNAME1= <>
##$TPNAME2= <>
##$TPNAME3= <>
##$TPNAME4= <>
##$TPNAME5= <>
##$TPNAME6= <>
##$TPNAME7= <>
##$TPOAL= (0..7)
0.5 0.5 0.5 0.5 0.5 0.5 0.5 0.5 
##$TPOFFS= (0..7)
0 0 0 0 0 0 0 0 
##$TUNHIN= 0
##$TUNHOUT= 0
##$TUNXOUT= 0
##$USERA1= <user>
##$USERA2= <user>
##$USERA3= <user>
##$USERA4= <user>
##$USERA5= <user>
##$V9= 5
##$VALIST= <valist>
##$VCLIST= <CCCCCCCCCCCCCCC>
##$VD= 0
##$VDLIST= <DDDDDDDDDDDDDDD>
##$VPLIST= <PPPPPPPPPPPPPPP>
##$VTLIST= <TTTTTTTTTTTTTTT>
##$WBST= 1024
##$WBSW= 4
##$XGAIN= (0..3)
0 0 0 0 
##$XL= 0
##$YL= 0
##$YMAX_a= 699154
##$YMIN_a= -857248
##$ZGOPTNS= <>
##$ZL1= 120
##$ZL2= 120
##$ZL3= 120
##$ZL4= 120
##$ABSF1= 15.45712
##$ABSF2= -2.594729
##$ABSG= 5
##$ABSL= 3
##$ALPHA= 0
##$AQORDER= 0
##$ASSFAC= 0
##$ASSFACI= 0
##$ASSFACX= 0
##$ASSWID= 0
##$AUNMP= <proc_1d>
##$AZFE= 0.1
##$AZFW= 0.1
##$BCFW= 0
##$BC_mod= 2
##$BYTORDP= 0
##$COROFFS= 0
##$CY= -3
##$DATMOD= 1
##$DC= 0
##$DFILT= <>
##$DTYPP= 0
##$F1P= 0
##$F2P= 0
##$FCOR= 1
##$FTSIZE= 16384
##$FT_mod= 6
##$GAMMA= 0
##$GB= 0
##$INTBC= 1
##$INTSCL= 3.70164e-10
##$ISEN= 128
##$LB= 0.24
##$LEV0= 0
##$LPBIN= 0
##$MAXI= 10000
##$MC2= 0
##$MEAN= 0
##$ME_mod= 0
##$MI= 1.114404
##$NCOEF= 0
##$NC_proc= -6
##$NLEV= 6
##$NOISF1= 3.799351
##$NOISF2= 2.8
##$NSP= 0
##$NTH_PI= 0
##$NZP= 0
##$OFFSET= 15.46703
##$PC= 1
##$PHC0= -24591.53
##$PHC1= 14.25273
##$PH_mod= 1
##$PKNL= yes
##$PPARMOD= 0
##$PSCAL= 0
##$PSIGN= 0
##$REVERSE= no
##$SF= 200.130010940938
##$SI= 16384
##$SIGF1= 3
##$SIGF2= 2
##$SINO= 5.538805
##$SIOLD= 16384
##$SREGLST= <1H.CDCl3>
##$SSB= 0
##$STSI= 16384
##$STSR= 0
##$SW_p= 3612.71676300578
##$SYMM= 0
##$S_DEV= 0
##$TDeff= 16384
##$TDoff= 0
##$TI= <>
##$TILT= no
##$TM1= 0
##$TM2= 0
##$TOPLEV= 0
##$USERP1= <user>
##$USERP2= <user>
##$USERP3= <user>
##$USERP4= <user>
##$USERP5= <user>
##$WDW= 1
##$XDIM= 16384
##$YMAX_p= 489455840
##$YMIN_p= -267554
$$ End of Bruker specific parameters
$$ ---------------------------------
##NTUPLES= NMR SPECTRUM
##VAR_NAME=  FREQUENCY,     SPECTRUM/REAL,   SPECTRUM/IMAG
##SYMBOL=    X,             R,               I
##VAR_TYPE=  INDEPENDENT,   DEPENDENT,       DEPENDENT
##VAR_FORM=  AFFN,          ASDF,            ASDF
##VAR_DIM=   16384,         16384,           16384
##UNITS=     HZ,            ARBITRARY UNITS, ARBITRARY UNITS
##FACTOR=    0.220516191357247, 1,           1
##FIRST=     3095.41679737475, 0,            0
##LAST=      -517.299965631028, 0,           0
##MIN=       -517.299965631028, -267554,     0
##MAX=       3095.41679737475, 489455840,    0
$$ Real data points
##PAGE= N=1
##DATA TABLE= (X++(R..R)), XYDATA
$$ [...]
6606A325949k11876j65152j9193r741L341K215L0825p1188J5568o4653r5027L5289
6594G76357m413l9165r8804l515j307n4745J71803o1141o9932J8835K2913N8029
6582G14915n285j14011k711Q9348q7047j9935J31421o8855n595k9475N0819r4437
6570E59152l4894n9754J3960J00837j8090O6109j6808m4282q264n4989j2153N3372
6558E44196j262Q0279n3826L8199R1797l3818j7303o3959m4495q7835R9902N3477
6546F05352m6600n3388M6579R18n7373K0324J8124N3303L8494N8062q508m4860
6534F30427o1499P1691r200j07591j13147P077O7450L3975l0867N8365r373J0267
6522E47575j4630K0979M4238m3953J3545j08744o002K5956Q7339l8324m8511J2506
$$ plain form
6606 1325949 1114073 948921 929728 919987 923328 925543 956368 885180 900748 836095 741068 776357
6594 776357 771944 732779 633975 630460 629153 574408 746211 685070 615138 633973 656886 714915
6582 714915 709630 595619 592908 682256 595209 575274 706695 637840 632245 602770 653589 559152
6570 559152 524258 464504 478464 579301 561211 627320 610512 566230 557966 502977 490824 544196
6558 544196 542934 623213 569387 607586 699383 665565 648262 584303 539808 451973 551875 605352
6546 605352 558752 505364 551943 552861 495488 515812 533936 587239 625733 683795 675287 630427
6534 630427 568928 640619 631419 523828 410681 417758 485208 519183 488316 546681 537308 547575
6522 547575 532945 553924 598162 554209 567754 459010 453008 478964 566303 527979 479468 491974
6510D91974J0993J36456K0972m1057j7467O984k2939j146j6436Q2147j33020j0164
6498E07297M1282M6925R9174o4117K2386l7335R512J10571m4723R0819k8280j00243
6486F53268J09947M3662p7118m4890M0186L0139K5730j64213l2361J12005o3345
6475F33010J19158K2004k9086Q0659m0396M2310K3588j21190k2731L4321K6656
6464G68303l332J8253O3455J4406N3948J09208l1923o1728P474j02223K0139N0504
6452I06484q4029O6901p0293r0534L0934P0844K7682j543O9278L6540m5379L5674
6440I52559K4653L9950k1169R2583J13938O0561N3988j9370l4018j08026j0107
6429A145542p3724P1921j302m7202o7027r6233j9894K2505O0288M5328J0079J8959
$$ plain form
6510 491974 502967 639423 660395 619338 601871 608855 585916 584770 568334 650481 517461 507297
6498 507297 548579 595504 694678 630561 652947 615612 625124 735695 690972 781791 753511 653268
6486 653268 763215 806877 729759 684869 725055 755194 780924 616711 584350 696355 633010
6475 633010 752168 774172 745086 825745 785349 827659 851247 730057 707326 741647 768303
6464 768303 764971 783224 846679 861085 915033 1024241 992318 930590 938064 835841 855980 906484
6452 906484 822455 889356 819063 728529 759463 830307 857989 856446 925724 962264 916885 952559
6440 952559 977212 1017162 995993 1088576 1202514 1263075 1317063 1297693 1263675 1155649 1145542
6429 1145542 1071818 1143739 1142437 1095235 1028208 931975 912081 934586 994874 1040202 1050281 1069240
6417A069240N9143P910J8591n0274M026k7025M3638R4657k3627n7966J0881M0723
6405A189917n5736j2030q6966P1003O9702o7427m9792l9907N5505N661l975J15903
6393A191858P1043N43m111R1750N753J879m86m4712r5072m881N0751r0430K4369
6380A198254p4982J4009J6302r9913K2970L8364j1924m6450m281L7410K4070K5240
6368A139069O4208M5038o1171l8609k0167N0056Q798N2062m5450k2248M6267O779
6356A224632M3608k14470O6548J02118l8315N5171L72j19581J1302O0352P9057
6345A270794j07744N7003j26333J58406Q6713r8705m3897l9208J29315L7246K3167
6334A346757Q913n6754j6616L9756J08635j4287j08934l4229L5261L0012N0948
$$ plain form
6417 1069240 1128383 1136293 1154884 1104610 1108636 1081611 1125249 1219906 1196279 1138313 1149194 1189917
6405 1189917 1134181 1122151 1035185 1106188 1175890 1108463 1058671 1018764 1074269 1079930 1075955 1191858
6393 1191858 1262901 1263444 1259333 1351083 1356836 1358715 1358229 1313517 1218445 1213564 1264315 1173885 1198254
6380 1198254 1123272 1137281 1153583 1053670 1076640 1115004 1103080 1056630 1052349 1089759 1113829 1139069
6368 1139069 1203277 1248315 1187144 1148535 1128368 1178424 1187222 1239284 1193834 1171586 1217853 1224632
6356 1224632 1268240 1053770 1120318 1222436 1184121 1239292 1239664 1120083 1131385 1191737 1270794
6345 1270794 1163050 1220053 1093720 1252126 1338839 1240134 1196237 1157029 1286344 1323590 1346757
6334 1346757 1355670 1298916 1282300 1322056 1430691 1416404 1307470 1273241 1308502 1338514 1389462
6323A389462M4802K0269r7559k367P1193P4673Q9318J3503n7573j14357J2610
6312A443974J28247J35526L5623o1203O4395n3220r780J13761j25207J22055J8210
6301A812381M119M7397j1079J75Q116k8207K5537m2200J44746l4107k1727j5087
6289A890064Q8505R7149J4675J4295m7364K2051J54686J06169K0385K6005N87
6278B387207P7366J6135q2365r2261J17580J24683m5270J07302n5861J34191J1835
6267B700542j0023J7664N3576R2325P3140n7338p0010K39544N4734O2507O7069
6256C223730J1631J23172K0269N3824J17303O2729K0388Q1327J0499P0878R0166
6245C885916J43256N6270k9136J39874N5789K3235J31848J50390M9664J35548
$$ plain form
6323 1389462 1434264 1454533 1356974 1354607 1425800 1500473 1589791 1603294 1545721 1431364 1443974
6312 1443974 1572221 1707747 1743370 1682167 1746562 1693342 1683562 1797323 1672116 1794171 1812381
6301 1812381 1816500 1863897 1852818 1852993 1861109 1832902 1858439 1816239 1960985 1926878 1905151 1890064
6289 1890064 1978569 2075718 2090393 2104688 2057324 2079375 2234061 2340230 2360615 2386620 2387207
6278 2387207 2464573 2480708 2398343 2306082 2423662 2548345 2503075 2610377 2554516 2688707 2700542
6267 2700542 2690519 2708183 2761759 2854084 2927224 2869886 2799876 3039420 3094154 3156661 3223730
6256 3223730 3235361 3358533 3378802 3432626 3549929 3612658 3633046 3714373 3724872 3795750 3885916
6245 3885916 4029172 4085442 4056306 4196180 4251969 4275204 4407052 4557442 4607106 4742654
6235D742654K6499J5696Q9420N7474P9510N9137J29163J08199O3812P2040J77190
6224E620794J49812J16214J18006K11036J75751O8303J25297K20077J79319L1767
6214G016376J51360r231J42902Q8362Q8175J39268N0694R6683J20748J47808J22265
6203H155410K12538J28822J85293K12789K09213J46945J28253L43351J46999K51134
6193A0120747J44544K94836L81754J66065K78559K12724K77503K82918J80194
6184A2339844K35894K25731J77571J59198J93651L59523M55554L64196L55085
6175A4866247M09823M92131N91096O90319O25370Q36133Q94079R38110R94686
6166B1337994J190971J275325J344675J603925J889224K195993K518520L044877
$$ plain form
6235 4742654 4769153 4784849 4874269 4931743 5011253 5070390 5199553 5307752 5371564 5443604 5620794
6224 5620794 5770606 5886820 6004826 6215862 6391613 6459916 6585213 6805290 6984609 7016376
6214 7016376 7167736 7158505 7301407 7389769 7477944 7617212 7667906 7764589 7885337 8033145 8155410
6203 8155410 8367948 8496770 8682063 8894852 9104065 9251010 9379263 9722614 9869613 10120747
6193 10120747 10265291 10560127 10941881 11107946 11386505 11599229 11876732 12159650 12339844
6184 12339844 12575738 12801469 12979040 13138238 13331889 13691412 14146966 14511162 14866247
6175 14866247 15276070 15768201 16359297 17049616 17674986 18511119 19405198 20343308 21337994
6166 21337994 22528965 23804290 25148965 26752890 28642114 30838107 33356627 36401504
6158C6401504L485517L937444M300659M370159L827215K142358j9273j798853
6150E6646730l114739l613465l254379k622158j910594j483468q62464k65377
6142C9520086J02891M30870Q79725J117039J443326J859069K224359K654345L237283
6133E3468993L945455M865542N916661P155315Q469407R410595R420664P803577
6125A10456209L801550k064202p737406j1008051j1203338r810905p719491n772694
6117E8941672m316535l201673k371757j811705j358150j015234q34808p33421
6109D3298389n47776j98349K67981P71333J440047K034762K857475L432343M098017
6100E7454222M389298L617415J873458p95714l506058n437543o191430n764455
$$ plain form
6158 36401504 39887021 43824465 48125124 52495283 56322498 58464856 58445583 56646730
6150 56646730 53531991 49918526 46664147 44041989 42131395 40647927 39785463 39520086
6142 39520086 39622977 40053847 40933572 42050611 43493937 45353006 47577365 50231710 53468993
6133 53468993 57414448 62279990 68196651 75351966 83821373 93231968 102652632 110456209
6125 110456209 114257759 112193557 104456151 93448100 82244762 72433857 64714366 58941672
6117 58941672 54625137 51423464 49051707 47240002 45881852 44866618 44031810 43298389
6109 43298389 42750613 42552264 42820245 43591578 45031625 47066387 49923862 53356205 57454222
6100 57454222 61843520 65460935 67334393 66538679 63032621 57595078 51403648 45639193
6092D5639193m974288l974233l252120k598452k090871j817529j674029j502344
6084B3755327j428722j331117j250033j146233r09233q01887n71982m72328l84366
6075A5459426k50432l38688m11674m26832n22495o08148o13748m56116n62855
6066A1268438n35908l21226l18254k22486k35619j42679k36474p3278M110k8479
6056I158145K7612K3931R8037J94908K64586M16768L90500M71172N63774M01189
6046A2010622J25864k41798o95904r27832p54034o77022n02003m27975l72900
6037G537018l20015k21927j44814j24763j85287j76751k8358n6973M0050l0269
6027F287911N4237R1057J12834P3513K64569K54999J53576J59235j41093k37467
$$ plain form
6092 45639193 40664905 36690672 33438552 30840100 28749229 26931700 25257671 23755327
6084 23755327 22326605 20995488 19745455 18599222 17689989 16888102 16316120 15843792 15459426
6075 15459426 15208994 14870306 14458632 14031800 13509305 12901157 12287409 11831293 11268438
6066 11268438 10732530 10411304 10093050 9870564 9634945 9492266 9255792 9182514 9186624 9158145
6056 9158145 9185757 9209688 9307725 9502633 9767219 10183987 10574487 11045659 11609433 12010622
6046 12010622 12136486 11894688 11198784 10270952 9516918 8839896 8337893 7909918 7537018
6037 7537018 7217003 6995076 6850262 6725499 6540212 6363461 6335103 6278130 6318180 6287911
6027 6287911 6342148 6433205 6546039 6619552 6884121 7139120 7292696 7451931 7310838 7073371
6017G073371l31491l76248m27309m06469k77151j56013k57007k40699k22955j50380
6007D227649p3995q4716o3109j28347j27616j26815j51804P688p8341j5248q6553
5996C298793j22205m4964l0166l5225p8718m8909m0430K59j4735r7405l9082L9896
5984B787109j7073o9663p419l6381L1926J0840n8676q3852j51033l3675r334n8269
5972B304500J25437j6236j41864J9396L8998q4791R034j5010l3710L5468Q78k9583
5960B212517l8299M5980M2816l442K034m9615N1048r0617k5316M3459Q337o4581
5948B134321o1567O8958Q5538L1873q7284P573n5319MJ23537K1918n586k8239
5936B235727o5760n1778J24351q9825R5234J72286q9941q2915N1797M2028m6480
$$ plain form
6017 7073371 6741880 6365632 5938323 5531854 5254703 5098690 4841683 4600984 4378029 4227649
6007 4227649 4153654 4068938 4005829 3877482 3749866 3623051 3471247 3478935 3400594 3385346 3298793
5996 3298793 3176588 3131624 3101458 3066233 2987515 2938606 2898176 2898435 2883700 2786295 2747213 2787109
5984 2787109 2770036 2700373 2692954 2656573 2688499 2699339 2640663 2556811 2405778 2372103 2362769 2304500
5972 2304500 2429937 2413701 2271837 2291233 2330231 2245440 2254474 2239464 2205754 2241222 2242100 2212517
5960 2212517 2174218 2220198 2263014 2259572 2261606 2211991 2263039 2172422 2147106 2190565 2198902 2134321
5948 2134321 2072754 2141712 2227250 2259123 2171839 2179412 2124093 2124097 2247634 2269552 2263966 2235727
5936 2235727 2169967 2118189 2242540 2152715 2247949 2420235 2330294 2247379 2299176 2341204 2294724
5925B294724L0327Q1161R002L5222L0019o1015n0107n5437p8033L7600M3843J0139
5913B327445L9999k8816N2615j244q081j4186Q462P75M8635P6736O3315m8334
5901B517321P2484N9904O9925r8230j1212J4225M5359O0885m4517p5926M8885
5890B659103L994J33059m5294J31742M3767n7252J06002J15894Q3580p742K9734
5879C196587M7702J72898J16977M437j2932L2097q595N5896Q3485m9175k3043
5868C616334O9487l6803M2010P7652j4715M5665Q5772j4149P6568J72805J30957
5857D251583L1698R9397J24327J14315j2681J51491J35670N043N3959O1570J9660
5846E036032r1208K5728l2874J4666J2468P2478N0422o4137M9014O825J00931
$$ plain form
5925 2294724 2325051 2406212 2415214 2450436 2480455 2419440 2369333 2313896 2235863 2273463 2317306 2327445
5913 2327445 2367444 2338628 2391243 2389999 2381918 2367732 2376194 2376969 2425604 2502340 2565655 2517321
5901 2517321 2589805 2649709 2719634 2621404 2610192 2624417 2669776 2730661 2686144 2610218 2659103
5890 2659103 2663097 2796156 2750862 2882604 2926371 2869119 2975121 3091015 3174595 3166853 3196587
5879 3196587 3244289 3417187 3534164 3538601 3525669 3557766 3549171 3605067 3688552 3639377 3616334
5868 3616334 3685821 3649018 3691028 3768680 3753965 3799630 3885402 3871253 3947821 4120626 4251583
5857 4251583 4283281 4382678 4507005 4621320 4608639 4760130 4895800 4900843 4954802 5016372 5036032
5846 5036032 4944824 4970552 4937678 4952344 4964812 5037290 5087712 5023575 5072589 5079414 5180345
5835E180345N4530J52595J30283J58848R6613o1289N0740L8954J8340o9346j1676
5824E738937J16780N6201q3798o9179Q3343O0069N1276R4688J27567k1649R3499
5813F247734N6950N8778J34654j8140K7246J74342J54203L5017O1070J130l1527
5802F901457j8445K0431P8284J31895R2920P731R9739J36457M5808J76519K08248
5791G881044O2234J84921K04024J55220J70139J40039Q1273R4664J21310O6997
5781I161865J34508J06607N3357L1354J49701J84712J54280J36022K22174J67755
5771A0502335J22086J57725J64625L00926K63386K54397K01694K83789K64995
5762A2515958K68568K70250L55248K73759L22467L15333K83595L13117K65231
$$ plain form
5835 5180345 5234875 5387470 5517753 5676601 5773214 5711925 5762665 5801619 5819959 5750613 5738937
5824 5738937 5855717 5911918 5828120 5758941 5842284 5902353 5953629 6048317 6175884 6154235 6247734
5813 6247734 6304684 6363462 6498116 6479976 6507222 6681564 6835767 6870784 6931854 6932984 6901457
5802 6901457 6883012 6903443 6981727 7113622 7206542 7214273 7314012 7450469 7496277 7672796 7881044
5791 7881044 7943278 8128199 8332223 8487443 8657582 8797621 8878894 8973558 9094868 9161865
5781 9161865 9296373 9402980 9456337 9487691 9637392 9822104 9976384 10112406 10334580 10502335
5771 10502335 10624421 10782146 10946771 11247697 11511083 11765480 11967174 12250963 12515958
5762 12515958 12784526 13054776 13410024 13683783 14006250 14321583 14605178 14918295 15183526
5753A5183526L09761L21347K22608K01004L47656K22127K91569M33541L21243
5744A7854382N08860N99914N20343O02554N92902P80957Q61863R32989R59558
5735B4214322J062249J161691J351285J373242J754365J818346K124569K481901
5727C7341970K889413L384529L998222M846810N482360N971982N855593M665833
5719G4436712K008820j287881m112495n338959n366540m580403l646542k659071
5711D9453641k002649j244456n45468o0651K69995O49793J126475J524883J981681
5702E1153244K396279K955590L523336M343136N437466O804424Q532565J0378210
5694I5524250J1694413J0667354N567233k082794q257939j1556175j1868131j0603092
$$ plain form
5753 15183526 15493287 15814634 16037242 16238246 16585902 16808029 17099598 17533139 17854382
5744 17854382 18363242 18963156 19483499 20086053 20678955 21459912 22321775 23254764 24214322
5735 24214322 25276571 26438262 27789547 29162789 30917154 32735500 34860069 37341970
5727 37341970 40231383 43615912 47614134 52460944 57943304 63915286 69770879 74436712
5719 74436712 76445532 75157651 71045156 65706197 60339657 55759254 52112712 49453641
5711 49453641 47450992 46206536 45661068 45600417 45870412 46520205 47646680 49171563 51153244
5702 51153244 53549523 56505113 60028449 64371585 69809051 76613475 85146040 95524250
5694 95524250 107218663 117886017 123453250 121370456 113112517 101556342 89688211 79085119
5686G9085119q736656o673777n258038l927919k828540k307771j499365q30677
5678D7022376n26660k69549L4310J89767L7539L62101N69790Q95606J464158K124465
5668E1903903K616757L096836L347109K500727O15977j637449l757628m889651
5660E3796581n142492m505466l645292k781394k152089j720250j179973q13022
5652C1856603n30194n09564p38765r22704q94889q02721q90691o58024o45356
5643B5263695o28591n60689k51166j68633l44702k52915o8133J811j25826K4472
5633B2889323J37545K85096K87604K40826L53386L92986N03307N12732M81586
5624B6084391L95127K96829K14428K1662k16331l45280j40889j83208k2709Q1976
$$ plain form
5686 79085119 70348463 63674686 58416648 54488729 51660189 49352418 47853053 47022376
5678 47022376 46495716 46226167 46260477 46450244 46487783 46849884 47419674 48315280 49779438 51903903
5668 51903903 54520660 57617496 60964605 63465332 64081309 62443860 58686232 53796581
5660 53796581 48654089 44148623 40503331 37721937 35569848 33849598 32669625 31856603
5652 31856603 31326409 30816845 30078080 29155376 28260487 27457766 26567075 25909051 25263695
5643 25263695 24635104 24074415 23823249 23654616 23309914 23056999 22988866 22990677 22864851 22889323
5633 22889323 23026868 23311964 23599568 23840394 24193780 24586766 25090073 25602805 26084391
5624 26084391 26479518 26776347 26990775 27012437 26796106 26450826 26309937 26126729 26104020 26185996
5614B6185996L21460K31978L34869M33111M45791L90779M25926M48320M70260
5605B9688490P41275P41914N41589O15094P18883Q67352J068139J084612J206929
5596C7274277J047393O09432J06266j4722j35487k06346J56763J10744M35572
5587C9383892N38716O29487P18969Q94161J050011J008188R04957J047186J171913
5578D7347480J327259J613331J795491K025713K064294K454395K582908K810886
5570F4021757K912997K767179K565256K415277K560452L198759L757593M624611
5562H8823881N519038N976982O659810P663389P962138P300177N117040J203193
5554A36225648k192644m003845m276269l298820j855529l81114J310379K792463
$$ plain form
5614 26185996 26507456 26739434 27074303 27507414 27953205 28343984 28769910 29218230 29688490
5605 29688490 30429765 31171679 31713268 32328362 33047245 33914597 34982736 36067348 37274277
5596 37274277 38321670 38931102 39037368 39022646 38887159 38680813 38837576 38948320 39383892
5587 39383892 39922608 40552095 41271064 42165225 43215236 44223424 45128381 46175567 47347480
5578 47347480 48674739 50288070 52083561 54109274 56173568 58627963 61210871 64021757
5570 64021757 66934754 69701933 72267189 74682466 77242918 80441677 84199270 88823881
5562 88823881 94342919 100319901 106979711 114643100 122605238 129905415 135022455 136225648
5554 136225648 134033004 130029159 125752890 122454070 120598541 120217427 121527806 124320269
5546A24320269L928031M454606M433495L739919L263264L694198N009065O940471
5538A59783318R112251J1891821J4630947J7265117J8822372J8989232J7089229
5531B67584287J3619557R383641O056379N023888N894965O350197M288492M91699
5523C18693105l197716o313459j0023187j4314641j7564506j7944080j5734211
5516B33601305j3792137j3241001j3186354j2063596j0155537q093535n992889
5509A57076256m022197k678299k712761m073280o058491p379121p955506q387583
5501A13809018q638275q380982p410795o329895n310369m320793l555950k953814
5493F6908145k768968k742189k757052k859229k955617k831655k430534k091280
$$ plain form
5546 124320269 128248300 132702906 137136401 140876320 144139584 147833782 152842847 159783318
5538 159783318 168895569 180787390 195418337 212683454 231505826 250495058 267584287
5531 267584287 281203844 290587485 296643864 301667752 307562717 313912914 318201406 318693105
5523 318693105 315495389 309181930 299158743 284844102 267279596 249335516 233601305
5516 233601305 219809168 206568167 193381813 181318217 171162680 163069145 157076256
5509 157076256 153054059 150375760 147662999 143589719 137531228 130152107 122196601 113809018
5501 113809018 105170743 96789761 89378966 83049071 77738702 73417909 69861959 66908145
5493 66908145 64139177 61396988 58639936 55780707 52825090 49993435 47562901 45471621
5485D5471621j750266j670145j431854j506749j375932j116932j053787j087287
5477C4478669j096074j039367j406957j263258j169819r91809r15831r50204j124117
5468B4521233r71845q26998p64152p39592p01019o09942n59508m84095n04049
5459A8360033n05626m44925l97235l57270k84562k71267l89135l30873m26317
5450A4952823l43142k64815l71700k77741k95227k39961k08377k10019k08722
5441A2533119k90585j84284q3769l6107r6604o1400j07515o989j10655p3581j6920
5430A1464710n8234k1715o2726L5831o5322q7099J12474J29118K26562K82602
5420A1956201L85231M39487O53030Q33954J244040J568902J801145J969026J368800
$$ plain form
5485 45471621 43721355 42051210 40619356 39112607 37736675 36619743 35565956 34478669
5477 34478669 33382595 32343228 30936271 29673013 28503194 27511385 26595554 25645350 24521233
5468 24521233 23549388 22722390 21958238 21218646 20517627 19907685 19348177 18864082 18360033
5459 18360033 17854407 17409482 17012247 16654977 16370415 16099148 15710013 15379140 14952823
5450 14952823 14609681 14344866 13973166 13695425 13400198 13160237 12951860 12741841 12533119
5441 12533119 12242534 12058250 11974481 11938374 11841770 11780370 11672855 11665866 11555211 11481630 11464710
5430 11464710 11406476 11384761 11322035 11357866 11292544 11205445 11317919 11447037 11673599 11956201
5420 11956201 12341432 12780919 13433949 14267903 15511943 17080845 18881990 20851016 22219816
5411B2219816J1777j491093k233730k247154j854163j411586j058188q73941o35739
5402A0425999l48870k92688l91693l69763k60666j3089n6248j90425l18423l41939
5392G842195k70812k49582j87091k39238l08195k37103k62730n0070j73328j67968
5382E696078p2850r5161j20341m3244j03542r5934k926M0467N0825m4883K2927
5371E231416j346N8391J5426o892J10572l1999l3782R826l0702j08087L2266l0689
5359E214400K2820K1687J21327J59241p5937j39436j66866k82077j59216p1400
5349D644543j07961j79724j31026q0266m5652m4452N1433K9871n0411M683o584
5338D084454j7064m7634n7591l5521J25571L5239J55777L5980J42523Q6008L14269
$$ plain form
5411 22219816 22231593 20740500 18506770 16259616 14405453 12993867 11935679 11061738 10425999
5402 10425999 10077129 9784441 9392748 9022985 8762319 8749230 8692982 8502557 8184134 7842195
5392 7842195 7571383 7321801 7134710 6895472 6587277 6350174 6087444 6037374 5864046 5696078
5382 5696078 5623228 5528067 5407726 5364482 5260940 5165006 5162080 5202547 5253372 5208489 5231416
5371 5231416 5230070 5288461 5303887 5296995 5407567 5375568 5341786 5351612 5320910 5212823 5245089 5214400
5359 5214400 5237220 5258907 5380234 5539475 5463538 5324102 5157236 4875159 4715943 4644543
5349 4644543 4536582 4356858 4225832 4145566 4099914 4055462 4106895 4136766 4086355 4091038 4084454
5338 4084454 4067390 4019756 3962165 3926644 4052215 4087454 4243231 4279211 4421734 4507742 4822011
5327D822011M24286M14332M17853M53957K86475L6207j66239n26673n05295n31304
5317E125610m36776l34229j70002k22679k12264j49277n9533M0360k7629q1796
5307C471785k4009O4492J4453r238L020m4221J11539J02852J24885K00611J90566
5296D206735J66667L20079M07963M86720M23592L95895K07878l00265n82055m82855
5286E250354n00941m64076k70788k93874j71426k19187j65458j53301J7107p6664
5276B951746P266J9916j12836m2825J07132J48650j27132q2423L6586n0122O4505
5265B920463j2467R9821J46462J5118J333K31870J36829N7444J5244j16807r1254
5254C404056j63949o0570k6808j14688j11656j9412J23756N9947j12620J3621
$$ plain form
5327 4822011 5246297 5660629 6078482 6532439 6818914 6855121 6688882 6162209 5656914 5125610
5317 5125610 4688834 4354605 4184603 3961924 3749660 3600383 3540850 3581210 3553581 3471785
5307 3471785 3447776 3512268 3526721 3517483 3520503 3476282 3587821 3690673 3815558 4016169 4206735
5296 4206735 4373402 4693481 5101444 5588164 6011756 6407651 6615529 6315264 5733209 5250354
5286 5250354 4749413 4285337 4014549 3720675 3549249 3330062 3164604 3011303 3028410 2951746
5276 2951746 2959012 2978928 2866092 2823267 2930399 3079049 2951917 2869494 2906080 2855958 2920463
5265 2920463 2907996 3007817 3154279 3169397 3170730 3402600 3539429 3596873 3612117 3495310 3404056
5254 3404056 3240107 3179537 3152729 3038041 2926385 2906973 3030729 3090676 2978056 2991677
5244B991677j06534l1314M1546j2891n0514R5361J19395k2395m1788p7706l1666
5233B873171m5107K7573m9427q5741l7281N8044n8484n8003M3650j8585J28030
5222B777840J22271J25847J25809K49853k3959J09756O6624R8899K32492J88373
5212D073805J3113j35689p0708p2846m7135j86832r6838j96792j27280k4422j39763
5201B988613j11670L3728P6147j4748m8193q6317P8857J38180o5228j8988o5875
5190B904506N4754R7129N0381P9252r2453K0444Q8154j36977o1193O6533M6907
5179C117437l0947l4287j22893j09473j0922n4203j50867n5129r240L1701M8585
5168B619762n8264p3924Q5781p8221j15217N865K011o9909o5089m0104K5600N8092
$$ plain form
5244 2991677 2885143 2853829 2895375 2882484 2831970 2927331 3046726 3024331 2982543 2904837 2873171
5233 2873171 2828064 2855637 2806210 2720469 2683188 2741232 2682748 2624745 2668395 2649810 2777840
5222 2777840 2900111 3025958 3151767 3401620 3377661 3487417 3554041 3652940 3885432 4073805
5212 4073805 4086918 3951229 3880521 3807675 3760540 3573708 3476870 3280078 3152798 3128376 2988613
5201 2988613 2876943 2910671 2986818 2972070 2923877 2837560 2916417 3054597 2989369 2970381 2904506
5190 2904506 2959260 3056389 3106770 3186022 3093569 3114013 3202167 3065190 3003997 3070530 3117437
5179 3117437 3086490 3052203 2929310 2819837 2808915 2754712 2603845 2548716 2539476 2571177 2619762
5168 2619762 2561498 2487574 2573355 2495134 2379917 2385782 2387793 2317884 2252795 2212691 2238291 2296383
5156B296383P3136n1869o0200R88K4654N8938N5239P887J11845R047j2201J3103
5144B526950N8919J8617k729m521p6480Q2887K3952O8834n5883n3628Q41Q1847
5132B669606j04006j4822o6530J32017J2613L7501p2540L182J29058M3687k493
5121B767273m5282P4736j542O7502J66311J30102M1434q2847k8679l5896J5948
5110C069060m5100k8814K9228n5131P2503l2918l0258J01992J7931K8561M2207
5099C169261p217P7114N9123L4349K5534J24199M0585N4545M8694K2440j10291
5088C538336K3235q5450r6780N3805L8364M8557p9198P6374k6899N1591P9619
5077C621554J07618J15314m113K05525Q8810J21396M6093O4054J39290P8165j5845
$$ plain form
5156 2296383 2369519 2317650 2257450 2258438 2283092 2342030 2397269 2405156 2517001 2526048 2513847 2526950
5144 2526950 2585869 2604486 2601757 2597236 2520756 2603643 2627595 2696429 2640546 2586918 2587759 2669606
5132 2669606 2565600 2550778 2484248 2616265 2628878 2666379 2593839 2597021 2726079 2769766 2767273
5121 2767273 2721991 2796727 2795185 2862687 3028998 3159100 3200534 3117687 3089008 3053112 3069060
5110 3069060 3023960 2995146 3024374 2969243 3041746 3008828 2978570 3080562 3098493 3127054 3169261
5099 3169261 3162044 3239158 3298281 3332630 3358164 3482363 3522948 3577493 3626187 3648627 3538336
5088 3538336 3561571 3476121 3379341 3433146 3471510 3520067 3440869 3517243 3490344 3541935 3621554
5077 3621554 3729172 3844486 3840373 4045898 4134708 4256104 4302197 4366251 4505541 4583706 4567861
5066D567861J02206M2583J5215O4292M1592J37645m717L7662J1841Q5399N1345
5055E152924j2973k2911m3968J30821J1287J6781r562J20166P1784o971O5580
5044E472958P8943M9720M0125N3090j18255K6233M4598k5125R2332K3639L9624
5033E777882K2692j74912j9243O6385n5931n8732N8474n5066P5558K2780R3787
5022E753674K8094M5329P2871L628R3185J41041J23743Q4428K67347R3081m7985
5011F658436J20395J54795J39130M7595Q9279J45925Q6433J33160J39034m9019
5001G665163r62m2835J26816R9778n2356l320m6957J33193K14937O9264J03418
4990H266139J81595p8849l7651j04244Q960L8871Q2545n2443L4262n8980N9120
$$ plain form
5066 4567861 4670067 4712650 4727865 4792157 4833749 4971394 4966677 5004339 5016180 5101579 5152924
5055 5152924 5139951 5117040 5073072 5203893 5215180 5231961 5222399 5342565 5414349 5407378 5472958
5044 5472958 5551901 5601621 5641746 5694836 5576581 5602814 5647412 5622287 5714619 5738258 5777882
5033 5777882 5800574 5625662 5606419 5672804 5616873 5558141 5616615 5561549 5637107 5659887 5753674
5022 5753674 5781768 5827097 5899968 5903596 5996781 6137822 6261565 6345993 6613340 6706421 6658436
5011 6658436 6778831 6933626 7072756 7120351 7209630 7355555 7441988 7575148 7714182 7665163
5001 7665163 7664201 7621366 7748182 7847960 7795604 7792284 7745327 7878520 8093457 8162721 8266139
4990 8266139 8447734 8368885 8331234 8226990 8235950 8274821 8357366 8304923 8339185 8280205 8339325
4979H339325j08275o2099o6172L6083L0273n9817k7861r7420p3802r4048j27022
4968G689165j8499k9711m6939N9425L2233O9543M3268R800O2082K34432j3077
4957H091722l71L5776P9663Q1706O4492K5997J30907J14786J07624N3041J54292
4946H939635O3661J40532P7466J6997J54850J39504P6773J75772J38047J67533
4936A0090770J69475J73658K40799J84599L06439K59112K40310N0575K46766K28820
4926A2191323J12265K81782K80867L82256J85490K77180L17704L63715L17855
4917A4710437L47985K41302J51850J46879R3675J10335L27205L92371K87748M16936
4907A7226723M00317M67637K60528J77967J58530L30928L88215M43885O37326
$$ plain form
4979 8339325 8231050 8168951 8102779 8138862 8169135 8109318 8081457 7984037 7910235 7816187 7689165
4968 7689165 7670666 7640955 7594016 7653441 7685674 7755217 7798485 7808285 7870367 8104799 8091722
4957 8091722 8091351 8127127 8206790 8288496 8352988 8378985 8509892 8624678 8732302 8785343 8939635
4946 8939635 9003296 9143828 9221294 9238291 9393141 9532645 9609418 9785190 9923237 10090770
4936 10090770 10260245 10433903 10674702 10859301 11165740 11424852 11665162 11715737 11962503 12191323
4926 12191323 12303588 12585370 12866237 13248493 13433983 13711163 14028867 14392582 14710437
4917 14710437 15058422 15299724 15451574 15598453 15692128 15802463 16129668 16522039 16809787 17226723
4907 17226723 17627040 18094677 18355205 18533172 18691702 19022630 19410845 19854730 20492056
4898B0492056P89680R76411J307033J620302K176950J798301J57545j039827j410365
4889B6868086j240316j033680o24340l38735r4986J74885K06675L23036L04643
4880B4545268M04722M57470N69165N91088O21958P21425N21092O33590O52866
4871B9718644P40349N89140O09308P68458Q56868P76795Q63045Q82688Q91695
4862C6696990J066538J078132J304192J356253J468333J607734J859015J937837
4854D8375024K037613K160987K450003K662264K939583L392300M003249M352803
4846G2373826M992881N835851O651663P158022P563522P214850N658744L097511
4838A20546870O5298j940769k794148k736995k257103j574794r49900m87885l5339
$$ plain form
4898 20492056 21281736 22258147 23565180 25185482 27362432 29160733 29318278 28278451 26868086
4889 26868086 25627770 24594090 23969750 23631015 23536029 23710914 23917589 24240625 24545268
4880 24545268 24949990 25407460 25976625 26567713 27189671 27911096 28432188 29065778 29718644
4871 29718644 30458993 31048133 31657441 32425899 33282767 34059562 34922607 35805295 36696990
4862 36696990 37763528 38841660 40145852 41502105 42970438 44578172 46437187 48375024
4854 48375024 50412637 52573624 55023627 57685891 60625474 64017774 68021023 72373826
4846 72373826 77366707 83202558 89854221 97012243 104575765 111790615 117449359 120546870
4838 120546870 120612168 118671399 115877251 113140256 110883153 109308359 108358459 107870574 107835235
4829A07835235O00292R20037J069270J532122K034647K691746L632251M986212
4821A25301812O474157P987327R315192J0197626J0280015R006162O528171K986528
4813A88076990r45751m082203n765755o222226o069994n825944n250374m619953
4805A49294790m175089l894047l775043l843482l849502l490199k783949j960402
4797A21523077p74022K95861J427572K569175L474960M230148M154182K763805
4789A39664758O71927j202160k091238k109244j361199o69300j38529k7197k28793
4780A32509025n83637j133445j691703k058616k698082l343074l733386l878898
4772A13388184l830060l493124l075410k464509j833901j362759j046744n88928
$$ plain form
4829 107835235 108435527 109355564 110424834 111956956 113991603 116683349 120315600 125301812
4821 125301812 131775969 139763296 149078488 159276114 169556129 178562291 185090462 188076990
4813 188076990 187131239 183049036 177283281 171061055 164991061 159165117 153914743 149294790
4805 149294790 145119701 141225654 137450611 133607129 129757627 126267428 123483479 121523077
4797 121523077 120749055 121044916 122472488 125041663 128516623 132746771 136900953 139664758
4789 139664758 140336685 139134525 137043287 134934043 133572844 132903544 132765015 132737818 132509025
4780 132509025 131925388 130791943 129100240 127041624 124343542 121000468 117267082 113388184
4772 113388184 109558124 106065000 102989590 100525081 98691180 97328421 96281677 95692749
4764I5692749l8034J94936P06469J175663J431514J929611K390216K567444K541453
4755A08592021K442274K186515J727929J489757J181468P53683L5082j005581
4747A17403148k283131l049724l565408l622341l435484l117400k848523k771594
4739I2709543k575589k293321j957494j494180j411598j240979r34452o43545
4731H0158385n99903n41340o75813p37203r14248j092447j383262j594969j771687
4722G0847513k174006k679570k994654l123224l163810l098344k969574k813202
4714D7831129k686101k582210k388396k101753j881679j855830j727986j451915
4706C1155259j444694j476516j301659j209977j166491j062832j073354j106507
$$ plain form
4764 95692749 95654715 95849651 96556120 97731783 99163297 101092908 103483124 106050568 108592021
4755 108592021 111034295 113220810 114948739 116438496 117619964 118373647 118408729 117403148
4747 117403148 115120017 112070293 108504885 104882544 101447060 98329660 95481137 92709543
4739 92709543 90133954 87840633 85883139 84388959 82977361 81736382 80801930 80158385
4731 80158385 79558482 79017142 78341329 77604126 76689878 75597431 74214169 72619200 70847513
4722 70847513 68673507 65993937 62999283 59876059 56712249 53613905 50644331 47831129
4714 47831129 45145028 42562818 40174422 38072669 36190990 34335160 32607174 31155259
4706 31155259 29710565 28234049 26932390 25722413 24555922 23493090 22419736 21313229
4698B1313229r69759r07614o44000o87854o45113n67669n17642m99987n59163
4689A5314428l76473k50389k56484l42703k05617j92700j89976k91293k73394
4680A2935399l95286m51900m37419n18931l50216k98488k54959l07921m71598
4671I448681j54223k22639k21980j91524l04276j79629p9424k49728j31106j40730
4661G573422k66901j88979r3799j11643j41393j55370j21933j77619m1872j44938
4651F128975j15562k5679m3923j35106o6899q4425j01867j71159j03930J01252
4641E381677k5998j35067p1931o3389p6889k2059r5214j17264O4102M6551j02841
4630D781678j57371O685J9023l814p527L61N5405j5428k9630n7960R647J10866
$$ plain form
4698 21313229 20343470 19435856 18791856 18104002 17458889 16891220 16373578 15873591 15314428
4689 15314428 14937955 14687566 14431082 14088379 13882762 13690062 13500086 13208793 12935399
4680 12935399 12540113 12088213 11650794 11131863 10781647 10483159 10228200 9920279 9448681
4671 9448681 9294458 9071819 8849839 8658315 8354039 8174410 8094986 7845258 7714152 7573422
4661 7573422 7306521 7117542 7023743 6912100 6770707 6615337 6493404 6315785 6273913 6128975
4651 6128975 6013413 5987734 5943811 5808705 5741806 5657381 5555514 5384355 5280425 5381677
4641 5381677 5355679 5220612 5148681 5085292 5008403 4986344 4891130 4773866 4837968 4884519 4781678
4630 4781678 4624307 4630992 4650015 4646201 4638674 4639035 4694440 4679012 4649382 4591422 4601069 4711935
4618D711935o1862L0413P3250m922M8553R6647P1979J8433o421p9325j89677j47893
4606D561110o7599q063j25008j3956l2412j47366Q163o8800L0872j0383q9280
4595D037278J21629K1819p684J62825L453J97819P576J14906q836q5370k63O9299
4583D634451L5043r2133j41951j80455J08752o7416j60672o8709j4155N179l755
4572D054179J284J7068o7970n5612K2019k767N6044m1857M4663Q9195M6302J4002
4560D176550K9814J80319J94190J24361J46687R6634Q5100M8854M1035q6602R8616
4549E135558j72738r3801j90898j33593k2003M3839K1812j76044q2968J0773R408
4538D349345J13815J71628q0232P6943Q2365L3073J20359J00213J38217R4520
$$ plain form
4618 4711935 4650073 4680486 4753736 4748814 4797367 4894014 4965993 4984426 4978005 4898680 4709003 4561110
4606 4561110 4493511 4485448 4360440 4346484 4314072 4166706 4174869 4106069 4136941 4126558 4037278
4595 4037278 4158907 4180726 4173042 4335867 4339320 4537139 4544715 4659621 4650785 4565415 4565152 4634451
4583 4634451 4669494 4577361 4435410 4254955 4363707 4296291 4135619 4066910 4052755 4057934 4054179
4572 4054179 4055463 4072531 4004561 3948949 3970968 3968201 4024245 3982388 4027051 4116246 4162548 4176550
4560 4176550 4206364 4386683 4580873 4705234 4851921 4948555 5033655 5082509 5123544 5036942 5135558
4549 5135558 4962820 4869019 4678121 4544528 4522525 4566364 4588176 4412132 4329164 4339937 4349345
4538 4349345 4463160 4634788 4554556 4631499 4713864 4746937 4867296 4967509 5105726 5200246
4528E200246J37385J25288J7948k1025r4118m5889N0754p4186j74097j25653j47361
4517D849292p1278o411j0260L4614L7131K4771j24617j47940k2196j56114p1147
4506D335845j0543l4875j2547k9270R5557O4353J4485j3367P125J66524R3326
4495D676613N7146L7136K4161o614M9654j47790j01364J3739j0050l9618r9599
4484D453414k3985n5747k35939R438O8309k8672q1356L5205J1224n857J9883M4684
4472D210601K11839P9470M314m3148K2356Q2070J36563j16914j36160l1925j56812
4461D262254J1975p1870j69793K7899L8051m8016K3530j8407n554j2134P1400
4450D109335n3105J2810N724n8898M84J06099l3435l9190P1875m394n9148O1192
$$ plain form
4528 5200246 5337631 5462919 5480867 5459842 5365724 5319835 5370589 5296403 5122306 4996653 4849292
4517 4849292 4778014 4771603 4761343 4795957 4833088 4857859 4733242 4585302 4563106 4406992 4335845
4506 4335845 4325302 4290427 4277880 4248610 4344167 4408520 4423005 4409638 4416763 4583287 4676613
4495 4676613 4733759 4770895 4795056 4788442 4838096 4690306 4588942 4602681 4592631 4553013 4453414
4484 4453414 4429429 4373682 4137743 4147181 4215490 4186818 4105462 4140667 4151891 4146034 4165917 4210601
4472 4210601 4422440 4501910 4506224 4463076 4485432 4567502 4704065 4587151 4450991 4419066 4262254
4461 4262254 4274229 4202359 4032566 4060465 4098516 4050500 4074030 4055623 4050069 4037935 4109335
4450 4109335 4056230 4069040 4074764 4015866 4016350 4122449 4089014 4049824 4121699 4117305 4058157 4119349
4438D119349J05005N6361K2348M7385j8906k1379J27155k3482j00763K5391J7518
4427D355982R1429Q2457r921P1478Q8811j4101k7335K3700K10261m841L1068P6336
4415D975324J36619K5933O7898J71812o144J62233k3612K01668J50623L4155l3331
4404E863178N5891r209j1505K6613l2153J55002J95731P1861m6669M9006J2103
4393F329849M7896L0084K5372M7988l7295N4037J15478J2967O2735J63777P8233
4382F931121p5724J2536K05341J4769J6486j9537R4519K7268p9671l1700Q4663
4371G180071J12810J40718j42791o7871J82694J13015J23907M0157o9637J31869
4361G744942n882l8654R0669K20270J25575r351R9828L1866J19244M0950p1201
$$ plain form
4438 4119349 4224354 4280715 4303063 4350448 4331542 4310163 4437318 4413836 4313073 4338464 4355982
4427 4355982 4447411 4529868 4519947 4591425 4680236 4666135 4638800 4662500 4872761 4867920 4898988 4975324
4415 4975324 5111943 5137876 5205774 5377586 5371442 5533675 5510063 5711731 5862354 5896509 5863178
4404 5863178 5919069 5909860 5898355 5924968 5892815 6047817 6243548 6315409 6268740 6317746 6329849
4393 6329849 6377745 6407829 6433201 6481189 6443894 6497931 6613409 6626376 6689111 6852888 6931121
4382 6931121 6855397 6867933 7073274 7088043 7104529 7084992 7179511 7206779 7127108 7095408 7180071
4371 7180071 7292881 7433599 7290808 7222937 7405631 7518646 7642553 7682710 7613073 7744942
4361 7744942 7739060 7700406 7791075 8011345 8136920 8127569 8227397 8259263 8378507 8419457 8348256
4350H348256J39789J30037J18091J57250j9508o8273Q466r778J58271K0649J16931
4339I100181J35239l3409j102N4601P5093J1066L6195Q599m498K00505N8785J326
4327I642581N54J15439J46048J7538J33352M1688J9526R881J70406M9630J1921
4316A0358564j4239R7154J99064P9228M6063J76801n7563J04152J37706J43873
4306A1270803J12187J39923J95052J01248Q4830J05771K05577K69525Q7874J24645
4296A2697435K14052J79992K57624K00961J59579J70579M7613K08163L87900K62435
4286A4786333K49006K32408L16166L56550K53924J79778L03644K68951L36095
4277A7282855L57212K67961M04307L82061M46949L66700L72530L55235N22159
$$ plain form
4350 8348256 8488045 8618082 8736173 8893423 8873915 8805642 8814108 8804330 8962601 8983250 9100181
4339 9100181 9235420 9202011 9200909 9255510 9330603 9341669 9377864 9386463 9381965 9582470 9641255 9642581
4327 9642581 9643135 9758574 9904622 9922160 10055512 10097200 10116726 10126607 10297013 10346643 10358564
4316 10358564 10344325 10441479 10640543 10719771 10765834 10942635 10885072 10989224 11126930 11270803
4306 11270803 11382990 11522913 11717965 11819213 11904043 12009814 12215391 12484916 12572790 12697435
4296 12697435 12911487 13091479 13349103 13550064 13709643 13880222 13927835 14135998 14523898 14786333
4286 14786333 15035339 15267747 15583913 15940463 16194387 16374165 16677809 16946760 17282855
4277 17282855 17640067 17908028 18312335 18694396 19141345 19508045 19880575 20235810 20757969
4268B0757969M93108M42079O04786N57900N24109M75080O22146P77054Q02708
4259B6056939Q38956P06615R05264J015777R33720J096095J212986J157412J279453
4250C5203217J383754J488978J544117J548969J645994J794073J993396J887859
4242D8490357K120466K166624K275861K452019K284352K411408K467973K462809
4234F7131869K552228K647197K748813K872597K942145K847817K962849K988240
4226H9693755L010052K864158K674456K620087K373115K297655K097201J915941
4218A09546420J807469J753359J679919J543022J492930J271090J304990R33256
4210A21332455L83265J77225j40226o80657q56843r77236j211729j411993j425221
$$ plain form
4268 20757969 21251077 21693156 22297942 22855842 23379951 23855031 24477177 25254231 26056939
4259 26056939 26895895 27602510 28507774 29523551 30457271 31553366 32766352 33923764 35203217
4250 35203217 36586971 38075949 39620066 41169035 42815029 44609102 46602498 48490357
4242 48490357 50610823 52777447 55053308 57505327 59789679 62201087 64669060 67131869
4234 67131869 69684097 72331294 75080107 77952704 80894849 83742666 86705515 89693755
4226 89693755 92703807 95567965 98242421 100862508 103235623 105533278 107630479 109546420
4218 109546420 111353889 113107248 114787167 116330189 117823119 119094209 120399199 121332455
4210 121332455 121715720 121892945 121752719 121072062 120215219 119237983 118026254 116614261 115189040
4201A15189040j587826j467980j626768j695403j951271k220988k281279k487017
4193I9870508k668558k879636k837453k946330k924013k891606k778939k600633
4185G7343340k485545k416914k378896k376080k357779k309727k285209k272347
4177E8460843k224055k089461j907875j864925j818032j602688j419005j269308
4169D4265494j292249j210837r99157q66769p23941r19374p61525o61495o19169
4160C6210978o21546n51990m32992l44744l80566l09114j35403r8171j65141K7103
4150C3198414J96979R8996J48077K09295L95747L36363L61309K25028K78713K75552
4140C5724473K02511J64746K39898K33411K64746L80746M35304M12585N19560
$$ plain form
4201 115189040 113601214 112133234 110506466 108811063 106859792 104638804 102357525 99870508
4193 99870508 97201950 94322314 91484861 88538531 85614518 82722912 79943973 77343340
4185 77343340 74857795 72440881 70061985 67685905 65328126 63018399 60733190 58460843
4177 58460843 56236788 54147327 52239452 50374527 48556495 46953807 45534802 44265494
4169 44265494 42973245 41762408 40763251 39896482 39172541 38253167 37491642 36830147 36210978
4160 36210978 35589432 35037442 34604450 34259706 33879140 33570026 33434623 33336452 33171311 33198414
4150 33198414 33395393 33494389 33642466 33851761 34247508 34583871 34945180 35170208 35448921 35724473
4140 35724473 35926984 36091730 36331628 36565039 36829785 37210531 37645835 38058420 38577980
4131C8577980P05860Q90901R18379R21360R10433O85075P26321N68385N50140
4122D5454834O36448N78864P20142P80660Q90773Q27944P50305Q43377Q31257
4113E2314604P51756P97119Q25111O21390P05578O80726Q79293J021673J232873
4104E9830123J585234J972119K097176K114659J881818J391414P84816M78027
4096G2135386K49843J99357K14964L96123N39520M14221L62090L77780M52278
4087G5341562O75065Q36117O97707O57383O28753L61825K62669L33428N40958
4078H0335467P38431J169851J624803K003919K353323K552226K478482K191922
4070I5448424J633936J405022J183594R38788J178590J043285R08886P58800O54844
$$ plain form
4131 38577980 39283840 40174741 41093120 42014480 42924913 43609988 44336309 44904694 45454834
4122 45454834 46091282 46670146 47390288 48170948 49061721 49889665 50639970 51483347 52314604
4113 52314604 53066360 53863479 54688590 55309980 56015558 56696284 57575577 58597250 59830123
4104 59830123 61415357 63387476 65484652 67599311 69481129 70872543 71657359 72135386
4096 72135386 72385229 72584586 72799550 73195673 73735193 74149414 74511504 74889284 75341562
4087 75341562 76016627 76852744 77550451 78207834 78836587 79198412 79461081 79794509 80335467
4078 80335467 81073898 82243749 83868552 85872471 88225794 90778020 93256502 95448424
4070 95448424 97082360 98487382 99670976 100609764 101788354 102831639 103740525 104499325 105154169
4061A05154169M94639O05794L73991K49117K55600M03586M51002O05301O66100
4052A09259299P75003O41208M95340O53618O45588N07570J87005r1077m24290
4043A12649264n20400m69659m65111l56905n3319J12789J79463J48346j11478
4034A11112990l12598n04551o61839o35767n55457p05452p38063q05641r78987
4025A05214635j055595j396104j693075j789723k163826k710032l011270l040470
4017H8354540k855065k301507j744863j107330q65920n85718n23140m54181m61930
4008G7454886o19038o67632r09979r56332r79058q81336q49856r74865j015678
3999F9601112r05177p58299m75467k46238j14382l6917n74003j379313j771184
$$ plain form
4061 105154169 105648808 106254602 106628593 106877710 107133310 107536896 107987898 108593199 109259299
4052 109259299 110034302 110675510 111170850 111824468 112470056 112977626 113164631 113073554 112649264
4043 112649264 112128864 111659205 111194094 110837189 110783870 110896659 111076122 111224468 111112990
4034 111112990 110800392 110295841 109634002 108998235 108442778 107737326 106999263 106193622 105214635
4025 105214635 104159040 102762936 101069861 99280138 97116312 94406280 91395010 88354540
4017 88354540 85499475 83197968 81453105 80345775 79479855 78894137 78370997 77916816 77454886
4008 77454886 76835848 76168216 75258237 74301905 73322847 72441511 71591655 70616790 69601112
3999 69601112 68695935 67937636 67462169 67215931 67101549 67064632 66490629 65111316 63340132
3990F3340132k163642k101676j775336j423919j038145q62432p19840n48790o76354
3981E2029998o58169o52177r07048q75749r05131q40469q51204q70749p83485
3972D4685817o53729n18420o19670m50686m45572n75552o09458o15140r54045
3963C9243545p59943p78942r62780o96922m33011l09781l93133l83044k90025
3954C4235964k49348k48212k20166j37391j59339l14188k89071j35099k79629
3945C2203521l21111k59297j60856k33085j37522m1758k5106J2470k9771N9974
3935C1067459J26791L58311J57306J37531K83077K44437M23819L95833L40410
3926C3534974L93454K77617L65730M43488N18842N97761N39908N72111O76240
$$ plain form
3990 63340132 61176490 59074814 57299478 55875559 54837414 53974982 53255142 52706352 52029998
3981 52029998 51371829 50719652 49812604 48936855 48031724 47191255 46340051 45469302 44685817
3972 44685817 44032088 43513668 42893998 42443312 41997740 41422188 40812730 40197590 39243545
3963 39243545 38483602 37704660 36741880 36044958 35611947 35302166 34909033 34525989 34235964
3954 34235964 33986616 33738404 33518238 33380847 33221508 32907320 32618249 32483150 32203521
3945 32203521 31882410 31623113 31462257 31229172 31091650 31049892 31024786 31037256 31007485 31067459
3935 31067459 31194250 31552561 31709867 31847398 32130475 32374912 32798731 33194564 33534974
3926 33534974 33928428 34206045 34571775 35015263 35534105 36131866 36671774 37243885 37920125
3917C7920125P89541Q04136R30722R43710Q81754J109235J056295J144538J144347
3908D6724403J294039J352751J243982J382334J407173J373968J289739J220994
3900E7289383J329984J279848J178337J279407J267969J253866J199896J175019
3892F7253709R91918J023213Q75050O67200N25011M78244M25630J97275J86911
3883G2624161J71150J45639K10322L42669L41549L48876M12307M71853L33071
3874G5401597L22636L73325M26512M48724N13538P22507Q08588Q78861J188891
3865H1085179J543878J658919J787089K151580K364630K572652K831929L131719
3857I9127575L360665L670980M137840M355868M774335N239260N487723N716569
$$ plain form
3917 37920125 38709666 39513802 40444524 41388234 42269988 43379223 44435518 45580056 46724403
3908 46724403 48018442 49371193 50615175 51997509 53404682 54778650 56068389 57289383
3900 57289383 58619367 59899215 61077552 62356959 63624928 64878794 66078690 67253709
3892 67253709 68245627 69268840 70143890 70811090 71336101 71814345 72239975 72437250 72624161
3883 72624161 72795311 72940950 73151272 73493941 73835490 74184366 74596673 75068526 75401597
3874 75401597 75724233 76097558 76524070 76972794 77486332 78208839 79017427 79896288 81085179
3865 81085179 82629057 84287976 86075065 88226645 90591275 93163927 95995856 99127575
3857 99127575 102488240 106159220 110297060 114652928 119427263 124666523 130154246 135870815
3849A35870815N810292N785812N846586N745753N750339N445262N445547N532023
3841A81232429N482488N620184N822162O017648O016232O049182N824831N603859
3833B27669015N283148N101267M927972M913805M671414M927026N146228N439584
3825B68079459O075167O668493P259411P692976Q409804R139118R799988J0802768
3817C33927184J1956240J3575116J5372488J7000417J8293904J8608908J8000641
3810D46734898J5978858J2923374R061673M563974J93063l391080n905795p038518
3802D73120447p176636o651092n959979n188943m771575m698928n638301p813069
3794D25221924j0713148j4401093j8168211k1392920k3662542k4837121k4853971
$$ plain form
3849 135870815 141681107 147466919 153313505 159059258 164809597 170254859 175700406 181232429
3841 181232429 186714917 192335101 198157263 204174911 210191143 216240325 222065156 227669015
3833 227669015 232952163 238053430 242981402 247895207 252566621 257493647 262639875 268079459
3825 268079459 274154626 280823119 288082530 295775506 304185310 313324428 323124416 333927184
3817 333927184 345883424 359458540 374831028 391831445 410125349 428734257 446734898
3810 446734898 462713756 475637130 484698803 489262777 489455840 486064760 480158965 473120447
3802 473120447 465943811 459292719 453332740 448143797 443372222 438673294 433034993 425221924
3794 425221924 414508776 400107683 381939472 360546552 336884010 312046889 287192918
3787B87192918k3861747k2165251k0199012j7948649j5956095j3992024j2360924
3780A60709216j0762499r398358q373689p158071o272080n481144m812973m160415
3772A04289987l664420l266617k870803k388240k133596k044877k028133j875045
3764H4018256j844398j879504j707094j631449j455167j321494j187982j016544
3756G1974624p90754p44197o77986o24961p83724r03193j069010j176486j270083
3747F3934230j481450j638411j525949j687943j590412j446248j457391j284126
3739E1822300j283378j238139j245888j322258j174356j172683j402282j299959
3731D1683357j345403j305957j288146j351178j103887j097198j045861r31361
$$ plain form
3787 287192918 263331171 241165920 220966908 203018259 187062164 173070140 160709216
3780 160709216 149946717 140548359 132174670 125016599 118744519 113263375 108450402 104289987
3772 104289987 100625567 97358950 94488147 92099907 89966311 87921434 85893301 84018256
3764 84018256 82173858 80294354 78587260 76955811 75500644 74179150 72991168 71974624
3756 71974624 71183870 70439673 69761687 69136726 68353002 67449809 66380799 65204313 63934230
3747 63934230 62452780 60814369 59288420 57600477 56010065 54563817 53106426 51822300
3739 51822300 50538922 49300783 48054895 46732637 45558281 44385598 42983316 41683357
3731 41683357 40337954 39031997 37743851 36392673 35288786 34191588 33145727 32214366
3723C2214366p46765o04025o64717n41462n50084m53395m31560m89493m51825
3714B7281040m84111m57578n62440m86303m07138m58916m21004l36558m84234
3705B3182758k96082l00412k46121k63266k22788j73469k77190m2841j27064j30625
3695B1102900j76708k41748j72090j37560j25683r2707j37468k27877j1421N9765
3685A9839403j19517j05336R44p5152n1212j7321n335n7926j3185N827l3191N9127
3673A9427126l124q704J2426J46422J20913J77217J71485K9859J27984J36757
3663B0338361J92965J17002J31167J62117J19556K23472J14498K37815J45672
3654B1782625K04406M89373M05236M95603M59069O76866Q16080Q22320Q41262
$$ plain form
3723 32214366 31467601 30863576 30198859 29657397 29107313 28653918 28222358 27732865 27281040
3714 27281040 26796929 26339351 25776911 25290608 24883470 24424554 24003550 23666992 23182758
3705 23182758 22886676 22586264 22340143 22076877 21854089 21680620 21403430 21360589 21233525 21102900
3695 21102900 20926192 20684444 20512354 20374794 20249111 20156404 20018936 19791059 19779638 19839403
3685 19839403 19719886 19614550 19615494 19540342 19489130 19471809 19466474 19408548 19395363 19401190 19367999 19427126
3673 19427126 19424002 19415298 19427724 19574146 19695059 19872276 20043761 20073620 20201604 20338361
3663 20338361 20531326 20648328 20779495 20941612 21061168 21284640 21399138 21636953 21782625
3654 21782625 21987031 22476404 22881640 23377243 23836312 24513178 25329258 26151578 26992840
3645B6992840Q06982P62035O85848O69350L12079K33467P8868Q463j62645j4011
3635C0373276l8721k4787R4387K9929R1436k7283p6535j17353l73994m33283n98739
3624B8898333q33157q02635p02811o76514n25921n58867n74920m22644l38493
3615B3462371k54052k53893k90167j96305o2542j64916j41623q6406r5736m4507
3605B1872224o4708l8020j61384j40223j78242o4334m1987k1941m7758j37877
3595B0975750j18086j91098O9129q2354j09324o0977k4275m7046j0693r6298j964
3584B0302764m7547o2540O8673K8643J2276j51349j31252J1577L1878j31333q8594
3573A9843196j31763k9150q8184m0478M830j45937K826K7017k1440r7631J2519
$$ plain form
3645 26992840 27799822 28561857 29247705 29917055 30229134 30462601 30541469 30549932 30387287 30373276
3635 30373276 30334555 30309768 30404155 30434084 30525520 30498237 30421702 30304349 29930355 29497072 28898333
3624 28898333 28065176 27262541 26559730 25883216 25357295 24798428 24223508 23800864 23462371
3615 23462371 23208319 22954426 22664259 22467954 22405412 22240496 22098873 22012467 21916731 21872224
3605 21872224 21807516 21769496 21608112 21467889 21289647 21225313 21183326 21161385 21113627 20975750
3595 20975750 20857664 20666566 20735695 20653341 20544017 20483040 20458765 20411719 20401026 20304728 20302764
3584 20302764 20255217 20192677 20261350 20289993 20302269 20150920 20019668 20031245 20063123 19931790 19843196
3573 19843196 19711433 19682283 19594099 19553621 19558451 19412514 19415340 19442357 19420917 19323286 19335805
3562A9335805L7010J03537k9290R5222l0970l2595J5752J39884J42420K9142J05242
3551A9911159J14588J91879Q4558P2032R1345J30267L2273l2056j4039M937J0033
3540B0596976j683J0956P8943J17466L6207Q5622J15465J44073L13764K41246
3530B1739035K72158K60264K07276L27798L90558K51707K74872L35427J00352
3521B4159447K28543J03912P832N9322K20322J69108J61636L12338J50497L43829
3511B5916786L14981K44208L36385L26633M05060L79921M80959M78176N21703
3502B9404812P00254O56490P75146Q92692R69432J121321J208661J243205J457538
3493C8429551J639155J616709J725097J740082J649809J327213R22842M59021
$$ plain form
3562 19335805 19372815 19476352 19447062 19542284 19511314 19478719 19494471 19634355 19776775 19805917 19911159
3551 19911159 20025747 20217626 20302184 20374216 20465561 20595828 20628101 20596045 20582006 20586943 20596976
3540 20596976 20595293 20606249 20685192 20802658 20838865 20924487 21039952 21184025 21497789 21739035
3530 21739035 22011193 22271457 22478733 22806531 23197089 23448796 23723668 24059095 24159447
3521 24159447 24387990 24491902 24499734 24559056 24779378 24948486 25110122 25422460 25572957 25916786
3511 25916786 26231767 26475975 26812360 27138993 27544053 27923974 28404933 28883109 29404812
3502 29404812 30105066 30761556 31536702 32429394 33398826 34520147 35728808 36972013 38429551
3493 38429551 40068706 41685415 43410512 45150594 46800403 48127616 49050458 49509479
3485D9509479j45966r96487j542670j944672k194199j912955j889990j737924
3477C7144616j394569j316078j111477p82549o02145m64798k44062K3652J28198
3468C1380788p574n08688p69055q90895q21617q05707n20860o52973p18529p06212
3458B4978678o55846n86169n44422m71917m89497m69194l01283l55598m20991
3449B0683761l35429j79772k22047j86359j51016k14705n7288J1516J91937K25592
3439A9766190N52084P95040J007687R05167J16703o80727j000445j132328j109621
3430A9219750j048185r20826o57130n98863n00188m93054m39025l35996j93840
3421A4032643k20609k33469j26520j64305m1179M1378j7380m2281J24414Q0512
$$ plain form
3485 49509479 49363513 48367026 46824356 44879684 42685485 40772530 38882540 37144616
3477 37144616 35750047 34433969 33322492 32539943 31937798 31473000 31228938 31252590 31380788
3468 31380788 31373214 30864526 30095471 29204576 28382959 27577252 27056392 26403419 25684890 24978678
3458 24978678 24322832 23736663 23192241 22720324 22230827 21761633 21460350 21104752 20683761
3449 20683761 20348332 20168560 19946513 19760154 19609138 19394433 19337145 19348661 19540598 19766190
3439 19766190 20318274 21113314 22121001 23026168 23142871 22462144 21461699 20329371 19219750
3430 19219750 18171565 17250739 16593609 15994746 15494558 15001504 14562479 14226483 14032643
3421 14032643 13812034 13578565 13452045 13287740 13246561 13287939 13270559 13228278 13352692 13433204
3411A3433204J63146K44344K67693M00358O47584P25641Q47770J028038J043740
3402A8801518Q32088Q82433Q68792l92032j757483k104846j750997j309046j027327
3393A3043100o55558m55570l85909l28458k98311k73227j67937l011j14156q0934
3383A0280029m5465m2081J22042J0791K10749K86716K73693N24423Q28832J083632
3373A3533361J421849J186446l59881j429677j614095j412316j056734p76740
3365I492213l99492n16128l86345k37059j12296k66029k24969n6841p5232r8295
3355G119527j68711j92422j51603p3827j32337L1356l4560j48778p533j5293j54792
3344F071027O410n9064p6577j29502j13567K5064k4725o0756j30784l8850J9848
$$ plain form
3411 13433204 13596350 13840694 14108387 14508745 15156329 15881970 16729740 17757778 18801518
3402 18801518 19633606 20516039 21384831 20992799 19235316 17130470 15379473 14070427 13043100
3393 13043100 12387542 11931972 11546063 11217605 10919294 10646067 10478130 10475119 10360963 10280029
3383 10280029 10234564 10192483 10314525 10325316 10536065 10822781 11096474 11620897 12449729 13533361
3373 13533361 14955210 16141656 15781775 14352098 12738003 11325687 10268953 9492213
3365 9492213 9092721 8576593 8190248 7953189 7840893 7574864 7349895 7293054 7217822 7119527
3355 7119527 6950816 6758394 6606791 6532964 6400627 6431983 6397423 6248645 6241112 6225819 6071027
3344 6071027 6077437 6018373 5941796 5812294 5698727 5723791 5699066 5638310 5507526 5468676 5488524
3333E488524R3800L3514k00113j26166N318R049j2812M446K6357j04487l8597
3322E178833j3724o2026o4345j09662O6420j55883M4285m2087j65202l91q179
3311D668039N723n2683o5350l2801m0555P133m8394n723o1077q4284J05780k6736
3299D369072j01933K9085M434M9374o8591K107p3295n1328l4258j9272r5194P4698
3287D084899Q91j14882J09631j81378l8781q2513j11247M8614q2750Q251O5246
3276C705981k4669q7717m1129O1704k4743N2871m2825j12260j7901N7933Q5721
3265C612966M5460n2019N503P663M5990n6698N3868L0295Q7278j41392p1935L9373
3253C606352j5278q2999K7819J68261J48356n6995j06959l9615P1651J8419k0532
$$ plain form
3333 5488524 5582324 5615838 5415725 5289559 5294877 5303926 5291114 5295560 5321917 5217430 5178833
3322 5178833 5165109 5103083 5038738 4929076 4995496 4839613 4883898 4841811 4676609 4676218 4668039
3311 4668039 4673762 4621079 4555729 4522928 4482373 4489506 4441112 4435389 4374312 4290028 4395808 4369072
3299 4369072 4267139 4296224 4300658 4350032 4281441 4283548 4210253 4158925 4124667 4105395 4010201 4084899
3287 4084899 4085790 3970908 4080539 3899161 3860380 3777867 3666620 3715234 3632484 3640735 3705981
3276 3705981 3681312 3593595 3552466 3614170 3589427 3642298 3599473 3487213 3469312 3527245 3612966
3265 3612966 3658426 3606407 3611910 3619573 3665563 3608865 3662733 3693028 3780306 3638914 3566979 3606352
3253 3606352 3591074 3508075 3535894 3704155 3852511 3795516 3688557 3648942 3720593 3739012 3718480
3242C718480J04223j3245P7720p561R2753K6534l5933R1205P078K7836J40373
3231D229463J76878R1117N3745J57476J01551q7398j25632O007j7995Q457J02107
3220D695776J41724N9424M502J51231J12147p1622n203m9891k6676K010r9831
3209D913591O8418P2285j6905L8151P5436J00955k0436Q2331J46152J02184K32065
3198E794227K06242J12231K83444J32439j39593k6285j4332J586O4394P7963J88758
3187F681074N1052K08516K62035K68311J53973J41884m3222L1100J59693J88875
3177H103291J10409K5051J46838L4285J93359J63323Q3886J78336K3822m3368
3167I019232R8296O0200J35828R3532K10599K14698M2319J61538K41414J83547
$$ plain form
3242 3718480 3822703 3809458 3887178 3879617 3972370 3998904 3962971 4054176 4061254 4089090 4229463
3231 4229463 4406341 4497458 4551203 4708679 4810230 4722832 4597200 4603207 4585212 4593669 4695776
3220 4695776 4837500 4896924 4901426 5052657 5164804 5093182 5087979 5038088 5011412 5013422 4913591
3209 4913591 4982009 5054294 5037389 5075540 5150976 5251931 5231495 5313826 5459978 5562162 5794227
3198 5794227 6000469 6112700 6396144 6528583 6388990 6362705 6348373 6349959 6414353 6492316 6681074
3187 6681074 6732126 6940642 7202677 7470988 7624961 7766845 7723623 7754723 7914416 8103291
3177 8103291 8213700 8238751 8385589 8419874 8613233 8776556 8860442 9038778 9062600 9019232
3167 9019232 9117528 9177728 9313556 9407088 9617687 9832385 9874704 10036242 10277656 10461203
3157A0461203J72257L92877L16375L45675M25494M47845L63187M01024N41867
3148A3867804M20475L55339K30927J86626R342p7445m34410n45903n59532o24124
3138A2829099l45411k73039j60484p7950L599J58509O8542O9334K24336J52424
3128A2648959K10034L74522K61750M05115K76529L41510J84490K57176K26385
3119A5186470J04392p4827j80294k12415k26315l57128m57103m40684p19205n12787
3109A2110104m08986m75416k66642j25761l56444j45756q8278m02N9465R3758
3099A0395642M5693j55353K1667L476p8104j94050j67094j02011k45180l21864
3089I202822l76410m26265l75355l59968l03170m58953k90667j98854k70892k32417
$$ plain form
3157 10461203 10633460 11026337 11342712 11688387 12113881 12561726 12924913 13325937 13867804
3148 13867804 14288279 14643618 14874545 15061171 15070513 14993068 14558658 14012755 13453223 12829099
3138 12829099 12483688 12210649 12050165 11972215 11975814 12134323 12202865 12272199 12496535 12648959
3128 12648959 12858993 13233515 13495265 13900380 14176909 14518419 14702909 14960085 15186470
3119 15186470 15290862 15216035 15035741 14823326 14597011 14239883 13782780 13342096 12622891 12110104
3109 12110104 11701118 11225702 10959060 10833299 10476855 10331099 10242821 10242419 10301884 10395642
3099 10395642 10441335 10285982 10307649 10311125 10233021 10038971 9871877 9769866 9524686 9202822
3089 9202822 8826412 8400147 8024792 7664824 7361654 6902701 6612034 6413180 6142288 5909871
3079E909871l56814j71286k37327r6174p2380q2092k17507j01368J6973r5756
3069D496140j00329j54138j26867l7809j11607l4883j79174j83755j19017j14111
3059C334450q0751l1077j11012p6674n5330j08071m4057j15067n3781j10207j08189
3048B440234m5212M2801j6617q8540m5267q4980l2372J7133p2983l1023n7757
3037B025417j5333k7025l5119K223k4093j5552m9630N9219N3571J454j05955q7917
3025A781260k6217j67156N3111L7485m7726p0509j13408K8479k1042k9948k9527
3014A394802P792L8028j46206j3980K8602l8152p1760M4068L943K7578m2658K0562
3002A252619J970j11921O049Q0394j00580K4509m1813j26046n015n7434o1901
$$ plain form
3079 5909871 5553057 5381771 5144444 5048270 4975890 4893798 4676291 4574923 4591896 4496140
3069 4496140 4395811 4241673 4114806 4076997 3965390 3930507 3751333 3567578 3448561 3334450
3059 3334450 3253699 3222622 3111610 3034936 2979606 2871535 2827478 2712411 2658630 2548423 2440234
3048 2440234 2395022 2437823 2421206 2332666 2287399 2202419 2170047 2187180 2114197 2083174 2025417
3037 2025417 2010084 1983059 1947940 1950163 1926070 1910518 1860888 1920107 1973678 1975132 1869177 1781260
3025 1781260 1755043 1587887 1640998 1678483 1630757 1560248 1446840 1475319 1454277 1424329 1394802
3014 1394802 1402594 1440622 1294416 1280436 1309038 1270886 1199126 1243194 1247137 1274715 1232057 1252619
3002 1252619 1254589 1142668 1148717 1229111 1128531 1153040 1111227 985181 980166 922732 860831
2991H60831M9563J42222q3871o5931K5273N7352k12132p4585Q6070O7835l3901
2980H18726Q6986k4297j57601K9254O3422M292n0712p242L3592M3676p9431j00986
2968F59679l8420j9087K7223J18576R239p0868p5881p9849K714k5455N5988L9513
2956F03372o7380l7698K2740K7428L9961M344J8962P083q952L228j20621N2932
2944E45399J37795q7477j09695K6667k4088o4108k7986M6915J7017j4857J4402
2933D59984K9786j51494q1370N1920J46138p939j09701K1536Q4635p1591m0217
2922C31687j990M9048j6013n4560J00258P2858j18245j1784P1974r5881P8239
2911D05591n8358l3078k6498K7966J1171n7615m0381J0782P806j3017j0765K0999
$$ plain form
2991 860831 910394 1052616 968745 902814 928087 985439 773307 698722 784792 852627 818726
2980 818726 905712 881415 723814 753068 816490 820782 770070 762828 796420 840096 760665 659679
2968 659679 621259 602172 629395 747971 757210 686342 610461 530612 533326 507871 563859 603372
2956 603372 535992 498294 521034 548462 588423 592767 611729 618812 609860 613088 492467 545399
2944 545399 683194 595717 486022 512689 488601 424493 396507 443422 460439 445582 459984
2933 459984 489770 338276 256906 308826 454964 447025 337324 358860 443495 371904 331687
2922 331687 329697 378745 362732 308172 408430 481288 363043 351259 423233 327352 405591
2911 405591 347233 314155 287657 315623 326794 269179 228798 239580 247386 234369 223604 244603
2899B44603o0004J01134J42957m4330k8643j5681R289M4515n4529k141k6030L2196
2887C43336p7075l0614P0342j18065K0361M6877L7191K3588J5148K6425m4757
2876C12757K8781l3656q1704P547J6438R5103q2206q9616j3275K5720O2846N0343
2864B99078j5535L7385K3731r1637N6363L4478j10845j12021j187P5602M3215
2853B38627Q2807q2561k2179O4236o1008k76j9432J9745l2680L8375M4795R1661
2841C62110j5139j09152k7772R7688j2110l9m8127j7365J01423j01323m7993q343
2829A73858J35908j3178j77008r4989L0159Q4989N8668N7259m3689J7195k1821
2818B07351p9151L5872J29339j7624n2376n7489q264j5947n8615P9586K8971r5
$$ plain form
2899 244603 184599 285733 428690 384360 355717 340036 349325 393840 339311 337170 311140 343336
2887 343336 266261 235647 305989 187924 208285 255162 292353 315941 331089 357514 312757
2876 312757 341538 307882 226178 233725 250163 345266 263060 173444 160169 185889 248735 299078
2864 299078 283543 320928 344659 253022 309385 343863 233018 120997 119810 195412 238627
2853 238627 321434 238873 216694 280930 219922 219646 200214 219959 187279 225654 270449 362110
2841 362110 346971 237819 210047 307735 295625 295586 247459 230094 331517 230194 182201 173858
2829 173858 309766 296588 119580 24591 54750 139739 198407 255666 211977 229172 207351
2818 207351 128200 164072 293411 275787 223411 165922 157658 141711 83096 162682 191653 191558
2806A91558L7328J6619K5175k2734j00297R416p712j10976o4322k8629R2354J35657
2794A73437M2140m3035p5197k4491n2097M7171Q840R2265L4965k6793j2662M685
2782A69228j0707N3291j26072n3660N3851J15269J17548n8170j08431J10233p7688
2771A84692m8828j7115n9668P4375j6710q0113K9541m5833k3145Q7899N8068J493
2759A44656j8853O4819j67977J7487K1066O3141l6750o2910J4383J9536q9628
2748c1030K7782n1571K385O4058j8909K3735M6307L131K9122q6902K6576p071
2736B7613l9276K7671p3594J01138K1177l1077j21077Q7203P5024l980o1048N8386
2724F8160m557k3958l0072n5132k1999k4636L15J59550j1390L6953O545r8503
$$ plain form
2806 191558 228886 245505 270680 247946 147649 157065 149353 38377 -25945 -54574 37780 173437
2794 173437 215577 172542 97345 72854 20757 67928 76768 169033 203998 177205 164543 169228
2782 169228 158521 211812 85740 32080 85931 201200 318748 260578 152147 262380 184692
2771 184692 135864 118749 59081 133456 116746 36633 66174 20341 -2804 85095 143163 144656
2759 144656 125803 190622 22645 40132 61198 124339 87589 24679 39062 58598 -31030
2748 -31030 -3248 -54819 -52434 11624 -7285 16450 62757 65888 95010 8108 34684 27613
2736 27613 -11663 16008 -57586 43552 64729 33652 -87425 -222 74802 70822 9774 68160
2724 68160 63603 39645 9573 -45559 -67558 -92194 -91879 67671 56281 93234 99779 1276
2712A276L6724m9818o684N1815K4024j04362l7807L2452J15067N1715n0797J9094
2700H2699Q6190k7169j6475m674J6218L1063l0147j14681K58l108J08906q1754
2688D7326j2523q4314N4942O3261p2556k3543N7420m5694m2626M5611L5112K7720
2676E0136m966m2903l2426l392l6108N5286k9947p6383J1002P3005k3463j6738
2664g6897J33025N8402n5663M5466Q548j7881q0727N1775k90K6340r0955N900
2652G043M4890K2085j04622N5208K2453j9941k1648K5494Q8714P099j24035p9345
2640g6605m9983J31790P4095l993m7654p3737L5234N3315K4579N6563N5057r4259
2628H4402P3342K7142m016q4598M1395q1428l2932k4723N2087P5594M5410k1375
$$ plain form
2712 1276 38000 -11818 -18502 33313 57337 -47025 -84832 -52380 62687 114402 63605 82699
2700 82699 168889 141720 125245 120571 136789 167852 137705 23024 23282 20174 129080 47326
2688 47326 34803 -49511 5431 68692 -3864 -27407 30013 -15681 -58307 -12696 22416 50136
2676 50136 45170 2267 -30159 -33551 -69659 -14373 -44320 -120703 -109701 -36696 -60159 -76897
2664 -76897 56128 114530 58867 104333 112881 95000 14273 66048 65758 92098 1143 7043
2652 7043 51933 74018 -30604 24604 47057 27116 5468 30962 119676 126775 2740 -76605
2640 -76605 -126588 5202 79297 75304 27650 -46087 -10853 42462 67041 123604 178661 84402
2628 84402 157744 184886 180870 96272 137667 56239 23307 -1416 50671 126265 171675 150300
2616A50300K2750R981J30727P5050p3336o6845n6598o6211q246k7484m341m4110
2604D1637L125m1919L5533J23462m5519K900n5836M3976N1900q875K515p3539
2592G9360j8168p2152J7490R878M0445J1846J4915p843l9453O7181r1485l3041
2580b1027m985J3255L3919n5160P8456J04750j21336j752M1863k8432r85J9758
2568E8324N119q9172n0842J3817m8401j6144M2159N7056o6443J53301O5200j29322
2556e348q2037L2596R864n7365J13232Q3637n9991k0691N9527N6999P2328K3119
2544B25870m6099N5961j2534j12533j05336k8745N6402Q4626p4989J8307O2865
2533A23795k5136l658k1803m5493J37923L2773k8703o626J0743n9496j58507n1726
$$ plain form
2616 150300 173050 183031 313758 388808 315472 248627 192029 125818 117572 90088 85747 41637
2604 41637 44762 2843 38376 161838 116319 119219 63383 107359 159259 150384 152899 79360
2592 79360 61192 -10960 6530 16408 56853 68699 83614 75771 36318 103499 12014 -21027
2580 -21027 -26012 -12757 21162 -33998 44458 149208 27872 26120 67983 39551 38566 58324
2568 58324 63443 -25729 -76571 -62754 -111155 -127299 -85140 -28084 -94527 58774 123974 -5348
2556 -5348 -87385 -54789 -44925 -102290 10942 94579 34588 13897 73424 130423 202751 225870
2544 225870 179771 235732 223198 110665 5329 -23416 32986 117612 42623 60930 123795
2533 123795 98659 95001 73198 27705 165628 198401 169698 163072 173815 114319 -44188 -95914
2521i5914K16023j6518q8610j387P0056J0418Q1952M001r3254J9506k9439J02948
2509A79782L0529k69j9191J0261N5826K113j6250M4873j34456q1130L2838J02172
2497B07098j400j1992M5916Q0592o9403l2662Q5287L4177p2180k365R2273Q6663
2485D42004l7273p0976m292l5615R8743L2186N771K1728m1016n9568k3025n6432
2473B72235J5778j446J06330J49993j13518p6041n4610L9587P3192J4911L6483
2462D62894M6492J1305j2978k2651M0373o3265j090N7650L8407k6871K195Q8594
2450F21055p4215j7388J21147L8652N0189l430l9867K2429J08540j01943P591
2439G32760L4086J39236M9857r3035n8392K2750L7629N1800J52600M2570o1789
$$ plain form
2521 -95914 120109 103591 14981 13594 83650 94068 176020 180021 86767 106273 76834 179782
2509 179782 210311 210042 190851 201112 256938 259051 242801 287674 153218 72088 104926 207098
2497 207098 205698 193706 239622 320214 250811 218149 303436 337613 265433 263068 355341 442004
2485 442004 404731 333755 329463 293848 392591 424777 430548 452276 411260 351692 328667 272235
2473 272235 288013 286567 392897 542890 429372 353331 298721 338308 411500 426411 462894
2462 462894 509386 520691 507713 485062 525435 462170 461080 518730 557137 530266 532461 621055
2450 621055 546840 529452 650599 689251 739440 736010 696143 718572 827112 725169 732760
2439 732760 766846 906082 955939 862904 804512 827262 864891 916691 1069291 1111861 1050072
2428A050072K9861o5880O7065N5898L7274Q0458o7864P8748n1214M012M6189K9068
2416A293687J0671O142O6742J44419J03247r5223L1363p0665l2222J03752J2058
2405A573971P4416M5431j7983J181J17680L3745l6187Q4922L9162J38459K05411
2394B260208R9894J47803Q544J94062K46802J48801O9590O3027J65419J90472
2384C594622R4766J21351J17395J18302J68929J74115K07711Q4647J37150J23269
2374D942257M3952O2530J74518K25937K43051K46689K40827L13225L68400N80221
2364G441607O91952O84270Q72039N70368L75384N27237O79384R70285J304347
2355A4116873J601072K145253K913968L764989N080621O572893R071569J2783618
$$ plain form
2428 1050072 1079933 1014053 1081118 1137016 1174290 1254748 1186884 1265632 1214418 1218430 1264619 1293687
2416 1293687 1304358 1310500 1377242 1521661 1624908 1529685 1561048 1490383 1458161 1561913 1573971
2405 1573971 1648387 1693818 1675835 1677016 1794696 1828441 1792254 1877176 1916338 2054797 2260208
2394 2260208 2360102 2507905 2516449 2710511 2957313 3106114 3175704 3238731 3404150 3594622
2384 3594622 3689388 3810739 3928134 4046436 4215365 4389480 4597191 4681838 4818988 4942257
2374 4942257 4986209 5048739 5223257 5449194 5692245 5938934 6179761 6492986 6861386 7441607
2364 7441607 8133559 8817829 9689868 10260236 10635620 11162857 11842241 12812526 14116873
2355 14116873 15717945 17863198 20777166 24542155 29622776 36195669 45267238 58050856
2347E8050856J2330777j741394j2730933j3149907j0592629o851232m705075l484789
2339A7125674k720291j900959j442338j071291p56212n21197m12442k00105m87778
2330G613061o43984o46367n76482m60326m19442m12686k46667j36148j55029k64765
2320C651165k12657k06893k42069k30243j54903k32752j58080j52004p293o9230
2310A985041M258j24331k12192M1195k1457j32821R478N3383n8497j2508q7022
2299A444527o9912Q01j5068m5103k026r35o6064r0552r247m3265j19127n0246
2287I33783j12265P8020q5917q140l545m9429K0787j24628k0294R29M1251n6765
2275F13787p0120m5232M3022L2723J4446r0473j30533Q8823K5284O3395K3066
$$ plain form
2347 58050856 70381633 68640239 55909306 42759399 32166770 25315538 20610463 17125674
2339 17125674 14405383 12504424 11062086 9990795 9234583 8713386 8300944 8100839 7613061
2330 7613061 6969077 6322710 5746228 5285902 4866460 4453774 4207107 4070959 3915930 3651165
2320 3651165 3438508 3231615 2989546 2759303 2604400 2371648 2213568 2061564 2054271 1985041
2310 1985041 1989299 1864968 1652776 1693971 1672514 1539693 1549171 1602554 1544057 1531549 1444527
2299 1444527 1374615 1375416 1360348 1315245 1313219 1312284 1246220 1155668 1146421 1103156 984029 933783
2287 933783 821518 899538 813621 805481 801936 752507 773294 648666 628372 629301 670552 613787
2275 613787 543667 498435 541457 574180 588626 498153 367620 456443 481727 545122 568188
2264E68188o7813n2463J6419m2517M297M0867p805r6017M0940J5240r0521o28
2252C28187q7020L7061L1546j18832j8830L1612k7599k2915J16724k288j3850
2241B53796j6582j1505j5892q606k0374K2650l9779j7444J11970O56j2595j07694
2229A38601J09050p7980l4964j3976j449O9043M050r5764M9818R8208M5662q9022
2217B01277j58925J1344N9682o6808o609N4617k072l3398l0741J66632p3653k6109
2205I5237M8193K5448m606m6501O5889l7374q7605k5901L2328J6300P15k0216
2193F1907n6221J5903N907J01470L0509p7224j09203N0185O1237j07779L1557
2182H248K9484Q559o3670J18922m9012p8887Q2810m6180M4949r4369O0072Q8770
$$ plain form
2264 568188 500375 447912 464331 421814 426111 466978 459173 363156 404096 419336 328815 328187
2252 328187 241167 278228 309774 190942 172112 203724 176125 153210 269934 267646 253796
2241 253796 237214 225709 209817 201211 180837 203487 163708 146264 258234 258890 246295 138601
2229 138601 247651 169671 134707 120731 119282 188325 192375 96611 146429 244637 290299 201277
2217 201277 42352 53696 113378 46570 39961 94578 92506 59108 28367 194999 121346 95237
2205 95237 143430 168878 164272 117771 183660 146286 58681 32780 65108 81408 82123 61907
2193 61907 5686 21589 27496 128966 159475 82251 -26952 23233 84470 -23309 8248
2182 8248 37732 46291 -17379 101543 52531 -26356 56454 10274 55223 -39146 20926 109696
2170A09696k6982k5587q1843L7471N0384p4462j9115N0473K0170n8123M397O6576
2158E3055M0830L0322j2182L2338m0779j04938m5484L5458J10232m512m0455R3567
2146A47452M636P1705n1874j18044p8424J41783K4706l2328P2202l2816q4878
2135F4120L8445J4627j01124K4578O532N0176J0631L811m2035m3031l5182Q0336
2123G1884n733K0535o9730O4029P899r9645m2182J1520L5727Q3539N8706m0068
2111I6481p0364L4515l8642q5487N9549L4834k2226J87k2978l8775R5076M088
2099D6258M9347Q729r533n0487o400L6740k1899p3908Q7880n8431o490M3624J8534
2086F3964P4147J8633j1655N3621m7560k2034M3731J44704k5491l416K3578n7464
$$ plain form
2170 109696 82714 57127 -24716 12755 63139 -11323 -30438 20035 40205 -17918 -13521 53055
2158 53055 93885 124207 112025 144363 103584 -1354 -46838 -11380 98852 94340 53885 147452
2146 147452 152088 223793 171919 53875 -24549 117234 141940 109612 181814 148998 64120
2135 64120 102565 117192 16068 40646 47178 97354 107985 111796 69761 26730 -8452 71884
2123 71884 66151 86686 16956 80985 88884 -10761 -52943 -41423 -5696 77843 136549 96481
2111 96481 26117 60632 21990 -63497 -3948 30886 8660 8847 -14131 -52906 42170 46258
2099 46258 95605 104334 94801 44314 37914 74654 52755 -21153 66727 8296 1806 45430 63964
2086 63964 138111 156744 145089 198710 151150 129116 172847 317551 292060 288644 312222 254758
2074B54758r5753j03218O054j4581j2496k9909o5614L3285m6289O9815N3493r9486
2062d9941r4150M5492j6335K2520J391N7542P7430p0700k3514n7498K3090j8129
2050a02802Q1951J1159m56r4935J5542M7751m072k5257k176p091k1362j7465N9060
2037f0153R7678Q6456r1931N1009l7510n0228m909M2605j03025q3115P1679M9740
2025c1704K3989n6550O0696n0726j2311M1730L9581M7683o9048o143N828N7453
2013E0478J1882q9962j0120Q9621l0419L7442n1793L0198k2539p6909J20587p4156
2001a5690k9024O1595J9588k270j2411q2057o8192Q4202n4802O5755N9234p6532
1989e0604n219K11q6586L885o3122K8457J7080J7477P1656O9948J05581j88058
$$ plain form
2074 254758 159005 55787 61841 47260 34764 4855 -60759 -27474 -73763 -3948 49545 -49941
2062 -49941 -144091 -98599 -114934 -92414 -91023 -33481 43949 -26751 -50265 -107763 -84673 -102802
2050 -102802 -20851 -9692 -10148 -105083 -89541 -41790 -45862 -71119 -73295 -80386 -101748 -119213 -60153
2037 -60153 37525 123981 32050 83059 45549 -4679 -9588 33017 -70008 -153123 -81444 -31704
2025 -31704 -7715 -64265 -3569 -54295 -66606 -24876 14705 62388 -6660 -12803 -6975 50478
2013 50478 62360 -27602 -37722 51899 21480 58922 7129 37327 14788 -62121 58466 -15690
2001 -15690 -44714 16881 36469 34199 21788 -60269 -128461 -44259 -99061 -33306 25928 -50604
1989 -50604 -55823 -55612 -142198 -138313 -201435 -172978 -155898 -138421 -66765 3183 108764 -79294
1977g9294k2854P4492J5613q0983k9731L467K7844j20131Q4812R1346L3162L8354
1965C6097j08393k4956j5182j2077R9945P1878k9463o4269m8970K4095P4698N4465
1953E7868p0226L8250L3786L474p0645o5830J8932L649o709r6092L1047k1566
1941a44062j9255J16068O7309K1496N6373r9629o812P090m100j0608N6881J0869
1929E1620n8797p1200k209n053j7048j2262M7105K7938J5288m733Q5391l9817
1917A6223r393j5356o682k9275n7105N8462j7930M8034K1476O726p8016M6347
1905a6489J1956n7511o2865K0645j06320P422J08815M0225N8072M8048l6847k8970
1893a3819j3329Q9919r3273j0823K0042n6240n1977k0862J03287p7864N1011K627
$$ plain form
1977 -79294 -102148 -27656 -12043 -93026 -122757 -119290 -91446 -211577 -126765 -35419 -2257 36097
1965 36097 -72296 -97252 -112434 -124511 -24566 47312 17849 -46420 -95390 -71295 3403 57868
1953 57868 -12358 25892 59678 63152 -7493 -73323 -54391 -50742 -57451 -153543 -122496 -144062
1941 -144062 -163317 -47249 20060 41556 97929 -1700 -8512 -1422 -5522 -16130 40751 51620
1929 51620 -7177 -78377 -80586 -85639 -102687 -114949 -67844 -39906 -24618 -29351 56040 16223
1917 16223 6830 -8526 -15208 -44483 -101588 -43126 -61056 -13022 8454 15180 -62836 -16489
1905 -16489 -4533 -62044 -124909 -104264 -210584 -203162 -94347 -54122 3950 51998 15151 -13819
1893 -13819 -27148 62771 -30502 -41325 -21283 -77523 -129500 -150362 -47075 -124939 -73928 -71301
1881g1301r28Q4124L1864L3831l0448q0616k351j1323p8754Q5123O8113J1252
1869C8586n3321r5420M1126M6263M5533j64022N5300P9661r761n5275J1403p891
1857f7818n2422M5813R4219N35k8318K6292l1436K5345k6730k7618M2749M9992
1845E0603j02478m835N1062K0088r1701J04686R4401O2762j09009p0809j4360
1834i590K77q7221j873Q7619l6477k964m9492L1595K9536l1397J7814R5659K2881
1821F6367m5410N047O2368q1428m1090J07443k3091j17988K9023m4588n717J6845
1809g2219j157N0284Q403n023K0449k3248j01772L4253k2397k8257O880K7389
1797a06415Q4421J1022o3514Q1828O2091p3445k8112p1822l1838Q5017J41295
$$ plain form
1881 -71301 -72229 11895 43759 77590 47142 -33474 -35825 -47148 -125902 -40779 27334 38586
1869 38586 -14735 -110155 -69029 -22766 22767 -141255 -85955 -6294 -16055 -71330 -59927 -67818
1857 -67818 -120240 -74427 19792 20327 -7991 18301 -13135 12210 -14520 -42138 611 50603
1845 50603 -51875 -56710 -5648 14440 -77261 27425 121826 184588 75579 4770 -9590
1834 -9590 -9313 -96534 -98407 -10788 -47265 -50229 -99721 -68126 -38590 -69987 -52173 43486 66367
1821 66367 20957 26004 88372 6944 -34146 73297 50206 -67782 -38759 -83347 -89064 -72219
1809 -72219 -73376 -23092 -14689 -19712 737 -22511 -124283 -90030 -112427 -140684 -133804 -106415
1797 -106415 -21994 -10972 -74486 7342 69433 -4012 -32124 -103946 -135784 -50767 90528
1786I0528n5924n8253M9786J4936j8702o8242l7353J97J4257o6528r935R9621
1774d5612K3698k8215o9382J04291K6312j42873k4784J06372q1164J4526R4649
1763b2182k034L8659J5133p2144j1910Q524m4896k3739Q1872N2469k3316L288
1751b76o2171o5598O7329j09799Q1942P7489m5618q8765m3822J30040k7278N7537
1739b8990L5741O8615j41934j7940K1992q983N1825m1260l8866Q5612K1970J5033
1727B2815K8441N1116p3197j4482j4844n2448o2741O6458M4749q7052N9207o5424
1715i7402l1993Q4415N1769M2104P2882j63299p348M9693P3604j3649j80787k3857
1703a43868N9749l0608P3771J01864L452J0694o7448q9247k3922k7802J7461J35693
$$ plain form
1786 90528 34604 -23649 26137 41073 22371 -45871 -83224 -83027 -68770 -135298 -145233 -45612
1774 -45612 -21914 -50129 -119511 -15220 11092 -131781 -156565 -50193 -131357 -116831 -22182
1763 -22182 -24216 14443 29576 -42568 -54478 -45954 -90850 -114589 -32717 19752 -3564 -276
1751 -276 -62447 -128045 -60716 -170515 -88573 -11084 -56702 -145467 -189289 -59249 -86527 -28990
1739 -28990 6751 75366 -66568 -84508 -62516 -71499 -19674 -60934 -99800 -14188 7782 22815
1727 22815 51256 102372 29175 14693 -151 -52599 -115340 -48882 -4133 -91185 -31978 -97402
1715 -97402 -129395 -44980 6789 48893 121775 -41524 -48872 821 74425 60776 -120011 -143868
1703 -143868 -84119 -114727 -40956 60908 64360 75054 7606 -81641 -105563 -133365 -115904 19789
1691A9789j49339q0098L5785O9199n228P113M1793K5962r810l4963J1827p4350
1679a42320L0186L8316J0956Q418o622J8162k2906J11656m1425o6177p9624J6507
1667a24873J30430p754J3111M7043j41456k9981J6211j7160R1556m8193j09941
1656a81007N0383Q8144m0627N0685R701n1633K8119o7360j0174K8943j8244J03904
1644i166L0254n5066r2575J03063n6379P551N3281K3622n9223N9894j0985o3295
1632f9024J3003l3270j635J69J26208M7162o0221L9244O4270j63267n8439n095
1620a00895p3401P772O7363J54575j04865q5588j6551M3490N844R2351O2001o5690
1608a3594m7285L9894m7381m884P2970n0814l4366J03160j22871M6693L9713l0340
$$ plain form
1691 19789 -129550 -209648 -173863 -104664 -109892 -102779 -60986 -35024 -44834 -79797 -67970 -142320
1679 -142320 -112134 -73818 -62862 -54444 -61066 -42904 -65810 45846 4421 -61756 -141380 -124873
1667 -124873 5557 -2197 10914 57957 -83499 -113480 -97269 -114429 -22873 -71066 -181007
1656 -181007 -130624 -42480 -83107 -32422 -22721 -74354 -46235 -113595 -123769 -94826 -113070 -9166
1644 -9166 21088 -33978 -126553 -23490 -79869 -72318 -19037 4585 -54638 5256 -5729 -69024
1632 -69024 -56021 -89291 -90926 -90757 35451 82613 22392 61636 125906 -37361 -95800 -100895
1620 -100895 -174296 -166524 -99161 55414 -49451 -135039 -151590 -108100 -102256 -9905 52096 -13594
1608 -13594 -60879 -20985 -68366 -73250 -280 -51094 -85460 17700 -105171 -58478 -18765 -49105
1596d9105Q8297M7586l5308p4493M2636j7314O6218o8829P818l5411M7372K7147
1584D6614m8602J89657p0045j54287N6387O00o3141q553j3812N8735k3852m7654
1572g7953O4789m2791l0045K0600k5945R731K3880l7514m2516N7880O8360M7952
1560C6428p5951j8023R739M884n2536j1609M5588l1409N7406l5767P6491k0472
1548a5231K1318l123k5099k1699N2745o6450P114Q8678l0835r5428m170m1428
1536a33608K0178L8741R215m560M7208j15798N828m0746J35543j11735Q9389P0432
1524A0087n7596M9972J034K5492R4864q8532N1097K5991j64252n0259O9320N773
1512b7009R855M5736n3192K1743p331Q263J2722J7295L5823j6118j39262n6437
$$ plain form
1596 -49105 39192 86778 51470 -23023 19613 2299 68517 -312 7506 -27905 19467 46614
1584 46614 -1988 187669 117624 -36663 19724 20324 -42817 -51370 -65182 -6447 -30299 -77953
1572 -77953 -13164 -55955 -86000 -65400 -91345 -81614 -57734 -95248 -137764 -79884 -11524 36428
1560 36428 -39523 -57546 -47807 -42923 -95459 -107068 -61480 -92889 -35483 -71250 5241 -15231
1548 -15231 6087 2964 -22135 -43834 8911 -57539 -50425 38253 7418 -88010 -92180 -133608
1536 -133608 -113430 -74689 -65474 -70034 -22826 -138624 -132796 -173542 -37999 -149734 -60345 10087
1524 10087 -47509 2463 3497 28989 123853 35321 86418 112409 -51843 -102102 -32782 -27009
1512 -27009 -17154 28582 -24610 -2867 -10198 -1935 10787 28082 63905 47787 -91475 -147912
1500a47912L0508L737J4438l621n2684J9153n015J02819M6191L3835j8852p2428
1488d9831J8769Q5480L8405o7205j11257M0107j06418R7725J8217J5640k8754
1477d9122k4499K0325K88n8673j9495L1564O4541k5054M0782j02800R4120N3227
1465B5204M0233j942n957N0764l3181n6751q6132L7111q246q8230J5155K8249
1453h3723O6172K9119O7179m7742q3224q6669j2413R4240K4223j0818N4260m4548
1441c3944L3219o7488P0521J2028l0665l4752k7196L9886q2730Q1501j708o5708
1429a07036J7702r130O8955J15442q4089L5680p6586K0235O8336n5673n8013k7358
1417i1535N4188o1524J9504L2128k65j2619Q8440L661p6140M4252K2467P8318
$$ plain form
1500 -147912 -117404 -113667 -99229 -102850 -155534 -136381 -141396 -38577 7614 41449 22597 -49831
1488 -49831 -31062 54418 92823 25618 -85639 -45532 -151950 -54225 -36008 -20368 -49122
1477 -49122 -73621 -53296 -53008 -111681 -131176 -99612 -35071 -60125 -19343 -122143 -28023 25204
1465 25204 65437 63495 57538 108302 75121 18370 -67762 -30651 -38897 -127127 -111972 -83723
1453 -83723 -17551 11568 78747 31005 -52219 -138888 -151301 -57061 -32838 -43656 10604 -33944
1441 -33944 -725 -68213 2308 14336 -16329 -51081 -78277 -38391 -121121 -39620 -41328 -107036
1429 -107036 -89334 -98464 -29509 85933 1844 37524 -39062 -18827 49509 -6164 -64177 -91535
1417 -91535 -37347 -98871 -79367 -47239 -47504 -60123 28317 31978 -44162 90 22557 100875
1405A00875l3740L8231o0606P5213r8387l365l2194p4297L7959M7024J8195j1562
1393C346j2985K393J1786M1095j5448m5652l2573P7072l4568q9719n3842q697
1381a57792J29999l1717o2301J33756j9621n9274M5427Q3937k968o0317P8419
1370G7548P4005o6880r0409L2414r9689N8661P9752m3456J13932j24702J4807
1359B5983J8964m3603M7112L3895j7291l3673l2340k7960m4540m7573N8253J7003
1347d5770J2317K8334M201K2867J6338j08916M2912Q2977j01950J9171J45341
1336A17822M4256J754j31110r1699N3077m7966j31363K5620J58921o8100J3623
1325e5165J0646N5675J03227q8776j5422N265J308l9580n1569j6117K9545n239
$$ plain form
1405 100875 67135 105366 44760 119973 21586 18221 -13973 -88270 -50311 -3287 14908 3346
1393 3346 -9639 -7246 4540 45635 30187 -15465 -48038 29034 -5534 -95253 -149095 -157792
1381 -157792 -27793 -59510 -121811 11945 -7676 -66950 -21523 62414 59446 -871 77548
1370 77548 151553 84673 -5736 26678 -73011 -14350 65402 21946 135878 11176 25983
1359 25983 44947 1344 48456 82351 65060 31387 -953 -28913 -73453 -121026 -62773 -45770
1347 -45770 -33453 -5119 -918 21949 38287 -70629 -27717 55260 -46690 -27519 117822
1336 117822 162078 163832 32722 -58977 -5900 -53866 -185229 -159609 -688 -68788 -55165
1325 -55165 -44519 11156 114383 25607 10185 15450 16758 -22822 -74391 -90508 -60963 -66202
1313f6202P1272O8440q1913o2322L8690L3904K587J5675l60l8254J04916N347
1301I1780n7044J0726J6016q2672n225P741j6139N1414j345j9173n2592L1510
1289b5003k578M7651J5l8143j3613K605l5090j4224l9317J377P156N1123l33m2629
1275a01003P9943R595l0569n8129M4760N7776K217p3536n4329P7405L5462q496
1263a8904Q9816m6900m0404J09806J1757r3027q099J21758L1300j40615k6093
1252i605j5466L9757O0875L9625j32801L841l7441K98J9201m392j2600o8562J77115
1239E9845m614l1603M8185j2487q4261N3675L1611o8835r874K180N2502j5993
1227B0331P2783n5635k6848L8607j01103o4865J08349J0311P0532J13002j28885
$$ plain form
1313 -66202 5070 73510 -8403 -70725 -32035 1869 4456 20131 19771 -18483 86433 91780
1301 91780 34736 45462 61478 -21194 -26419 -18678 -34817 16597 15252 -3921 -56513 -25003
1289 -25003 -27581 20070 20085 -18058 -31671 -29066 -64156 -78380 -117697 -116320 -109164 -58041 -58374 -101003
1275 -101003 -21060 -11465 -42034 -100163 -55403 2373 4590 -68946 -123275 -45870 -10408 -18904
1263 -18904 70912 24012 -16392 93414 105171 12144 4045 125803 157103 16488 -9605
1252 -9605 -25071 14686 75561 115186 -17615 -13774 -51215 -50917 -31716 -36108 -48708 -117270 59845
1239 59845 55231 23628 71813 59326 -24935 28740 60351 -8484 -18358 -16178 36324 20331
1227 20331 93114 37479 10631 49238 -51865 -116730 -8381 1930 72462 185464 56579
1216E6579k0031m956j1833l6492N9310P6228p4136o5874m3169M8714q1586r1384
1204a88630P7348Q0632l2286r4069J61290k9616M3714p734m9424L8298n1276K5411
1192b6342k3957o1538P893P9548M3212N635j19332O9150N2606o7499J8370K1186
1180a068M191Q9257j6650j16094n5677l5597n5305J43658J8587m7526J09776k9959
1168G593J5631q908p1130r2747K0998M4291P9291j144p9202O4065M7565M3638
1156F9941q7478p2147K2820J1536L6393L5549j0484K0372J5784P313O0307L4886
1144A44792m3874j8942n3819l568K0324J0079j0945m5568m4283j0045r4709P7269
1132g3289R2707m8558j7953j8837M6323J1084J10989K4652o2605R815N4729k6932
$$ plain form
1216 56579 36548 31592 19759 -16733 42577 118805 44669 -21205 -64374 -15660 -97246 -188630
1204 -188630 -111282 -30650 -62936 -157005 4285 -25331 18383 10649 -38775 -477 -51753 -26342
1192 -26342 -50299 -111837 -103944 -24396 18816 24451 -94881 -25731 26875 -40624 -22254 -1068
1180 -1068 3123 92380 75730 -40364 -96041 -131638 -186943 -43285 -24698 -72224 37552 7593
1168 7593 23224 14316 -56814 -149561 -128563 -84272 -4981 -6125 -85327 -21262 26303 69941
1156 69941 -17537 -89684 -66864 -55328 -18935 16614 6130 26502 42286 49599 109906 144792
1144 144792 100918 81976 28157 24589 44913 54992 44047 -1521 -45804 -55849 -150558 -73289
1132 -73289 19418 -29140 -47093 -65930 -19607 -8523 102466 127118 64513 74328 129057 102125
1120A02125P30n8250q4354N584K0870k9825M3545L2046P0693q4632N3361o4779
1108G114o3929M5677k2708K585P8567O9763k8486o7855Q2383P6626l3199r8427
1096D8111J4312j5705P7663o6571j1215p1787p9169J06409n9805p4537R6892Q65
1084c4537R844M5942M5200L551p5146L0175l809n918K1108j9434J16424l8288
1072I5112q7792k032O20o8485p8927J8194J54130L5304p3670m0501L2296J19427
1060A03676l4650p5051r6739O4711O4552j7907n4655J44000j12199J20437j11044
1049d869j6562j0008K0738M9966n987o110R1895J6787m6938k2993L4329P2612
1037A72860l8470p7483M9901j6203j9904p1173O5575N3890p6644M8491r3531L1560
$$ plain form
1120 102125 102855 44605 -39749 -34165 -13295 -43120 425 32471 103164 18532 71893 7114
1108 7114 -56815 -11138 -33846 -31261 47306 117069 88583 20728 103111 179737 146538 48111
1096 48111 62423 46718 124381 57810 46595 -25192 -104361 2048 -57757 -132294 -35402 -34537
1084 -34537 -24693 21249 66449 70000 -5146 25029 21220 15302 36410 16976 133400 95112
1072 95112 7320 5288 5908 -62577 -141504 -123310 30820 66124 -7546 -48047 -15751 103676
1060 103676 69026 -6025 -102764 -38053 26499 8592 -46063 97937 -14262 106175 -4869
1049 -4869 -21431 -31439 -10701 39265 33278 27168 119063 135850 88912 65919 100248 172860
1037 172860 134390 56907 106808 90605 70701 -472 65103 118993 42349 90840 -2691 28869
1025B8869j5179n102m7912K1016k11m300M3740n2184L726n7489j3718N3076M8398
1012B730l5598k1254P4368P3624q1972K2540K5601N7816o6080j40174j074N1911
1000c7562L3384n158p834j4114j0848o1139P07J29444Q1870m5151k9778L4849
988F8670k2454q8005j1913K2898J0709j8226J42507p7996p1810r1436N055J20115
976a1886K4531N817J8198o452n3899R4144O6604m97o2110j27117Q806L9368M7229
963D2736K0058j3465J2618n5357r6758N5525K8141n5043O761P2419L852l514M471
950B2444N2529l0668l6882l6740j7858n9652M6551Q8562M2166J0062m0403j4216
938B5895j03457n0919R3683L4232l7619K273L1128N4647k7883j5704L5574J2261
$$ plain form
1025 28869 13690 8588 -39324 -18308 -18519 -22819 20921 -31263 -27537 -85026 -98744 -45668 2730
1012 2730 -32868 -54122 20246 93870 11898 34438 60039 117855 51775 -88399 -89473 -37562
1000 -37562 -4178 -9336 -17170 -31284 -42132 -103271 -102564 26880 108750 63599 33821 68670
988 68670 46216 -41789 -53702 -30804 -20095 -38321 104186 26190 -45620 -137056 -132001 -11886
976 -11886 12645 18462 36660 30208 -23691 70453 137057 136560 74450 -52667 -43861 -4493 42736
963 42736 62794 49329 61947 6590 -90168 -34643 -6502 -61545 -54784 17635 21487 17973 22444
950 22444 74973 44305 7423 -29317 -47175 -106827 -60276 28286 70452 80514 40111 25895
938 25895 -77562 -128481 -34798 -566 -38185 -35912 -4784 49863 21980 6276 41850 54111
926E4111L5719p2660j12278J0387k4864M575n532K8437J65664k55m7426n6169
914b0291o954P8503M1285j14775j4736j3207K7176J3548L8448R619m8728k0866
902c0978K1974J08665o9936j18259p445M6162k3309J3724k1542J5146k202Q9684
890B1684J2882P7552o9160j00325J09730j35360O6587L6248M5685p7614O5641
879E3550q3802k1547M2786m6335k4367L4770O8383j0646R1343n9023j667j082
867D2363Q0627m7777q5799R2007j3608j02476J68975o7120j39493Q1847k019j9764
855a2237R7014o6931J6681k507K7456J385M3845n6370j06338L6975J41878o7629
843E3222j22578K0626n615N5998P3775J36580m9888k101j09199l6523L0650m3674
$$ plain form
926 54111 89830 17170 -95108 -84721 -109585 -105010 -110542 -82105 83559 83304 35878 -20291
914 -20291 -27245 51258 92543 -22232 -36968 -50175 -22999 -9451 28997 38616 -10112 -30978
902 -30978 -9004 99661 29725 -88534 -95979 -49817 -73126 -59402 -80944 -65798 -68000 21684
890 21684 34566 112118 42958 -57367 52363 -82997 -16410 19838 65523 -12091 53550
879 53550 -30252 -51799 -9013 -55348 -79715 -44945 23438 12792 104135 45112 43445 42363
867 42363 122990 75213 -10586 81421 67813 -34663 134312 67192 -72301 9546 7527 -12237
855 -12237 84777 17846 34527 32020 59476 60861 104706 48336 -58002 -21027 120851 53222
843 53222 -69356 -48730 -54345 1653 75428 212008 162120 160019 50820 14297 44947 1273
831A273l048K8999O1651m9711Q895j01941J8869r772J6655P0783n6813K4999L3142
818D3981n2612j9725l9178J9876j0422N218N4911N7415L9379l0626p3250k7667
806c2700K2673M3507K3253j0454j11435j1398R9084M394p8214k427m476l9263
794i7456j1285k5708J3873J46248L7403m3892J13509n315j38794K9232n505p2811
782f0501j4701L615J8542P3028m410l63k2590q3196J00717k1633M8307m8757L6575
769B4633L947M4212k0446m7461n1962j0305N442Q9478L2897o3715j03389l4364
757a31033Q2822l3334L5659P8016K8037M6233j5732J3869j06265j7173J5633k494
745e762l4062P2400K6005K9256J0150k4153Q7595p0486q1777k7323r515m9101
$$ plain form
831 1273 -1775 27224 88875 39164 48059 -53882 -35013 -44785 -28130 42653 -14160 10839 43981
818 43981 -8631 -28356 -67534 -47658 -58080 -52862 2049 59464 98843 68217 -5033 -32700
806 -32700 -10027 33480 56733 46279 -65156 -76554 22530 26924 -51290 -53717 -58193 -97456
794 -97456 -108741 -134449 -120576 25672 63075 19183 132692 127377 -11417 17815 12310 -60501
782 -60501 -75202 -71587 -53045 19983 15573 15210 -7380 -90576 10141 -11492 36815 -11942 24633
769 24633 28580 72792 52346 4885 -47077 -57382 -51940 37538 70435 6720 -96669 -131033
757 -131033 -48211 -81545 -45886 32130 60167 106400 90668 104537 -1728 -18901 -3268 -5762
745 -5762 -39824 32576 58581 87837 97987 73834 161429 90943 9166 -18157 -27672 -76773
733g6773L050N9658l6285p1002Q4108q856P6011K8445j03636M4324K9960l856
721B5148m216J5929N3730p2689J0013r297j36421L9290R9204r101J4446q367m1114
708b3445r438N5104R9418k9019l3522N8125o6874l5295j3137O3896m5228L4124
696E4709k351n9415n02L0450N7822l0544q2106k0429K2533q9043n5636J25991
684d8521J7279l2189k2133Q5482K6817o5072Q2117r630n1315M4627q028j0228
672I206j6848L5909J1322m3471p839l2085j1811L5746J10703k347j1515k8774
660D8196j8203j7901N3629L216o4134r995o5025j3134j890P3511N15j3184N9266
647C4867o2698j36301m52O0642J12610O0977q288n6504q1301J08401m2762j2850
$$ plain form
733 -76773 -73723 -14065 -50350 -121352 -37244 -46100 29911 58356 -45280 -956 29004 25148
721 25148 20932 36861 90591 17902 27915 18618 -117803 -78513 20691 11590 26036 17669 -23445
708 -23445 -32883 22221 121639 92620 59098 117223 50349 15054 1917 65813 20585 54709
696 54709 52358 -7057 -7559 22891 80713 50169 -31937 -52366 -29833 -118876 -174512 -48521
684 -48521 -31242 -63431 -85564 -82 26735 -38337 43780 34150 -17165 27462 19434 9206
672 9206 -7642 28267 39589 -3882 -11721 -43806 -55617 -19871 90832 88485 76970 48196
660 48196 29993 12092 65721 68937 4803 -5192 -70217 -83351 -85241 -11730 -11215 -24399 34867
647 34867 -27831 -164132 -164584 -103942 8668 69645 61357 4853 -76448 31953 -10809 -23659
635b3659O5816m1091l0285R0237L1093J1936N3500p9807r6242J5438M2369P1421
623A10726j24088M707J4045L0949m6295k7230K5289n3590P5656N7209k8458k2547
611A6373l427l6854M9699Q1264l3519m6713Q461o3021l6716M0561m1922l486M5305
598b3995K295N1205l6327k3552L0149n2200r6655Q3198J20421K4215k7974r7295
586d6515q64n3591J20684O2635m5662j8305k1758Q0798O989q5959m9705k7932
$$ plain form
635 -23659 42157 1066 -29219 61018 92111 104047 157547 77740 -18502 -3064 39305 110726
623 110726 -13362 -8655 5390 36339 -9956 -37186 -11897 -65487 10169 67378 38920 16373
611 16373 12946 -23908 25791 107055 73536 26823 35284 -27737 -64453 -23892 -65814 -69300 -23995
598 -23995 -21700 29505 -6822 -30374 -225 -52425 -149080 -65882 54539 78754 50780 -46515
586 -46515 -47379 -100970 19714 82349 36687 18382 -3376 77422 84411 -1548 -51253 -79185
$$ [...]
##END NTUPLES=NMR SPECTRUM
##END=
