##TITLE=1H_EC-3307(3)
 CDCl3
 8 sc, 
 26.12.2023
##JCAMPDX= 6.0         $$ Bruker NMR JCAMP-DX V2.0
##DATA TYPE= NMR SPECTRUM
##DATA CLASS= NTUPLES
##ORIGIN= UXNMR, Bruker Analytische Messtechnik GmbH
##OWNER= root
$$ XWIN-NMR		Version 3.5
$$ Tue Dec 26 13:56:58 2023 Russian Standard Time (UT+4h)  she@DPX200
##.OBSERVE FREQUENCY= 200.1313
##.OBSERVE NUCLEUS= ^1H
##.ACQUISITION MODE= SIMULTANEOUS
##.ACQUISITION SCHEME= undefined
##.AVERAGES= 8
##.DIGITISER RES= 18
##SPECTROMETER/DATA SYSTEM= spect
##.PULSE SEQUENCE= zg30
##.SOLVENT NAME= CDCl3
##.SHIFT REFERENCE= (INTERNAL, CDCl3, 0, 15.488)
##AUDIT TRAIL= $$ (NUMBER, WHEN, WHO, WHERE, WHAT)
$$ ##TITLE= Audit trail, XWIN-NMR		Version 3.5
$$ ##JCAMPDX= 5.01
$$ ##ORIGIN= Bruker BioSpin GmbH
$$ ##OWNER= she
$$ F:/spectra/data/she/nmr/H-F/1/pdata/1/auditp.txt
$$ ##AUDIT TRAIL=  $$ (NUMBER, WHEN, WHO, WHERE, WHAT)
(   1,<2023-12-26 13:54:56.00 +0400>,<she>,<DPX200>,
      <created by zg, POWCHK disabled, PULCHK disabled
       configuration hash MD5:
       00 E9 B6 7A A2 85 ED C7 34 08 36 98 17 FE 4E 26
       data hash MD5: 16K
       B5 D9 20 7E 00 44 8E 1C 18 42 2C 3B 1B 69 84 BA>)
(   2,<2023-12-26 13:54:58.06 +0400>,<she>,<DPX200>,
      <Start of raw data processing
       efp BC_mod = 2 LB = 0.24 FT_mod = 6 PKNL = 1 PHC0 = -24594.17 PHC1 = 13.85273 SI = 16K 
       data hash MD5: 16K
       51 29 8B 8A 27 16 1A B7 24 76 19 BB 73 35 0B 22>)
(   3,<2023-12-26 13:55:17.57 +0400>,<she>,<DPX200>,
      <pk PHC0 = -5.314243 PHC1 = 3.6 
       data hash MD5: 16K
       F5 15 22 B6 05 3C 8C AA FA D1 1F AB D2 75 23 E1>)
(   4,<2023-12-26 13:55:21.42 +0400>,<she>,<DPX200>,
      <abs ABSG = 5 
       data hash MD5: 16K
       22 B4 84 B7 75 1E A2 2C B2 3A 7A 46 21 FA ED A7>)
(   5,<2023-12-26 13:55:57.53 +0400>,<she>,<DPX200>,
      <pk PHC0 = 4.606141 PHC1 = -6 
       data hash MD5: 16K
       4C FB 4F CC 8F 17 B7 DB CF 2F F0 C1 FB 06 88 45>)
(   6,<2023-12-26 13:56:01.40 +0400>,<she>,<DPX200>,
      <abs ABSG = 5 
       data hash MD5: 16K
       3F 9D DD 39 DB 4A 49 0A 01 AF 62 B4 E7 5D 5E B3>)
$$ ##END=
$$ 
$$ hash MD5
$$ BF 31 48 D4 22 9A CB DB D0 B7 97 F7 A2 5A C0 FD
##$RELAX= 
##$RELAX= 
##$RELAX= 
##$RELAX= 
##$RELAX= 
##$RELAX= 
$$ Bruker specific parameters
$$ --------------------------
##$DU= <F:/spectra>
##$EXPNO= 1
##$NAME= <H-F>
##$PROCNO= 1
##$TYPE= <nmr>
##$USER= <she>
##$AMP= (0..31)
100 100 100 100 100 100 100 100 100 100 100 100 100 100 100 100 100 100 
100 100 100 100 100 100 100 100 100 100 100 100 100 100 
##$AQSEQ= 0
##$AQ_mod= 1
##$AUNM= <au_zg>
##$AUTOPOS= <>
##$BF1= 200.13
##$BF2= 200.13
##$BF3= 200.13
##$BF4= 200.13
##$BF5= 200.13
##$BF6= 200.13
##$BF7= 200.13
##$BF8= 200.13
##$BYTORDA= 1
##$CFDGTYP= 0
##$CFRGTYP= 5
##$CHEMSTR= <none>
##$CNST= (0..31)
1 1 145 1 1 1 1 1 1 1 1 1 1 1 1 1 1 1 1 1 1 1 1 1 1 1 1 1 1 1 1 1 
##$CPDPRG= <>
##$CPDPRG1= <>
##$CPDPRG2= <>
##$CPDPRG3= <>
##$CPDPRG4= <mlev>
##$CPDPRG5= <mlev>
##$CPDPRG6= <mlev>
##$CPDPRG7= <mlev>
##$CPDPRG8= <mlev>
$$ [...]
##$SUBNAM3= <"">
##$SUBNAM4= <"">
##$SUBNAM5= <"">
##$SUBNAM6= <"">
##$SUBNAM7= <"">
##$SUBNAM8= <"">
##$SUBNAM9= <"">
##$SW= 18.0517328524113
##$SWIBOX= (0..15)
0 0 2 0 0 0 0 0 0 0 0 0 0 0 0 0 
##$SW_h= 3612.71676300578
##$TD= 16384
##$TD0= 1
##$TE= 0
##$TE2= 300
##$TE3= 300
##$TEG= 300
##$TL= (0..7)
0 120 120 120 120 120 120 120 
##$TP= (0..7)
150 150 150 150 150 150 150 150 
##$TP07= 0
##$TPNAME0= <>
##$TPNAME1= <>
##$TPNAME2= <>
##$TPNAME3= <>
##$TPNAME4= <>
##$TPNAME5= <>
##$TPNAME6= <>
##$TPNAME7= <>
##$TPOAL= (0..7)
0.5 0.5 0.5 0.5 0.5 0.5 0.5 0.5 
##$TPOFFS= (0..7)
0 0 0 0 0 0 0 0 
##$TUNHIN= 0
##$TUNHOUT= 0
##$TUNXOUT= 0
##$USERA1= <user>
##$USERA2= <user>
##$USERA3= <user>
##$USERA4= <user>
##$USERA5= <user>
##$V9= 5
##$VALIST= <valist>
##$VCLIST= <CCCCCCCCCCCCCCC>
##$VD= 0
##$VDLIST= <DDDDDDDDDDDDDDD>
##$VPLIST= <PPPPPPPPPPPPPPP>
##$VTLIST= <TTTTTTTTTTTTTTT>
##$WBST= 1024
##$WBSW= 4
##$XGAIN= (0..3)
0 0 0 0 
##$XL= 0
##$YL= 0
##$YMAX_a= 642204
##$YMIN_a= -752059
##$ZGOPTNS= <>
##$ZL1= 120
##$ZL2= 120
##$ZL3= 120
##$ZL4= 120
##$ABSF1= 15.42627
##$ABSF2= -2.625578
##$ABSG= 5
##$ABSL= 3
##$ALPHA= 0
##$AQORDER= 0
##$ASSFAC= 0
##$ASSFACI= 0
##$ASSFACX= 0
##$ASSWID= 0
##$AUNMP= <proc_1d>
##$AZFE= 0.1
##$AZFW= 0.1
##$BCFW= 0
##$BC_mod= 2
##$BYTORDP= 0
##$COROFFS= 0
##$CY= -3
##$DATMOD= 1
##$DC= 0
##$DFILT= <>
##$DTYPP= 0
##$F1P= 0
##$F2P= 0
##$FCOR= 1
##$FTSIZE= 16384
##$FT_mod= 6
##$GAMMA= 0
##$GB= 0
##$INTBC= 1
##$INTSCL= 3.70164e-10
##$ISEN= 128
##$LB= 0.24
##$LEV0= 0
##$LPBIN= 0
##$MAXI= 10000
##$MC2= 0
##$MEAN= 0
##$ME_mod= 0
##$MI= 1.114404
##$NCOEF= 0
##$NC_proc= -6
##$NLEV= 6
##$NOISF1= 3.799351
##$NOISF2= 2.8
##$NSP= 0
##$NTH_PI= 0
##$NZP= 0
##$OFFSET= 15.48797
##$PC= 1
##$PHC0= -24594.88
##$PHC1= 11.45273
##$PH_mod= 1
##$PKNL= yes
##$PPARMOD= 0
##$PSCAL= 0
##$PSIGN= 0
##$REVERSE= no
##$SF= 200.130006751613
##$SI= 16384
##$SIGF1= 3
##$SIGF2= 2
##$SINO= 5.538805
##$SIOLD= 16384
##$SREGLST= <1H.CDCl3>
##$SSB= 0
##$STSI= 16384
##$STSR= 0
##$SW_p= 3612.71676300578
##$SYMM= 0
##$S_DEV= 0
##$TDeff= 16384
##$TDoff= 0
##$TI= <>
##$TILT= no
##$TM1= 0
##$TM2= 0
##$TOPLEV= 0
##$USERP1= <user>
##$USERP2= <user>
##$USERP3= <user>
##$USERP4= <user>
##$USERP5= <user>
##$WDW= 1
##$XDIM= 16384
##$YMAX_p= 469608674
##$YMIN_p= -414320
$$ End of Bruker specific parameters
$$ ---------------------------------
##NTUPLES= NMR SPECTRUM
##VAR_NAME=  FREQUENCY,     SPECTRUM/REAL,   SPECTRUM/IMAG
##SYMBOL=    X,             R,               I
##VAR_TYPE=  INDEPENDENT,   DEPENDENT,       DEPENDENT
##VAR_FORM=  AFFN,          ASDF,            ASDF
##VAR_DIM=   16384,         16384,           16384
##UNITS=     HZ,            ARBITRARY UNITS, ARBITRARY UNITS
##FACTOR=    0.220516191357247, 1,           1
##FIRST=     3099.60761114913, 0,            0
##LAST=      -513.109151856645, 0,           0
##MIN=       -513.109151856645, -414320,     0
##MAX=       3099.60761114913, 469608674,    0
$$ Real data points
##PAGE= N=1
##DATA TABLE= (X++(R..R)), XYDATA
$$ [...]
6640F0847M5939p86j36331k5672n3877K8946J4219j0154j398N430P8470J0080
6628A5713m6731N6769K8289q1729O3781J7317o4794L6110j74705L9343J35337
6617B4700L1712k8865k0042k617r8694j4311l07q2478j3448J70418O5392J13259
6605A44719r6246l1004m981N7722N0719J6259l3407q3472K1010j8373O5017P7432
6593A65395M2411l5428m4943P2032L1173j31807o2968J3349j802L6932J46368
6582B30712O2987o7272o8409j30720o0313j3766N5029P7179n2000n654O6238o6017
6570B7994l3831L7997J05767J31373q8423j06713l8000J5300j7646r35J0057J30115
6558A73055N103j01308n1014M2859j2299j0639r6664r094P9213Q5584K8484q558
$$ plain form
6640 60847 106786 106000 -30331 -56003 -109880 -80934 -66715 -76869 -78267 -72837 5633 15713
6628 15713 -31018 25751 54040 -27689 36092 53409 -11385 24725 -149980 -110637 24700
6617 24700 56412 27547 7505 4888 -93806 -108117 -108424 -190902 -204350 -33932 31460 144719
6605 144719 48473 17469 12488 70210 120929 137188 103781 20309 41319 22946 87963 165395
6593 165395 207806 172378 127435 199467 230640 98833 35865 49214 47412 84344 230712
6582 230712 293699 226427 158018 27298 -33015 -46781 8248 85427 33427 27773 94011 27994
6570 27994 -5837 32160 137927 269300 180877 74164 36164 51464 33818 32883 42940 173055
6558 173055 178158 76850 25836 68695 56396 45757 -50907 -60001 19212 104796 133280 124722
6546A24722M9297j40318l1984K4922R7671o2056P7M6108M7429p6115j10840K8
6534c1059M474L8183Q6129p8793m157O1958K4168m65k3117m3483J9584O5066l5235
6521H3253q2121K0824P4868p7967N1493r364k0829P2875L8313l3698m1972J2001
6509H7676l3217p6248l009j0252O8323L0669j4786N0080P9498q8676l7970N8301
6497A10389j5501M2648l3518l1223p5257k3129j8304N5127J5540M3017Q2276o906
6485A45159L884j24394N953L4590R2520n0441j70639K8654L951J31074j1333L7423
6473A26401J13910k4584j29967L2880P3013n0954l9569N7402n2680p7561N1437
6462G9728O848J51589J6582m1152M0670l075O4195J6332j35841J9891k5932L5853
$$ plain form
6546 124722 174019 33701 1717 26639 124310 62254 62331 108439 155868 79753 -31087 -31059
6534 -31059 -26585 11598 97727 18934 14777 76735 100903 100438 77321 33838 53422 118488 83253
6521 83253 1132 21956 96824 18857 70350 60986 40157 113032 151345 117647 75675 87676
6509 87676 54459 -21789 -24798 -35050 33273 63942 49156 99236 178734 90058 52088 110389
6497 110389 94888 137536 104018 72795 -2462 -25591 -43895 11232 26772 69789 152065 145159
6485 145159 149043 24649 30602 65192 157712 107271 -63368 -34714 -30763 100311 88978 126401
6473 126401 240311 215727 85760 118640 191653 140699 101130 158532 105852 28291 79728
6462 79728 86576 238165 254747 213595 254265 251190 315385 331717 195876 215767 189835 225688
6450B25688j1277n1966m1597M3964N5879K8241L176j24306L397l5018M0973J33050
6438B70204O2084j53317J8907P6719j8364P4941N0613N3221n5885l9796L8644
6427C77971M0248J0193J4915l3837n596L4714m1908n2057O3218Q2968j72483M5448
6415C63794K534m4751j7056M4908J16552m8964l8062K224L2531p5458K0450l4774
6403C23928l2053J28725J88k0659j2170J50821j1985j59453o7948K6062R5439
6392D20895N386k1174M5431N4390J6450k1765j9606n0502m5850J18271l8499j08327
6380C55100l4701l7366j388J19252j19205l0852j6613J8514j4312Q6048N6865
6369C81342N5155N5476l7506J835o1289K5416o9026M8466q9n2687R3154m9708
$$ plain form
6450 225688 214411 162445 120848 164812 220691 248932 252108 127802 131199 96181 137154 270204
6438 270204 332288 178971 197878 274597 256233 331174 381787 435008 379123 339327 377971
6427 377971 418219 428412 443327 409490 403894 438608 396700 344643 407861 490829 318346 363794
6415 363794 366328 321577 304521 349429 465981 417017 378955 381179 413710 338252 358702 323928
6403 323928 291875 420600 420788 400129 387959 538780 526795 367342 299394 325456 420895
6392 420895 426281 405107 450538 504928 521378 499613 480007 429505 383655 501926 463427 355100
6380 355100 320399 283033 281645 400897 281692 250840 234227 252741 238429 324477 381342
6369 381342 436497 491973 454467 456302 395013 420429 351403 399869 399780 347093 440247 390539
6357C90539N2561N1311m7837J3968R1519p6767l4767k8226N0450k3018o6345k9408
6345C43980K038Q3409K9140j51279R0982N2281J2822K8186j46642R9675L5654
6334D80246q2185k3301N3875p1664O1257l616o7496m0464R8612Q4024M3222j09644
6322D22866P9890M2791p5585N307k7206J02462m3827j07058l5610k8402O3214
6311C98842J06703J09704k8992J7176j17374L7991P9366n0586K5923n3808L0306
6300E55251L7297n3954M3144j2039j2798K9299k1754M0258J08252L7244J61423
6289I11623j49276j23964Q3205J4660O4195R2522L7481p0845J84225l3735j02650
6278I07441m4033J1970M4641o4561l810J42677P4222K7634o8010k2129K409j57399
$$ plain form
6357 390539 443100 494411 446574 460542 552061 475294 440527 412301 462751 439733 373388 343980
6345 343980 346018 429427 458567 307288 398270 450551 463373 491559 344917 444592 480246
6334 480246 398061 374760 428635 356971 418228 414612 347116 306652 405264 489288 532510 422866
6322 422866 502756 545547 469962 475269 448063 550525 506698 399640 364030 335628 398842
6311 398842 505545 615249 586257 603433 486059 524050 603416 552830 578753 524945 555251
6300 555251 592548 538594 581738 569699 556901 586200 564446 604704 712956 750200 911623
6289 911623 762347 638383 721588 736248 800443 892965 930446 859601 1043826 1010091 907441
6278 907441 863408 875378 920019 855458 851648 994325 1068547 1096181 1028171 1006042 1008451 851052
6266H51052N8630J78096N2377J9435l742J3123M7177N921R4979j69655j44802
6255A002591R4926J28909k5091L2942J7580M7993R0076o6027N0892K8772Q7136
6244A490699J57322j5296p1094O451j5662N0840L2036J5737J27875K21133Q0016
6233B080057n0852J7350K7602O9544l5282j45755J57615J39080m5234l6701J10980
6222B288404l5435m3559J54651n6989P8725J49965N8646L9695O8742Q2985J717
6211B787547K41204J29611P9130R690J24401J14949J25404J2226L840J29203n1453
6200C705752N9319m4723m3549O0680J36648O1459Q9599L0014J25613R5818J42386
6189D419016J22278J58025J06014J06793K15468K28753J97535Q99K87073K2902
$$ plain form
6266 851052 909682 1087778 1140155 1159590 1155848 1168971 1216148 1222069 1317048 1147393 1002591
6255 1002591 1097517 1226426 1201335 1234277 1251857 1299850 1389926 1323899 1374791 1403563 1490699
6244 1490699 1648021 1632725 1561631 1568082 1552420 1603260 1635296 1651033 1778908 2000041 2080057
6233 2080057 2029205 2046555 2074157 2143701 2108419 1962664 2120279 2259359 2214125 2177424 2288404
6222 2288404 2252969 2209410 2364061 2307072 2385797 2535762 2594408 2634103 2702845 2785830 2787547
6211 2787547 3028751 3158362 3237492 3247182 3371583 3486532 3611936 3624162 3628002 3757205 3705752
6200 3705752 3765071 3720348 3676799 3737479 3874127 3935586 4025185 4055199 4180812 4276630 4419016
6189 4419016 4541294 4699319 4805333 4912126 5127594 5356347 5553882 5554781 5841854 5864756
6179E864756J44811K38981J21572J89114J10373K745J44275J21267K14771K16549
6169G369214J23654J12528K53581L32015K03374K39098K34126L09219M22575N52589
6159A0151973L97486N29255Q04627O21856P70035J112649J223955J373681J601196
6150A8586713J877552K244779K564017K754240K839160K335037J125302j91756
6142C4135044j397270k072401k305950k029248j667994j151031p08522m88053
6134B2314575j02432m2607K19982L69457O00005Q08217J021830J277272J644616
6125B8110915K122118K666951L145889L821065M645517N356953O102437O099919
6117F2071764M845113J846051k001893n310374o989401o661569n664129m427344
$$ plain form
6179 5864756 6009567 6248548 6370120 6559234 6669607 6672352 6816627 6937894 7152665 7369214
6169 7369214 7492868 7605396 7858977 8190992 8394366 8633464 8867590 9176809 9599384 10151973
6159 10151973 10549459 11078714 11883341 12505197 13275232 14387881 15611836 16985517 18586713
6150 18586713 20464265 22709044 25273061 28027301 30866461 33201498 34326800 34135044
6142 34135044 32737774 30665373 28359423 26330175 24662181 23511150 22802628 22314575
6134 22314575 22212143 22169536 22389518 22758975 23358980 24167197 25189027 26466299 28110915
6125 28110915 30233033 32899984 36045873 39866938 44512455 49869408 55971845 62071764
6117 62071764 66916877 68762928 66761035 61450661 54461260 47799691 42135562 37708218
6109C7708218l263434k239918j702715j275129r84712q86103q89888q73215n95277
6100B4997827l81660M181K81893O06379R97673J354166J773235K268634K701255
6091C4603583K942430K505405J005377o54323k401313l361660l666288l502391
6083B7470820k950582k260415j878240j466587j197758j086546j093428r50408
6075A4586856r18103q76544p13613n57962m39137n17364j96119j13908j73862
6066A0080244j61236k58452l26589l61761l72906m52459n46293k65986k41656
6057G092906k12189k69456k30975j89990n4318o1673m0282L029K8491O4598K3770
6046F153911k6856R2754K00555L25964L23807M25247L81031K45231L77212N1217
$$ plain form
6109 37708218 34444784 32204866 30502151 29227022 28242310 27356207 26466319 25593104 24997827
6100 24997827 24616167 24620348 24902241 25508620 26506293 27860459 29633694 31902328 34603583
6091 34603583 37546013 40051418 41056795 40402472 38001159 34639499 30973211 27470820
6083 27470820 24520238 22259823 20381583 18914996 17717238 16630692 15537264 14586856
6075 14586856 13668753 12792209 12078596 11520634 11081497 10564133 10368014 10254106 10080244
6066 10080244 9919008 9660556 9333967 8972206 8599300 8146841 7600548 7334562 7092906
6057 7092906 6880717 6611261 6380286 6190296 6135978 6074305 6034023 6037052 6065543 6130141 6153911
6046 6153911 6127055 6219809 6420364 6746328 7070135 7495382 7876413 8121644 8498856 8550073
6036H550073l88098n69970o23162o21750m47538m16090j77382j30002j11663p9446
6026D984972n201O3579J37945K98591J50600K74421K31599n5583j43395j71792
6016E765736j80728k4085J50605R2004N9440q7299j55598k58815m36229j65712
6006D759319k51018k77423j64527m8772j50145j0010j4674n5928M7762j4377K7896
5995C848103J39145L57883K51292L02329j5317k27135l85704m84400l07748k55780
5985C222668j64733j93714o5263r92j24695n5241q6056k3075k1324O6117P7805
5974B631497M294o6212J83258M3965j6022J92594J60623L62977N52527O23421
5964D672922L51664l0894m31348o16145n08084l87739j71118j91485l23477j04160
$$ plain form
6036 8550073 8161975 7592005 6968843 6347093 5899555 5483465 5306083 5176081 5064418 4984972
6026 4984972 4979771 5043350 5181295 5479886 5630486 5904907 6136506 6080923 5937528 5765736
6016 5765736 5585008 5560923 5711528 5803532 5862972 5775673 5620075 5361260 4925031 4759319
6006 4759319 4508301 4230878 4066351 4017579 3867434 3857424 3842750 3786822 3834584 3820207 3848103
5995 3848103 3987248 4345131 4596423 4898752 4883435 4656300 4270596 3786196 3478448 3222668
5985 3222668 3057935 2864221 2798958 2797966 2673271 2618030 2531974 2508899 2487575 2553692 2631497
5974 2631497 2635791 2569579 2752837 2796802 2780780 2973374 3133997 3496974 4049501 4672922
5964 4672922 5024586 4993692 4562344 3946199 3438115 3050376 2879258 2687773 2364296 2260136
5954B260136p1846j50087p8326J28482j09729q8783N6713R0510n7906L2937M2411
5943B054512J75442R8419J72135K56724K66920K81455K92974K55675j18699l97586
5933C337971l33261l19235k87094j20537k41642k22404l4991J54777L130j27529
5923A809185j63607p1410J9180K4409j494K0041P2397l0619M9224K9800p3134
5912A683972J08572Q6144J74593J60576J34094Q209k37173j86086k17054j03013
5902A612834J2045j7773Q0963l7299m4921M0901k14776o4026J05126p4366K0648
5891A419356O3106M0779R325l196p5908l7759K8560J12186j1702r1756Q96Q0866
5879A534753R9197O770K0742j4868n3870J3329m3087M153k4884J01609n3069Q4110
$$ plain form
5954 2260136 2188290 2038203 1959877 2088359 1978630 1889847 1946560 2037070 1979164 2012101 2054512
5943 2054512 2229954 2328373 2500508 2757232 3024152 3305607 3598581 3854256 3735557 3337971
5933 3337971 3004710 2685475 2398381 2277844 2036202 1813798 1778807 1933584 1936714 1809185
5923 1809185 1645578 1574168 1593348 1617757 1616263 1636304 1708701 1678082 1727306 1757106 1683972
5912 1683972 1792544 1878688 2053281 2213857 2347951 2356160 2118987 1932901 1715847 1612834
5902 1612834 1624879 1607106 1688069 1650770 1605849 1646750 1431974 1367948 1473074 1398708 1419356
5891 1419356 1482462 1523241 1532566 1529370 1453462 1415703 1444263 1556449 1544747 1452991 1453887 1534753
5879 1534753 1633950 1640720 1661462 1646594 1592724 1606053 1562966 1567119 1542235 1643844 1590775 1674885
5867A674885m0486n7469J09606Q7767J40420l6347M0305q640R857R6013m5173
5856A970738k517n628Q0460l4336O5631Q3930J14843j39534k8770J21908j07501
5845B119224K5145J46207J45630K5649M8788J21067P480L3518K5090J23876n8394
5834B763280K273K1465p5860K5585O5750r718k7849M9933K1064Q7503O6217M1474
5822C031117n9330J93000o262j44509n5907N2916P5196n2p0529J53960Q93Q6792
5810C257285L6300P9780n5062P6726j08655Q0534R4575r3991j0520P5532j6556
5799C415948P5693J43302N727j3680p3572j44062J29769Q9782L102l7632J8178
5788C612555J27804Q4951j04637J15967J50256R3026K73962K722J23237K27860
$$ plain form
5867 1674885 1634399 1576930 1686536 1774303 1914723 1878376 1918681 1910041 1919898 2015911 1970738
5856 1970738 1968221 1962593 2043053 2008717 2074348 2158278 2273121 2133587 2104817 2226725 2119224
5845 2119224 2144369 2290576 2436206 2461855 2510643 2631710 2639190 2672708 2697798 2821674 2763280
5834 2763280 2765553 2787018 2711158 2736743 2802493 2792775 2764926 2814859 2835923 2923426 2989643 3031117
5822 3031117 2971787 3164787 3158525 3014016 2958109 3011025 3086221 3086169 3015640 3169600 3170493 3257285
5810 3257285 3293585 3373365 3318303 3395029 3286374 3366908 3461483 3367492 3356972 3432504 3415948
5799 3415948 3491641 3634943 3640670 3626990 3553418 3409356 3539125 3628907 3632009 3594377 3612555
5788 3612555 3740359 3825310 3720673 3836640 3986896 4079922 4353884 4356606 4479843 4707703
5778D707703K98451K33224J93152K73654J34325j57283k10139n4961R2214j1829
5768E498511r2561N931l7568o964O6572M4006O5425J33684J73893l3936M5274
5757E862267J53219J41409M8475L09267J90935O7412J81012L65751J68296K57904
5747G745947M5879K34596L46848J35242L3540K40003J29028K25576K22977J35738
5737I495374J77881K36755K96964K53592K42237J30959L51050K33227L23251L71539
5727A2112829L85391O61120O08349O62314P72048Q52200R08359J223485J466465
5718A9652560J631199J914142K108635K510079K743747L237384L586773L787542
5710D1172061L234109J536419o86336k448068l335739l561757k993357k227025
$$ plain form
5778 4707703 5006154 5239378 5432530 5706184 5840509 5683226 5473087 5418126 5510340 5498511
5768 5498511 5405950 5411881 5374313 5367349 5433921 5477927 5543352 5677036 5850929 5816993 5862267
5757 5862267 6015486 6156895 6205370 6514637 6705572 6772984 6953996 7319747 7488043 7745947
5747 7745947 7791826 8026422 8373270 8508512 8542052 8782055 8911083 9136659 9359636 9495374
5737 9495374 9673255 9910010 10206974 10460566 10702803 10833762 11184812 11418039 11741290 12112829
5727 12112829 12498220 13159340 13767689 14430003 15202051 16054251 16962610 18186095 19652560
5718 19652560 21283759 23197901 25306536 27816615 30560362 33797746 37384519 41172061
5710 41172061 44406170 45942589 45256253 42808185 39472446 35910689 32917332 30690307
5702C0690307j667915j170649q76350m34599k67289J34968K48577N47391Q71073
5693B8075514J211194J649860K009673K361748K873395L538745M488659N693908
5685E1902696O967270P818379O937545L471623j257140n139634p445031p395617
5677E5860091o643801n620266m342367l238221k401539j825254j485878j090872
5669B9211893p45967m09757k8358r4486J33739J56726J43741L88246O11276J006831
5659C0373884J411706J806191K074118K509931K210093J292879j57865j762024
5651C9758913l187023l717917l357249k700210k121293j438612j081114r02507
5643B1252988o10619n18142p17254o23803n90822o62182o02782n93863m83802
$$ plain form
5702 30690307 29022392 27851743 26975393 26540794 26273505 26408473 26657050 27204441 28075514
5693 28075514 29286708 30936568 32946241 35307989 38181384 41720129 46208788 51902696
5685 51902696 58869966 66688345 73625890 77097513 75840373 70700739 63255708 55860091
5677 55860091 49216290 43596024 39253657 36015436 33613897 31788643 30302765 29211893
5669 29211893 28465926 28056169 28027811 27933325 28067064 28223790 28367531 28755777 29367053 30373884
5659 30373884 31785590 33591781 35665899 38175830 40385923 41678802 41520937 39758913
5651 39758913 36571890 32853973 29496724 26796514 24675221 23236609 22155495 21252988
5643 21252988 20642369 20124227 19406973 18783170 18192348 17530166 16927384 16333521 15849719
5634A5849719m09569l89573l17590j25053j48313j82634j60980l0032k0100J40231
5624A4206106N3559J99469K82266L60295K57864J61999k2309M5798O8568K36380
5614A5849995J59548J01797p0092j93753j38477k58042k53098k27297k00284k5110
5604A4745187R8539J14257N0694J56857K46004K37547J76154J44723L12740M80185
5594A6762887M02494L14885M76597M77923O10563O04518P08184P85252N31175
5585B1674478O8471k3823j06956l77757k93912o4342L7389J43759K07563K02617
5575B1467487J86645M15524K76226M10480N17749N45443P04291O09630N91973
5566B5725448P98772P83996Q86942Q10225R49662J092603J178937J276258J275757
$$ plain form
5634 15849719 15440150 15050577 14732987 14607934 14459621 14276987 14116007 14085975 14065875 14206106
5624 14206106 14259665 14459134 14741400 15101695 15359559 15521558 15499249 15545047 15613615 15849995
5614 15849995 16009543 16111340 16041248 15847495 15709018 15450976 15197878 14970581 14770297 14745187
5604 14745187 14843726 14957983 15008677 15165534 15411538 15649085 15825239 15969962 16282702 16762887
5594 16762887 17165381 17480266 17956863 18434786 19045349 19649867 20358051 21143303 21674478
5585 21674478 21742949 21719126 21612170 21234413 20940501 20876159 20913548 21057307 21264870 21467487
5575 21467487 21654132 22069656 22345882 22756362 23274111 23819554 24523845 25133475 25725448
5566 25725448 26524220 27308216 28195158 29005383 29955045 31047648 32226585 33502843 34778600
5557C4778600J165626J014258R34620J096152J408983J547248K052900K294664
5549D6293051K753355L143664L372823M082607M738228N112448M721435L202032
5541G7419643R50627j014295j890262k268186j907087j100524j96210P23836J697196
5532G2414738K358592K635513K121535J996518K171443K877682M100617N316782
5524I5993420O848862Q547804J0379107J2086622J3846108J4348285J2651709
5517A74701917R153325O576948N743190N228943L728058J186094j705688m238261
5509B00374526p173822j0300738j2115181j1891214j0371273r440692r617367
5502A29464239r380816q626370p550433o226722m683054l243338j778876k64270
$$ plain form
5557 34778600 35944226 36958484 37893104 38989256 40398239 41945487 43998387 46293051
5549 46293051 49046406 52190070 55562893 59645500 64383728 69496176 74217611 77419643
5541 77419643 78370270 77355975 75465713 73197527 71290440 70189916 69993706 70717542 72414738
5532 72414738 74773330 77408843 79530378 81526896 83698339 86576021 90676638 95993420
5524 95993420 102842282 111390086 121769193 133855815 147701923 162050208 174701917
5517 174701917 183855242 190432190 196175380 201404323 205132381 206318475 204612787 200374526
5509 200374526 193200704 182899966 170784785 158893571 148522298 139081606 129464239
5502 129464239 120083423 111457053 103906620 97679898 92996844 89753506 87974630 87710360
5494H7710360N47117M29558r78613l473074n588534o441049o308181n539830m531357
5485E5826397l732272k969534k536941k191049j967393j865997k021019k092819
5477C6449373j917342j887521j476183j356785j169128j041593r08500r75117
5469B5717204r93192q88624o57896o67339o29897p23657p11465p44347p01134
5460A8999653o39615p18976p30655p72243n00950n58794o59548m40328l10414
5451A3668130l81969l07895l34488j89399j12689k15612j48461j6389J4770P4989
5441A2050987K34495L27923M75306P30291R32150J168137J836314K119681J551612
5432B1426896j208840k564592k245633j974820j351953j041565o53119m93449
$$ plain form
5494 87710360 88257477 88687035 87708422 84235348 78646814 72205765 65897584 60357754 55826397
5485 55826397 52094125 49124591 46587650 44396601 42429208 40563211 38542192 36449373
5477 36449373 34532031 32644510 31168327 29811542 28642414 27600821 26692321 25717204
5469 25717204 24724012 23835388 23177492 22510153 21880256 21156599 20445134 19700787 18999653
5460 18999653 18360038 17641062 16910407 16138164 15637214 15078420 14418872 13978544 13668130
5451 13668130 13286161 12978266 12643778 12454379 12341690 12126078 11977617 11961228 11975998 12050987
5441 12050987 12285482 12613405 13088711 13819002 14751152 15919289 17755603 19875284 21426896
5432 21426896 20218056 17653464 15407831 13433011 12081058 11039493 10386374 9892925
5424I892925l09239k93947k87660j97515j08872l14196j92154j93518P8384Q5772
5414H159980O8183J07884Q3964K04872K36217K78857K63321O55831Q29325J032297
5404A1920731J044815J345604J328639L07344j009210j630076j576012j423416
5396A0308419j036334p92488o28970n75362m61806j78819k36884l17870k77917
5387E801969j37657k10835k48650m8738r4824k3027j42839k05799j4774m4412
5377D630414j61223k03927j2823J7610L9429j63692j71149j61407j49179Q4418
5367C748471P1337j07421j82401j43755j66913q191j0279J15461n817k8243o3124
5356C219125j48182p8115J3783L544M0620j58659J93857M0644M2348l4303j3622
$$ plain form
5424 9892925 9583686 9289739 9002079 8804564 8695692 8381496 8189342 7995824 8074208 8159980
5414 8159980 8228163 8336047 8420011 8624883 8861100 9139957 9403278 10059109 10888434 11920731
5404 11920731 12965546 14311150 15639789 15947133 14937923 13307847 11731835 10308419
5396 10308419 9272085 8479597 7850627 7275265 6813459 6634640 6397756 6079886 5801969
5387 5801969 5664312 5453477 5204827 5156089 5061265 5038238 4895399 4689600 4674826 4630414
5377 4630414 4469191 4265264 4252441 4270051 4309480 4145788 3974639 3813232 3664053 3748471
5367 3748471 3819808 3712387 3529986 3386231 3219318 3211127 3200848 3316309 3310492 3282249 3219125
5356 3219125 3070943 2992828 3006611 3010155 3050775 2892116 3085973 3126617 3168965 3134662 3121040
5345C121040j5812k5957p0926J713j06346q8312J3229j44680j54695p2808n767
5334B450679j34253k7341K4775J23635Q8316k7575r1850j39542n6616O3035L3322
5323B306585P0864o6294O6598J26038J33908O6589J43262J54198K07736K86190
5313C495674N4931j85948k37545j98434J2689k35732l20403k30892O249j17853
5303B042736M8384j4379j59431O9395j0248m4049j52980k8485M1807N2767o2030
5292A783487K9020P4866K0803K15699P3527J6572J02000K09594K02748L41853
5282C070169K43415P6972k9099k07892l10692j96041j14066j64449j97118j86633
5272A984566j86182j58982n6364M4626J9867o9586m9567N3186L6173K9089l818
$$ plain form
5345 3121040 3105228 3079271 3008345 3010058 2903712 2815400 2828629 2683949 2529254 2456446 2450679
5334 2450679 2316426 2289085 2313860 2437495 2525811 2498236 2406386 2266844 2210228 2273263 2306585
5323 2306585 2377449 2311155 2377753 2503791 2637699 2704288 2847550 3001748 3209484 3495674
5313 3495674 3550605 3364657 3127112 2928678 2941367 2705635 2385232 2154340 2160589 2042736
5303 2042736 2091120 2076741 1917310 1986705 1976457 1932408 1779428 1750943 1792750 1845517 1783487
5292 1783487 1812507 1887373 1908176 2123875 2197402 2213974 2315974 2525568 2728316 3070169
5282 3070169 3313584 3390556 3361457 3153565 2842873 2646832 2532766 2368317 2171199 1984566
5272 1984566 1798384 1639402 1583038 1627664 1647531 1577945 1528378 1581564 1617737 1646826 1643008
5261A643008n3369j36157J22724J56002j01158k4800J09854N6336O0861Q6986
5251A920287J6664L8795N399n5590p5402J9576j02042j2153j44685j21875L5299
5240A524273M0339k0160J2012J5006K3231j2461j29171j8778L1067R0539n953
5229A549944r5034j3819J4123K5062k1109l5411J72463P4064m1632k9983j61947
5218A436721Q4373Q8766j21830j6753l0677J9553Q2162n3796m7404R7700k7433
5207A511382P5592J36925n0439P9911J4594Q3403k3100R4894j34888N3803J10363
5196A952440o8405n4503l3900q1539p9730n2105j45126j51373Q7797N267N5870
5185A434693J30446j16928K1889k8995R886P2328l6320j11631M4069K899O3487
$$ plain form
5261 1643008 1589639 1453482 1576206 1732208 1631050 1606250 1716104 1772440 1833301 1920287
5251 1920287 1936951 1975746 1981145 1925555 1850153 1869729 1767687 1755534 1610849 1488974 1524273
5240 1524273 1564612 1544452 1556464 1571470 1594701 1582240 1453069 1434291 1465358 1555897 1549944
5229 1549944 1454910 1441091 1455214 1480276 1459167 1423756 1596219 1670283 1628651 1598668 1436721
5218 1436721 1521094 1609860 1488030 1471277 1440600 1460153 1542315 1488519 1441115 1538815 1511382
5207 1511382 1586974 1723899 1673460 1753371 1767965 1851368 1828268 1923162 1788274 1842077 1952440
5196 1952440 1884035 1829532 1795632 1714093 1634363 1582258 1437132 1285759 1373556 1378823 1434693
5185 1434693 1565139 1448211 1470100 1441105 1450991 1523319 1486999 1375368 1419437 1422336 1485823
5174A485823J1039l2662l0079L9321J5945Q850l4024j21332l7900m3459J16719
5163A378241m0523j30386N5033k1016J4631n5285l5234l440J4343j24180j00006
5152I52178R3561j05133N6672J24645n3698k0688Q391M4269O6344j10339j18476
5141I37726n5074J18761Q926P0663J17892K2657k7210o0152O2541l315K9070r6559
5129A125926o1781L1298m0351O4111O127M2403N5662n2958J05559J8825o3709
5118A231112n6025J37178K6585Q513j28231m8706M3754m9197Q5286l28J28942
5107A378883n219P4540J29017k1958k2279k6881Q6143k5485K5288j6976J7078
5096A592151l7268l6125q8343j14329J68998M1670L9150N8075j18749M7462K6016
$$ plain form
5174 1485823 1496862 1464200 1434121 1473442 1489387 1498237 1464213 1342881 1304981 1261522 1378241
5163 1378241 1337718 1207332 1262365 1241349 1255980 1200695 1165461 1162021 1176364 1052184 952178
5152 952178 1045739 940606 997278 1121923 1068225 1047537 1055928 1100197 1166541 1056202 937726
5141 937726 882652 1001413 1010339 1081002 1198894 1221551 1194341 1134189 1196730 1193415 1222485 1125926
5129 1125926 1064145 1095443 1055092 1119203 1125330 1167733 1223395 1170437 1275996 1294821 1231112
5118 1231112 1175087 1312265 1338850 1347363 1219132 1170426 1214180 1164983 1250269 1249941 1378883
5107 1378883 1373664 1448204 1577221 1555263 1532984 1506103 1592246 1566761 1592049 1575073 1592151
5096 1592151 1554883 1518758 1430415 1316086 1485084 1526754 1565904 1623979 1505230 1552692 1578708
5085A578708k6198j00368J46050M3037p2315J10803Q142l2965r008J09274P2848
5074A828008k8301q8737k4833l1959j864j7129q053R4026Q1454L359O2920R1808
5062A960699O8701N0849o373O9453Q4800k0891J8175J2169m7017J3803j680m1704
5050B160984P9297J3250K3188M9905K594l916n02J16660K0742k1349p2111j5088
5038B353654N6777j0667K5718J39605j8861q5634q2005j2152N6251O6074L5505
5027B524265m9812K0145j2540p5866N9025Q4112k8717m5380l059J48084M2205
5016B662462m719J09050N1107Q0748j6048J8136Q4585M3305J75102J10608l5653
5005C278683K0782O417J27565k7156p789J33532q0233Q6142Q2709m5535p4980
$$ plain form
5085 1578708 1552510 1452142 1598192 1641229 1568914 1679717 1687859 1654894 1645886 1755160 1828008
5074 1828008 1799707 1710970 1686137 1654178 1652314 1635185 1627132 1721158 1802612 1805971 1868891 1960699
5062 1960699 2029400 2080249 2073876 2143329 2228129 2207238 2225413 2237582 2190565 2204368 2202688 2160984
5050 2160984 2240281 2253531 2276719 2326624 2329218 2325302 2324800 2441460 2462202 2440853 2368742 2353654
5038 2353654 2410431 2399764 2425482 2565087 2546226 2460592 2378587 2366435 2422686 2488760 2524265
5027 2524265 2474453 2494598 2482058 2406192 2465217 2549329 2520612 2475232 2472173 2620257 2662462
5016 2662462 2657743 2766793 2817900 2898648 2882600 2900736 2985321 3028626 3203728 3314336 3278683
5005 3278683 3299465 3305882 3433447 3406291 3398502 3532034 3451801 3537943 3620652 3575117 3500137
4994C500137R4718l2141J21152l2186L9929Q7605O8940M7595p4114K0659l7397
4983C804897N0966k6522l8082N3968j2415m2480L3917R0028j48164J924L3971
4972C802008n5862J49867J7200j34176p2040o7935J11932l6903j23807j05917
4962C484367K4079N0432j3796l8041j8693J18539K6907l3648J29946P6807j1034
4951C795865l6868L9642L1335M8291J33009M5053L2056o9205L346J39132o7943
4940D093713l1981k1593k3101K23464j1485J5960J75054J17962J10773K183J01099
4929D752048J35998J54093Q0286J7912J88594l5129J01162Q5081P4533R1841J07197
4918E753616J27323J18987J27702K85503J74264J18138j05154R2866N6587J00162
$$ plain form
4994 3500137 3594855 3562714 3683866 3651680 3691609 3779214 3848154 3895749 3821635 3842294 3804897
4983 3804897 3855863 3829341 3791259 3845227 3832812 3790332 3824249 3914277 3766113 3768037 3802008
4972 3802008 3746146 3896013 3913213 3779037 3706997 3639062 3750994 3714091 3590284 3484367
4962 3484367 3508446 3558878 3545082 3507041 3488348 3606887 3633794 3600146 3730092 3806899 3795865
4951 3795865 3758997 3798639 3829974 3878265 4011274 4056327 4088383 4019178 4022524 4161656 4093713
4940 4093713 4061732 4040139 4017038 4240502 4229017 4244977 4420031 4537993 4648766 4650949 4752048
4929 4752048 4888046 5042139 5122425 5140337 5328931 5293802 5394964 5480045 5554578 5646419 5753616
4918 5753616 5880939 5999926 6127628 6413131 6587395 6705533 6600379 6693245 6749832 6849994
4908F849994N9505R3534J28029J20512J24678J75065J45378j6241K14380K11472
4898H106306K54273J27351K22044K92388J91552K36262K39595L40583O03441N76915
4888A1190710P58469J048169R97534L61537k53901k25509l89976l43880j94267
4879A2948886K989M2065K32726M97356N34798M75866J29157k52772l57517k87919
4869A3965635j9528r5421j03685J68341K91831L41953J90598K29418L49423M09797
4859A5728362L67342L36718K72847N11044N10444N55387O13047M89629M82401
4850A9867221L87533L31399M68589N40433M52475O87035P48404P49429P77733
4841B5010251R78054J089225J024767J294469J537087J721947J868703K348541
$$ plain form
4908 6849994 6909499 7003033 7131062 7251574 7376252 7551317 7696695 7680454 7894834 8106306
4898 8106306 8360579 8487930 8709974 9002362 9193914 9430176 9669771 10010354 10613795 11190710
4888 11190710 11949179 12997348 13994882 14356419 14102518 13877009 13487033 13143153 12948886
4879 12948886 12951875 12993940 13226666 13724022 14258820 14734686 14863843 14611071 14253554 13965635
4869 13965635 13946107 13850686 13747001 13915342 14207173 14549126 14739724 14969142 15318565 15728362
4859 15728362 16095704 16432422 16705269 17216313 17726757 18282144 18895191 19384820 19867221
4850 19867221 20254754 20586153 21054742 21595175 22047650 22734685 23483089 24232518 25010251
4841 25010251 25988305 27077530 28102297 29396766 30933853 32655800 34524503 36873044
4833C6873044K521394K891267L169682L787540M176936M764802N178940N148023
4825F8511628M231741K040207k69224k032193k589490k593608k154186j521666
4817F3623209r89809n69159j41975P0262O44384J056559J275451J601701K139514
4808F8710137K816633L736609M515692N379081O525995P011361P287405O595487
4800A12578400N151436K734399p48604l853522n701023o391704n851272m943929
4792I2974181m220151l540815l143398k885968k586474k469509k103659j489936
4784G0534271q59377m05935J47201Q92868J442834K153399K689632L089317L405034
4775H3089244K695492J223104n13596j608819j800234j555176j636689j301205
$$ plain form
4833 36873044 39394438 42285705 45455387 49242927 53419863 58184665 63363605 68511628
4825 68511628 72743369 74783576 74514352 72482159 69892669 67299061 65144875 63623209
4817 63623209 62633400 62064241 61922266 61992528 62636912 63693471 64968922 66570623 68710137
4808 68710137 71526770 75263379 79779071 85158152 91684147 98695508 105982913 112578400
4800 112578400 117729836 120464235 119715631 115862109 110161086 103769382 97918110 92974181
4792 92974181 88754030 85213215 82069817 79183849 76597375 74127866 72024207 70534271
4784 70534271 69674894 69268959 69416160 70309028 71751862 73905261 76594893 79684210 83089244
4775 83089244 85784736 87007840 86494244 84885425 83085191 81530015 79893326 78592121
4767G8592121j051739j222642j138012j278919j436212j774670k028930k156194
4759F6504803k023230j990783j837700j538581j214909q71936n99034o35663l75604
4750E5417363k35565n2092J68492M77494P43355J090912J451737J548375J626102
4741F2236173J508226J465873J223339R98520Q99060O65831K42227o60393j266377
4732F7312479j796280k005322j893324k012806j880278j684575j571774j415315
4724E3052805j254707j027833q86378q67951p79725m28793l47031l17143m49394
4715D6693850j95206l73119m60539n29876o49665p39705j086915j400015j752896
4706C9505914j694775k019129j866649j870223j724150j514583j687356j552125
$$ plain form
4767 78592121 77540382 76317740 75179728 73900809 72464597 70689927 68660997 66504803
4759 66504803 64481573 62490790 60653090 59114509 57899600 57027664 56428630 55792967 55417363
4750 55417363 55181798 55129706 55298198 55775692 56519047 57609959 59061696 60610071 62236173
4741 62236173 63744399 65210272 66433611 67432131 68331191 68997022 69239249 68578856 67312479
4732 67312479 65516199 63510877 61617553 59604747 57724469 56039894 54468120 53052805
4724 53052805 51798098 50770265 49883887 49015936 48236211 47807418 47460387 47143244 46693850
4715 46693850 46498644 46125525 45664986 45135110 44485445 43745740 42658825 41258810 39505914
4706 39505914 37811139 35792010 33925361 32055138 30330988 28816405 27129049 25576924
4698B5576924j275757j218961j191241j027984q88842q33719p64484q22397p86501
4689A6767038p00616m92865p84773q37259p55554n29841n50669o50011l93116
4680A1072334m43349k74188l45087m12685l42021j85473p1375l42217k05207n5814
4670H394918r3880j64237k72418k57475l03576k31316k40769l00292k70904q4361
4660F175690j99900j68923q0289j81407j07868o3399j75405j48527p1758j35071
4650D843143j48271J490o6730j41513j56640m7056K1188j06443r0065j12891K7726
4639D023938n0851n6140p4711j36504o5710p0676q867j08935k9302m4944r4629
4628C282669m57M8841k2120M0565r1451p7257l3276J31868J00037j64377j7j34520
$$ plain form
4698 25576924 24301167 23082206 21890965 20862981 19974139 19140420 18375936 17553539 16767038
4689 16767038 16066422 15573557 14788784 13951525 13195971 12666130 12115461 11465450 11072334
4680 11072334 10628985 10354797 10009710 9597025 9255004 9069531 8998156 8655939 8450732 8394918
4670 8394918 8301038 8136801 7864383 7606908 7303332 7072016 6831247 6530955 6260051 6175690
4660 6175690 5975790 5806867 5726578 5545171 5437303 5373904 5198499 5049972 4978214 4843143
4650 4843143 4694872 4696362 4629632 4488119 4331479 4284423 4305611 4199168 4109103 3996212 4023938
4639 4023938 3973087 3916947 3842236 3705732 3640022 3569346 3560479 3451544 3422242 3377298 3282669
4628 3282669 3282212 3331053 3308933 3349498 3258047 3180790 3147514 3279382 3379419 3215042 3215025 3080505
4616C080505n0670j22759j26198j5235n9242N2636j53382l3759n1105j0555j5581
4605B494655O4047R9817j07514O5433M1791r5324R3435k5155P6072j552n9711
4594B645994J23142j1449r8467l7288l3781q9292q1799j29254K953j9892j7570
4583B253297l9438J51704Q8518o972j15015l4185j3841j5125l7315Q7890N6740
4572B376258l0739J6373J39875l172m9376O2043k452P555J19546O4563q688K4105
4560B715891j1423n2914J4064r3118m7926P5641J299j36380j03464l677N392L3008
4548B396393k5611l536l184o1697Q0996O6008J14123P6055r868N8397K3907L067
4536B715050P611J6876k409O7984K1547j12261j31249M3028o4409K8146J2535
$$ plain form
4616 3080505 3029835 2907076 2780878 2765643 2706401 2759037 2605655 2571896 2520791 2510236 2494655
4605 2494655 2558702 2658519 2551005 2616438 2658229 2562905 2656340 2631185 2707257 2705705 2645994
4594 2645994 2769136 2757687 2659220 2621932 2588151 2498859 2417060 2287806 2290759 2270867 2253297
4583 2253297 2213859 2365563 2454081 2447109 2332094 2297909 2284068 2268943 2231628 2319518 2376258
4572 2376258 2345519 2361892 2501767 2498595 2449219 2511262 2508810 2516365 2635911 2700474 2691786 2715891
4560 2715891 2704468 2651554 2665618 2572500 2524574 2600215 2601514 2465134 2361670 2357993 2363385 2396393
4548 2396393 2370782 2367246 2364062 2302365 2383361 2449369 2563492 2639547 2629679 2688076 2711983 2715050
4536 2715050 2722661 2739537 2737128 2805112 2826659 2714398 2583149 2626177 2561768 2589914 2602449
4525B602449P962j26552O790J08177P4985m0522r8222j0590n167J03102N6296
4514B678708p9831r932P9420o5382N5732R5499K363r997Q9854Q8691Q8015L2139
4502C045279j00767Q7669L8986N5706J33839r4452J0831j4734l6439j6295j12902
4491B996721o1900J6653N805j25845J5253O5894J8384j45080M0953K4205J04491
4480B955534J76109o5668l0636O8837Q3537l9166n8933m204r3579p4422o150j64189
4468B747070q7457K1801j5306L495n062p2313m9639k3078l2789L2567m1328k7727
4456B450234m9910k5684M4578O4915j68900l213R9743O0444l9667l9266J18138
4445B511412J1893n6332O8673j0937k5695M5313N5713J12365m8517j595p8354
$$ plain form
4525 2602449 2610411 2483859 2490649 2598826 2673811 2633289 2535067 2524477 2519310 2622412 2678708
4514 2678708 2598877 2588945 2668365 2602983 2658715 2754214 2756577 2746580 2836434 2925125 3013140 3045279
4502 3045279 2944512 3032181 3071167 3126873 3260712 3166260 3177091 3162357 3125918 3109623 2996721
4491 2996721 2934821 2951474 2957279 2831434 2846687 2912581 2930965 2785885 2826838 2851043 2955534
4480 2955534 3131643 3065975 3035339 3104176 3187713 3148547 3089614 3085410 2991831 2917409 2911259 2747070
4468 2747070 2659613 2681414 2666108 2669603 2664541 2592228 2542589 2519511 2486722 2519289 2477961 2450234
4456 2450234 2400324 2374640 2419218 2484133 2315233 2312020 2411763 2472207 2432540 2393274 2511412
4445 2511412 2523305 2466973 2535646 2524709 2499014 2544327 2600040 2712405 2663888 2662293 2583939
4434B583939o9606J50011j00751j72034Q1761q252Q06k549J07182j7807N7466
4423B610166J09547m4707J03140O4904N2683Q2081j6077k0200q3033L0049O6587
4412B955140J43646J2060J49757L0663n8551N0714j3555L6236j05852l7248O1416
4401C224426j00744L8589J76282Q4776J19357L9322l8007J8390M7669L3526k6793
4390C616793l157O1019J10372o4862J318M8297k4317K5609J38264k7180P3131
4379C955287m850L1217J49114p403K1368j35917R8172J07613l6391P3376J60030
4368D411616m1875Q4587M9647P6304P2942n1718q9523k621M2244P9172O4776o4790
4356D630761R1320L6537R1911m1065K7241Q3114p9493r2085J67996P4264r865
$$ plain form
4434 2583939 2514333 2664344 2563593 2391559 2473320 2465068 2465874 2463325 2570507 2552700 2610166
4423 2610166 2719713 2675006 2778146 2843050 2895733 2977814 2961737 2941537 2858504 2888553 2955140
4412 2955140 3098786 3110846 3260603 3291266 3232715 3283429 3269874 3306110 3200258 3163010 3224426
4401 3224426 3123682 3162271 3338553 3423329 3542686 3582008 3544001 3562391 3610060 3643586 3616793
4390 3616793 3613636 3674655 3785027 3720165 3721483 3769780 3745463 3771072 3909336 3882156 3955287
4379 3955287 3950437 3981654 4130768 4123365 4144733 4008816 4106988 4214601 4178210 4251586 4411616
4368 4411616 4369741 4454328 4503975 4580279 4653221 4601503 4511980 4509359 4551603 4630775 4695551 4630761
4356 4630761 4722081 4758618 4850529 4809464 4836705 4919819 4840326 4748241 4916237 4990501 4980636
4345D980636J29363K8848R6834R2408J13328N715l0173O8467J13933L696Q9452
4334E692507Q5698L8556l2313m5484J58871R0464K5080J01133L7614M8279J3100
4323F213505J15096J08390m6091o915J09600r184N1078p9388K04920K20728L0027
4312F911766Q8623n3970O2095J45488M0805J12466J13597K700Q4696J58356J56771
4301G823393J05230n339K65837J38841J51467J50203O9585K27242L13772J37282
4291I377513l8242K19869O7297J68932R3413J69183P9453K55967J80714J30415
4281A0704514K27910J14938J86342L32612J28695J24416K35565K43712K33890
4272A2532594K03780K28847J98356J76858L58780L05801K74782J89994K27952
$$ plain form
4345 4980636 5109999 5138847 5235681 5328089 5441417 5447132 5416959 5485426 5599359 5603055 5692507
4334 5692507 5778205 5816761 5784448 5738964 5897835 5988299 6013379 6114512 6152126 6200405 6213505
4323 6213505 6328601 6436991 6390900 6383985 6493585 6484401 6535479 6456091 6661011 6881739 6911766
4312 6911766 7000389 6946419 7008514 7154002 7194807 7307273 7420870 7423570 7508266 7666622 7823393
4301 7823393 7928623 7923284 8189121 8327962 8479429 8629632 8699217 8926459 9240231 9377513
4291 9377513 9339271 9559140 9626437 9795369 9888782 10057965 10137418 10393385 10574099 10704514
4281 10704514 10932424 11047362 11233704 11566316 11695011 11819427 12054992 12298704 12532594
4272 12532594 12736374 12965221 13163577 13340435 13699215 14005016 14279798 14469792 14697744
4263A4697744K90131L45425L93279K83324K85977L24017L51904L50185M11035
4254A7733021M22897L62466L70455L79874N04317N17925M75041O28483N95402
4245B1989881O22006P20329Q11485O91662R82252Q71235Q91442R99542J237616
4236B9817450J093945J199101J321388J353842J496993J577200J792764J686462
4228D1339145K006341J956586J995453K252596K261721K425946K577042K674113
4220E9488943K704545K698004L003526L098509L107476L170251L363622L390515
4212H4025391L366972L410914L374208L264573L354999L377045L337820L217032
4204A10728954L218170L279249K970468K987073K822453K543667K474661K290858
$$ plain form
4263 14697744 14987875 15333300 15726579 16009903 16295880 16619897 16971801 17321986 17733021
4254 17733021 18155918 18518384 18888839 19268713 19773030 20290955 20765996 21394479 21989881
4245 21989881 22611887 23332216 24143701 24835363 25817615 26688850 27580292 28579834 29817450
4236 29817450 30911395 32110496 33431884 34785726 36282719 37859919 39652683 41339145
4228 41339145 43345486 45302072 47297525 49550121 51811842 54237788 56814830 59488943
4220 59488943 62193488 64891492 67895018 70993527 74101003 77271254 80634876 84025391
4212 84025391 87392363 90803277 94177485 97442058 100797057 104174102 107511922 110728954
4204 110728954 113947124 117226373 120196841 123183914 126006367 128550034 131024695 133315553
4196A33315553K039300J711794J164918J154448Q59536P31484O77183K89784J74769
4187A42118769P2226k64024n84024r34553j268095j698321j928236k168406k378611
4178A30966725k498692k522135k705959k790642k779886k898389k905096l103379
4170A08762547l196736l243695l443931l692302l483442l552318l652640l393409
4162H1104074l220592l185676l027175k832012k734884k839158k682925k486474
4154E8095178k546019k412653k315539k360349k105711k015884j801255j705172
4146D0832596j619525j407447j327093j263452j042188j049442j152029q41082
4138C1130338o82122n87719o45496n06329m01699l19553k29752j47100k28476
$$ plain form
4196 133315553 135354853 137066647 138231565 139386013 140245549 140977033 141654216 141944000 142118769
4187 142118769 142190995 141926971 141342947 140408394 139140299 137441978 135513742 133345336 130966725
4178 130966725 128468033 125945898 123239939 120449297 117669411 114771022 111865926 108762547
4170 108762547 105565811 102322116 98878185 95185883 91702441 88150123 84497483 81104074
4162 81104074 77883482 74697806 71670631 68838619 66103735 63264577 60581652 58095178
4154 58095178 55549159 53136506 50820967 48460618 46354907 44339023 42537768 40832596
4146 40832596 39213071 37805624 36478531 35215079 34172891 33123449 31971420 31130338
4138 31130338 30448216 29860497 29215001 28708672 28306973 27987420 27757668 27610568 27382092
4129B7382092j95772p4803j83683j62512j48114R5598j05403k57221J15302O2400
4119B6527884R5732K30158K56458K96606M93106M63455L74584K49044L17153L90573
4109B9694753J67548L22593K77101M11514M04301M22346L42129M34360M07247
4100C2883892L69977M84652M69901L81723L93405L76859L33538M12612N12894
4091C6619453O67169P60187J064013J317028J264220J064380R70022M45273K29612
4082D4401357J40847J45767J30687K26934M07247K53348K05233K29753L02727
4073D6443900K63514M27617L64862L98184M27606K26700L14465K31812K60609
4064D9359269M10619N77552Q04845J074771J475087J507245J387348J224470J100623
$$ plain form
4129 27382092 27186320 27111517 26927834 26765322 26617208 26712806 26607403 26350182 26465484 26527884
4119 26527884 26623616 26853774 27110232 27406838 27899944 28363399 28737983 28987027 29304180 29694753
4109 29694753 29862301 30184894 30461995 30873509 31277810 31700156 32042285 32476645 32883892
4100 32883892 33253869 33738521 34208422 34590145 34983550 35360409 35693947 36106559 36619453
4091 36619453 37286622 38046809 39110822 40427850 41692070 42756450 43726472 44171745 44401357
4082 44401357 44542204 44687971 44818658 45045592 45452839 45706187 45911420 46141173 46443900
4073 46443900 46707414 47135031 47499893 47898077 48325683 48552383 48866848 49098660 49359269
4064 49359269 49769888 50347440 51152285 52227056 53702143 55209388 56596736 57821206 58921829
4055E8921829P59607P84179R33354P98204O27184N70024M21482L53311M14194
4046F4583368M66945M63653L15897J70395K8608M7598o2929Q3118Q6484K33535
4036F6416672M23842M78987O18462M60491J88810k038l49775m49076m20091l69447
4026F6996837l9248j78381k1583J8599n2615K254r5748j33721k91184k85112j22645
4015F5797453n2757k55967m99330q35731r66356j008558q70406p65223j010083
4006E9533042j233287j419268j458145j503025j402228j058317q14438k98648
3998E0345686j51163j090R78p5232j16167l01864m07081n14788p81902o74614
3988D7322763o27252n53138n14952n76200m05933j90223k17738m8541K652k10458
$$ plain form
4055 58921829 59681436 60465615 61398969 62197173 62824357 63394381 63815863 64169174 64583368
4046 64583368 65050313 65513966 65829863 66000258 66028866 66076464 66013535 66096653 66183137 66416672
4036 66416672 66840514 67319501 67937963 68398454 68587264 68585226 68235451 67786375 67366284 66996837
4026 66996837 66957589 66779208 66757625 66776224 66723609 66725863 66630115 66496394 66205210 65920098 65797453
4015 65797453 65744696 65488729 64989399 64153668 63187312 62178754 61308348 60543125 59533042
4006 59533042 58299755 56880487 55422342 53919317 52517089 51458772 50644334 50345686
3998 50345686 50194523 50193433 50194411 50119179 50003012 49701148 49294067 48779279 47997377 47322763
3988 47322763 46695511 46142373 45627421 45051221 44645288 44455065 44237327 44188786 44191438 43980980
3978D3980980o97277q62910j090565j415889j263669j066459q44537o77032m50239
3969C5612403l86416k30559m36818n25415n14198m00043n22778o51762m57295
3960C1487119n97659m04855k66266l27757l77330k06120j66356k85007l22279
3951B8533490l19930l11282n43001n21391l59588k48443l75307j53182j87333
3942B5514033o0018j87534k23129j13908q8681k0881M5793Q3969j88066r5785
3932B4665793q9891j71152j29690k19376J03960k3344k2782M2820m5802Q2981
3922B4193517M7729K99399L20953K56849Q8891J59608K47744L69932K77566L34312
3912B6596500L42549L06271L63999L12232M66284M92587M08250M04523N28117
$$ plain form
3978 43980980 43283703 42420793 41330228 39914339 38650670 37584211 36739674 36062642 35612403
3969 35612403 35225987 34995428 34558610 34033195 33518997 33118954 32596176 31944414 31487119
3960 31487119 30889460 30484605 30218339 29890582 29513252 29307132 29140776 28855769 28533490
3951 28533490 28213560 27902278 27359277 26837886 26478298 26229855 25854548 25701366 25514033
3942 25514033 25454015 25266481 25043352 24929444 24840763 24819882 24865675 24949644 24761578 24665793
3932 24665793 24575902 24404750 24275060 24055684 24159644 24136300 24113518 24156338 24110536 24193517
3922 24193517 24241246 24540645 24861598 25118447 25207338 25366946 25614690 25984622 26262188 26596500
3912 26596500 26939049 27245320 27609319 27921551 28387835 28880422 29288672 29693195 30221312
3903C0221312N40008N92215O76466O47377N20548P24927Q17454J040583R53017
3894C6733907J014350J007320J072305J138397J320891J281150J163191J345108
3886D6076619J323014J386643J249925J427115J326503J350986J330810J520947
3878E6992562J600076J546148J516968J499751J446636J316140J290065J015520
3870F8223866Q69672P29242Q51694P57571Q15514Q65732P91036Q88584R88421
3861G5781332Q85079Q78743P35575N93440L73648N38661N37983M49954M44518
3852H1218933N20429P36603Q70587J103985J299382J465880J551738J637170J832983
3843I2237690K105645K383086K631878K919424L039088L437042L668078L957669
$$ plain form
3903 30221312 30761320 31353535 32030001 32677378 33197926 33922853 34740307 35780890 36733907
3894 36733907 37748257 38755577 39827882 40966279 42287170 43568320 44731511 46076619
3886 46076619 47399633 48786276 50036201 51463316 52789819 54140805 55471615 56992562
3878 56992562 58592638 60138786 61655754 63155505 64602141 65918281 67208346 68223866
3870 68223866 69093538 69822780 70674474 71432045 72247559 73113291 73904327 74792911 75781332
3861 75781332 76666411 77545154 78280729 78874169 79247817 79786478 80324461 80774415 81218933
3852 81218933 81739362 82475965 83346552 84450537 85749919 87215799 88767537 90404707 92237690
3843 92237690 94343335 96726421 99358299 102277723 105316811 108753853 112421931 116379600
3835A16379600M311469M479900M917738M905696N038988N094553N415676N687975
3827A56231595N944513O138340O610462O834013P114200P322410P507439P427620
3819B11130592P413974P185246O977119O858015O711550O827568O982231P165334
3811B67251629P501200Q145687Q922631R298425R807885J0217547J0495067J0939057
3803C42579128J1321863J1956368J2566327J3004618J3676920J3773365J3142540
3796D32021129J2135717J0326891P744137M839383K298539K42878j266528k122231
3788D66219915k393940k038478j583571j101486o61810q04407r54172k059147
3780D54622904l569224m931894o331765p232662p267585o607313n002016l216996
$$ plain form
3835 116379600 120691069 125170969 130088707 134994403 140033391 145127944 150543620 156231595
3827 156231595 162176108 168314448 174924910 181758923 188873123 196195533 203702972 211130592
3819 211130592 218544566 225729812 232706931 239564946 246276496 253104064 260086295 267251629
3811 267251629 274752829 282898516 291821147 301119572 310927457 321145004 331640071 342579128
3803 342579128 353900991 365857359 378423686 391428304 405105224 418878589 432021129
3796 432021129 444156846 454483737 462227874 467067257 469365796 469608674 468342146 466219915
3788 466219915 463825975 461787497 460203926 459102440 458440630 457636223 456682051 454622904
3780 454622904 451053680 446121786 439790021 432557359 425289774 418682461 413680445 410463449
3772D10463449j700967l75209J07331l56374j833182m539125p277475r588373
3764C84900075j0961091j1012982j0450744r220692p854889o185072m872827l753878
3756C20587900l454275m343453o630682r960462j3005997j5460095j7264303j8049753
3748B32418880j7837137j7053533j5362996j3272025j1175382r270833p813434
3741A40633540o668425n911096n192136m638115m076687l818268l567123l193466
3733A03568224l042078k616127k458565k304472k131544k003093k044262j887239
3725H5080844j890230j995857j844915j834963j963742j965637j927690j852970
3717F9804840j813236j611210j624974j471937j340940j348368j168141j179346
$$ plain form
3772 410463449 408762482 408387273 408494604 408138230 406305048 401765923 394488448 384900075
3764 384900075 373938984 362926002 352475258 343254566 335399677 329214605 324341778 320587900
3756 320587900 317133625 312790172 306159490 296199028 283193031 267732936 250468633 232418880
3748 232418880 214581743 197528210 182165214 168893189 157717807 148446974 140633540
3741 140633540 133965115 128054019 122861883 118223768 114147081 110328813 106761690 103568224
3733 103568224 100526146 97910019 95451454 93146982 91015438 89012345 86968083 85080844
3725 85080844 83190614 81194757 79349842 77514879 75551137 73585500 71657810 69804840
3717 69804840 67991604 66380394 64755420 63283483 61942543 60594175 59426034 58246688
3709E8246688j283572j241343j376750j150167j162843r16364p85200q23084o84647
3700D8822718o79591m95785m36617m62498k80243k9472j31919r7139J68140J55990
3690D6533584J68579K69705L53925M37931M21760L47219M67658P39632P01421
3681E0441414P36277O92781P51241R50699J027093R33667J079973J220161J263109
3672E9096415J366222J415357J481119J537999J707900J802193J778719J901939
3664G2087863J931709J750756J765941J743192J574929J448194J176868J014638
3656H4494090Q41143M98571J27871j83241m06081q32711r68063j260961j585675
3647H0724943j750098j838636j985759k025380k016914k111901k106048k035611
$$ plain form
3709 58246688 56963116 55721773 54345023 53194856 52032013 51115649 50330449 49507365 48822718
3700 48822718 48143127 47647342 47210725 46748227 46467984 46438512 46306593 46209454 46377594 46533584
3690 46533584 46702163 46971868 47325793 47763724 48185484 48532703 49000361 49739993 50441414
3681 50441414 51177691 51870472 52621713 53572412 54599505 55533172 56613145 57833306 59096415
3672 59096415 60462637 61877994 63359113 64897112 66605012 68407205 70185924 72087863
3664 72087863 74019572 75770328 77536269 79279461 80854390 82302584 83479452 84494090
3656 84494090 85335233 85833804 85961675 85778434 85372353 84539642 83571579 82310618 80724943
3647 80724943 78974845 77136209 75150450 73125070 71108156 68996255 66890207 64854596
3639F4854596j892246j784545j786253j705314j528216j503910j557093j328979
3631E1768040j214704j262249j209562j271989j280176j332165j257003j191094
3623D1749098j108761j109139j073823j029884r56167p91187p78828q66064o87116
3614C3348129r80337j024789j021606q66927j000503j112745p89057p44026q07361
3605B5000778p53873p13543o78771o40639n38313n27802m54560m94181m75108
3596A9723988m78369l25928l41645l08786l81676l27025k78107k70561l19414
3587A6692477l06514j50918j65784k20894k21508k98437j21613p0985k72655j14409
3577A4748760k21039j92502n8632j98442j59563j57459j67796q8921k07449j3405
$$ plain form
3639 64854596 62962350 61177805 59391552 57686238 56158022 54654112 53097019 51768040
3631 51768040 50553336 49291087 48081525 46809536 45529360 44197195 42940192 41749098
3623 41749098 40640337 39531198 38457375 37427491 36471324 35680137 34901309 34035245 33348129
3614 33348129 32367792 31343003 30321397 29454470 28453967 27341222 26552165 25808139 25000778
3605 25000778 24246905 23533362 22854591 22213952 21675639 21147837 20693277 20199096 19723988
3596 19723988 19245619 18919691 18578046 18269260 17887584 17560559 17282452 17011891 16692477
3587 16692477 16385963 16235045 16069261 15848367 15626859 15328422 15206809 15135824 14863169 14748760
3577 14748760 14527721 14335219 14276587 14078145 13918582 13761123 13593327 13504406 13296957 13283552
3567A3283552p4669j84079j38974o2714j07528j24821r2199k4786k9232p4170
3557A2370380m2451n8701j3632J03221j5507k7987j5363j0514M8155N6042J57154
3546A2550797Q6339j60332L2772K11397o9189O694O4729j05917J69585K502Q5092
3535A2874469j449M4756J65919J49390Q9564P1617O1839Q419O4283J93023Q1981
3524A3803811M4751K12258J21212J80475J58215J94703J49563J1694J42931J68100
3514A5187713J44559K50222Q5171J97636K53381J80820K50429J47341R2553J63813
3504A6953638J30356J00702K94643K06018J92722K92695K42557K62939L27469
3495A9003739K97841K56017L39701L33441K54578L51232L58316M22014K90007
$$ plain form
3567 13283552 13208883 13024804 12885830 12823116 12715588 12590767 12498568 12473782 12444550 12370380
3557 12370380 12327929 12269228 12255596 12358817 12343310 12315323 12299960 12289446 12337601 12393643 12550797
3546 12550797 12637136 12476804 12509576 12720973 12651784 12658478 12723207 12617290 12786875 12789377 12874469
3535 12874469 12873020 12917776 13083695 13233085 13322649 13394266 13456105 13464524 13528807 13721830 13803811
3524 13803811 13848562 14060820 14182032 14362507 14520722 14715425 14864988 14876682 15019613 15187713
3514 15187713 15332272 15582494 15667665 15865301 16118682 16299502 16549931 16697272 16789825 16953638
3504 16953638 17083994 17184696 17479339 17685357 17878079 18170774 18413331 18676270 19003739
3495 19003739 19301580 19557597 19897298 20230739 20485317 20836549 21194865 21616879 21906886
3486B1906886N46248N54228P14459N94135N20020P46356Q74352R32655J093710
3477B8483049J133110J228170J438398J583504J722513J683198J934185J956347
3469D1162474J782204R29826j41815q27973j334127j693926j808251j683716j469394
3460C4915302j277761j045883q51537o02543o48005q98685p92046n97358p73178
3451B7428306p54484n37714m61935l65271k80546j69663l1126R3886K31323K18506
3441B5371282O22946P66419J235870J676110J757671O60355k82059J07782M09600
3432C2325976J157001K216184L313406M744601O590915O098976q79505n911919
3424D9655635o198173n808612m383254l145593k221411j694923j470917j110406
$$ plain form
3486 21906886 22453134 23007362 23721821 24315956 24835976 25582332 26456684 27389339 28483049
3477 28483049 29616159 30844329 32282727 33866231 35588744 37271942 39206127 41162474
3469 41162474 42944678 43874504 43732689 42904716 41570589 39876663 38068412 36384696 34915302
3460 34915302 33637541 32591658 31740121 31137578 30489573 29590888 28798842 28201484 27428306
3451 27428306 26673822 26136108 25674173 25308902 25028356 24858693 24827567 24921453 25152776 25371282
3441 25371282 25994228 26760647 27996517 29672627 31430298 32090653 31808594 31916376 32325976
3432 32325976 33482977 35699161 39012567 43757168 50348083 56447059 55567554 49655635
3424 49655635 43457462 37648850 33265596 30120003 27898592 26203669 24732752 23622346
3416B3622346q67453p28014n07713k83027j16213J5969R1895N78504Q70809J220903
3406B3898006J545613J812968J808367K057983K956802M453462O261295M217931
3398D9012427l188348o721787o102195n130345l320583k251599j347164j166138
3390A9784268q47667q08814p48695n58294l50743k47732K4975L31658J52851o84443
3380A6047364j036246j041844r64086p71733o81519m88996l02973l73408k76526
3371A0110033l86133k93895k12554j83101p6375r4393j80736p9279n643P987J24453
3360H730364L199K07383K91354L23684O78494O88063L37459n54838p51656p99844
3350I153662o03043n81949m50377l58594k87162j29492l13738j27464j23886p3793
$$ plain form
3416 23622346 22754893 22026879 21519166 21236139 21119926 21135895 21227790 21806294 22677103 23898006
3406 23898006 25443619 27256587 29064954 31122937 34079739 38533201 44794496 49012427
3398 49012427 45824079 39102292 33000097 27869752 24549169 22297570 20950406 19784268
3390 19784268 18936601 18127787 17379092 16820798 16470055 16222323 16247298 16578956 16731807 16047364
3380 16047364 15011118 13969274 13005188 12233455 11551936 11062940 10759967 10386559 10110033
3371 10110033 9723900 9430005 9217451 9034350 8957975 8863582 8682846 8603567 8597924 8605911 8730364
3360 8730364 8733563 8940946 9232300 9555984 10234478 10922541 11260000 10705162 9953506 9153662
3350 9153662 8550619 7968670 7518293 7159699 6872537 6743045 6429307 6301843 6177957 6104164
3340F104164j28809j79382p1737p6446j12754n5811j65503j2991p9463k28648
3330D992620k5846j37474J09869p5153r7196j8529O3248p8695p3604j12800j45076
3319D401364k3359m3999L0055N6351o6868k34281j3224P6220j2934o6185k196
3308D100944O2699l9647j55812r717n3620j06942r7076J09428M9921q8860q9579
3297C681739O8066q2971p9725l6921o3186P94J03138r7803m882L3309j33167m1537
3285C346854L1389Q9004n7042j19847o056n6709m8722L6520q088q4398k4478k3066
3273C075361q1892M6169p5138n957j8752l7049j9645j00716J93997j10377L6932
3262B902933j84r3593q2129L6501n2665K4648J131K7638r5951j32496l298p7887
$$ plain form
3340 6104164 5975355 5795973 5724236 5647790 5535036 5479225 5313722 5300731 5221268 4992620
3330 4992620 4966774 4829300 4939169 4864016 4766820 4748291 4811539 4732844 4659240 4546440 4401364
3319 4401364 4378005 4334006 4364061 4420412 4353544 4119263 4106039 4182259 4169325 4103140 4100944
3308 4100944 4163643 4123996 3968184 3958467 3904847 3797905 3700829 3810257 3860178 3771318 3681739
3297 3681739 3749805 3666834 3587109 3550188 3487002 3487796 3590934 3493131 3488249 3521558 3388391 3346854
3285 3346854 3378243 3467247 3410205 3290358 3284302 3227593 3178871 3215391 3207303 3122905 3098427 3075361
3273 3075361 2993469 3039638 2964500 2958543 2939791 2902742 2883097 2782381 2976378 2866001 2902933
3262 2902933 2902749 2809156 2727027 2763528 2710863 2735511 2736642 2764280 2668329 2535833 2532535 2454648
3250B454648R8501k5397k1305k9815n390O7150M6814r766q733m8843N0864O4865
3238B633593K2603l2182o8519o1007J03812Q273n7730r4739K6283J83196l4407
3227B629176p6095K4789K0149O5062P3892J6928L3045o3273N2644M1225j0456
3216B807086R8321o3938J4948J00259M3583l454K2349J42169L1862q4840k9871
3205C078474N4791j451J02550K3381M0163j3514o2292K421R2972Q4091Q4j8039
3193C383631Q088l6472N5740J12708J2500M349J7120N6807R5998K33437j0371
3182C933535J32679N4715J71865j887k1214M7875k9571n4313N2571J60905J61041
3171D608201K58743Q1124O916K45247L7679j2588P4355O739R3919J33883L8531
$$ plain form
3250 2454648 2553149 2527752 2506447 2476632 2471242 2538392 2585206 2575440 2566707 2517864 2568728 2633593
3238 2633593 2656196 2624014 2555495 2494488 2598300 2606573 2548843 2454104 2480387 2663583 2629176
3227 2629176 2553081 2577870 2598019 2663081 2736973 2753901 2786946 2723673 2776317 2817542 2807086
3216 2807086 2905407 2841469 2856417 2956676 3000259 2996805 3019154 3161323 3193185 3108345 3078474
3205 3078474 3133265 3131814 3234364 3257745 3297908 3284394 3222102 3224523 3317495 3401586 3401670 3383631
3193 3383631 3391719 3355247 3410987 3523695 3536195 3540544 3557664 3614471 3710469 3943906 3933535
3182 3933535 4066214 4120929 4292794 4290907 4269693 4317568 4287997 4233684 4286255 4447160 4608201
3171 4608201 4866944 4948068 4954984 5200231 5237910 5225322 5299677 5306416 5400335 5534218 5572749
3160E572749J02393J95098K25199J83331L17882J37359P6152n07j07725J51664
3150F853595l8227J58J35051M6843J70232O3084J03312J04750R0768J39168K48806
3139G917540K35892K42340J80814K66673L29807K03389L19534M34647K64483L53436
3129A0748555M16142K81175K67601M3452N5938l24317k93672m83142m20592l25741
3119I965399l11952k34017j26561j6966N0687K7959J11184J8346J65357K29817
3109I879253K22251J74478J37108K86861J65226K39784L93884J47455P0052J51861
3099A1868213p1157j4588q0054l00169l17148l75026m86048n03892l95804l47844
3089H976483k88788k45670k52286L4052o7010j37416N2994N239m0288O4567J13885
$$ plain form
3160 5572749 5675142 5870240 6095439 6278770 6596652 6734011 6810163 6809656 6701931 6853595
3150 6853595 6815368 6815526 6950577 6997420 7167652 7230736 7334048 7438798 7529566 7668734 7917540
3139 7917540 8153432 8395772 8576586 8843259 9173066 9376455 9695989 10130636 10395119 10748555
3129 10748555 11164697 11445872 11713473 11756925 11812863 11488546 11194874 10711732 10291140 9965399
3119 9965399 9653447 9419430 9292869 9275903 9326590 9354549 9465733 9484079 9649436 9879253
3109 9879253 10101504 10275982 10413090 10699951 10865177 11104961 11498845 11646300 11716352 11868213
3099 11868213 11797056 11782468 11702414 11402245 11085097 10710071 10224023 9720131 9324327 8976483
3089 8976483 8687695 8442025 8189739 8223791 8156781 8019365 8072359 8077598 8037310 8101877 8215762
3078H215762p2917p8615o5873o3115m8512j54115k45464k46091k41669l43573
3068F655818l69722l21522l13233k60657j95133j70540k10229k01010j55749j88195
3058D269828k02782l6556j12665r2254j03183o5747r6800j4943o757q8633o4330
3047C385178j56244j60345k07996r457q9742r3261r453j38605j10397k668r1628
3036B315382o2941r9789k7098n2803l6894k143r554q9246j23901k3482m2531r9244
3024A645756J5467O117n0675o6441m2551j8299p1283l1453P8337r7766n1919J08960
3012A424250N52j5021O8023K1995k8380j42312j44087l1435q5714Q6399L2307
3001A186577k2118L0556N999p1878p728k14050J6959k5827m479l7982k733q8597
$$ plain form
3078 8215762 8142845 8064230 7998357 7935242 7886730 7732615 7487151 7241060 6999391 6655818
3068 6655818 6286096 5964574 5651341 5390684 5195551 5025011 4814782 4613772 4458023 4269828
3058 4269828 4067046 4030490 3917825 3825571 3722388 3656641 3559841 3544898 3538141 3449508 3385178
3047 3385178 3228934 3068589 2860593 2851136 2761394 2668133 2658680 2520075 2409678 2407010 2315382
3036 2315382 2252441 2152652 2125554 2072751 2035857 2033714 2024160 1934914 1811013 1787531 1745000 1645756
3024 1645756 1661223 1667340 1616665 1550224 1507673 1489374 1418091 1386638 1464975 1367209 1315290 1424250
3012 1424250 1424802 1409781 1477804 1499799 1471419 1329107 1185020 1153585 1067871 1154270 1186577
3001 1186577 1164459 1195015 1201014 1129136 1121408 907358 924317 898490 894011 856029 853296 764699
2989G64699P1122J08653m0684j5447r5776J6610k135k1801l0213J5945L660m8671
2977G25962k2055o363M3921J2355l3291j5123p0373q2565L4159m7201q9197J0590
2965D60819j5693j353J67023J014j25995j8130K9411l8848o6787Q4163k3222J33953
2953E86355r639K4672q3072n7823n7871L2012j01702L679Q6066L5421m4446l4698
2941C78954n0258N9547J05908n9581p2905p6184l6374L1327P7600J22034q0725
2930C99343j2156o1014O1437J8347j33822j31930k4588K2309J08921k1044j08349
2919A17454n301P2146j6707J7653P7492q231j01709N6213k0468m8575J8346P016
2907A65329q3828j3756R9639n4792J5162j10545Q8104P1178J4445o9743l4512
$$ plain form
2989 764699 835821 944474 903790 888343 792567 809177 807042 785241 755028 770973 774633 725962
2977 725962 703907 697544 741465 753820 720529 705406 635033 552468 586627 539426 450229 460819
2965 460819 445126 443773 610796 611810 485815 467685 497096 458248 391461 475624 452402 586355
2953 586355 576716 601388 518316 460493 402622 434634 332932 336611 422677 458098 413652 378954
2941 378954 328696 388243 494151 434570 361665 285481 249107 280434 358034 480068 399343
2930 399343 387187 326173 387610 405957 272135 140205 115617 137926 246847 225803 117454
2919 117454 112153 184299 167592 185245 262737 254506 152797 209010 188542 139967 158313 165329
2907 165329 81501 67745 167384 112592 127754 17209 105313 176491 190936 121193 86681
2896H6681n8552J77031p2615N7540l6184p0319M1170O4135j26018K7776P8151
2885A68796p3146J5586J0140P031L1817k5211n6765J24895n426k1824N0957r881
2873B16969P76j1918j9242p1688p5842l5743P3160J6319m929J02226q0155j7518
2861I2415j6387j7439n2933N1710m0451k5630J41873L6502o0857j29256J29710
2850A09257M7529p53m5846J38776J8188j04555j5447n3403Q4364N5278J3352o9064
2838A77676r9369J01440K4660m5575p1479M6486j28977R8667k7727l1576R1356
2827A35582L9029J7679j10080j9776l720o71L3957J21713n5920m0525K2265m8955
2815I0578j4823N3922o4870J5417J00891L1016n6941P7179l2485j07985N9175
$$ plain form
2896 86681 28129 205160 132545 190085 153901 83582 124752 188887 62869 90645 168796
2885 168796 95650 111236 121376 128407 160224 135013 78248 203143 197717 175893 226850 216969
2873 216969 217745 205827 186585 114897 39055 3312 76472 92791 87862 190088 109933 92415
2861 92415 76028 58589 5656 57366 16915 -8715 133158 169660 108803 -20453 109257
2850 109257 156786 156033 110187 248963 267151 162596 147149 93746 178110 233388 246740 177676
2838 177676 78307 179747 204407 158832 87353 133839 4862 103529 75802 44226 135582
2827 135582 174611 192290 82210 62434 58714 58043 92000 213713 157793 117268 139533 90578
2815 90578 75755 129677 64807 80224 181115 212131 155190 232369 199884 91899 151074
2804A51074L3637l1110k9336j06483L3028n3427j11639J14757K2038N9144n1290
2793C0393M0348J8994j49135J02427o7885J4143k1927Q9644N9732j5420m5430
2782E5884o8579n144l9636q096q8176K5696J67923j9672q1047o3687k0625O3132
2770h2027Q0719o9005j4932j3183K2549M8506L0647J5292o265o5662k3045k2920
2758i9326L803o6978J59250J44125q1476J1296P5138r2572q2431p7175K1932R7304
2746A2890p2051p7122o322J28725n8636J5269O7819J14667j10269m1724N0442
2735B3688k0571p7247l2296j057n9955J06651r1970Q5586L1630K121Q7282n6935
2723c073p7013L1538n8015r4678P0759m0541l7080P3951P2385j20206p4767R2973
$$ plain form
2804 151074 184711 153601 124265 17782 50810 -2617 -114256 501 22539 81683 30393
2793 30393 70741 89735 -59400 43027 -24858 -10715 -32642 57002 116734 101314 55884
2782 55884 -12695 -17839 -57475 -65571 -153747 -128051 39872 20200 -60847 -124534 -145159 -82027
2770 -82027 -1308 -70313 -85245 -98428 -75879 -27373 3274 18566 12301 -53361 -76406 -99326
2758 -99326 -95523 -162501 -3251 140874 59398 70694 145832 53260 -29171 -106346 -84414 12890
2746 12890 -59161 -136283 -142605 -13880 -72516 -57247 10572 125239 14970 -26754 23688
2735 23688 3117 -74130 -106426 -107483 -167438 -60787 -152757 -67171 -35541 -33420 53862 -3073
2723 -3073 -80086 -48548 -106563 -201241 -130482 -171023 -208103 -134152 -61767 -181973 -256740 -163767
2711a63767Q7289K9892Q3269j04761M4337K3782j5199J9847q3634K5237M5287
2700h421l3994m0650q7853p7530J44906J40227k5609p7657P4045q17k9061q9371
2688a11785j4758M3482J00291o3040M829l9155l9764M3091M4289L6332K3645P2063
2676I9520m2489j22133r2144Q1127K326J0063k1127M5328j8868J1488M1998j02554
2664a07465J5776R4428j32480M1627J12398M6958p4841n2655P0169m9342O5029
2653B9602N277q8382J2860j1339O8241m3996n6232j3010M7231j3127m7258P1529
2641c8604M0027o8609M2519o4730k8788l6915j0996J92J0301N934J02008l5474
2629h3135K9415J4075m7266m8583L3890L7557M0794L9291l5165q944P0051J1069
$$ plain form
2711 -163767 -76478 -46586 36683 -68078 -23741 41 -15158 4689 -78945 -53708 -8421
2700 -8421 -42415 -83065 -170918 -248448 -103542 36685 11076 -66581 7464 6647 -22414 -111785
2688 -111785 -126543 -83061 17230 -45810 -40981 -80136 -119900 -76809 -32520 3812 27457 99520
2676 99520 57031 -65102 -157246 -76119 -73793 -63730 -84857 -39529 -58397 -46909 -4911 -107465
2664 -107465 -91689 2739 -129741 -88114 24284 71242 -3599 -56254 13915 -35427 29602
2653 29602 34879 -53503 -40643 -51982 16259 -27737 -83969 -96979 -49748 -62875 -110133 -38604
2641 -38604 1423 -67186 -24667 -89397 -118185 -155100 -166096 -165904 -155603 -149669 -47661 -83135
2629 -83135 -53720 -39645 -86911 -135494 -101604 -64047 -23253 16038 -19127 -28071 41980 53049
2617E3049r1503k6803P3320m5124o7735M9434M7259R0536j29365L0405P105N1316
2605D1894N052n1882l4924K1665Q1282J14748n7844L2746J36176O0116L0140n0190
2593C28979k5601l9458j36762K7177o8111j35808q952M902L5324L3404O3917J3276
2581I2287m4112P1216o1708p2882K4571N9847P0461j680j09988j34768m5259P0884
2569h1131J16474l2507K0478N1767O80M7155j8052p6913r7087L5098m1467k9634
2557a05139l0273l1188J3221k4016R5881q2757Q4798M0301l8448n1461O2449J01983
2545C5351j4044o7500q1706Q1943l495M805K1040J00523j7107m5715R0229P2869
2533A77193l9877l8914L0074J02330j8065L439p5683N0576l8628m6405m9311l5798
$$ plain form
2617 53049 -38454 -65257 8063 -37061 -104796 -55362 -8103 82433 -46932 -16527 -9422 41894
2605 41894 46946 -4936 -39860 -18195 63087 177835 119991 152737 288913 349029 379169 328979
2593 328979 303378 263920 127158 154335 86224 -49584 -58536 -53634 -18310 15094 79011 92287
2581 92287 48175 119391 57683 -15199 9372 69219 139680 138000 28012 -106756 -152015 -81131
2569 -81131 35343 2836 23314 75081 75761 122916 104864 27951 -69136 -34038 -75505 -105139
2557 -105139 -135412 -166600 -153379 -177395 -81514 -164271 -79473 -39172 -77620 -129081 -66632 35351
2545 35351 21307 -46193 -127899 -45956 -49451 -44646 -23606 76917 59810 14095 104324 177193
2533 177193 137316 98402 128476 230806 212741 216180 140497 191073 152445 106040 56729 20931
2521B0931o4000q353J5353N5705J08562M4249m311J712k3365J2078J9769r3673
2509H4657l7146p7968M352R1192J23646j0432q4396J21452K8365j02286m5579
2498I5857R8547r487k8676Q1458k9529r1433o8840m582M3487K4330K8699O5980
2486B05811N5509Q7782j14507O2289l7583l9863q4522L4073r7414Q4460L0866
2475A86901O0174j4877j11316l081k540Q9667P1734J94043j15732j0616m3502
2464C00855m6906Q8504q6287k6963J12179q1587N465M4876k7436L1777j02448
2453B12029q41K9330Q568P8044K0679N7959k8627r4199j1123N3261O3966m3169
2441C45877o7440R1899P5513J09353K2489n1580Q4543j49941J1413J79618K8636
$$ plain form
2521 20931 -43069 -51422 -36069 19636 128198 172447 168136 169848 146483 158561 178330 84657
2509 84657 47511 -30457 -26105 65087 188733 178301 93905 215357 243722 141436 95857
2498 95857 194404 184917 156241 237699 208170 116737 47897 43315 86802 111132 139831 205811
2486 205811 261320 349102 234595 296884 259301 219438 134916 168989 71575 156035 186901
2475 186901 247075 232198 120882 117801 115261 204928 276662 470705 354973 344357 300855
2464 300855 253949 342453 256166 229203 341382 259795 265260 310136 282700 314477 212029
2453 212029 211188 240518 249086 327130 347809 405768 377141 282942 271819 325080 389046 345877
2441 345877 278437 370336 445849 555202 577691 526111 610654 460713 472126 651744 680380
2430F80380n7161j42438l7866j24412J23705K02943p4003J01485M2043P8943J40423
2419I34042N2914K4962n2339N1503o3371O601J37143J7011o236L6549Q2161J11558
2407A332498J13585j29796j84551L7501K5396N33J84093N7249J4799l9444L4514
2396A446377J14321J43387P4922Q6407n3369O6171l555J33986j20397o5392J20749
2385A943607J17515Q8879L5350N5957O5831j6434J16593K6719N5166J63277J35171
2374B787631J7707J16211J24251J74658J28168K97908J39041L2047J47833J45122
2364D110577K07555K25281J91088P7927K68968J38477K90870J15042K27375K84564
2354F137724L11968J68293K46815J88804M08938K69029M20572L95237N39812O33672
$$ plain form
2430 680380 623219 480781 442915 318503 442208 645151 571148 672633 714676 793619 934042
2419 934042 986956 1011918 959579 1011082 947711 954312 1091455 1108466 1102230 1138779 1220940 1332498
2407 1332498 1446083 1316287 1131736 1169237 1194633 1195166 1379259 1436508 1451307 1411863 1446377
2396 1446377 1560698 1704085 1779007 1865414 1812045 1878216 1874661 2008647 1888250 1822858 1943607
2385 1943607 2061122 2150001 2185351 2241308 2307139 2290705 2407298 2434017 2489183 2652460 2787631
2374 2787631 2805338 2921549 3045800 3220458 3348626 3646534 3785575 3817622 3965455 4110577
2364 4110577 4318132 4543413 4734501 4812428 5081396 5219873 5510743 5625785 5853160 6137724
2354 6137724 6449692 6617985 6864800 7053604 7462542 7731571 8152143 8547380 9087192 9720864
2344I720864P74690Q06050O67122L14309N43707R06148J394630J822908K463602
2335A9414030L133402L885555M873196O526192P938571J1269825J6717489J7633831
2327I1392091j169845j6410083j5511631j3991840r575965o345623m539264l521814
2319B0326026k321604j761051j267382j044718r19427o48630m39605p66061r66218
2310A0191330r42342q45877p49787o24370m43833l63179m19578l91003l08035
2301E103326k66835j85529k59341k26316n3760j77879k68079k27011j81645k00898
2291C056033q9504j04011n8571j23054j08840j33367p7750m1453j25148j15614
2281B078721j38030j05429N8619j39526j20458k4886k0793r3232m5747j65993
$$ plain form
2344 9720864 10495554 11301604 11968726 12283035 12826742 13732890 15127520 16950428 19414030
2335 19414030 22547432 26432987 31306183 37832375 45770946 57040771 73758260 91392091
2327 91392091 90222246 73812163 58300532 44308692 34732727 28387104 23847840 20326026
2319 20326026 18004422 16243371 14975989 13931271 13011844 12363214 11923609 11157548 10191330
2310 10191330 9248988 8403111 7653324 7028954 6585121 6221942 5802364 5411361 5103326
2301 5103326 4836491 4650962 4391621 4165305 4111545 3933666 3665587 3438576 3256931 3056033
2291 3056033 2966529 2862518 2803947 2680893 2572053 2438686 2360936 2319483 2194335 2078721
2281 2078721 1940691 1835262 1893881 1754355 1633897 1609011 1588218 1494986 1449239 1283246
2271A283246r1169L241J21886j62816r5057L0480l3981l6064J57360p9579j46021
2260I51526J4635m1162r2713J0844R5525m6873n7713M1614m149n8323M7641q5039
2248G75813j55919L1427J01505j22207n075M1487J7590n9075r1452j43859k7423
2237C62812M6547J02391k7616l9182L9814N8714o3608o4354k8636j8257l1598
2226C37027o8444l8318J46112r650l8900n5521k6988n0329m9062P5409o3043M4438
2214B02731K5515N858K3634j1262K2680j67008R4570Q9063m2810O223q641K930
2202B43483k4607o1088q024j14470K3095J83255k4233j56194J3357J05280K1179
2191B01033M8976l0673o9104l7097O1459Q4773j17575l8171k8885l0979l010q591
$$ plain form
2271 1283246 1192077 1195318 1317204 1154388 1059331 1089811 1055830 1019766 1177126 1097547 951526
2260 951526 966161 924999 832286 843130 938655 891782 834069 875683 871534 813211 860852 775813
2248 775813 619894 651321 752826 630619 625544 667031 684621 625546 534094 390235 362812
2237 362812 409359 511750 484134 444952 484766 543480 479872 415518 386882 368625 337027
2226 337027 268583 230265 376377 366727 327827 272306 245318 194989 145927 221336 158293 202731
2214 202731 228246 234104 257738 246476 269156 102148 196718 285781 242971 249194 240553 243483
2202 243483 218876 157788 149764 35294 58389 241644 217411 61217 74574 179854 201033
2191 201033 250009 219336 150232 113135 174594 259367 141792 103621 74736 43757 40747 32156
2179C2156l4854p6976P3029N9937N8775l4305o0147p8601J360K2322Q5580l1470
2167A6806K1117k8703l291O5213n4844p6757N5019P2995k3221o9451K3227l5699
2155c7589m8302N1025j7566l2628K2441O0436N544k6466N028O5257K8196p4813
2143E63J8785J12325J2280j59506q760M3723m2661j6159l3861M6015K951K04383
2131A80078k7444j15849j1384q731n0134J5285n0051K6190Q925P0171L1901L367
2119G2324j24778r0361J96129J333j24895m8539M9390K2842K9648J2250N6290
2108E1633k4489q1892L9617N5275J1844N4445p9193k7865O2837J6576p2956O04
2096F436k6619L5405o2953k570P4151o3727j4676o261o4329j1916J24023l9172
$$ plain form
2179 32156 -2698 -79674 -6645 53292 112067 77762 17615 -60986 -59626 -37304 48276 16806
2167 16806 37923 9220 5929 71142 16298 -60459 -5440 67555 44334 -25117 -1890 -37589
2155 -37589 -85891 -34866 -52432 -85060 -62619 -2183 3361 -23105 -18077 47180 75376 563
2143 563 19348 131673 143953 -15553 -24313 19410 -23251 -39410 -73271 -27256 -24305 180078
2131 180078 152634 36785 25401 16670 -33464 -18179 -68230 -42040 -33115 37056 68957 72324
2119 72324 -52454 -142815 53314 54647 -70248 -118787 -69397 -46555 -16907 -4657 51633
2108 51633 27144 -54748 -15131 40144 51988 106433 27240 -625 62212 78788 5832 6436
2096 6436 -20183 15222 -47731 -50301 23850 -39877 -54553 -60814 -125143 -137059 -13036 -52208
2084e2208l2048q287O3080M7459j4773o4590P7760O6007j05114L2218n0098N7421
2072A6827q5961O3829R8649m3087n6863n0875r2303J380J18568J01995k0407N8184
2060A09936J28306L6677J32866j36368r4275l7221M8096o707j07085p7278m1640
2049d4693o0554K7652P5399P7981j07773o0328O6905K5975p402n323k6160R7008
2037E8687j7161k7083j1259l9127O3378L2899l6250n4126R7929n3156J1165m4796
2025a8900q5671K8700O5719J5293j2955n5866P999l4820K7527q647p9577O457
2013a44741o1308j4747Q2388r169K3355l2651l5551L4274M4578r812M5733l2948
2001a10599k3843Q7265k3435K4518j9257K8986J2302M5460J4159m6715Q129j08568
$$ plain form
2084 -52208 -84256 -92543 -29463 17996 3223 -61367 16393 82400 -22714 9504 -40594 16827
2072 16827 -69134 -5305 93344 50257 -6606 -57481 -149784 -148404 -29836 72159 51752 109936
2060 109936 238242 274919 407785 271417 177142 139921 188017 181310 74225 -3053 -44693
2049 -44693 -105247 -77595 -2196 75785 -31988 -92316 -25411 564 -6838 -12161 -38321 58687
2037 58687 41526 14443 3184 -35943 27435 60334 24084 -30042 67887 14731 25896 -18900
2025 -18900 -104571 -75871 -10152 5141 -7814 -63680 -55681 -90501 -62974 -71621 -151198 -144741
2013 -144741 -206049 -220796 -138408 -147577 -124222 -156873 -192424 -158150 -113572 -123384 -77651 -110599
2001 -110599 -134442 -47177 -70612 -46094 -65351 -36365 -24063 21397 35556 -11159 -3030 -111598
1989a11598m6858P6774K7355N7132J7264q5683N4872K827l9285m8605l3391Q5827
1977d3369L651q9027o3260L8285N8919k755q8422k1471j6501m4735J00427R7258
1965g1000p209k4743m7979M6785n4106Q179m714M6549p480R587K7326K5523m7613
1952a00895n971o5733K0546J16969j2359l0636l472M970L0334O2076p9501j5068
1940g8740M7114k4922l8091j9977p8404P9838M5263Q9730q3140q0640m6401L3704
1928a54666J0499J1841J7406J4261K6730j64971k1170J64847J0690j4795L3169
1917f6159N7478N6298m8219r7331J7474N6144N4930M8926j57360n0926K4484k2245
1905a26506m145N6296l1581M7214n8999j3604P5828k3679K3193n7726M1465l3088
$$ plain form
1989 -111598 -158456 -81682 -54327 2805 20069 -65614 -10742 -7915 -47200 -95805 -129196 -43369
1977 -43369 -39718 -128745 -192005 -153720 -94801 -97556 -185978 -207449 -223950 -268685 -168258 -71000
1965 -71000 -78209 -102952 -150931 -104146 -158252 -150073 -154787 -108238 -115718 -106131 -78805 -53282 -100895
1952 -100895 -106866 -172599 -152053 -35084 -47443 -78079 -81551 -76581 -46247 15829 -63672 -78740
1940 -78740 -31626 -56548 -94639 -114616 -193020 -113182 -67919 21811 -61329 -141969 -188370 -154666
1928 -154666 -144167 -132326 -114920 -100659 -73929 -238900 -260070 -95223 -84533 -99328 -66159
1917 -66159 -8681 47617 -602 -97933 -80459 -24315 30615 79541 -77819 -128745 -104261 -126506
1905 -126506 -130651 -74355 -105936 -58722 -117721 -131325 -55497 -79176 -55983 -113709 -72244 -105332
1893a05332K960Q0228J6927j59604M7002o4028M835J22154M2500J3757L6730n6055
1881a7926n5475j20654O3314L8994q7771J71972N6263m5997K3359Q905k81865
1870b46881N9241J41446n8966O0126K6224j5536j8155o30M5240l9159M6515m116
1858d651o4639j1593N6435o070p5761q7797L0090j00391N7131K7565J43800k8820
1846f4701n242J383J7251r6244p30P7815L6777L5512J0103q8179J0567P0130k7961
1833b3519M0875k8255j39618o593J26303j22306O4514m6293Q2091k0813j185N033
1821f9766q0962N3697K6930l7147M0381n2754k1276J13458m704M1725n5606m9546
1809i5570K3495l9124m6043m3217J20657P3275p0553j07450R9935P0750l0978
$$ plain form
1893 -105332 -102372 -22144 -5217 -164821 -117819 -181847 -177012 -54858 -12358 1399 38129 -17926
1881 -17926 -73401 -194055 -130741 -91747 -179518 -7546 48717 2720 26079 34984 -246881
1870 -246881 -187640 -46194 -105160 -45034 -18810 -34346 -52501 -53131 -7891 -47050 -535 -4651
1858 -4651 -69290 -80883 -24448 -30518 -106279 -194076 -163986 -264377 -207246 -179681 -35881 -64701
1846 -64701 -69943 -68560 -51309 -147553 -148283 -70468 -33691 1821 11924 -76255 -65688 4442 -23519
1833 -23519 17356 -10899 -150517 -157110 -30807 -153113 -88599 -134892 -52801 -73614 -74799 -69766
1821 -69766 -150728 -97031 -70101 -107248 -66867 -119621 -140897 -27439 -32143 9582 -46024 -95570
1809 -95570 -72075 -111199 -157242 -200459 -79802 -6527 -77080 -184530 -84595 -13845 -44823
1798d4823O5272N3393K6976j8921j30298j476O0797j6239p452k4218N8615K4512
1786D6138j07775o9610M9792j5317p3869N8677n945j9692q4655n2347Q2002J42134
1774e0467o6496j08013Q3676J13763r4245k3875j15349P8369P821q9188R6649
1763a67355O0335J56393p0785o1040J6370m2544L6696R3518m8641K7128j32858
1752a32783p3449J07053O6676k0091Q6831J9559m5354j7148q3537N3120Q3246
1741D4123R680p0132r9296n981m3975N2258K0963K9204k7429k7657P4373o6986
1729a10855j060k0532K9591n3180J64437l9178p4987M1635M9265l3131o2200p314
1717a17509l7462P133r86o530N6780J06821j1202J503n6618K9705j09958J5738
$$ plain form
1798 -44823 20449 73842 100818 81897 -48401 -49877 10920 -5319 -12771 -36989 21626 46138
1786 46138 -61637 -131247 -81455 -96772 -170641 -111964 -117909 -137601 -222256 -274603 -192601 -50467
1774 -50467 -116963 -224976 -141300 -27537 -121782 -145657 -261006 -182637 -174816 -264004 -167355
1763 -167355 -107020 49373 -21412 -82452 -66082 -108626 -71930 21588 -27053 75 -132783
1752 -132783 -206232 -99179 -32503 -52594 34237 53796 8442 -8706 -92243 -39123 44123
1741 44123 53803 -16329 -115625 -121606 -165581 -113323 -92360 -63156 -90585 -118242 -43869 -110855
1729 -110855 -111915 -132447 -102856 -156036 8401 -30777 -105764 -64129 -14864 -47995 -110195 -117509
1717 -117509 -154971 -147838 -148824 -155354 -98574 8247 -2955 -1452 -58070 -28365 -138323 -122585
1705a22585L7444j53731L6339J6796k222P9285N0481M7946o9692L5606J1311q7676
1693a20698j3030K4603J4213Q3543q7977M8319R5759l3012K1559l1135o9761R9044
1681C1427J3089k16839p5633J68451m9717j07768R1393P7385L6617j39648Q4417
1670h6826P5207j3815j18338l4115O5310M8276o154O2138l6542n7571k093k6968
1658a31491q546R6353l095j14927N8158J03832o586M7735P353j41788P9147q2236
1646i6091R23K8697M1428P8537j3944j31822q1909l7224R1852J2200o3707k0437
1634a91497P3591L7877M7028J03610q63j49626k9874M360k5369Q8449L8705j3786
1622a7395R9410j38641m3388J77332j22413m0498m4030R2200J1990o7009j6891
$$ plain form
1705 -122585 -85141 -238872 -202533 -185737 -187959 -108674 -58193 -10247 -79939 -44333 -33022 -120698
1693 -120698 -133728 -109125 -94912 -11369 -99346 -51027 44732 11720 33279 2144 -67617 31427
1681 31427 44516 -172323 -247956 -79505 -129222 -236990 -145597 -68212 -31595 -171243 -86826
1670 -86826 -11619 -25434 -143772 -177887 -112577 -64301 -70455 -8317 -44859 -102430 -104523 -131491
1658 -131491 -140037 -43684 -46779 -161706 -103548 284 -6302 41433 48786 -93002 -13855 -96091
1646 -96091 -95168 -66471 -25043 53494 39550 -92272 -174181 -211405 -119553 -107353 -171060 -191497
1634 -191497 -117906 -80029 -33001 70609 69746 -79880 -109754 -105394 -130763 -42314 -3609 -17395
1622 -17395 82015 -56626 -100014 77318 -45095 -85593 -129623 -37423 -25433 -92442 -109333
1611a09333o314m9053o7595Q2283J5456k4410k8915K8366L6851M1621o9762j0580
1599a61385m983P1739N0777K110p7622l082Q6988j41139m2581L4340J39364k6307
1587g1781K7635Q9337r9219o7747J19498K2794m3242R6557k2133j39305P7401
1576a0205N787K7758j6183o3500j06319L024J03523K3543n7492L4924Q4793q7667
1564e8014r472n0425p4398N1718K0456M2810o8766P3425K3050Q452n9014K3163
1552g7015j4088J06277K7301o880j21134j38557L1197J39069M6338m2947K7028
1541b3411j7251j02334K157K3078j4587J3717k3272N6832p185J7130K8942k4116
1529g0300n4804J6412j05R3765Q3852p368j36194j7746k3436o7476l320R8194
$$ plain form
1611 -109333 -115647 -164700 -232295 -150012 -134556 -158966 -187881 -159515 -122664 -81043 -150805 -161385
1599 -161385 -166368 -94629 -43852 -41742 -119364 -122446 -35458 -176597 -219178 -184838 -45474 -71781
1587 -71781 -44146 45191 -54028 -121775 -2277 20517 -22725 73832 51699 -87606 -10205
1576 -10205 -4418 23340 7157 -56343 -162662 -159638 -56115 -32572 -90064 -55140 29653 -58014
1564 -58014 -67486 -117911 -192309 -140591 -120135 -77325 -146091 -72666 -49616 -41164 -100178 -77015
1552 -77015 -91103 15174 42475 35595 -85539 -224096 -192899 -53830 -7492 -50439 -23411
1541 -23411 -40662 -142996 -140839 -117761 -132348 -118631 -141903 -85071 -92256 -75126 -46184 -70300
1529 -70300 -125104 -108692 -108797 -15032 68820 61452 -74742 -92488 -115924 -183400 -186720 -88526
1517h8526J8901O9783n9915J4763J3987j37546N1995n8088L8922J50227o7217
1506e2714N3337j20363k0493K1484n5069N1730J1449q3896J30503o0523O7206
1495e7349N7959N0819m2635J07295p6530p6206j15863L536J18654P2453r326m2599
1483i792P4720Q064n1433l8044J1980j10644k7220k0864l9571o135J49870Q174
1471e0895N4213o3089j4139O4552j5188k466j1348k4605p3315O4021J30925o9245
1459a0579l5531j0022P9362n3735J1839n8078J2112r99N1908j6083K0576k0225
1447b9455k4509n478m5841n5834J7248K9774j5979P4740L5002J21422l162p4064
1435B3864n8743p002N9758j9727L5850m4003o8908k1254r843o753k158J00707
$$ plain form
1517 -88526 -69625 158 -59757 -44994 -31007 -168553 -116558 -174646 -135724 14503 -52714
1506 -52714 623 -119740 -140233 -118749 -173818 -122088 -110639 -194535 -64032 -124555 -57349
1495 -57349 610 51429 8794 116089 39559 -36647 -152510 -148974 -30320 42133 32807 -9792
1483 -9792 64928 72992 21559 -16485 -4505 -115149 -142369 -163233 -202804 -208939 -59069 -50895
1471 -50895 3318 -59771 -73910 -9358 -24546 -27012 -38360 -62965 -136280 -72259 58666 -10579
1459 -10579 -46110 -56132 23230 -30505 -18666 -76744 -64632 -65631 -13723 -29806 -9230 -29455
1447 -29455 -53964 -59442 -105283 -161117 -143869 -114095 -130074 -55334 -20332 101090 97928 23864
1435 23864 -34879 -41881 17877 -1850 34000 -10003 -78911 -100165 -110008 -116761 -118919 -18212
1423a8212j2711r0235P3634O2414n7077n8662J995L3743J5442k2639n0985N7872
1411f5421l2137q4283k7025M4046R2179K6652n7277q9329N5602m716Q5790Q695
1399d7224R1385J1905n5150m6728O9464O2541j9159n6585K7285J6433j0719k8051
1387A5397j44997O0781M1307q9645p5439P9203L4372R3877j4919m3927L897M3259
1375C166M6275o9419r3209N7900J28375K3198j02838m4736K4195P4980L6779j39522
1363e4856P932k6521n1913k7330J15859N9042j20749o0035Q7259O794m9345R8802
1351a5061n9894M135n3996L9111K2626J16553m4181j7395p4223M958J12049J1491
1339D6173l7449k9714M2495l2497l8771J6840q9958R3732N3591n2582m4925q8739
$$ plain form
1423 -18212 -30923 -121158 -47524 14890 -42187 -100849 -98854 -65111 -49669 -72308 -123293 -65421
1411 -65421 -97558 -181841 -208866 -164820 -72641 -45989 -103266 -192595 -136993 -141709 -55919 -47224
1399 -47224 44161 56066 916 -45812 23652 86193 67034 10449 37734 54167 43448 15397
1387 15397 -129600 -68819 -27512 -117157 -192596 -113393 -79021 14856 -63 -43990 -40093 3166
1375 3166 49441 -19978 -113187 -55287 73088 96286 -6552 -51288 -27093 47887 84666 -54856
1363 -54856 -46924 -73445 -125358 -152688 -36829 22213 -98536 -158571 -71312 -64518 -113863 -15061
1351 -15061 -74955 -70820 -124816 -85705 -63079 53474 9293 -8102 -82325 -77367 34682 46173
1339 46173 8724 -20990 21505 -10992 -49763 -32923 -122881 -29149 24442 -28140 -73065 -161804
1327a61804j5310J12044K7491k0795Q0924K6781q6185j53823J8536O0456R1960
1316a9725o8000L081J3030J3871P888P5432K4024n6565m4970l994o5451q1478
1304b02857J35210L5959Q311m5772K554L1251n2181k8676P0519M8650j18693J5824
1292i9901N5061J8843P9579J5265k901K6842j68629j28818J49045L8880k2408
1281c9142M7092K84q5273n3349J5111m833M8065O4891j49330L7437J4979p9596
1269a83664J8086J6624Q9988j644k0053l1847Q7919J6813n5080J3457N0759J04213
1257A05571J4746j65228o1737Q0508k364n8428M8455P9516k4425l4099K1734k9816
1245b5567l4502J34245L4471n9564o1703K1186J3228p4609p415K602n9870o7666
$$ plain form
1327 -161804 -177114 -65070 -37579 -58374 22550 49331 -36854 -190677 -172141 -111685 -19725
1316 -19725 -87725 -84644 -71614 -57743 -49855 25577 49601 -6964 -51934 -55928 -121379 -202857
1304 -202857 -67647 -31688 -23377 -69149 -66595 -35344 -87525 -116201 -45682 2968 -115725 -99901
1292 -99901 -44840 -25997 53582 68847 65946 92788 -75841 -204659 -55614 -16734 -39142
1281 -39142 7950 8234 -77039 -130388 -115277 -120110 -72045 -7154 -156484 -119047 -104068 -183664
1269 -183664 -165578 -148954 -58966 -60610 -80663 -112510 -24591 -7778 -62858 -49401 1358 105571
1257 105571 120317 -44911 -106648 -26140 -28504 -86932 -38477 41039 16614 -17485 4249 -25567
1245 -25567 -60069 74176 108647 49083 -12620 8566 21794 -52815 -60230 -57628 -117498 -185164
1233a85164P1184J32820K2150l2608j2585M7329j318r0671K3231l2606j2017K5120
1221d5135K5605P7749r429n3530k4269j02977R7698K6806J1195R822K3730j24777
1209h7512J31380P9756j37802L7722K9973K0287L4372n7453j02783j3294Q2423
1198A7069j38319K164K0820O5473r96P074K7084r1748L341J5087J2202J11655
1186E0906j601j16823j3032N3548N5166j03474L2119l285P0427J08685j8702r1709
1174B2225m035L6540n7611k5682K2654l558O0100n5476N7435j1874L8427M5433
1162A24578j56309L0639n2173l1384J84018o6056j16628m6515J6096K2054j054
1151i2734q5957r212J18006r66m4693j6292J05014m5330r723J33471k5347L6303
$$ plain form
1233 -185164 -113980 18840 40990 8382 -4203 43126 41808 -48863 -25632 -58238 -70255 -45135
1221 -45135 -19530 58219 48790 -4740 -29009 -131986 -34288 -7482 3713 13535 37265 -87512
1209 -87512 43868 123624 -14178 23544 53517 73804 108176 50723 -52060 -65354 17069
1198 17069 -121250 -119086 -98266 -32793 -33789 -26715 369 -91379 -88038 -72951 -60749 50906
1186 50906 49305 -67518 -80550 -27002 28164 -75310 -43191 -46476 23951 132636 113934 22225
1174 22225 18190 54730 -2881 -28563 -5909 -9467 50633 -4843 52592 40718 79145 124578
1162 124578 -31731 -1092 -53265 -84649 99369 33313 -83315 -129830 -113734 -91680 -92734
1151 -92734 -178691 -187903 -69897 -70863 -115556 -131848 -26834 -72164 -81887 51584 26237 62540
1139F2540j96491J8407K1076Q7456K5612m3261p3882m1043M8000J41424M5692
1128I5530j4868j12955O7903l7119o5718J36760J2546k02225n540J16028j19648
1117a29306p0270J68489N2539j08078k4178R6405J23194j76088m0574n020R7102
1106a5785J00245o3441r9060R26r5788N6379J56421k4728j47186N8623J11100
1095C7706j938K5544k3416p1463N4143j7468n7596N8413k5193J7177P2063L6471
1083A04443J3670m2910k1193j6513n9043p8212N6067m4820N0270K2070K9422m8499
1071c5248N0584M0219k8863m3570K1840l9940o2291m0188K960O257N3285J51315
1059G6360r617p6514r1608m8151n2829J53173J31899O3972n0804j0091n7254k7888
$$ plain form
1139 62540 -133951 -115544 -94468 -7012 18600 -24661 -98543 -139586 -91586 49838 95530
1128 95530 80662 -32293 35610 -1509 -67227 69533 82079 -120146 -125686 -9658 -129306
1117 -129306 -199576 -31087 21452 -86626 -110804 -14399 108795 -67293 -107867 -112887 -15785
1106 -15785 84460 21019 -78041 -77115 -172903 -116524 39897 15169 -132017 -73394 37706
1095 37706 35768 61312 37896 -33567 20576 3108 -54488 3925 -21268 -4091 67972 104443
1083 104443 118113 75203 54010 37497 -21546 -99758 -43691 -88511 -38241 -16171 13251 -35248
1071 -35248 15336 55555 26692 -16878 4962 -34978 -97269 -137457 -134497 -128240 -74955 76360
1059 76360 66743 -9771 -101379 -149530 -202359 -49186 82713 146685 95881 85790 28536 648
1047F48l4588M6310m4724m7307k8888J408k3122m7045J15678R667o254J8023q1234
1034a21428k82Q6944N9756L8150l098k6081q5070J426O56P9565J8545j52345Q2527
1021b0735L6639J6614l4812m7267P3071L5955l3864m1720J20717J4109j25341
1010f634m2874J32422L534J62769j37924j20092M6740J07669m0485q2678J5592
999C8039r1934j171L0860o0121J08056J921r2415j446Q0847j2106R5309j0513
987H5326j30886j1413O2397M8647P0610J765r7818k6585r3080P1521N4953L1968
975F7405m1091P137m8951L4298j2854R7404N8245l9506j3318r1566J4999j6579
963A5623n3731o0172M3266M5042j9498N6559m3086n3435l9769O9682J8686J7627
$$ plain form
1047 648 -33940 12370 -32354 -79661 -108549 -107141 -130263 -177308 -61630 -51963 -58217 -40194 -121428
1034 -121428 -121710 -34766 24990 63140 60042 33961 -51109 -49683 -49027 30538 49083 -103262 -20735
1021 -20735 15904 32518 -2294 -49561 23510 59465 25601 -16119 104598 118707 -6634
1010 -6634 -49508 82914 86448 249217 111293 -8799 37941 145610 105125 22447 38039
999 38039 -53895 -55066 -24206 -84327 23729 25650 -66765 -68211 12636 530 95839 85326
987 85326 -45560 -56973 5424 54071 124681 126446 28628 2043 -91037 -19516 35437 67405
975 67405 26314 33451 -15500 18798 5944 103348 161593 122087 108769 17203 32202 15623
963 15623 -38108 -98280 -55014 -9972 -29470 27089 -15997 -69432 -109201 -39519 -20833 -3206
951c206j5498j9292P5972J18129j42828j39721J02558P452m9280j1084M3799K4298
939h701N6428J05273Q005j20588o4645j13845R3621J07409r487k1701j14616M0331
927d2516N7337K59696k2108j79974q8027J6200M2592n4383J9532J0381p2089P9711
915B6352Q0075o7418l1714P811L7382o6279J33726n6903j23007J29800m96M132
903G3461M2168j90097k5042Q6972p995R4797j3717o3000q2372J59657J0461j84264
891i8971L0297R9982n2353K1126M6589M2002k4091k7546k8433L4792K9754N0016
879A23164J2337j45045r4081Q8080Q7155l3468m0550j7171J2232Q9688n4654n5855
867b8168Q1125K0035k5736R5867J8048j36132R8476J3613m8468k882k5476N4905
$$ plain form
951 -3206 -18704 -37996 37976 156105 13277 -126444 -23886 -16434 -65714 -76798 -32999 -8701
939 -8701 47727 153000 161005 40417 -24228 -138073 -44452 62957 53470 31769 -82847 -42516
927 -42516 14821 274517 252409 72435 -15592 608 43200 -11183 8349 18730 -53359 26352
915 26352 106427 39009 7295 15106 52488 -13791 119935 63032 -59975 69825 69329 73461
903 73461 115629 -74468 -99510 -12538 -20533 74264 60547 -2453 -84825 74832 85293 -98971
891 -98971 -68674 31308 -21045 81 46670 88672 64581 37035 8602 43394 73148 123164
879 123164 135501 -9544 -103625 -15545 71610 38142 -2408 -19579 -7347 82341 27687 -28168
867 -28168 52957 72992 47256 143123 161171 25039 123515 137128 88660 85778 60302 115207
855A15207o8824j38093J6610L4747k2150J3128R1290M8487m6188l5585l1756K0055
843c072m2037J09941p3350j093O7040o0409O4931j6784M5468m1235n7135j15533
831a23268J563P4548R2303n7750Q9939j04262J2556J3513J7307r4464M9180O4488
819C5653L667J28848q5214K7073q3568J09570L8342q0819R9463j13258j07081
808b7324M2943l0779L176j8422N3840O5964m6942K3819K1158m7669J9796M7774
796A07334j39017J40921J07024O7167q8813n4443r8465k3027k7228k5380n5781
785h9708M1480K17728J915k3471N4920j28497l2372J1861L076j7760k1765J0727
773B8134J65835N1550j70485k348q1114K7382m5313K440J2371J7527K837k129
$$ plain form
855 115207 46383 -91710 -75100 -40353 -62503 -49375 41915 90402 44214 8629 -23127 -3072
843 -3072 -45109 64832 -8518 -9611 57429 -2980 61951 45167 90635 49400 -7735 -123268
831 -123268 -121705 -47157 45146 -12604 77335 -26927 -14371 -858 16449 -78015 -28835 35653
819 35653 39320 168168 82954 110027 26459 136029 174371 93552 193015 79757 -27324
808 -27324 15619 -15160 -11984 -30406 23434 89398 42456 66275 87433 39764 59560 107334
796 107334 -31683 109238 216262 283429 194616 140173 41708 18681 -8547 -33927 -89708
785 -89708 -48228 169500 171415 147944 202864 74367 41995 53856 56932 39172 17407 28134
773 28134 193969 245519 75034 72686 -8428 18954 -26359 -23919 -11548 5979 8816 6687
761F687l0785m4855J02087J28585j28515n3410O7731P5775L0338N8714k8108j5628
749A68616n0581J3522n192l6840o993q9163j16625N0437J36076m3247k0628k2917
737b3535R756M0540P7407j5300j6423L3595k5254q1003N8195k7953q7658J29854
725G2221K5462m0754n271j0156l0579K8569j744R727k7616P9328R6023p8282j0691
712A06237j05466j11465P7345M6773K8689m8985p0812R5680J56246j43205N2460
701H3497j15739N9410L6373Q088M1646o2988J2262m3117j22341K8657m912J7877
689f1287o0477J23282K1745o5925o7780N7504R69l9J3115M443J38106j2259L230
676I4627J2533J3616p0777q919J22900l8273n8995j39653O418N0985k2567J28352
$$ plain form
761 6687 -24098 -68953 33134 161719 33204 -20206 47525 123300 153638 212352 184244 168616
749 168616 118035 131557 126365 89525 82532 -6631 -123256 -72819 63257 20010 -618 -23535
737 -23535 -13779 26761 104168 88868 72445 106040 80786 -217 57978 30025 -57633 72221
725 72221 97683 56929 51658 41502 10923 39492 37748 47475 19859 99187 195210 116928 106237
712 106237 771 -110694 -33349 13424 42113 -6872 -77684 17996 174242 31037 83497
701 83497 -32242 27168 63541 71629 113275 50287 62549 19432 -102909 -74252 -79164 -61287
689 -61287 -121764 1518 23263 -42662 -110442 -52938 -51969 -52008 -38893 -34450 103656 91397 94627
676 94627 107160 120776 49999 41080 163980 125707 66712 -72941 -66523 -15538 -38105 90247
664I0247O3862j1093j64881J28141l1598n7478J04320k4319L4434j2184Q628K7549
652A55628j21542m2241K6078R6796k8206q720M7508M8241o3758J9512o0951P2357
640A40702j30275k7306J6317J9947P8127j26103J4756O8751q9801l6266k4051
629i5202J55968N5214K8363K0317j7491J6319k7249k5167K4119M8790q7418j48042
617e1479N8429Q7384M3927j51672L5453O2335J9843K9736j963r9401m9109m754
605b1271N8336l3946l7194O9388j739N8083n0895r743k9369J4730j7922O6455
$$ plain form
664 90247 154109 143016 -21865 106276 74678 17200 121520 97201 131635 119451 128079 155628
652 155628 34086 -8155 17923 114719 86513 77793 125301 173542 109784 129296 68345 140702
640 140702 10427 -16879 -562 19385 97512 -28591 -13835 54916 -34885 -71151 -95202
629 -95202 60766 115980 144343 164660 147169 163488 136239 111072 135191 183981 96563 -51479
617 -51479 6950 94334 138261 -13411 22042 84377 104220 133956 131993 32592 -16517 -21271
605 -21271 37065 3119 -34075 35313 33574 91657 40762 31019 1650 16380 -1542 64913
$$ [...]
##END NTUPLES=NMR SPECTRUM
##END=
