##TITLE=1H_EC-3307(22)
 CDCl3
 8 sc, 
 9.1.2024
##JCAMPDX= 6.0         $$ Bruker NMR JCAMP-DX V2.0
##DATA TYPE= NMR SPECTRUM
##DATA CLASS= NTUPLES
##ORIGIN= UXNMR, Bruker Analytische Messtechnik GmbH
##OWNER= root
$$ XWIN-NMR		Version 3.5
$$ Tue Jan  9 14:00:20 2024 Russian Standard Time (UT+4h)  she@DPX200
##.OBSERVE FREQUENCY= 200.1313
##.OBSERVE NUCLEUS= ^1H
##.ACQUISITION MODE= SIMULTANEOUS
##.ACQUISITION SCHEME= undefined
##.AVERAGES= 8
##.DIGITISER RES= 18
##SPECTROMETER/DATA SYSTEM= spect
##.PULSE SEQUENCE= zg30
##.SOLVENT NAME= CDCl3
##.SHIFT REFERENCE= (INTERNAL, CDCl3, 0, 15.4571)
##AUDIT TRAIL= $$ (NUMBER, WHEN, WHO, WHERE, WHAT)
$$ ##TITLE= Audit trail, XWIN-NMR		Version 3.5
$$ ##JCAMPDX= 5.01
$$ ##ORIGIN= Bruker BioSpin GmbH
$$ ##OWNER= she
$$ F:/spectra/data/she/nmr/H-F/1/pdata/1/auditp.txt
$$ ##AUDIT TRAIL=  $$ (NUMBER, WHEN, WHO, WHERE, WHAT)
(   1,<2024-01-09 13:58:59.37 +0400>,<she>,<DPX200>,
      <created by zg, POWCHK disabled, PULCHK disabled
       configuration hash MD5:
       00 E9 B6 7A A2 85 ED C7 34 08 36 98 17 FE 4E 26
       data hash MD5: 16K
       50 E1 A9 55 01 86 C2 10 E0 4B 4C BA B9 38 1C A9>)
(   2,<2024-01-09 13:59:02.26 +0400>,<she>,<DPX200>,
      <Start of raw data processing
       efp BC_mod = 2 LB = 0.24 FT_mod = 6 PKNL = 1 PHC0 = -24588.11 PHC1 = 12.05273 SI = 16K 
       data hash MD5: 16K
       DC C4 F1 A7 0A AC 09 3A CE 81 52 51 15 C6 B0 AA>)
(   3,<2024-01-09 13:59:24.68 +0400>,<she>,<DPX200>,
      <pk PHC0 = -2.307415 PHC1 = 1.6 
       data hash MD5: 16K
       6A 57 E9 51 32 5C C0 5C 13 53 AA F7 73 2C 1C 3D>)
(   4,<2024-01-09 13:59:28.40 +0400>,<she>,<DPX200>,
      <abs ABSG = 5 
       data hash MD5: 16K
       A1 9B 23 C9 03 30 99 61 7C 78 BE C3 96 1A C6 E0>)
$$ ##END=
$$ 
$$ hash MD5
$$ FE 62 31 07 D5 5F 18 E9 F8 60 1E 01 5E C6 25 1F
##$RELAX= 
##$RELAX= 
##$RELAX= 
##$RELAX= 
##$RELAX= 
##$RELAX= 
$$ Bruker specific parameters
$$ --------------------------
##$DU= <F:/spectra>
##$EXPNO= 1
##$NAME= <H-F>
##$PROCNO= 1
##$TYPE= <nmr>
##$USER= <she>
##$AMP= (0..31)
100 100 100 100 100 100 100 100 100 100 100 100 100 100 100 100 100 100 
100 100 100 100 100 100 100 100 100 100 100 100 100 100 
##$AQSEQ= 0
##$AQ_mod= 1
##$AUNM= <au_zg>
##$AUTOPOS= <>
##$BF1= 200.13
##$BF2= 200.13
##$BF3= 200.13
##$BF4= 200.13
##$BF5= 200.13
##$BF6= 200.13
##$BF7= 200.13
##$BF8= 200.13
##$BYTORDA= 1
##$CFDGTYP= 0
##$CFRGTYP= 5
##$CHEMSTR= <none>
##$CNST= (0..31)
1 1 145 1 1 1 1 1 1 1 1 1 1 1 1 1 1 1 1 1 1 1 1 1 1 1 1 1 1 1 1 1 
##$CPDPRG= <>
##$CPDPRG1= <>
##$CPDPRG2= <>
##$CPDPRG3= <>
##$CPDPRG4= <mlev>
##$CPDPRG5= <mlev>
##$CPDPRG6= <mlev>
##$CPDPRG7= <mlev>
##$CPDPRG8= <mlev>
##$CPDPRGB= <>
##$CPDPRGT= <>
##$D= (0..31)
0 1.2 0 0 0 0 0 0 0 0.06 0 0.03 0 0 0 0 0.0002 0 0 0 0 0 0 0 0 0 0 0 0 
0 0 0 
##$DATE= 1704794338
##$DBL= (0..7)
120 120 120 120 120 120 120 120 
##$DBP= (0..7)
150 150 150 150 150 150 150 150 
##$DBP07= 0
##$DBPNAM0= <>
##$DBPNAM1= <>
##$DBPNAM2= <>
##$DBPNAM3= <>
##$DBPNAM4= <>
$$ [...]
##$SUBNAM3= <"">
##$SUBNAM4= <"">
##$SUBNAM5= <"">
##$SUBNAM6= <"">
##$SUBNAM7= <"">
##$SUBNAM8= <"">
##$SUBNAM9= <"">
##$SW= 18.0517328524113
##$SWIBOX= (0..15)
0 0 2 0 0 0 0 0 0 0 0 0 0 0 0 0 
##$SW_h= 3612.71676300578
##$TD= 16384
##$TD0= 1
##$TE= 0
##$TE2= 300
##$TE3= 300
##$TEG= 300
##$TL= (0..7)
0 120 120 120 120 120 120 120 
##$TP= (0..7)
150 150 150 150 150 150 150 150 
##$TP07= 0
##$TPNAME0= <>
##$TPNAME1= <>
##$TPNAME2= <>
##$TPNAME3= <>
##$TPNAME4= <>
##$TPNAME5= <>
##$TPNAME6= <>
##$TPNAME7= <>
##$TPOAL= (0..7)
0.5 0.5 0.5 0.5 0.5 0.5 0.5 0.5 
##$TPOFFS= (0..7)
0 0 0 0 0 0 0 0 
##$TUNHIN= 0
##$TUNHOUT= 0
##$TUNXOUT= 0
##$USERA1= <user>
##$USERA2= <user>
##$USERA3= <user>
##$USERA4= <user>
##$USERA5= <user>
##$V9= 5
##$VALIST= <valist>
##$VCLIST= <CCCCCCCCCCCCCCC>
##$VD= 0
##$VDLIST= <DDDDDDDDDDDDDDD>
##$VPLIST= <PPPPPPPPPPPPPPP>
##$VTLIST= <TTTTTTTTTTTTTTT>
##$WBST= 1024
##$WBSW= 4
##$XGAIN= (0..3)
0 0 0 0 
##$XL= 0
##$YL= 0
##$YMAX_a= 505367
##$YMIN_a= -662116
##$ZGOPTNS= <>
##$ZL1= 120
##$ZL2= 120
##$ZL3= 120
##$ZL4= 120
##$ABSF1= 15.53093
##$ABSF2= -2.52092
##$ABSG= 5
##$ABSL= 3
##$ALPHA= 0
##$AQORDER= 0
##$ASSFAC= 0
##$ASSFACI= 0
##$ASSFACX= 0
##$ASSWID= 0
##$AUNMP= <proc_1d>
##$AZFE= 0.1
##$AZFW= 0.1
##$BCFW= 0
##$BC_mod= 2
##$BYTORDP= 0
##$COROFFS= 0
##$CY= -3
##$DATMOD= 1
##$DC= 0
##$DFILT= <>
##$DTYPP= 0
##$F1P= 0
##$F2P= 0
##$FCOR= 1
##$FTSIZE= 16384
##$FT_mod= 6
##$GAMMA= 0
##$GB= 0
##$INTBC= 1
##$INTSCL= 3.70164e-10
##$ISEN= 128
##$LB= 0.24
##$LEV0= 0
##$LPBIN= 0
##$MAXI= 10000
##$MC2= 0
##$MEAN= 0
##$ME_mod= 0
##$MI= 1.114404
##$NCOEF= 0
##$NC_proc= -7
##$NLEV= 6
##$NOISF1= 3.799351
##$NOISF2= 2.8
##$NSP= 0
##$NTH_PI= 0
##$NZP= 0
##$OFFSET= 15.45712
##$PC= 1
##$PHC0= -24590.42
##$PHC1= 13.65273
##$PH_mod= 1
##$PKNL= yes
##$PPARMOD= 0
##$PSCAL= 0
##$PSIGN= 0
##$REVERSE= no
##$SF= 200.130012924678
##$SI= 16384
##$SIGF1= 3
##$SIGF2= 2
##$SINO= 5.538805
##$SIOLD= 16384
##$SREGLST= <1H.CDCl3>
##$SSB= 0
##$STSI= 16384
##$STSR= 0
##$SW_p= 3612.71676300578
##$SYMM= 0
##$S_DEV= 0
##$TDeff= 16384
##$TDoff= 0
##$TI= <>
##$TILT= no
##$TM1= 0
##$TM2= 0
##$TOPLEV= 0
##$USERP1= <user>
##$USERP2= <user>
##$USERP3= <user>
##$USERP4= <user>
##$USERP5= <user>
##$WDW= 1
##$XDIM= 16384
##$YMAX_p= 293947918
##$YMIN_p= -574966
$$ End of Bruker specific parameters
$$ ---------------------------------
##NTUPLES= NMR SPECTRUM
##VAR_NAME=  FREQUENCY,     SPECTRUM/REAL,   SPECTRUM/IMAG
##SYMBOL=    X,             R,               I
##VAR_TYPE=  INDEPENDENT,   DEPENDENT,       DEPENDENT
##VAR_FORM=  AFFN,          ASDF,            ASDF
##VAR_DIM=   16384,         16384,           16384
##UNITS=     HZ,            ARBITRARY UNITS, ARBITRARY UNITS
##FACTOR=    0.220516191357247, 1,           1
##FIRST=     3093.43361371301, 0,            0
##LAST=      -519.283149292774, 0,           0
##MIN=       -519.283149292774, -574966,     0
##MAX=       3093.43361371301, 293947918,    0
$$ Real data points
##PAGE= N=1
##DATA TABLE= (X++(R..R)), XYDATA
$$ [...]
8726 19115461 18728151 18009847 17249108 16903508 16490996 16089194 15608348 15262436 14796279
8717 14796279 14344244 14069042 13826750 13517361 13387167 13203438 12955464 12706881 12574204
8708 12574204 12569410 12206605 11722988 11276282 11155857 11184234 10974752 10688032 10612758 10671529
8698 10671529 10448602 10080189 10028528 9955010 9872029 9695201 9566101 9729495 9743784 9606245
8688 9606245 9608589 9631004 9600608 9576247 9560581 9507011 9317665 9312955 9111774 9130048 9135535 9144169
8676 9144169 9273372 9414596 9606371 9615621 9733225 9692299 9689424 9863984 9833510 9908002 9758089
8665 9758089 9982530 9955929 9830699 10006448 10041799 10335961 10531848 10640179 10764029 11015739
8655 11015739 11122640 11013452 10881312 11292554 11535205 11632109 11761235 11836156 11962323 12252028
8645 12252028 12448306 12394681 12822588 12992765 12964133 13132533 13517551 13657113 13762386 13946134
8635 13946134 14167297 14370080 14826770 15082053 15575274 15898418 16325035 16601365 16935360
8626 16935360 17178050 17353239 17646535 17905530 18565720 19243329 20002077 20932746 21963580
8617 21963580 22975678 24161079 25687342 27384946 29374293 31343686 32930110 34140647
8609 34140647 34885470 35387134 35349735 35380577 35205323 35141511 35374575 35841804 36762169 37716134
8599 37716134 38694563 39531279 40385399 40739936 40480553 39909421 38602436 36882023 35662270
8590 35662270 35160714 35259493 35950834 37338889 39503441 41879957 44127773 45234909 44446012
8581 44446012 42465219 41209152 40037976 39668034 40299418 41862298 44273600 47618642
8573 47618642 51097623 54398658 56763232 57700198 57890619 57579983 56772432 55858685 54925702
8564 54925702 54087019 53329893 52933240 52846090 53570132 54415230 55168279 55933948 56578308 56815714
8554 56815714 56019366 54781292 52668471 50215985 47550763 45961773 45053790 45125090 46279018
8545 46279018 48445139 50551407 52075271 52695099 52444185 50748868 47883208 44675087
8537 44675087 42313453 40997464 40850530 41697051 43301591 45054923 46217582 47043769 47063392
8528 47063392 45572453 43163537 40673908 38353448 36283544 34704014 33504394 32483607
8520 32483607 31653250 31613284 32215391 32454284 32499883 32598302 32957700 32928162 32221231 30773631
8510 30773631 29025299 27335826 25845671 24743503 24214088 24149693 24979752 26174291 27570729
8501 27570729 28220133 27580301 25911073 23966091 22279352 21333531 20758679 20366273 20155361
8492 20155361 20556217 20846276 20939368 20233076 18679604 16700436 14884043 13411264 12341211
8483 12341211 11769660 11268703 10710602 10209806 9932535 9791156 9662347 9312101 9422992
8474 9422992 9578433 9677724 9546669 9224521 8846464 8500854 7845227 7558509 7158534 6815805
8464 6815805 6761236 6764446 6820967 6588841 6615734 6822725 6965459 7336094 7514187 7562455 7288386
8453 7288386 7041952 6704229 6200029 5764196 5413697 5168640 4932220 4820412 4528833 4206889
8443 4206889 4267976 4354418 4183616 4206142 4236350 4349226 4126031 3989189 4158498 4008737
8433 4008737 3835253 3853314 3795791 3851292 3780580 3676446 3590696 3589363 3591393 3444204 3534658
8422 3534658 3521212 3490493 3393331 3255760 3068542 3035240 3034715 2984527 3114903 3222794 3080155
8411 3080155 2872978 2788224 2780528 2658509 2769497 2916376 2666311 2717023 2812408 2731463 2721151
8400 2721151 2806373 3034385 2966557 2794400 2629068 2612515 2881782 2979988 2807829 2950238
8390 2950238 2969596 2906707 2942345 3059595 2943685 2949135 3086150 3084687 3033367 3090536 3020169
8379 3020169 2832941 2757296 2765935 2886154 2718189 2701115 2623773 2667018 2652991 2559713 2361647
8368 2361647 2232000 2285542 2541006 2533431 2346417 2400973 2520506 2536179 2604439 2586847 2653871
8357 2653871 2568569 2654868 2737687 2683987 2763071 2734722 2768681 2710754 3121785 3236777 3208058
8346 3208058 3115292 3062232 3102462 3243793 3267484 3301735 3201678 3220344 3255283 3136133 3283414
8335 3283414 3252067 3068187 2953839 2975882 3048185 2876613 2795527 2837185 2791837 2977606 2783750
8324 2783750 2871631 2834426 2866081 2656623 2695460 2570071 2612876 2734999 2688917 2405740 2484674
8313 2484674 2700462 2767955 2902054 2699500 2939555 2872318 2899277 2741933 2667697 2695656
8303 2695656 2731631 2858894 2872538 2862127 3029456 3147815 2913234 2814886 2786623 2842686 2838419
8292 2838419 2822850 2858079 2887433 2958981 2892257 2708596 2939559 2875092 2654340 2642994 2768281
8281 2768281 2791378 2592238 2846998 2905601 2784071 2862530 2927461 2790881 2720924 2752057 2797756
8270 2797756 2618179 2792319 2773179 2768767 2727039 2769176 2646808 2594705 2595570 2716335 2673249
8259 2673249 2742323 2699761 2536284 2627363 2752444 2947450 2787736 2764225 2632345 2638205 2563198
8248 2563198 2486942 2480547 2499640 2517533 2604868 2559225 2473755 2709897 2686025 2553637 2938210
8237 2938210 3064408 2974392 2777593 2729418 3011026 3124245 2976380 2835053 2915010 2971682
8227 2971682 2958835 3044874 2899205 2653659 2793891 2832320 2803325 2690682 2657857 2500118
8217 2500118 2364430 2250668 2037089 2280938 2381016 2260552 1973058 1914811 1994636 2113814
8207 2113814 2256924 2307426 2369873 2426610 2116101 1982314 2169395 2570187 2528588 2637342
8197 2637342 2743298 2672191 2730303 2723118 1674333 1613873 3250091 3143031 3072593 3018490
8187 3018490 3260136 3567364 3604585 3514828 3421794 3562948 3710033 3541596 3314621 3315114 3334816
8176 3334816 3445619 3357471 3224212 3002947 3096858 3081012 3038851 2953436 2686705 2579977
8166 2579977 2662748 2584044 2529733 2484981 2614111 2745453 2785408 2932990 2908714 2993602 3087227
8155 3087227 3363504 3391664 3336347 3300803 3262904 3189590 2873554 2936931 3004950 2881970 2839537
8144 2839537 2902321 2860277 2713427 2781076 2709165 2670462 2575586 2641315 2561434 2646337 2691825
8133 2691825 2728534 2605030 2408153 2415166 2292649 2140362 1892644 2093509 2143342 1953561
8123 1953561 1981956 2155546 2047574 2118770 2217051 2279966 2413847 2404576 2337591 2484974 2401515
8112 2401515 2458923 2639135 2720008 2723477 2636057 2684544 2685951 2595009 2427959 2294318 2376976
8101 2376976 2363006 2494921 2490774 2353795 2196779 2213284 2360095 2410963 2450695 2444224 2509699
8090 2509699 2520644 2319600 2422682 2658055 2664679 2678569 2673108 2648371 2554509 2422177 2868639
8079 2868639 3045028 2877631 2922716 3005315 2944495 3193221 3236394 2988494 3241304 3123008
8069 3123008 3388787 3497776 3415191 3415328 3812113 4076103 4054403 4021755 3985399 4110160 4383293
8058 4383293 4493055 4588430 4541789 4621752 4787609 4881967 4875513 5049226 5073784 5065680 5220075
8047 5220075 5276577 5129518 5405722 5770749 5924042 6310728 6313884 6468747 6702768 7174444
8037 7174444 7345431 7474747 8077516 8563108 8756403 9291120 10188935 11032511 11920026 12839931
8027 12839931 13953377 15299061 17262942 19887036 23087360 27363330 33077124 40075860
8019 40075860 47127018 52849236 55192909 52518383 46351373 38587570 30924768 24363107
8011 24363107 19481131 15913363 13567010 11670767 10192617 9474273 8699033 8018768 7321856
8002 7321856 6823560 6462667 5865502 5420310 5094006 4688443 4575520 4290054 3856320 3561385
7992 3561385 3576888 3342509 3357025 3164512 3107616 3131128 3051682 2926394 2644538 2439916
7982 2439916 2210702 2077243 2343912 2425336 2189676 2076331 2124414 2058444 1826712 1770685
7972 1770685 1825893 1805407 1620563 1618086 1356598 1401414 1422595 1284836 1309787 1058888 1190246
7961 1190246 1088200 1070573 984772 1045179 1147694 1021315 934423 1053443 1017053 1079982 1149664
7950 1149664 1222038 1293899 1085404 1121370 1110488 1133060 1132454 1143799 1108498 1322438 1124482
7939 1124482 1097827 911570 953417 1158919 952762 1061678 1207425 1235189 1306027 1249761
7929 1249761 1298805 1365720 1291832 1210985 1155702 1233149 1635938 1606652 1459263 1381209 1334072
7918 1334072 1397700 1481681 1756752 1794573 1780769 1522866 1517384 1585040 1390536 1267968 1306108
7907 1306108 1396985 1527836 1410272 1346599 1568603 1569633 1479947 1233734 1172957 1257439 1391123
7896 1391123 1109414 1211851 1449932 1515990 1542764 1375662 1344879 1321185 1288039 1253165 1224531
7885 1224531 1255055 1308352 1283351 1408967 1382013 1330422 1176643 1343199 1527823 1525715 1600076
7874 1600076 1477727 1663369 1812937 1738879 1755735 1646006 1453587 1611644 1584753 1523183
7864 1523183 1372740 1485715 1753080 1776618 1699718 1701722 1840408 1575795 1334443 1114954
7854 1114954 1104803 1199340 1276935 1307420 1257714 1202833 1278378 1207494 1070438 1189813 1027219
7843 1027219 1165783 1281118 1260064 1382802 1357750 1546767 1404090 1324160 1323464 1341171 1092167
7832 1092167 1231613 1360255 1221336 1182445 1358274 1386401 1305993 1481674 1559311 1596015
7822 1596015 1436761 1629715 1698378 1595395 1405630 1431063 1510649 1523899 1418526 1547730
7812 1547730 1451477 1563315 1613917 1398355 1360747 1437298 1515740 1455242 1291172 672390 801930
7801 801930 1056274 1026830 969602 1168412 1316219 1304566 1460592 1280724 1247929 1396810
7791 1396810 1309344 1419224 1218193 1343404 1311894 1473744 1352507 1367033 1509765 1224108
7781 1224108 1251461 1296039 1412861 1288205 1176640 981118 902093 1124181 1216349 1037533
7771 1037533 961605 1127548 1146205 1121923 1167761 1233316 1216930 1413193 1468884 1413629 1328355
7760 1328355 1338095 1255098 1197939 1264059 1233692 1142584 1134718 1276701 1197146 1115340 1037383 983601
7748 983601 920085 1106314 1105839 955891 886037 884512 1018425 1097229 1117520 1170760 1156732 1042622
7736 1042622 838712 991785 942335 828115 1094802 1027208 937912 876678 785937 787907 768695
7725 768695 982809 867675 692616 559880 809600 737662 782710 710585 653810 789309
7715 789309 1068571 1043743 806772 719108 758174 903027 999592 982042 1001364 1057602 1031939
7704 1031939 908470 964652 823702 877694 933853 816168 847619 700543 676439 824320
7694 824320 871621 787728 753749 925478 952266 872797 933916 1081595 990069 573722 560363
7683 560363 508873 683517 742545 843438 909463 808412 755527 684000 604047 711492 531603
7672 531603 605810 691242 893021 823684 804360 766917 738727 976516 912328 851069 755478
7661 755478 775809 840568 757332 735671 607202 580966 791741 705169 694939 831426 909061
7650 909061 741481 727942 886343 846254 835402 914933 880139 829286 765768 697217 831034
7639 831034 945049 895524 824819 724981 659237 762561 653836 616440 721748 704652 945819
7628 945819 773259 557663 570341 446803 707352 483162 619261 919912 960715 1106413
7618 1106413 974522 776625 913308 1016662 1077403 1063361 1007318 877774 1006074 1032359
7608 1032359 839986 976122 924290 864721 853979 920736 912822 1063350 1208567 1261586 1210183
7597 1210183 1109563 1134042 1099365 1015528 938611 745942 916049 889674 671409 1051444
7587 1051444 846230 781671 908692 843853 1050386 897755 923247 1162901 1219869 1237148
7577 1237148 1327327 1387289 1129987 1281788 1340695 1251779 1312477 1204958 1253587 1145951 1207794
7566 1207794 1327182 1226398 1186887 1260324 1202875 975220 856384 895928 845587 857157 918121
7555 918121 703098 595314 725521 765996 682416 702231 695398 635839 588925 797725 1100300
7544 1100300 1131459 1119183 1028977 972596 978277 883213 1066825 1181139 999205 990396 714726
7533 714726 782038 894995 737632 619290 683527 690564 777668 746883 532484 554414 615811
7522 615811 714537 813457 701339 547636 559112 487110 469137 251755 426606 552065 554588
7511 554588 785285 573357 643883 622474 682093 910172 877866 836039 953264 543280 411985
7500 411985 543329 625044 760974 801127 647023 728827 909851 728400 547501 407215
7490 407215 450452 689275 956516 893370 613847 829670 975664 923339 874112 739107
7480 739107 635313 779957 792870 771991 730620 810704 918649 849932 766868 999421 1065306
7469 1065306 955855 825367 695567 584394 726650 1029987 907606 775394 729113 717603
7459 717603 716463 860108 861696 1044773 924764 857802 956161 988811 937785 1014351 872983
7448 872983 881919 1048852 1196541 1179931 1276614 1189428 1131609 1221707 1181951 1176994 950490
7437 950490 904659 897849 816807 1146392 1159370 1081529 1081808 928637 1002024 1134979 1123327 1238263
7425 1238263 1102617 1034214 944407 1157053 1195500 1143246 1115813 920062 845983 809037 852688
7414 852688 1096929 1051990 932072 783365 906084 920424 1006468 870137 826069 732301 883825
7403 883825 928039 699411 760127 837316 869905 849193 566344 507999 835424 747835 790015
7392 790015 580021 534220 344199 467375 539182 436505 396126 361694 322155 299150 428519
7381 428519 410368 266357 278646 138287 220616 196704 237147 154089 292104 355091 358267
7370 358267 408561 461841 327624 448738 280636 277284 414124 256518 132308 228933 450651
7359 450651 426223 362638 340129 395435 286649 403085 349194 105232 155195 34359 -27785
7348 -27785 255052 169842 30927 199193 120471 92410 249313 171061 -2459 42151 94664
7337 94664 91875 97918 -38101 69198 160918 141388 247640 187035 76961 105449 189491
7326 189491 217263 189203 -80195 4084 62426 113341 221829 272596 253153 85335 97387
7315 97387 273485 226072 116906 -20678 -130048 -6137 -17350 60270 60916 -67208 22080
7304 22080 160634 283746 248233 120073 117214 115609 168737 67274 -88049 -124841 15222
7293 15222 142818 31894 67672 260633 42351 70659 -50857 59691 -32514 10474 37704
7282 37704 47081 80388 -64826 -29844 141356 140045 -47670 -148852 29814 104719 222745
7271 222745 280368 45914 -44268 191895 305696 110182 32686 10565 110823 218864
7261 218864 228871 371941 339708 244864 184552 86856 88699 128170 127818 199607 205188 85153
7249 85153 43814 -5325 224538 142240 113362 7483 -138034 74570 301366 140142 139928
7238 139928 354601 322054 6955 125284 268310 308544 29731 216885 265675 -13049
7228 -13049 188102 265543 60984 -77366 67945 358667 390361 325027 221072 -51614
7218 -51614 -44885 33297 246074 338701 239277 114782 18100 23888 145311 99080 14922 244
7206 244 -43619 -64413 239263 164462 50285 86609 117497 121249 300691 195617 186081 -49497
7194 -49497 -227766 -269159 185012 390107 231865 222163 109561 -27049 -101198 92106 155662
7183 155662 128005 61660 19157 -181490 -39027 -39265 43888 -13437 41918 97362 167676 -18261
7171 -18261 150187 236308 416356 426787 226631 191587 194581 236998 115184 12773 143991
7160 143991 208983 196045 113678 252805 456952 268028 209279 82689 237427 94808
7150 94808 314140 360194 172831 116662 155540 205759 195695 93229 158251 61747 43703
7139 43703 62284 64892 165369 129857 -11386 23423 99856 1323 -45818 136238 409349
7128 409349 491779 373039 471083 525122 521553 611775 422108 284613 289358 325140 443999
7117 443999 265636 129399 220150 244799 362623 401119 383270 369296 450777 343185 375703
7106 375703 165719 103306 387887 408128 293130 240062 184171 62492 250758 189287 61708
7095 61708 206545 169795 244828 218009 267241 281986 374541 226945 387728 107742 -39398
7084 -39398 58855 -86374 -13828 204965 295128 193105 163344 206733 158914 433449 336586
7073 336586 155004 244753 325217 276277 65157 194765 161700 405756 386352 194638 273722
7062 273722 412526 291625 263666 238920 191804 132163 172745 70503 104960 409854 282788
7051 282788 327768 443096 435896 376921 308405 205574 384483 400819 203116 385216 453155
7040 453155 320770 239711 213317 157705 165999 159080 152204 123606 80640 175809 195105 256405
7028 256405 419294 291576 213215 260163 149907 191890 350704 431370 331864 159873 358861
7017 358861 294999 338996 398461 355838 454304 302968 168108 285421 389323 315714 522534
7006 522534 474457 420709 436318 471980 487645 413899 270367 148507 95292 184601 289129
6995 289129 67935 241566 174202 129628 312591 389544 342492 221923 295192 174885 182990
6984 182990 514867 525376 376654 180617 249368 252785 304314 310660 208789 196706 116365
6973 116365 116325 263975 390514 346492 327147 508559 543061 302163 163588 259702 367629
6962 367629 443135 214429 260282 145318 377049 321252 196023 219504 162832 96597 153513
6951 153513 163812 86096 135747 247566 191835 288511 381442 137025 480109 403825 315718
6940 315718 431839 446746 249573 152041 144001 293381 352813 536851 442362 298760 555039
6929 555039 548862 630879 552558 504839 568190 514811 496903 389288 616808 653188 684138
6918 684138 520075 370515 252059 -19730 157595 408318 345681 338977 402164 381888 234525
6907 234525 213446 126609 -52291 156679 354567 195536 216172 603996 506848 117954
6897 117954 329230 452072 347198 196178 307707 398079 394545 250139 120768 262859
6887 262859 294096 209744 272564 158540 12277 -30870 231478 346089 168367 73713 80174
6876 80174 -11602 106944 252170 174580 149585 181250 124694 209650 286278 279082 203093 370180
6864 370180 510782 420604 179380 26177 190913 124200 77922 136679 189461 484676 513037
6853 513037 454108 454267 138279 204445 148601 208976 247223 208982 -15476 22428 188175
6842 188175 243511 145098 120653 278120 258091 312675 264999 210080 293256 432935 331252
6831 331252 349914 364253 176615 334756 422321 345007 170201 350311 442367 352976 361039
6820 361039 310014 342615 359279 463217 599106 360379 412545 346464 352623 44468 -26789
6809 -26789 231278 288958 550362 565298 501261 473233 617055 460590 432828 532834 646894
6798 646894 682959 661312 457085 504488 467787 277151 439620 532510 344027 391545 483132
6787 483132 434898 536829 517039 641462 385842 404259 658006 646383 552646 600268 417807
6776 417807 487110 372142 417186 274811 467054 561821 555006 670361 510959 701528 594545
6765 594545 381885 310971 565145 669115 580898 556552 635217 610227 575398 506348 576629
6754 576629 529166 611969 482681 469950 479111 236289 437728 487617 631533 528415 512597
6743 512597 651945 782324 751389 599873 598672 551938 658220 748611 841874 884341 922211
6732 922211 769525 799640 650666 664039 534383 406145 615207 676249 796466 868189
6722 868189 800877 810484 810400 692406 557781 685333 743471 786655 982475 867595 811647
6711 811647 872717 769873 775805 697997 778780 782386 976752 835759 922602 951960 1048231
6700 1048231 964217 820030 1111297 1145694 938876 993926 903897 950102 981830 850891 849702
6689 849702 884405 882284 700027 790244 979885 886559 836833 1074337 1121189 1042637 1097269
6678 1097269 1150622 1164601 1256924 1355035 1314258 1308732 1368922 1194324 1306229 1196628 1243972
6667 1243972 1125214 1242451 1379224 1356743 1277750 1299387 1219039 1080842 1149112 1345920
6657 1345920 1427099 1510292 1669555 1518615 1458069 1541771 1526092 1358573 1423573 1649540 1703528
6646 1703528 1631992 1497227 1659679 1661610 1751843 1510856 1720473 1799154 1750247 1816184 1791709
6635 1791709 1755755 1755627 1961515 2018354 2053697 2042472 1994683 2029314 2387682 2435151 2579283
6624 2579283 2424508 2400044 2590560 2987387 3127718 3222730 3498671 3798559 3941078 4169027
6614 4169027 4331047 4190064 4063343 4103706 4108773 4062348 4091293 4198409 4392758 4244259
6604 4244259 4220534 4175011 4213636 4220910 4236285 4476025 4336372 4053988 4106384 4104895 3996782
6593 3996782 3909716 3884646 4006837 3691285 3752677 3665724 3542592 3347346 3044516 3063371
6583 3063371 3125553 2927694 2659270 2718716 2588166 2620586 2416062 2415762 2325888 2408261 2292043
6572 2292043 2159477 2124411 1923135 2038957 2060527 2198756 1946738 1809785 2065761 2125667
6562 2125667 2027119 1844080 1945421 1931160 1888213 1779274 1702943 1594116 1833349 1868956
6552 1868956 1640319 1633604 1515351 1588969 1704608 1706114 1736107 1644897 1585271 1542503 1582766
6541 1582766 1599774 1598161 1626634 1623415 1425386 1207176 1241099 1215059 1316521 1460161 1432128
6530 1432128 1324842 1410344 1509976 1544307 1453083 1451576 1439747 1539411 1453053 1662033 1757932
6519 1757932 1772074 1972106 1916952 1897963 1831622 1698908 1657183 1637645 1644548 1475544 1516274
6508 1516274 1614231 1540370 1719292 1728854 1683364 1826369 1696421 1534653 1477368 1507749 1769177
6497 1769177 1829834 1831950 1788267 1592335 1679706 1651198 1609937 1479270 1619704 1713376 1527169
6486 1527169 1540140 1557033 1529804 1451701 1554949 1646635 1476037 1468939 1474690 1521420 1259552
6475 1259552 1145502 1268739 1139860 1203565 1216324 1185832 1251295 1324392 1393795 1502099 1483582
6464 1483582 1502386 1475382 1400950 1434855 1337867 1357042 1296594 1349304 1456213 1529447 1474310
6453 1474310 1243098 1133185 1096505 1373529 1435662 1689655 1738707 1669838 1669975 1608144 1553981
6442 1553981 1754793 1776364 1776552 1897826 1749236 1762192 1913094 1806451 1780777 1886891 2115090
6431 2115090 2031937 1844592 1834093 2016997 1988613 1839694 1692451 1743060 1806117 1644036
6421 1644036 1792808 1905598 1825896 1794800 1768484 1653724 1721827 1736326 1688822 1962994 1895636
6410 1895636 1984945 1989050 2221699 2229530 2209772 2492747 2400731 2409739 2227653 2225869 2343507
6399 2343507 2386570 2259204 2210099 2203898 2296995 2193500 2107614 2097493 1941324 1889928 2051854
6388 2051854 2168760 2267113 2422483 2295994 2213709 2347907 2289004 2277841 2301430 2181139
6378 2181139 2187553 2360371 2493080 2395672 2051295 2086826 2187335 1968794 2077572 2176126
6368 2176126 2189704 2312043 2336502 2377794 2454922 2243067 2162686 2268990 2174477 2337293 2245955
6357 2245955 2286417 2239213 2170210 2270243 2284180 2250603 2325037 2230063 2170332 2340005 2355002
6346 2355002 2290120 2407442 2539221 2514629 2446882 2535576 2094418 2179740 2355351 2524032
6336 2524032 2428371 2414033 2567112 2502546 2322993 2403164 2525693 2532291 2628616 2685518 2716245
6325 2716245 2665816 2824391 2783162 2925954 2844630 2640755 2739012 2968152 3060521 3023536 2955457
6314 2955457 3014500 2823638 2702078 2635885 2813111 3029876 3115994 3110876 3160327 3177081 3152138
6303 3152138 3183497 3205051 3253902 3522989 3549892 3429140 3330396 3413509 3520519 3473765 3477127
6292 3477127 3715766 3736508 3644524 3698568 3700441 3770684 3738952 3714812 3766139 3771834 3824181 3708036
6280 3708036 3678199 3730241 3826576 3869384 3787947 4072125 4285297 4063067 4198158 4325935
6270 4325935 4392207 4463751 4614872 4696372 4692941 4792137 4699976 4811574 5134518 5278495 5244579
6259 5244579 5407956 5497209 5288644 5276300 5412516 5557763 5605754 5455734 5249533 5466806
6249 5466806 5528964 5754655 5855083 6098849 6301225 6239599 6522493 6598916 6568581 6823997
6239 6823997 6983868 7170647 7099011 7101346 7261563 7285080 7400815 7635877 7788548 8027085
6229 8027085 8250227 8313404 8444088 8521814 8559308 8763930 9019888 9086155 9189376 9408507
6219 9408507 9794197 9994441 10128968 10149792 10346273 10272186 10465127 10727493 10951218 11026414
6209 11026414 10836130 11044040 11386756 11494969 11821938 11901540 11874279 12001115 12225035 12482777
6199 12482777 13040615 13165720 13326495 13708575 13891091 14120544 14378177 14552509 14908389
6190 14908389 15428274 15503651 15571038 15710331 15911904 16283648 16571078 16885986 17180879 17555977
6180 17555977 18022824 18552469 18775884 19309344 19782709 20607986 21189203 21657921 22494648
6171 22494648 23461738 24376450 25358417 26438061 27614280 28889179 30047388 31516429 33208587
6162 33208587 34989396 36919864 39395504 42319060 45228189 47976939 50280295 51733463
6154 51733463 52096373 51903283 51104597 50203781 49681885 48963537 48718909 49000999 49770621
6145 49770621 50919867 51763906 52374295 52903250 53292093 53861528 54637945 55853566 57066684
6136 57066684 58781447 60945767 63973027 67695308 72559728 78212599 84340866 89908613
6128 89908613 93737968 95284300 94237863 91406298 87816259 83991782 80911037 78468765
6120 78468765 76997053 76020721 75166526 73844825 71826042 68761839 65006476 61422008
6112 61422008 58436046 56355253 54980427 54217332 53798928 54437988 55531060 57068212 59212052
6103 59212052 61599878 64258560 65922816 66183649 65604884 64178566 62443737 60464848
6095 60464848 58581260 56777852 55151233 53819752 52386855 50552512 48842233 47220027
6087 47220027 45736054 44660557 43970902 43101489 42171176 41313979 39562536 37632152 35764631
6078 35764631 33734626 31926407 30484456 29464296 28406443 27700450 27036565 26782868 26521187
6069 26521187 26375537 26395598 26560612 26715428 27259252 28107252 29158394 30481861 31889920
6060 31889920 34080638 36678043 39494936 42011931 44172953 44567020 42707025 39642642
6052 39642642 35999219 32203370 29046865 26933677 25086285 23628173 22516622 21710039
6044 21710039 21211016 20772289 20406969 20238090 20107911 20220535 20330887 20462964 20973649
6035 20973649 21446881 22182126 23156983 24521018 25571191 26333333 26628825 26416216 25095985
6026 25095985 23351162 21198199 19130619 17685744 16339957 15010623 13862676 13285743
6018 13285743 12511595 11838915 11415359 11155981 10991232 10768828 10528085 10373083 10265001
6009 10265001 10143789 9782975 9333079 9180324 8876917 8453183 8037924 8000548 7910859 7625623
5999 7625623 7474331 7126226 6970083 6877809 6831581 6782812 6738861 6543797 6339741 6158503
5989 6158503 6097134 6030050 6031581 6086033 5996309 5875165 5723915 5696738 5552434 5504060 5344346
5978 5344346 5163544 5049561 5085274 5009366 4920968 4942551 4956229 4899372 4880217 4818058 4802933
5967 4802933 4833991 4672818 4693616 4762110 4710234 4447548 4612291 4543085 4467643 4578610 4512396
5956 4512396 4323759 4453186 4243675 4152939 4209425 4210304 4399323 4428389 4461323 4392900 4540216
5945 4540216 4615961 4685047 4825166 4765843 4749710 4822444 4747682 4684699 4633831 4420769 4461918
5934 4461918 4272488 4220663 4159480 4252505 4159679 4166628 4302596 4369127 4199838 4163038 4343412
5923 4343412 4404395 4477614 4428671 4396508 4428818 4354214 4380944 4418985 4509225 4542285 4448939
5912 4448939 4447519 4342686 4356631 4547769 4686565 4660741 4913109 4953511 4859960 5013541 5172235
5901 5172235 5124669 4819329 4814885 4911344 5001875 4965713 5044680 5234620 5429613 5413116 5294610
5890 5294610 5419944 5425226 5572242 5641771 5798642 5821825 5908334 5821766 5869453 6034293 6088838
5879 6088838 5947849 6104846 6162940 6262849 6173272 6129357 6124734 6320126 6458430 6551496 6486943
5868 6486943 6522289 6737210 6915362 6951008 7133624 7061816 6929677 7018589 7267888 7475111
5858 7475111 7400630 7414846 7446203 7470383 7541004 7741526 7676146 7764211 7926049 8136354 8090360
5847 8090360 7952163 8140474 8082378 8102596 8262842 8375534 8382558 8292998 8395069 8368399 8493729
5836 8493729 8640297 8895934 8884773 8834166 8764901 8737749 8993927 9077566 8982300 8946670 9074325
5825 9074325 8988407 9227832 9285458 9212189 9313451 9462727 9562039 9767371 9745389 9717997 10007920
5814 10007920 10286591 10098336 10267813 10442495 10505405 10621148 10632957 10841384 10885005 10893492
5804 10893492 11262328 11439564 11325431 11583048 11728142 11921073 12104035 12330358 12372802 12471879
5794 12471879 12586934 12743555 12880570 13108417 13292190 13428151 13607817 13761162 14050361
5785 14050361 14193909 14174736 14481985 14577321 14867164 15106311 15346134 15454195 15518189 15742088
5775 15742088 16071283 15986195 16327697 16908812 16995693 17209564 17464161 17620270 17978091 18402562
5765 18402562 18589752 18897558 19322630 19740755 20209272 20556964 20834632 21066208 21360450
5756 21360450 21475205 21931244 22559298 22755152 23140135 23553991 24093885 24689509 25190239
5747 25190239 25509256 25886238 26369670 26971067 27798121 28499248 29281338 30155422 31105519
5738 31105519 31832642 33068591 34109437 35152957 36157427 37333036 38598019 39918679
5730 39918679 41633999 43783559 46140342 48689910 51922470 55163963 58161275 60589964
5722 60589964 62117909 62260770 61644870 60562614 59608443 58831757 58599910 59040588 59884268
5713 59884268 60526248 61500204 62451205 63045555 63493862 64015133 64843267 65949416 66900540
5704 66900540 68293770 69782910 71113849 73063272 75945458 80036212 85009565 90538287
5696 90538287 95166697 97442516 97153092 94628200 90820366 86954416 83821204 81791830
5688 81791830 80881975 81028049 81777383 82639968 82561497 81966743 81289720 80511612 80018020 79806198
5678 79806198 79275603 77720053 76102923 73927125 72062843 71098556 70480350 70559725 71095509
5669 71095509 71937835 72458772 72262041 71462841 70185298 68661079 67161615 66108170 65651232
5660 65651232 65719588 66422336 67437134 67986189 67837614 66948007 65579708 64064048 62698003
5651 62698003 61549674 60255679 58977878 57730308 56450607 55296194 54469021 54091747
5643 54091747 53867098 53754708 54054742 54581970 55130450 55927512 56946939 58273512 59854079
5634 59854079 61730943 63855742 65852745 67377614 67826097 67260182 66009937 64490573
5626 64490573 63024087 62104282 61658179 61822021 62140891 62386106 62923274 62974929 62960283 63076220
5616 63076220 63669050 64514545 65532276 66961233 68699486 70820342 73157580 75820146
5608 75820146 78912927 82737009 87053950 91164041 93809369 93777077 91790770 88880406
5600 88880406 86110266 83724780 82266311 81211332 81181754 81783172 82823280 84088026 85121108
5591 85121108 86003005 87094150 88223277 89122168 90296044 91614927 93431099 95411124
5583 95411124 97460046 99706742 102587663 106006964 109995943 114285895 119035059 122660255
5575 122660255 125708692 128705780 132113601 136118173 140696547 146225509 153015354 161124830
5567 161124830 170120557 179512187 188198807 193809216 194637400 190519555 183858349 177744824
5559 177744824 173014031 169744785 167352463 165295209 163703092 162845431 162536673 162529979 162391175
5550 162391175 162534020 163664017 165201325 167214859 169101209 170211092 170426910 169829922
5542 169829922 168763052 167911685 168261613 169537629 172032989 175053591 178224679 181236349
5534 181236349 184037290 186939661 189834458 192219587 193117927 193161181 192853316 192409288 191765471
5525 191765471 190565229 188681142 186370127 184113425 181354468 177533528 172407342 166579956
5517 166579956 160886704 156013912 152300498 149613351 147256829 144870170 142172940 139236420
5509 139236420 136604286 133365625 129116832 124180213 118498815 112565887 107007899 101585024
5501 101585024 96549205 91937949 87686878 83717807 79635718 76311175 73492612 71034439
5493 71034439 69250930 67579922 66359298 64844290 63076280 61166843 59485773 57671508
5485 57671508 55941214 54774268 53738294 52443526 50889170 49543354 48115465 46469497
5477 46469497 44854973 43285554 42104681 40961615 39936730 39014616 38265999 38009091 37633722
5468 37633722 37239677 37107004 37004487 37285971 37569508 37424405 37148459 36573372 35863150
5459 35863150 35275565 34567083 33894328 33411849 33471410 33582991 33310053 33452460 33373832 33263369
5449 33263369 33318577 33366828 33462166 33823801 34193138 34642702 35220335 35869060 36572716 37086972
5439 37086972 37487660 37728536 37929580 38415677 38563240 39136237 39715388 40502174 41490717
5430 41490717 42837383 44219004 46024996 48385199 51064515 55063429 60250791 67109916
5422 67109916 75631596 85039376 93716132 97458521 93805525 85149392 75082019 65967169
5414 65967169 58856765 53647290 50215830 47852807 46303019 45069770 43805042 42530664
5406 42530664 41430274 40378236 39038881 37738999 36438121 34924822 33227366 31688575
5398 31688575 30306163 28970040 27951294 27035901 26048428 25073828 24494116 23960587 23343813
5389 23343813 22780020 22747590 22718222 22354848 22343676 22245757 22195328 21954348 22216727 22082609
5379 22082609 22135649 22669717 22975113 23167742 23542114 23847286 24338297 24672281 24636693 24740805
5369 24740805 25011305 25093519 25052011 25216911 24616085 23757904 22648967 21467120 20340285
5360 20340285 19398124 18351441 17642239 17058684 16626439 16228489 15776332 15858097 15905072 15870276
5350 15870276 15679408 15518089 15546204 15900606 16166294 16538861 16921815 17304799 17762524 18198749
5340 18198749 19003475 20071583 21556951 23508401 25970966 28887298 31581647 33060273
5332 33060273 32847401 31030673 28367439 25509625 22952807 20994175 19370259 18031865
5324 18031865 17328425 16691899 16209788 15699945 15198522 15300464 15123768 15119297 15051888 14900324
5314 14900324 15147002 15336486 15424047 15907277 16383621 16946747 17741257 18939811 20318548
5305 20318548 22069860 24302964 27258026 30195802 32336247 32486567 31037893 28551542
5297 28551542 25759974 22791360 20656958 18873185 17348319 16195886 15151698 14433031
5289 14433031 13960301 13640128 13402595 13041740 12846957 12842895 12693608 12773690 12822178 12723371
5279 12723371 12892120 12967208 13066031 13408298 13551830 13974961 14538427 15168248 15886008 16740799
5269 16740799 17242137 17290263 17085465 16567864 15626547 14591382 13661775 13228781 12739581
5260 12739581 12640314 12587385 12611134 12823430 12947648 12576924 12308942 12163376 11818265 11369708
5250 11369708 11076095 11038904 10721398 10445149 10329094 10197524 9986289 9729561 9860661 9942432
5240 9942432 10037344 10054552 10150388 10290018 10142245 10020068 10110214 10161084 10162444 10368594 10466485
5229 10466485 10700530 11133512 11476584 11843516 12143025 12366140 12429671 12336164 12245180 12114914
5219 12114914 11806285 11452391 11294191 11149519 10869352 10616547 10314421 10029320 9773880
5210 9773880 9540711 9263975 9063931 8820638 8680927 8757214 8468033 8490878 8719023 8742042
5200 8742042 8829976 8728397 8926507 9224211 9243855 9208712 9142680 9342926 9548577 9814407
5190 9814407 10208770 10292452 10571149 10266138 10151857 9911479 9646979 9402255 9158622 8842260
5180 8842260 8776082 8731447 8490628 8322836 8437516 8129765 7869078 7918652 7973912 7882124
5170 7882124 7824767 7799973 7799153 7894778 7901361 7882631 7903481 7895068 8080029 8214714 8167302 8234302
5158 8234302 8300985 8481126 8579036 8768708 8909537 9048621 8931571 8653147 8337144 8205261
5148 8205261 8168490 8184071 8123728 8098282 7926265 7888789 7916117 7949151 7737120 7849430 7984371
5137 7984371 8072482 7839778 8052504 8176570 8515259 8598362 8487330 8204837 8396530 8398024
5127 8398024 8480495 8464148 8469512 8352485 8379413 8392618 8523791 8434768 8269427 8609374 8628214
5116 8628214 8539168 8602412 8804891 8995234 8915757 8942746 9159096 9365844 9563713 9670096
5106 9670096 9807852 9852715 9846891 9797878 10048024 10233653 10272319 10393431 10452869 10691804 10954430
5095 10954430 10767878 11057081 10968714 11104118 11278802 11583079 11705694 11875274 12226632 12564164
5085 12564164 12893630 13376803 13991263 14658846 15097555 15621637 16065062 16154109 16724922 17019430
5075 17019430 17118696 17373208 17534195 17820578 17919585 18072994 18134649 18384973 18425934 18755316
5065 18755316 18968073 18593753 18545349 18480226 18824992 18919706 19226434 19402679 19502626 19759776
5055 19759776 19847297 20222339 20459380 20479475 20338063 20129159 19905030 19508960 19254334 19031020
5045 19031020 19046760 18982906 18693163 18307745 17984031 17801151 17366765 17248657 17265415 17233155
5035 17233155 17272432 17420655 17420500 17379493 17482444 17826263 17985646 18309377 19000069 19703833
5025 19703833 20193067 21117707 22267629 23171144 24075668 24329713 24518162 24750425 25090348
5016 25090348 25596289 25707132 25659243 25684626 25624545 25535955 25620380 25763301 25758933 25980305 26365065
5005 26365065 26610536 27080145 27621512 28239344 28726267 28993916 29002655 28961979 28725666 28224857
4995 28224857 27884969 27895881 27980586 27835123 27552929 27330731 26751968 26389681 25961523 25391342
4985 25391342 25032029 24793949 24424750 24051045 23725948 23195543 22639593 22201011 21938700
4976 21938700 22003303 21718352 21451101 21741706 21940443 21981068 22084212 22309114 22519478 22463081
4966 22463081 22254228 22291001 22205652 22017982 22397639 22598770 22654637 22658796 22855637 23056569
4956 23056569 23303879 23600311 23820660 24109609 24604063 25111046 25430092 25865807 26038758
4947 26038758 26557491 27259414 27980244 28949930 29734759 30225859 30933781 31266980 31730084
4938 31730084 32167910 32918203 33429397 34252868 35366819 36639329 37818419 39017732 40146249
4929 40146249 41036698 41892323 42233169 42033897 41941043 41758964 42178047 43057021 43968372 45263789
4919 45263789 46646640 48084839 49429203 50336374 50409786 50630011 50889889 51926530 53736959
4910 53736959 56263671 60197730 65786879 72959080 82523717 92178924 96598057 93219342
4902 93219342 84827801 75654919 66698174 60302077 55769206 52691149 50642468 49122759
4894 49122759 48434300 48074676 47902130 47825517 48052467 48321422 48971862 49795207 50747394 51794151
4884 51794151 52788341 53783856 54928755 56139027 57371440 58457896 59466269 60256521 60608451
4875 60608451 60860657 61407471 61866630 62702773 63698800 64861060 66569465 68451000 70176688
4866 70176688 71869350 73427500 74883904 76309897 77622946 79531755 81809408 84525316
4858 84525316 87720538 90891485 93722422 95772756 96790984 97203206 97430826 97713655 98201857
4849 98201857 99316339 100992253 102895538 105084289 107390440 109986808 112775288 115264133
4841 115264133 117548947 119884066 122207907 124694856 127492247 130471663 133824960 137416972
4833 137416972 140721043 143268478 145078666 145628664 145083126 143951658 142614084 141688742
4825 141688742 141307847 141732544 142967120 145036554 147976722 151567135 155438471 159595663
4817 159595663 163925283 168277876 172732876 177520671 182244630 186856430 191105126 194395302
4809 194395302 196730068 198353364 198503857 197738818 196086353 193546792 191169117 189113928
4801 189113928 187548963 186534377 186199654 186695289 187732531 189269583 190963092 193361921
4793 193361921 196576033 199969961 203657282 207656175 211224183 214377744 217453886 220411145
4785 220411145 223089101 225431986 226415105 226189574 224959127 222529921 220373101 218102635
4777 218102635 216084381 214409186 213263307 212665897 212120582 211593705 211018622 210407415 209683282
4768 209683282 209178567 208707886 208821625 209376106 210329503 211574921 212985875 214561580 216566245
4759 216566245 218592609 220633693 222398459 223482681 223663621 222997161 221128334 218983249
4751 218983249 217124886 214899573 213060285 210667893 207688997 203673784 198814316 193767057
4743 193767057 188618813 183265830 177883422 172645103 167751321 163080332 158677264 155204818
4735 155204818 152298464 149790381 147853716 146083737 144253607 142430676 140242078 137489027
4727 137489027 134273377 130417561 126276191 121901483 117478531 112526965 107363471 101726500
4719 101726500 96016894 90315738 84885131 80089955 75303259 71082026 67717806 64426658
4711 64426658 61356560 58519325 55798182 53455198 51260225 49305134 47750267 46407544
4703 46407544 45065640 43841736 42862295 41653875 40323591 38900029 37249793 35999805
4695 35999805 34652197 33203565 31844774 30761376 29695017 28809555 28204405 27303108 26576297
4686 26576297 25956643 25298769 24663415 24114856 23653088 22942596 22406084 21856962 21620699
4677 21620699 21357929 20730424 20269132 19920049 19513458 19065428 18781809 18538133 18195553
4668 18195553 17813209 17650877 17646694 17073822 16641824 16316777 16279860 16092483 15899004 15605948
4658 15605948 15303274 15494762 15248747 14980626 14913300 14722445 14743062 14823323 14448072 14455177
4648 14455177 14138818 14012930 13909704 13999765 13976737 13828526 13710548 13515518 13798873 13825944
4638 13825944 13952119 13787917 13832359 13814053 13901738 14181779 14362262 14678796 15189724 15625414
4628 15625414 15973219 16379838 16760836 17021857 16932451 16535736 16045240 15713475 15290654 14866410
4618 14866410 14201056 13769878 13496590 13397445 13358172 13115255 13182575 13195293 13042404 13211017
4608 13211017 13459935 13616839 13717901 14151572 14466494 14851938 15271551 15556485 16177706
4599 16177706 16609356 16780358 16911091 16823452 16338329 15786496 15365171 14975794 14529902 14050276
4589 14050276 13908018 14019102 13868348 13914697 14008256 13954913 13922591 13812013 13881881 13704936
4579 13704936 13768965 13981656 14276412 14503325 14666860 14988975 15566300 15944369 16423265 17239922
4569 17239922 18090614 18853342 19306143 19713205 20111350 20066859 19762239 19137035 18287735 17659454
4559 17659454 16951902 16386767 15879504 15530875 14972073 14718748 14814476 14894958 14833350 14909281
4549 14909281 15290492 15790905 15969745 16411225 16981880 17725966 18023261 18661169 19131554
4540 19131554 19170397 19249476 19153936 18733498 18284448 17680807 16894469 16144475 15379882 14828240
4530 14828240 14190162 13718064 13228357 12875939 12870661 12618794 12301743 12254778 12120506 12107134
4520 12107134 12176386 12322540 12209259 12448982 12395005 12245581 12235715 12412041 12686020 13133876
4510 13133876 13404742 13808660 14358385 14883605 15069689 14892531 14743788 14307029 14086211
4501 14086211 13769222 13463951 13142330 12730005 12355887 12086985 12204680 12263263 12071617 12031077
4491 12031077 12372348 12633569 12801420 12985090 13260100 13759202 14149566 14353474 14614805
4482 14614805 14968028 15155987 15469978 15416426 15359788 14929492 14524872 14181041 13813986 13312927
4472 13312927 13014221 12626804 12577281 12363035 12165698 12001399 12115274 12000557 11939744 12105293
4462 12105293 11810735 11970761 12198548 12253954 12081069 12161784 12294935 12382813 12436482 12506525
4452 12506525 12540562 12657212 12492600 12740257 12877875 13079421 12904224 12918802 13222169 13354281
4442 13354281 13392155 13220274 13224728 13341059 13427998 13642896 13855426 14006235 14206869 14364247
4432 14364247 14736695 14996749 15373518 15868680 16103643 16480611 16769395 17044854 17196371
4423 17196371 17343785 17801782 18320864 18750276 19378286 19680024 20110987 20154679 20456772 20306482
4413 20306482 20120948 20043290 19758673 19976047 20354724 20657672 20731615 20845750 20949354 21024880
4403 21024880 20855191 20527612 20447958 20403697 20482391 20646457 21077261 21488824 21679595 21717572
4393 21717572 21832692 21751463 21992334 22219931 22094100 21985661 22055236 21959981 21924377 22235093
4383 22235093 22292070 22377875 22443037 22590391 22581037 22535344 22586153 23006794 23139345 23402191 23345952
4372 23345952 23381344 23488410 23365698 23127278 23363488 23693002 23876311 24129920 24563273 24893544
4362 24893544 24982841 25107470 25122457 24844448 25115321 25193525 25152198 25259903 25319190 25748291
4352 25748291 26060038 26139656 26151061 26175824 26335607 26175838 26053341 25525652 25295697 25220116
4342 25220116 25106289 24910866 25140432 25422352 25332428 25172406 25142607 25095727 25041741 25012808
4332 25012808 24799549 24683254 24544941 24286500 24064935 24035583 24010853 23958387 23951910 24097176
4322 24097176 24243378 24277220 24031699 23852634 23648038 23655828 23769767 23661157 23676318 23721610
4312 23721610 23758689 23731749 23859159 24193352 24285587 24310704 24307651 24365080 24478844 24715148 24725799
4301 24725799 24878300 24927014 25205005 25436061 25497372 25784003 26070008 26272137 26676065 26844342
4291 26844342 27086713 27476692 27506136 27759113 28103893 28447377 28602247 28998421 29244065 29427541
4281 29427541 29816747 29969233 30250139 30626002 31049455 31356040 31793587 32024370 32354576
4272 32354576 32699055 33017136 33315956 33906333 34260827 34646294 34994140 35247598 35950013
4263 35950013 36722247 37520807 37849330 38534885 39436671 40219598 41039279 41748285 42624238
4254 42624238 43753728 44312913 44899360 46135973 47106179 48360604 49723451 50894273 51966703
4245 51966703 53243692 54454516 55713168 57156289 58639987 60294048 61911998 63519821
4237 63519821 65306311 66852002 68737984 70572922 72477341 74196300 75894151 77588050
4229 77588050 79228591 80878456 82128698 83849782 84964755 86144121 87542048 88506749
4221 88506749 89596791 90510339 91337724 91894936 92354066 92759110 92952398 93115938 93082582
4212 93082582 92839857 92666347 92416993 92125770 91839376 91427081 90848940 90373885 89861519
4203 89861519 89091319 88241564 87437500 86432139 85289928 84132841 83264850 82271876 81383269
4194 81383269 80737424 79808046 79049760 78189891 77333527 76104628 75370655 74647868 73757383
4185 73757383 72954650 72125468 71277756 70728295 70290376 69795674 69462774 69005740 68644487
4176 68644487 68477086 68094699 67611985 66925604 66472015 66087270 65670689 65074817 64734299
4167 64734299 64503488 64125771 63944444 63925583 63457931 63143255 62824828 62525701 62335155 61934978
4157 61934978 61925316 61935375 61953341 61896386 61779534 61822050 62227394 62428473 62673320 63153193
4147 63153193 63608671 64038597 64671107 65074852 65460391 66048061 66591406 67182487 67992681
4138 67992681 69078430 70173905 71258940 72519092 73964604 75396207 76731144 77972879
4130 77972879 79033493 80290356 81495210 82855240 84025261 85122472 86286734 87759288
4122 87759288 88962121 89933356 91313626 92349298 93707142 95397193 97032933 98713682
4114 98713682 100390074 102414769 104657509 106732951 108944441 110832035 112738330 114517786
4106 114517786 116236238 117999864 119339199 120603515 121951556 122974030 124435807 125825255
4098 125825255 127355206 129085673 130580289 132015202 133628330 135388578 136991741 138228723
4090 138228723 139854520 141949329 143943155 146488339 149190274 151984139 154658103 156964749
4082 156964749 159121070 161412318 163934384 166689137 169402114 172070632 174712941 177325210
4074 177325210 180324049 183270587 185969922 188835621 191609149 194184899 196976051 199924986
4066 199924986 203362600 207450727 211946532 216685184 221149926 224504502 226058634 226910468
4058 226910468 227263083 227859692 228448283 229267503 230424560 231500396 232756874 233776236 234504025
4049 234504025 234388242 233860770 233596684 233437323 233033947 232061206 230856234 229657393 227711302
4040 227711302 225778204 224202264 222618524 221583077 220665380 220038397 219280972 217638524
4032 217638524 214434990 210082478 205007099 200039278 195377129 190683486 186464831 182434069
4024 182434069 178541049 175316062 171923185 168666821 165690766 162616570 159906190 157445974
4016 157445974 155064890 152539651 149897860 147771981 145375168 142944728 140487263 138137920
4008 138137920 135426783 132799725 130813480 129036272 127472593 126187813 125617522 124520040
4000 124520040 123046502 121166895 119163192 116910388 114750667 112563742 110341245 108543469
3992 108543469 107232036 105652409 104244128 103226710 101939640 100671386 99342891 97811881
3984 97811881 96368436 95011490 93242791 91386668 89870626 88542151 87079072 85751881
3976 85751881 84592928 83364332 82313396 81420735 80454329 79258216 78193032 77300276 76535706
3967 76535706 75708106 74878986 74291555 73662577 73207324 72643407 72050582 71421461 70742350
3958 70742350 70196398 69716748 69464983 69213757 68877683 68495720 68300047 68145088 67959011
3949 67959011 67667829 67789254 67443294 67474803 67652410 67730773 68056815 68560481 68808033 69019984
3939 69019984 69231680 69291081 69411770 69180543 69117385 69180467 69634557 70291855 71038106 71851898
3929 71851898 72655661 73507336 74493261 75404836 76054880 76883683 77775658 78351395 78827901
3920 78827901 79281711 79514657 79985007 80793185 81407075 82099308 83152102 84403080 85399284
3911 85399284 86590539 87723436 88821747 89699120 90367765 90686470 90832056 90789360 90867781
3902 90867781 90976722 91256643 91321725 91264061 91259823 91317534 91556881 92043203 92622603 92898475
3892 92898475 92952485 93003524 93167700 93086202 93199576 93239047 93367698 93195616 93102703 92930419
3882 92930419 92712675 92512154 92336377 92348250 92416143 92886253 93710576 94666731 95945035 97576407
3872 97576407 98817196 99918717 100747359 101080343 101417511 101761987 102147639 102791976 103880528
3863 103880528 105103685 106770408 108782305 110881991 112904144 115221174 117644539 119879069
3855 119879069 121933336 123939937 125552542 127466733 129601471 131764647 134241553 136649943
3847 136649943 139294225 142059326 145202406 148398117 151834673 155510539 159088891 162913547
3839 162913547 166856868 171024285 175491445 180126392 185106123 190528719 196393853 202646192
3831 202646192 209558659 216414042 223724297 231281835 239246081 247148690 255311701 263224116
3823 263224116 270518982 277383360 283112556 287836255 290958477 292934269 293887857 293947918
3815 293947918 293308322 291920880 290190158 288392301 286271755 283584923 280818173 277343545
3807 277343545 272913993 267398122 260933080 252842263 243638549 233920667 223932467 213715353
3799 213715353 203866515 194700266 185942697 177951773 170283562 163370092 157050703 151214842
3791 151214842 145664936 140634129 136183134 132058025 128177276 124780233 121675715 119126183
3783 119126183 116647101 114542218 112589469 110674774 109242158 107769914 106524282 105155095
3775 105155095 103690998 101974412 100306322 98774827 97335201 95830669 94386644 93316845
3767 93316845 91934241 90394363 88808430 87137761 85645949 84174489 82889552 81955543
3759 81955543 80706466 79318848 77769026 76189456 74772415 73444149 71915159 70381685
3751 70381685 68970134 67691836 66390981 65039567 64154207 62949941 61525629 60556145
3743 60556145 59745144 58665214 57623162 56726766 55666646 54698467 53645710 52752453 51978544
3734 51978544 51458673 50853026 50363738 50255684 50124457 49962762 49951779 49941719 49743585 49763628
3724 49763628 49586091 48930883 47876355 46800472 45728044 44315140 43216565 42519580 41876079
3715 41876079 41166633 40650153 40289952 39909101 39587249 39335895 39072355 39068161 39143136 38957569
3705 38957569 38762823 38736445 38454594 38138034 37737622 37351347 36889076 36562485 36108530 35942133
3695 35942133 35891850 35588559 35506134 35512337 35493003 35328070 35082652 34852480 34655724 34147806
3685 34147806 34119114 33852876 33784187 33981476 34005361 34077125 34326688 34752181 35343029 35861443
3675 35861443 36477782 37219368 37830051 38718827 39617514 40761593 41776455 42452157 43018046
3666 43018046 43869230 44826511 45975525 47358704 49122126 51070482 52806045 54482004
3658 54482004 56046728 57568018 58432499 58896470 59150449 59388391 59264869 59273280 59420105
3649 59420105 59226892 59190112 59126438 58950625 58696050 58363379 57504514 56430094 55136696
3640 55136696 53219294 51130082 48914944 46825283 44597777 42737300 41002285 39377397
3632 39377397 37993514 36868965 35820441 35091573 34290794 33485515 33070689 32770475 32447519
3623 32447519 32255333 32150760 32152554 32261710 32396088 32525314 32395758 32270157 32235252 32300027
3613 32300027 32258622 32178998 32150716 32192014 31899202 31588446 31600987 31608493 31675293 31795486 31849865
3602 31849865 31775400 31755519 31966729 32400468 32518648 32775064 33214117 33479780 33827284 34320364
3592 34320364 34613711 34975122 35531155 36129932 36327550 36563293 36854748 37280009 37563459
3583 37563459 37848720 37869113 37992326 38331841 38487639 38776614 38838045 39200542 39720003 40370430
3573 40370430 40591883 40823995 41517002 42248044 42688047 43313617 44160881 44752854 45717430
3564 45717430 46819021 47930889 49284142 50117881 51115190 51935629 52617974 53185234 53891760
3555 53891760 54173764 54637587 55054216 55598029 55883480 56509250 57249810 57806606 58571894
3546 58571894 59549563 60571278 61469115 62381307 63564527 65069463 66512626 68083527 69701222
3537 69701222 71059957 72370690 73430884 74249841 74777648 74995048 75354414 75903917 76445867
3528 76445867 77114987 78029451 79123853 80282625 81656485 83171019 84876001 86855463
3520 86855463 88963921 91057473 92740904 94333587 96218722 98593090 100999521 103736218
3512 103736218 106904458 110300712 113885754 118179789 122721677 127838906 133265664 138891387
3504 138891387 145494433 152608275 159812530 167513421 175685590 183562051 190497152 196154004
3496 196154004 199711313 200814830 198936624 194495131 187536395 179345587 170894307 162979516
3488 162979516 156130524 150338659 145115535 140514673 136806861 134007790 132104313 130803587
3480 130803587 130713601 131534952 132664731 133081416 132070603 129399534 125686109 121644584 117426681
3471 117426681 113761557 110396567 106768976 103227163 100004149 97205387 94908344 92810765
3463 92810765 91171679 89649510 88233152 86941641 85812560 84911665 84126448 83508676 83113476
3454 83113476 82618553 82301984 82383998 83059028 84379458 86442788 89907553 94523175 100243204
3445 100243204 105560420 107953593 106068709 101569905 95791189 89513069 83630902 78580032
3437 78580032 74088334 70041648 67083285 64619940 62610107 60964959 59724751 58780088
3429 58780088 58056552 57577240 57180118 56905391 57132624 57443531 57803002 58500753 59548514
3420 59548514 60975394 62474119 64304267 66550272 69597669 73408504 77905434 82733887
3412 82733887 87520795 92513469 97475114 103368106 107937759 106524759 97333548 85539527
3404 85539527 75599663 67664039 61751950 57451784 54489592 52502685 51091362 49801372
3396 49801372 48883397 48209818 48022955 47690918 47426593 46922937 46783464 46890676 47682067
3387 47682067 48633255 50342162 52838135 56621968 62140667 69225892 77482273 83705982
3379 83705982 83102174 74954780 65391494 57175130 50376345 45524235 42156213 39830526
3371 39830526 38073600 36527330 35525198 34454003 33429852 32666795 31687256 30832587 30134333
3362 30134333 29216452 28453552 28062310 27662432 26965246 26559310 26156296 25591662 25303161
3353 25303161 25022676 24722025 24565670 24151522 23848610 23625929 23461681 23297907 22932349
3344 22932349 22676062 22503374 22455314 22043499 21900146 21700820 21471689 21486271 21639695 21501606
3334 21501606 21326954 21514129 21158685 20493151 20250119 20168307 20073635 19943040 19569229 19434089
3324 19434089 19325861 19080771 19132672 19143055 18925003 18767073 18567637 18149600 18204447 18100013
3314 18100013 17897430 17945580 17804076 17820094 17808433 17728914 17653095 17675202 17778319 17799119 17783219
3303 17783219 17562618 17246612 17144266 17004162 16982241 16724490 16825742 16812920 16603442 16429468
3293 16429468 16233417 16155059 16001837 15805433 15735584 15598721 15531605 15593798 15561493 15414157
3283 15414157 15353725 15431815 15529968 15469539 15296638 15219887 15135401 15029651 15073717 15209739 15235066
3272 15235066 15337223 15409834 15485617 15334753 15383462 15595888 15619705 15572087 15767717 15832017
3262 15832017 15925581 16088333 16254232 16456731 16566024 16567331 16767011 16805884 16722243 16907628
3252 16907628 17150032 17348799 17401121 17512885 17635244 17881366 17941132 17903042 18286716 18750780
3242 18750780 19028864 19465548 19876809 20392524 20810815 21516505 21892570 22097701 22339318
3233 22339318 22027232 21740987 21778277 21775928 21992673 22550373 22870770 23198615 23769136 24042160
3223 24042160 24253831 24095219 23741044 23511122 23401692 23475230 23656382 23720847 23857626 24112410
3213 24112410 24418161 24842563 25173968 25610184 26012757 26467208 27387160 28590909 29863055
3204 29863055 30965792 31819971 32182805 32166852 31827659 31683178 31690659 31981088 32509705 33114581
3194 33114581 34016871 35038450 35944667 36504691 36827671 37332345 37565796 37709799 38137223
3185 38137223 38449073 38964186 39325122 39864113 40323132 40707775 40974733 41117768 41642755
3176 41642755 42173720 42490325 43154180 43667084 44421267 44960079 45781116 46416152 47089285
3167 47089285 47874173 48795358 50016593 51341772 52615040 54286059 56263957 58214709
3159 58214709 60442588 62680432 64707196 66449389 67815155 68330203 68073490 67314258 65680087
3150 65680087 63399608 61313537 58981869 56952815 55772392 55007313 54751690 54596782 54550928
3141 54550928 55027439 55668817 56477331 57358009 58729338 60105621 61141191 62209766 63422072
3132 63422072 64516356 65847996 67003690 67713858 68258730 68024791 67174284 66447616 65024814
3123 65024814 63368218 61624505 59711615 57511056 55073967 52858014 50817663 49420543
3115 49420543 48217017 47425507 46938051 46518286 46083842 46099385 46134302 46524995 46728787 46526892
3105 46526892 46226778 45819232 45171363 44308510 43351526 42238052 40933698 39544001 37778850
3096 37778850 35783665 34013055 32603563 31229804 29759164 28480993 27447545 26421080
3088 26421080 25463948 24754021 23932245 23174561 22596799 21984962 21401806 20951423 20522364
3079 20522364 20329224 19812051 19410698 18910877 18410141 18156791 17592392 17070387 16677792
3070 16677792 16202411 15848415 15260835 14751413 14427357 13876560 13400474 13128687 12781135
3061 12781135 12766177 12609509 12440961 12038766 11686265 11258846 11017278 10578365 10368790 10391318
3051 10391318 10141400 9983212 9662868 9397536 9321866 9153022 9044447 9174669 9237814 9205048
3041 9205048 8949856 8705373 8709068 8640773 8504362 8524327 8349425 8158486 7899183 7815508
3031 7815508 7870415 7463696 7257320 7168525 7076632 6906895 6674419 6443211 6385384 6125808
3021 6125808 6095075 6046394 5847217 5883200 6096556 6071683 5738202 5591908 5480364 5586764
3011 5586764 5411341 5421836 5264788 5262096 5157449 5222325 5126216 4914375 4906164 4948120 4905683
3000 4905683 4951196 4931137 4658041 4472797 4341609 4208073 4359290 4208050 4048024 4107455
2990 4107455 3823941 3644429 3571176 3596550 3619899 3451285 3414006 3521943 3333668 3129744
2980 3129744 3123445 3106184 3199570 3444309 3385804 3270675 3077171 2964715 3006896 3057367 2993617
2969 2993617 2952227 2897684 3034112 2896364 3002475 2846556 2795227 2870627 2724000 2599838
2959 2599838 2669203 2697555 2568891 2514850 2531643 2655746 2781974 2830204 2545213 2433399
2949 2433399 2542356 2808310 2343755 2146509 2199304 2237309 2282146 2238143 2115351 2455221
2939 2455221 2347893 2286362 2391202 2266739 2205429 2260946 2164876 2295250 2344569 2182728
2929 2182728 2011373 1878371 2048211 2183745 2107214 2026631 2078810 2106369 1848451 1900472
2919 1900472 1980131 1961411 2026830 2027205 1974414 1827359 1923675 1817242 1859239 1868254 1721479
2908 1721479 1742890 1889575 1806563 1923613 1996484 1920309 1991490 1978816 1931954 1884203 2059713
2897 2059713 2017711 1842035 1907552 1933867 1769841 1796403 1846239 1851911 1883248 1815257 2041966
2886 2041966 1789392 1818016 1872532 1884086 1944383 1954131 1818329 1826691 1803066 1804873 1692101
2875 1692101 1854199 1937919 1848226 1810875 1525174 1786066 1723854 1511892 1556619 1575722 1626148
2864 1626148 1611518 1771527 1625781 1501509 1479458 1469172 1560600 1489251 1615556 1558932 1508466
2853 1508466 1432965 1335227 1386655 1286031 1407212 1433461 1547960 1671688 1534725 1694224
2843 1694224 1628511 1369579 1302410 1355537 1446547 1423505 1270143 1255171 1284652 1397288 1378006
2832 1378006 1521465 1410217 1128845 1062727 1107667 1342511 1284391 1191320 1189304 1451311 1524163
2821 1524163 1485116 1266252 1131386 1206686 1346421 1364772 1368104 1219562 948561 830319
2811 830319 1028259 1176198 1169003 1061361 1174545 1245778 963416 1135509 1009100 834000
2801 834000 963165 1005056 1056515 1047369 938672 814718 737907 757252 975284 953843 1008203
2790 1008203 960235 712233 897450 970977 985506 957499 918079 783932 724216 863813 1001695
2779 1001695 1075788 1156152 945511 878689 930210 853686 815996 775357 835343 878231 808930
2768 808930 953493 937033 809435 746376 595861 859227 808580 646323 671637 818667
2758 818667 851934 471261 487207 607547 608608 605443 680025 749421 741273 735097 845632 668278
2746 668278 799228 797463 702476 718152 638413 727578 807288 707978 512785 606446 774917
2735 774917 841672 765426 698032 948140 1052876 688146 421481 660413 669091 464124 639902
2724 639902 773836 741043 797168 777193 616470 626927 710566 821835 768815 711481 515726
2713 515726 453830 499652 600110 630996 556226 536968 518775 699905 639800 586807 532530
2702 532530 466505 610195 653700 627270 552624 569011 756186 473535 298757 258683 302517
2691 302517 406345 375021 365461 430068 432208 438516 501930 470922 323691 362232 570963 484024
2679 484024 437106 601830 568812 451267 467334 612656 707815 667212 493673 427902 342735
2668 342735 292943 571176 403490 331832 350029 410481 382717 404461 557235 541102 574904
2657 574904 551971 290734 451831 353412 437022 531777 404047 488427 413968 287837 515328
2646 515328 491850 455183 441215 453202 390479 554426 432544 301590 332559 315457 530187
2635 530187 562683 484446 345824 398092 412503 467423 508801 589005 639075 782802 832584
2624 832584 671630 822978 984916 945046 1003481 880862 719976 373908 378616 424325 610999
2613 610999 671759 472711 455087 572759 442564 376408 503586 519581 432224 427104 451535
2602 451535 448451 466089 393197 423546 468706 536049 605921 569296 491572 337882 407971 487701
2590 487701 429750 412547 532163 445437 354471 522388 438986 261793 264509 398872 525606
2579 525606 481119 462220 268356 226449 245151 263960 625503 659679 584260 581392 333722
2568 333722 288136 561386 535990 364938 260715 331542 481494 528258 679165 570593
2558 570593 499154 571671 706657 604385 495784 626651 455393 470619 503091 552073 364237
2547 364237 406580 480082 527733 686307 590590 407149 576642 565924 577382 495461 583737
2536 583737 629982 516429 692549 770566 927734 753017 785716 618638 479174 513289
2526 513289 440115 759245 1117334 1073628 1049080 833207 666346 586913 385594 363246 423521
2515 423521 544664 681681 723661 674291 691293 578861 524900 591612 769968 812444 891707
2504 891707 714845 736484 725023 722264 610389 437172 499446 578876 770158 557869 621027
2493 621027 809552 853423 1014941 1146113 925325 970060 930838 1046485 1124671 1028907 1072228
2482 1072228 1046958 1102204 1081125 1110276 1110461 963539 1130784 949254 1148481 1343065 1500974
2471 1500974 1544990 1177024 1191397 1216013 1234694 1385609 1470175 1579495 1775251 1689949 1681335
2460 1681335 1587008 1637477 1938561 1868117 1774411 2013824 2216879 2123901 1971478 1971102 2040796
2449 2040796 2285783 2126140 1987258 2205052 2126207 2319225 2522031 2558072 2529529 2464677
2439 2464677 2529782 2484752 2551363 2657476 2734119 2983192 2988707 2982638 3148729 3042489 2974155
2428 2974155 3036753 3154152 3164765 3227072 3250997 3356484 3477344 3502101 3622909 3757823
2418 3757823 3797094 4107661 4311370 4421152 4452802 4394846 4417137 4408724 4698113 4912010 4996165
2407 4996165 5125064 5435235 5603598 5579358 5964054 5976634 6187502 6690409 6894634 7152502
2397 7152502 7196228 7393659 7656808 8076615 8357923 8321849 8398373 8578228 8969102 9099329
2387 9099329 9155140 9321812 9734268 10094699 10435831 10582413 10804243 11250069 11673051 12019361
2377 12019361 12618456 13373255 14247446 15134170 16114068 17485402 19030236 20423119 21462227
2368 21462227 22563180 24073103 25670898 27717616 30374552 33926109 39016273 45719169
2360 45719169 54628137 67430270 85177903 108059621 130978730 136727907 117107915
2353 117107915 90864879 70776300 54238392 43027945 35744767 30436882 26369770
2346 26369770 23198574 20958336 19244318 18195514 17461400 16844730 15950369 14813494 13472440
2337 13472440 12492474 11420342 10499322 9869547 9031168 8447012 7875052 7576192 7253674
2328 7253674 7043058 6701725 6340300 6177457 5729048 5309170 5006521 5064889 4787285 4550154
2318 4550154 4328048 4054646 3863528 3697764 3595101 3393451 3393476 3195280 3005553 2938479
2308 2938479 2986375 3028683 2915448 2595711 2315042 2092015 2237193 2193026 2074156 1846126
2298 1846126 1852851 1981137 1912395 1615442 1408068 1523036 1358617 1293713 1628575 1465347
2288 1465347 1373469 1385202 1403572 1414609 1279691 1283395 1433479 1237052 1198933 1208587 1282653
2277 1282653 1345709 1326137 1348999 1179416 1100262 902638 1026541 1058425 934064 922529 918304
2266 918304 1011671 953691 718248 577636 714495 767459 712960 765087 734342 766142 771266
2255 771266 903074 874034 962102 769332 570649 479045 566795 655399 726759 598199 616575
2244 616575 669275 611280 548935 486994 517158 667653 560822 677998 789447 647760 542534
2233 542534 589967 564420 562874 599193 571851 668679 538321 630752 411213 382927 381485 250944
2221 250944 262808 412491 564309 555248 463382 555277 547123 491727 428772 349163 389077 381103
2209 381103 385859 442465 513719 264543 210684 202996 255444 263826 315382 194244 132210 25657
2197 25657 6070 126344 -6528 293892 490887 503523 231718 126734 270954 273186 209136
2186 209136 217630 -50343 5755 187779 374480 295292 269467 219403 209523 258083 70709
2175 70709 168238 102141 92320 87420 259314 95481 140924 91531 53079 247704 73292
2164 73292 -61537 261549 429882 327202 233153 206854 149195 186348 199461 10918 20735
2153 20735 179272 168063 221069 377480 360296 174600 298498 145786 175931 113015 15319
2142 15319 7609 16296 54144 125973 466400 413924 261979 248504 38053 129728 328342
2131 328342 239468 309005 280152 218104 233405 289577 180205 235951 428713 441313 333950
2120 333950 177365 108361 210161 186247 55908 66534 177833 277001 278401 183684 16037
2109 16037 151772 77311 163752 96735 -170406 -45558 28219 74419 -52315 53402 19304
2098 19304 232008 387301 408028 298357 271583 278888 207926 151286 314901 380274 626786
2087 626786 643943 814440 748580 433181 268803 222555 290112 350716 319942 329539 197260
2076 197260 31864 106899 20874 94008 437969 157348 149128 144953 324997 313193 311431
2065 311431 242644 61158 193626 251830 24141 -104925 -143033 -24737 118011 -27071
2055 -27071 203529 280104 281763 59560 68606 99857 155443 48404 36398 -21113 -28514 38861
2043 38861 104084 220303 238239 46611 13103 -99905 -152367 -33026 194488 184081 94486
2032 94486 169503 381643 393479 124520 235995 167752 -125761 -83894 -29630 123280 31592
2021 31592 -665 -41552 86683 -58503 -80376 5641 218901 171092 225259 369260 280268
2010 280268 134500 143785 -32501 -253105 -54048 763 -2714 125671 42054 179122 196278
1999 196278 -45680 42402 38142 59787 109710 38372 -65519 -105771 -41612 157121 1540
1988 1540 -187911 18103 186685 14774 -20850 -9007 -79800 33990 246624 165077 -112668
1977 -112668 -155767 -3490 -8700 57381 74772 -52281 42685 269308 203976 72490 -31692
1966 -31692 11505 118112 143057 132481 197507 73694 108727 -46329 78106 5559 -117855
1955 -117855 -224044 -26488 97817 191096 47434 -88793 8523 -60121 71299 88383
1945 88383 26008 -228195 -85073 -101022 34668 33949 -31789 -213814 -234316 110159 236520
1934 236520 202799 346031 398953 82741 -76747 51683 206236 132170 210761 106578
1924 106578 -55846 124629 199437 122154 -113648 -89065 -104790 72807 46845 114585 -108500
1913 -108500 -129626 29398 63246 141977 241366 -84601 -117081 -71646 95136 101619 -115507
1902 -115507 -166845 -99504 -101463 -110747 83934 28569 -94783 48877 463558 399944 50712
1891 50712 -38359 60521 -77464 -56343 -42630 -14256 -39292 181965 130150 9604 -108344
1880 -108344 4103 -314266 -181640 -19368 -133690 -124966 160059 -40687 120882 -67033
1870 -67033 -107336 -52438 26437 157968 152765 82604 -43254 165519 -16535 -356883 -340674
1859 -340674 -32635 -176860 -214780 -194945 -86830 7298 -6513 63972 51621 38419 -41761
1848 -41761 106859 238387 192238 207084 261696 114509 -67299 -185848 -107622 134996 -42828
1837 -42828 -217293 -78860 -1829 50693 200639 94165 141149 28361 -87207 -79664 -159201
1826 -159201 3547 -1607 59749 -28296 -130773 36723 94769 106572 118498 -50934 -113769
1815 -113769 -72351 -154261 -53286 -52181 -183297 -66724 -54643 -155713 -213564 -301224 -55341
1804 -55341 -164423 187061 114467 -23800 305 -135963 -276309 -255437 -163021 -70846 -199703
1793 -199703 -114010 -41313 136565 26663 57812 245130 315974 30109 -82326 -43267 78529
1782 78529 -106536 56957 73627 -5034 25099 158712 270459 277887 315867 168408 141191
1771 141191 94677 31580 56109 117182 163919 101443 56598 147416 89246 51642 -176928
1760 -176928 -102122 113244 27068 -114907 3792 -130999 -157814 -5609 181330 292927
1750 292927 157950 5179 -44743 -143961 -125976 -150294 182171 151814 33942 -107304 15776
1739 15776 -84562 -118637 -23130 49415 -18404 -27853 -119929 58503 230011 -75374 -124076
1728 -124076 -145510 -166561 -29400 223153 249416 120769 136405 86886 135826 6491 14915
1717 14915 -200240 -92494 -158714 -222054 -168371 -12813 1774 -65648 40731 -242389 -24173
1706 -24173 -160852 -417786 -379972 9014 -152709 -203685 -65839 -78664 -30726 -71127 -187944
1695 -187944 -235629 -294232 -202205 62424 81245 120589 90812 166468 1605 156575 140673
1684 140673 -55689 102958 103138 -101963 -149309 176244 283156 172693 219185 121215 144525
1673 144525 131575 242072 225622 226769 186661 -42935 -141938 -225882 -116613 -103427 75647
1662 75647 2186 -20773 -23150 107628 132857 31515 -117033 35925 117012 -55669 -5241
1651 -5241 -25270 -100834 -77336 -43340 170204 91940 -80277 -112289 -110768 50172 -84877
1640 -84877 -107089 -143278 -163477 12945 72332 -88694 -104691 41677 287953 131136 78904
1629 78904 255408 233301 77226 5908 193568 113098 -138995 -138971 -25338 53319 59449 118679
1617 118679 18965 50200 6109 -160624 -142946 18863 209153 131137 8249 191454 228144
1606 228144 170059 228240 71535 -122121 -66812 -217330 -76046 -56490 -77489 -271122 -129782
1595 -129782 -19527 -24117 26501 -74589 -165295 -255923 -38647 -121100 41964 66409 -57043
1584 -57043 -253145 -117607 7240 47453 -130090 -10854 -104177 -91730 7012 125381 101046
1573 101046 133680 -276952 -351241 52504 -22445 14134 -7651 16594 136022 -19551 97639
1562 97639 73169 52260 22620 115858 240583 77064 -170547 -18619 -69058 -14429 -117264
1551 -117264 -185985 61990 55347 -20464 -147030 -133588 -224335 -93157 -183790 -285684 29872
1540 29872 109185 103650 389310 193494 -110282 -186110 -251086 -8228 82790 19879 -41551
1529 -41551 -21102 5089 -38917 -101087 42866 117001 106053 148481 61093 87541 -140799
1518 -140799 -84914 -198522 -416080 -287867 -286187 -83023 -118497 -351767 -48062 -15118 14104
1507 14104 -23175 -96411 -19837 63833 114020 80004 89311 63430 -6614 11511 -126804 -144160
1495 -144160 -229976 -156732 -269596 -70120 -22547 -161114 -180654 -37207 -202720 -84108
1485 -84108 -10367 184114 71672 104 -61502 197505 -62715 -188597 -17868 -23036 58339
1474 58339 26027 87688 -73012 172863 4533 -144692 -157353 -119176 23353 94184 12856
1463 12856 -159540 -170292 -145741 -204351 -194410 -83977 50891 18725 172061 -54202 -59280
1452 -59280 -52673 -159002 -15963 132070 220189 -8153 -42020 -72906 19751 -132599 21762
1441 21762 -64218 22854 -60795 -186004 -61867 -20757 157583 -5537 116289 93427 -25396
1430 -25396 184374 359396 32287 -97649 -75154 -40917 -116124 -81684 -174796 -114122 -5933
1419 -5933 -72019 -254320 -218381 -155250 24045 -169328 -92836 -59254 36824 15058 -39976
1408 -39976 -168760 9346 254705 271995 179120 99420 61851 150938 58183 151926 180144
1397 180144 132047 22863 -234530 -282863 -33977 129678 79505 108317 149590 153863 166271
1386 166271 86383 77248 -102792 -112080 -74091 -264089 -158874 -23910 23504 -173368 -155043
1375 -155043 -297997 -62301 -51507 -17648 -134071 -342830 -251534 -129613 -34741 -163467
1365 -163467 -150059 -175135 -129450 43765 -33379 -152834 -170556 -36046 -25278 -131439 -1117
1354 -1117 -98248 -94962 141754 -33449 71780 115896 -173161 -327128 -343419 53460 208995
1343 208995 22646 981 -73516 95382 168526 204889 250789 265196 74413 -88640 -130138
1332 -130138 -51644 -30377 -115999 21995 118876 63712 -123709 -222758 -104211 -179325 -104124
1321 -104124 -104320 -40548 33667 7589 -44624 -12126 31551 77001 -18701 -115057 194130 59313
1309 59313 27783 -54584 66293 157164 138016 60380 48559 239227 185871 234496 36502
1298 36502 39895 231385 125463 41359 -1636 -111403 -87873 -137810 -95118 -114492 -2116
1287 -2116 -21716 -30633 53009 86121 73297 250003 366753 357848 225943 207682 165195 210471
1275 210471 28906 -70311 -25465 -223150 -181540 -44665 -119732 -243433 -96472 43 258773
1264 258773 301808 337892 119685 -137371 -185288 -214668 -147141 17999 196009 20764 -86128
1253 -86128 -99951 -166694 -112225 -80520 22163 -128369 -7734 204704 23520 -46914 40793
1242 40793 79311 102555 122903 128783 -14583 -48170 73221 53624 -158534 50274 134392
1231 134392 -20541 142548 228313 168346 27330 -72659 -30146 -53155 -53050 -148500 -130012
1220 -130012 -11248 -79096 -229745 -146952 -64788 -45259 35503 -91504 -204193 -143658 37773
1209 37773 -144954 -119154 -191870 -275779 -23094 67820 25150 17623 131995 104308 172514
1198 172514 64158 -217284 -190410 -157384 -89582 -70603 -82528 -97637 -99227 55700 37361
1187 37361 -58220 21550 -16408 12973 -29003 3243 -121929 -196219 18926 -23213 84012
1176 84012 57577 113162 72768 -19374 108391 -27799 -6261 30369 24538 187569 114502
1165 114502 36165 174486 59731 -265292 -15805 186288 281838 160053 203112 156630
1155 156630 35634 -172184 -152770 -141344 -4182 -40216 -123237 120559 -46908 -76786 -44731
1144 -44731 -73274 -90166 77527 -111621 -79972 18130 49666 133806 -286084 -144262 -85269
1133 -85269 -105158 47891 264111 211818 72654 -56206 -29628 14075 -109974 -10153 30697
1122 30697 151178 223926 311872 114383 38341 -42053 -64306 -1325 -4988 60373 -124835
1111 -124835 -76539 167605 153055 102895 185930 250531 -29098 -158649 -104736 252338 81977
1100 81977 28359 51285 -11453 -121479 -118552 45415 208645 -86338 -52695 392790 279015
1089 279015 26641 24625 51022 95149 -91130 -189431 -29086 113072 260354 230475 160257
1078 160257 299279 57419 -140035 -115423 -10452 -69532 -45652 -55524 -138137 -85672 -169342
1067 -169342 -152626 35114 55316 -77738 105726 95278 33936 -85602 -52159 57816 134745
1056 134745 22178 179289 275640 139682 -172251 -162233 50962 203287 204658 -157832
1046 -157832 -264889 -166957 -321617 -101473 -49279 -24215 4111 -25811 44646 61300 61199
1035 61199 42667 -157984 -47015 16639 -9927 -40235 93603 38236 -68755 11219 -246042
1024 -246042 164949 75210 93951 -43151 -332076 -180657 1528 111737 112740 70752 83466
1013 83466 141697 22970 -53184 44025 248284 189431 -33751 -265521 -271441 -180842 -180778 -94977
1001 -94977 41874 -23391 -3212 -291144 -121481 49721 -192630 -171961 -80345 -66283 41375
990 41375 40122 -192021 -58140 -95860 17118 52172 19261 20123 -61401 -150016 -238294 -155285
978 -155285 -6177 -212359 -198399 78110 -108927 41534 97156 221111 140990 139477 314469
967 314469 230437 155457 102125 31191 -142009 -146468 -96235 35090 -128496 -73964 22944
956 22944 -2347 162440 65123 41171 -148743 -128790 -109696 -402355 -191562 187577 -62457
945 -62457 -176205 -265130 -264789 10917 186933 135282 33492 212286 302159 300008 341923 242698
933 242698 2544 36312 57258 183709 -13816 -80788 32266 113126 83838 27689 78538
922 78538 8409 -125574 -120814 -226554 -136114 2457 67321 144930 -98459 -171884 -178664 -124816
910 -124816 -22095 -198035 -109593 -113821 12491 -106243 -202780 -103241 -20795 -18269 53880
899 53880 257076 306909 -3127 -268722 -159990 -270330 -24698 62447 109897 -60379 -133443
888 -133443 -9992 140658 115381 -213952 -103953 58783 26779 102678 -41008 100747
878 100747 368229 242093 76746 -20002 2707 14311 187608 131945 2800 -87609 -205459
867 -205459 -185159 120777 123260 56511 321164 314758 37769 83272 91869 50184 114358 -22533
855 -22533 -3707 -192824 -177987 -2335 41242 -130742 -23739 136822 95090 175167 47581
844 47581 -144999 -103740 -182584 -281292 -127856 -127473 -165898 70353 38681 -51616 64708 92232
832 92232 -112773 23152 -69988 -59339 82676 -61230 -267016 -107818 18672 225893
822 225893 -158530 -238076 -145409 -165965 97861 249267 169360 -32387 -83798 18197 97567
811 97567 20791 -229721 -193422 -84349 -12166 118559 3088 -2201 -139289 16563 -165869
800 -165869 -276498 -235572 -239594 -153850 -48972 -174516 41821 -20865 45928 68080 59321
789 59321 -67740 -63797 41620 -85117 -77219 163808 -32489 -145376 -120089 -47475 -120001
778 -120001 -232398 -188635 19618 -65456 22586 -122659 -128992 -95846 -135969 -5588 288042
767 288042 424770 204665 121379 54153 130521 66462 118865 -30177 -44338 143742 -50445
756 -50445 -4449 73084 224481 303423 118411 -37965 4203 231350 162330 233881 -97337
745 -97337 -264438 -45356 241486 261382 83460 -126555 -14213 -149155 -47845 52465
735 52465 81641 35950 4428 -96128 62788 -162721 -187769 -295836 -329378 -99187 236301
724 236301 198022 23041 -295863 -251704 -167596 -161402 -69952 -210449 203515 99550 121162
713 121162 -102764 -114354 70521 99878 -92242 -251054 -328896 -373120 -110353 -49283 7734
702 7734 136287 -19372 27002 -205601 -137854 -163758 -175020 101334 52776 -67593 -84416
691 -84416 -58545 -254968 -61771 133433 70606 44172 -115730 -87488 -175605 -119228 -21356
680 -21356 -139057 -6291 24271 -158605 -206485 -131151 48025 -81330 -116494 -54355 -160243
669 -160243 -147501 -8024 392 39944 166755 87605 -76725 -7110 314499 215689 27284
658 27284 71026 98362 13136 34726 -112493 -93739 -109356 -93438 62629 171109 77801
647 77801 -81004 -44545 35597 -36263 66731 262113 224284 140024 8322 94653 250843
636 250843 129912 20288 -199139 -248176 -210212 -148015 -77037 26935 -70007 -104461 129999
625 129999 158160 216100 150031 170453 8800 -145081 162710 202012 153518 16231 -52589
614 -52589 166123 222303 51022 -142253 -63050 -40299 118361 125161 -70051 50265 61404
603 61404 -77208 -276503 -53502 34034 -663 -47990 -90257 120300 81113 48494 -237374
592 -237374 184305 -5764 14183 237620 316785 299592 149977 132481 30287 36358 243719
581 243719 135775 -54774 -8334 72125 44238 45622 -2873 -129208 44034 -205788 -202722
570 -202722 -330272 -207847 -181010 -72371 -28520 -31654 50432 161260 125973 75512 333320
559 333320 116850 -111825 -149474 -122469 -131303 -38684 -55460 -174772 31852 62590 120452
548 120452 75086 -164442 -122622 99325 119803 -12112 -2623 11817 64180 43037 -37505
537 -37505 -73295 10693 -49085 -28402 -114491 35024 127840 24769 78438 191127 90576
526 90576 55125 137335 54119 14236 -176211 -239703 -234547 -254283 -247521 -126712 59133 -67111
514 -67111 -277736 -121588 21405 -15605 -31702 32314 69670 -111135 17516 -46694 -126501
503 -126501 -187129 -166536 -81852 -310341 -164381 -96719 -81146 -186265 -142900 -9778 180464
492 180464 244775 236269 269709 36401 -115759 -134445 55931 70675 246776 341072 60276
481 60276 11139 -86289 -195151 -89640 -56250 -61940 -19812 -85329 41751 -8948 -62969 -3790
469 -3790 37689 94012 -72181 44427 170413 45087 18615 -34908 -883 129823 56353
458 56353 -187849 -51755 -54868 -284666 -410105 -82312 13498 265781 208420 81698 -151872
447 -151872 -295128 -233875 63034 88285 23391 260757 17917 27996 77150 -43672 -105152
436 -105152 -34491 -52497 -1917 -181377 -434499 -214076 -15573 -47779 -81651 -121372 -243315
425 -243315 -250727 -30534 -50613 51875 45418 76742 111771 79455 48801 72321 -17051 -73739
413 -73739 -333537 -23862 141519 43060 -53803 -71348 -100470 -234404 -146599 23825 -176192
402 -176192 -216897 81668 189276 110296 16003 -22330 -97326 35823 -321332 -332657 -35525
391 -35525 51580 -72357 -111551 -102611 -201466 -39763 21409 -132899 -271216 -319966 -252939
380 -252939 -214725 -96675 -232179 -207283 34694 125306 -82900 -104331 -270905 -204989 -214100
369 -214100 -327235 -135273 -142948 -4431 -19498 -191468 -237257 -150416 -59352 -36740 48690
358 48690 -162566 -96154 -122120 -195389 -37015 -141013 -106841 -192798 -172011 -236289 -164304
347 -164304 -19590 -10909 -162560 111264 25303 127447 74148 -91169 -224111 -288514 -121343
336 -121343 -53828 -5962 19177 157404 24086 -310669 -107088 -195510 -52791 68366 -17567
325 -17567 -79876 -191544 122233 10986 76716 17403 -4397 72736 -118840 -14399 -64268
314 -64268 -182346 -159584 12445 -52666 -142693 -154721 -191562 -92887 -39373 29695 -328073
303 -328073 -190814 -104708 -370662 -298444 -138652 -134321 -173846 -281450 -336029 -582092 -562477
292 -562477 -246034 37121 -22645 6607 -60367 -9557 35432 -115449 84504 -19881 -44333
281 -44333 86781 -166913 -205416 -242865 -196423 -68840 -137202 -61958 -210763 -372463 -261649
270 -261649 -217899 -152389 -95251 -146210 -189948 -191997 43627 186282 -11361 53748 20160
259 20160 -204748 -52255 61826 6093 42478 179252 95484 21503 92609 61528 -188574
248 -188574 -316231 -193311 -62456 -26257 -15429 -22626 -1410 -60243 -168691 -208831 -295400
237 -295400 -140957 -196838 -12993 74396 -165911 -241800 -238149 -227717 -107038 -81462 -137236
226 -137236 -2114 28697 -37870 58820 -14739 -202548 -125298 130969 74109 -110582 -310332
215 -310332 -211923 -24543 -71416 81910 32710 -112091 -174255 -311349 -154671 -109955 -277976
204 -277976 -509528 -362138 -140629 -53422 -376184 -546620 -445946 -255789 -74573 -57435
194 -57435 -8616 -86520 -45974 103918 244113 41475 107438 -175022 -241867 -163709 -86769
183 -86769 -157922 -300362 -306527 -168824 -46405 -58579 -211131 -258429 -128135 -37655 -9417
172 -9417 -203216 -219105 -22846 -106564 -31561 -142170 -102288 -80868 -89662 -184986 -258605 -118021
160 -118021 -47543 8046 4974 59029 -9250 -61138 26709 192153 181275 50710 -116349
149 -116349 -111743 -68888 -130017 -74035 -60675 -105069 -222598 -200173 -102649 14143 -31267 -153262
137 -153262 -63523 -215219 -188011 -276953 -148846 -65019 -113202 -68482 -95990 -173972 -245935
126 -245935 -154461 -125324 25399 126972 90448 -138251 -233745 -68322 51729 -35950 -32563
115 -32563 -4883 -76047 -236671 -317715 -198353 -82798 -218224 -252829 -64453 -113585 -144798
104 -144798 -85539 -81186 -84161 -327019 -337917 -145051 -89657 35031 -9315 -42943 -55877 -86702
92 -86702 -141307 -121660 -51594 -100853 49624 26602 -83021 -116650 -21844 -44517 -148149 -152225
80 -152225 -80152 -82498 9710 18849 -16031 -50495 -115080 -101473 -380906 -282507 -218930 -57072
68 -57072 -31962 -114108 -160699 -196814 -32104 -134408 -181577 57279 -160933 -183597 47880
57 47880 50013 -64285 -2373 78971 -144689 -90066 -122148 -177605 -24276 -29615 -132118 -78931
45 -78931 -46310 -151097 -52581 -100684 -45370 -83503 -233685 -223327 -138455 -170629 -23618 -156247
33 -156247 -176310 -108251 -41490 -80139 -110258 -260217 -291748 -152993 -79397 -25959 -89004 -101198
21 -101198 -99917 -53906 -194476 -216867 -115923 -145227 -102969 -125319 -185137 -127164 -102225 -31912
9 -31912 -30309 3301 -176709 -53357 -189625 -211500 -96195 -2817 138188
0 138188
$$ Imaginary data points
##PAGE= N=2
##DATA TABLE= (X++(I..I)), XYDATA
16383 -3942445 -3765998 -3777714 -3659391 -3604328 -3575301 -3620464 -3587480 -3385019 -3235753 -2999035
16373 -2999035 -3090050 -3097320 -2991500 -2925603 -2809384 -2836780 -2740368 -2714711 -2778656 -2592232 -2496022
16362 -2496022 -2439754 -2299248 -2316775 -2271825 -2264466 -2301040 -2163623 -1997420 -2031507 -1847615 -1753712
16351 -1753712 -1712286 -1673790 -1749208 -1540529 -1424854 -1278991 -1301544 -1152740 -1194044 -1158504
16341 -1158504 -1168646 -1132984 -936914 -821488 -838628 -852901 -598321 -485584 -499483 -472943
16331 -472943 -483013 -521581 -436105 -438966 -178998 -185479 -76256 -6757 46004 142971 -2825
16320 -2825 152495 182816 276242 280797 236248 425859 361919 396813 572420 809133 895886
16309 895886 1008032 859903 777601 952658 1155693 1260865 1279246 1301410 1217166 1342381
16299 1342381 1366120 1486147 1353606 1498653 1489603 1343080 1523263 1522078 1745155 1757490
16289 1757490 1761701 1796503 1916531 1989871 2148085 2092570 2222656 2077680 2072455 2334218 2426769
16278 2426769 2474509 2341554 2394269 2503858 2463817 2389344 2625531 2895068 2802366 2865719
16268 2865719 2870506 2690951 2766292 2923429 2918917 2996896 3309792 3055202 3089878 3226278 3189728
16257 3189728 3236104 3234703 3173793 3320710 3428129 3459808 3499572 3563480 3678010 3719640 3823727
16246 3823727 3884664 3813185 3888739 3799403 3771398 3854327 3816089 3910412 4065913 4094868 4119719
16235 4119719 3964824 3986872 4119104 4175483 4218203 4497093 4367208 4180020 4283137 4323234
16225 4323234 4306043 4314859 4241460 4385162 4407974 4518814 4456090 4668050 4706546 4795621 4783301
16214 4783301 4569019 4625680 4892131 5015495 4940033 4964988 5000795 5107743 5170742 5110636
16204 5110636 5130413 5065991 5060051 5166100 5171321 5166688 5119131 5141900 4987115 5109930 5195222
16193 5195222 5448248 5316736 5310332 5302561 5285889 5368258 5320967 5360394 5341566 5329430 5476527
16182 5476527 5493371 5638011 5525818 5407253 5591815 5597566 5769665 5780508 5766335 5778065
16172 5778065 5749076 5655041 5694666 5727527 5840467 5864853 5744542 5710217 5681670 5769132 5738786
16161 5738786 5882360 5856339 5838697 5959919 5933322 5828147 5713709 5502340 5646693 5685978
16151 5685978 5938576 5922360 6033798 6063193 6050016 5954604 5804847 5847037 6129233 5912647
16141 5912647 5984762 6141867 6346595 6277248 6218777 6149942 6044534 5975212 6045900 6161764
16131 6161764 5968475 6023068 6148699 6110556 6179529 6247038 6110733 6166842 6040098 6289536
16121 6289536 6284996 5981794 6075140 6244870 6224833 6205746 6208719 6067903 5914868 6237300 6245637
16110 6245637 6212553 6235173 6388961 6313386 6407804 6392322 6577737 6588949 6537127 6422532 6220271
16099 6220271 6313655 6441935 6483435 6406568 6242666 6457833 6650163 6484973 6436038 6338430
16089 6338430 6259013 6499874 6551859 6478278 6386635 6417179 6455615 6303971 6487728 6551236 6381876
16078 6381876 6383749 6448708 6435464 6237636 6240337 6424963 6361022 6348633 6329943 6347037 6396464
16067 6396464 6531465 6585312 6658052 6572686 6494699 6495704 6490886 6564747 6500762 6444936 6629811
16056 6629811 6507852 6422623 6329659 6282533 6392728 6499349 6387947 6641661 6660367 6644422
16046 6644422 6696657 6606077 6559599 6560181 6496022 6332362 6409492 6315509 6501004 6491980 6599590
16035 6599590 6327748 6341506 6330259 6344110 6439756 6422072 6594254 6733776 6727176 6580474 6356932
16024 6356932 6453735 6658855 6568031 6681337 6690841 6585894 6623180 6680656 6580618 6465595
16014 6465595 6540069 6447583 6534891 6637403 6642096 6514250 6511241 6579480 6572095 6523414 6519597 6519020
16002 6519020 6346287 6444004 6597661 6452733 6544366 6736585 6666575 6566391 6332208 6443049
15992 6443049 6810478 6797985 6685508 6560913 6605407 6639964 6552212 6521206 6469390 6541512 6724637
15981 6724637 6754061 6638666 6713401 6645082 6493225 6518992 6436133 6528228 6646668 6704813 6763992
15970 6763992 6840662 6813726 6706095 6714422 6715937 6862061 6833582 6757728 6628205 6625251 6552472
15959 6552472 6575906 6761168 6606323 6586286 6739512 6936060 6705320 6593977 6633547 6516482
15949 6516482 6560446 6379143 6423624 6369077 6481996 6627262 6820923 6593077 6456746 6773116
15939 6773116 6984730 6635826 6567272 6635796 6725915 6791474 6741889 6725816 6867379 6755434
15929 6755434 6602330 6535900 6528909 6747763 6816369 6744410 6747411 6687460 6590142 6447597 6482526
15918 6482526 6656433 6636022 6632716 6569802 6572414 6478921 6399704 6436009 6465019 6412313 6358881
15907 6358881 6463023 6617560 6630677 6764951 6833509 6819095 6780144 6799762 6825150 6637000
15897 6637000 6562340 6568502 6624099 6559367 6834367 6832809 6649411 6699846 6704354 6530009 6625138
15886 6625138 6639209 6550620 6672951 6716163 6640439 6680098 6743898 6817248 6854801 6543830 6359276
15875 6359276 6735185 6966375 6615425 6458833 6645554 6784108 6428583 6513377 6520179 6857984
15865 6857984 6902446 6700878 6740223 6793475 6877707 6739460 6542979 6484915 6468452 6583399
15855 6583399 6737496 6727253 6501776 6570321 6623015 6718991 6629760 6610085 6527904 6569212 6855334
15844 6855334 6944763 6683669 6685218 6671423 6735254 6843981 6940077 6856003 6633895 6540449 6633432
15833 6633432 6563647 6473181 6562294 6644990 6743605 6718373 6831029 6790862 7043520 7006762 6742827
15822 6742827 6698804 6822355 6708009 6526738 6349900 6396778 6708775 6767437 6902236 6693006
15812 6693006 6639233 6836204 6447378 6298624 6484141 6520436 6787723 6810708 6765265 6988443
15802 6988443 6870642 6702426 6902747 6931136 6626846 6720896 6647212 6744634 6821399 6866199
15792 6866199 6873243 6957743 6916605 6767494 6620205 6702620 7002060 7040721 7044264 6763303 6781944
15781 6781944 6796052 6458376 6558623 6711972 6566672 6637944 6710768 6585498 6664560 6808208
15771 6808208 6891467 6877657 6964309 7030076 6744503 6695729 6848833 6741122 6487724 6504467
15761 6504467 6675310 7153711 7035202 6772755 6806166 6707778 6844691 6868737 6771448 6780690
15751 6780690 6889056 6880366 6933725 7054066 6985917 6831497 6758634 6790868 6767195 6978529 6760577
15740 6760577 6711001 6969474 6911404 6879816 6834338 6774517 6857944 6996391 6880303 7055093
15730 7055093 6949047 6808021 6705176 6705421 6750447 6859573 6953045 6943302 7006535 7015186 6860867
15719 6860867 6795189 6878264 6761282 6568970 6775210 6774084 6887638 6838875 6910941 6745120
15709 6745120 6760899 6872355 6869441 6925782 7121232 6943877 6885988 6922720 7058301 7036394 6923750
15698 6923750 6862189 6801126 6709260 6814948 6863299 6820101 6790829 6788594 6903292 6767735 6698259
15687 6698259 6392983 6604791 6784328 6731782 6562010 6523889 6623328 6696362 6594513 6731376
15677 6731376 6588719 6650289 6748264 7036922 7118889 7108706 6948161 6765918 6747487 6592136
15667 6592136 6513813 6863226 6911301 6853830 6616480 6677493 6832344 6714202 6719197 6797462 6666827
15656 6666827 6664146 6757250 6704125 6575835 6698621 6596870 6340302 6646074 6800683 6732366
15646 6732366 6710765 6657500 6806856 6795379 6827541 7081105 6794773 6725080 6616460 6775709
15636 6775709 6954386 6790873 6888867 6934521 7072049 7099529 6896849 6770049 6728299 6934492
15626 6934492 6975045 6893530 6726896 6801969 6656239 6659415 6900311 6833408 6693309 6756625 6919356
15615 6919356 6743563 6764947 6767253 6791447 6850159 6859277 6886223 6894311 6973993 6948445 6853445 6807855
15603 6807855 6929844 6943342 6885295 6786673 6760800 6817271 6974042 6885019 6871385 6941305 6690865
15592 6690865 6801241 6917197 7017550 6868972 6821712 6828457 6807330 6778736 6761136 6964799
15582 6964799 7043992 7092884 7086027 6821292 6595430 6801660 6876578 6967181 6888120 6879889 6935606
15571 6935606 7199600 7169190 7005208 7113456 7097053 7218864 7094869 6775429 6703873 6880694
15561 6880694 6839976 6781598 6862020 6972116 6915331 6789668 6642927 6675991 6736545 6716330 6859030
15550 6859030 7017559 7033805 7153347 7072417 6850350 6852625 6883394 6897626 6915434 7023641 6924976
15539 6924976 6953870 7036383 7013681 6887439 6965347 7129913 7032381 6915271 6980049 6911627 6831018
15528 6831018 6947710 6804101 6771169 6720516 6864599 7126233 6910583 6980905 7067656 7067897 7102273
15517 7102273 7168941 6935297 6956197 7031562 7007111 6872585 7010564 6952180 6764087 6946956
15507 6946956 6968122 6780022 6754950 6716736 6666921 6661192 6810539 6957030 6904861 7026733 7048712
15496 7048712 6999440 6827878 6866043 6996123 6953122 6990389 6920034 6957566 6914532 6912926 7064909
15485 7064909 7009647 7007576 6992573 7167059 6983553 6774883 6820206 6950872 6910938 6941144 6955472
15474 6955472 7109821 7249142 7357631 7267105 7029267 7039564 6834601 6820095 6886301 6820690
15464 6820690 6913343 6906486 6963829 7126259 7193882 7134643 7137639 7066298 6787846 7065676 7179670
15453 7179670 7273883 7228118 7067179 6970065 6975782 7007329 7011732 6926106 6775965 6997310 6874201
15442 6874201 7116925 7297595 7331427 7212552 7019688 7172300 7332627 7091748 7080465 7040388
15432 7040388 7062792 6994637 6934400 6880848 6996480 7075896 7027457 6997009 6877135 6946167 7073256
15421 7073256 7109384 7232113 7175280 7105572 7055106 7117019 6865336 6936382 6912299 6889321 7135259
15410 7135259 7184539 7104184 6997705 7102578 7314395 7343175 6995075 6963148 6883274 6898773
15400 6898773 6920623 7036536 7213324 7317667 7120067 6880566 6956485 6893286 6758558 6998735
15390 6998735 6965724 6885608 6799232 7030603 6862099 6972741 7161016 7130211 7012121 7105856
15380 7105856 7231611 7211552 7145605 7021896 7025267 7121746 7205599 7175875 7083451 7208256 7089134
15369 7089134 7140052 7015690 7084822 7212741 7221335 7307271 7283113 7125153 7058889 7033003 6913771
15358 6913771 7000344 7052831 7121064 6910629 7143463 7082621 6918137 6982161 7034305 7235413
15348 7235413 7359665 7150156 7018771 7162894 7189011 7109407 7155386 6788873 6773482 6817202
15338 6817202 6950235 7098426 6996143 6987845 7028398 6998550 7111312 7114972 7112132 6926460 6893235
15327 6893235 7243254 7312709 7103580 7115780 7114168 7282336 7207262 6950569 7071036 6898687
15317 6898687 7026953 7098531 7096988 7005669 6873695 6845827 6889918 7033273 7171647 7118247 7092821
15306 7092821 7026488 7062062 7062540 7044683 7127663 7130805 7117603 6979403 7058503 7269283 7212629
15295 7212629 7116149 7130424 7090635 6978914 6765261 6800720 6994333 6891388 6917638 6982535
15285 6982535 7064095 7022146 6944626 6940009 7007636 7047081 7031120 7102314 7282544 6971192 7002394
15274 7002394 7021708 7135666 7164152 7189266 7250833 6935041 6954896 6995661 6853519 6784200 6981577
15263 6981577 6995081 6963363 7039345 7051782 6953133 7305479 7289846 7143436 7078846 7163913 7071982
15252 7071982 7208258 7227172 7166942 7021910 6785119 6814525 6930314 7076188 7165424 7122558
15242 7122558 7306561 7171017 7122085 7176004 6999523 6953851 7085283 7117836 7128281 7119046 6905739
15231 6905739 7083240 7098392 7256118 7419107 7318925 7254971 7357012 7185459 7043184 7181547
15221 7181547 7097791 7197668 7290493 7200382 7321596 7340711 7129900 7278757 7215753 7270304 7321195
15210 7321195 7295656 7352114 7266741 7270201 7264888 7366545 7193273 7210848 7268169 7363957 7252939
15199 7252939 7093462 7076725 7338016 7434361 7111636 7083865 7314297 7251588 7334487 7412096
15189 7412096 7075798 7060994 7223485 7162625 7052778 6894655 6906680 6938295 6950986 7237698
15179 7237698 7420146 7280112 7374667 7337612 7301995 7299208 7371141 7082195 6934505 7085178
15169 7085178 7289424 7275338 7406270 7378196 7260368 7329823 7115678 7324895 7398191 7573347
15159 7573347 7370892 7115364 7169975 7276761 7219177 7299471 7294810 7119896 6985007 6976227 7167128
15148 7167128 7201096 6975947 7096107 7234845 7125530 6998731 7071556 7346721 7298035 7289186
15138 7289186 7232727 7088413 7262206 7194115 7268386 7149788 7027075 6920959 7173036 7251558
15128 7251558 7148751 7254406 7071924 7164400 7116821 7063559 7111783 7172266 7233696 7271000 7166534
15117 7166534 7230104 7183854 7218974 7182996 7033071 7016423 7019839 7013835 7182739 7290693 7347474
15106 7347474 7120369 7144381 7148684 7225532 7182293 7189223 7251001 7335571 7284608 7250418 7269905
15095 7269905 7303432 7441270 7333555 7247118 7225821 7326271 7217699 7229382 7217006 7329698
15085 7329698 7308330 7169512 7289089 7306545 7265516 7323518 7345943 7447927 7305028 7263316
15075 7263316 7455867 7443853 7293693 7285815 7124756 7088418 7373664 7417791 7426648 7290511 7393076
15064 7393076 7348042 7275706 7409333 7205467 7314947 7635968 7521509 7382283 7585086 7324399
15054 7324399 7189163 7084378 7124069 7337477 7255128 7291141 7316433 7491755 7690799 7466595
15044 7466595 7342273 7332314 7277115 7281349 7412446 7280177 7134139 7067642 7166584 7084640 7214436
15033 7214436 7389343 7298201 7106744 7144147 7300051 7354607 7240778 7251514 7083874 7053964
15023 7053964 7165605 7202726 7359252 7526794 7474467 7232704 7352327 7432837 7373539 7172001
15013 7172001 7031636 7090018 7319550 7249864 7272160 7321087 6994688 6980591 7185268 7268786
$$ [...]
##END NTUPLES=NMR SPECTRUM
##END=
