##TITLE=1H_EC-3307(2)
 CDCl3
 8 sc, 
 26.12.2023
##JCAMPDX= 6.0         $$ Bruker NMR JCAMP-DX V2.0
##DATA TYPE= NMR SPECTRUM
##DATA CLASS= NTUPLES
##ORIGIN= UXNMR, Bruker Analytische Messtechnik GmbH
##OWNER= root
$$ XWIN-NMR		Version 3.5
$$ Tue Dec 26 14:03:50 2023 Russian Standard Time (UT+4h)  she@DPX200
##.OBSERVE FREQUENCY= 200.1313
##.OBSERVE NUCLEUS= ^1H
##.ACQUISITION MODE= SIMULTANEOUS
##.ACQUISITION SCHEME= undefined
##.AVERAGES= 8
##.DIGITISER RES= 18
##SPECTROMETER/DATA SYSTEM= spect
##.PULSE SEQUENCE= zg30
##.SOLVENT NAME= CDCl3
##.SHIFT REFERENCE= (INTERNAL, CDCl3, 0, 15.4659)
##AUDIT TRAIL= $$ (NUMBER, WHEN, WHO, WHERE, WHAT)
$$ ##TITLE= Audit trail, XWIN-NMR		Version 3.5
$$ ##JCAMPDX= 5.01
$$ ##ORIGIN= Bruker BioSpin GmbH
$$ ##OWNER= she
$$ F:/spectra/data/she/nmr/H-F/1/pdata/1/auditp.txt
$$ ##AUDIT TRAIL=  $$ (NUMBER, WHEN, WHO, WHERE, WHAT)
(   1,<2023-12-26 14:02:40.87 +0400>,<she>,<DPX200>,
      <created by zg, POWCHK disabled, PULCHK disabled
       configuration hash MD5:
       00 E9 B6 7A A2 85 ED C7 34 08 36 98 17 FE 4E 26
       data hash MD5: 16K
       DA E5 A3 81 B9 96 70 A3 D9 EB 3B 66 FC E4 1D 7E>)
(   2,<2023-12-26 14:02:43.09 +0400>,<she>,<DPX200>,
      <Start of raw data processing
       efp BC_mod = 2 LB = 0.24 FT_mod = 6 PKNL = 1 PHC0 = -24594.88 PHC1 = 11.45273 SI = 16K 
       data hash MD5: 16K
       3A D4 E4 D5 F0 9B E0 2B 34 17 54 4D 6D 6E 54 E9>)
(   3,<2023-12-26 14:03:03.04 +0400>,<she>,<DPX200>,
      <pk PHC0 = -2.410543 PHC1 = 3.2 
       data hash MD5: 16K
       6F 86 8E C6 CE 0E 19 DA 74 35 4A A1 AC 2A 7C 4C>)
(   4,<2023-12-26 14:03:06.35 +0400>,<she>,<DPX200>,
      <abs ABSG = 5 
       data hash MD5: 16K
       F6 BB 3D 2A D0 6C 8C 64 1C 76 5C 56 2F 3C AB 2B>)
$$ ##END=
$$ 
$$ hash MD5
$$ 70 3F 1D 7C EE 2E D0 25 76 58 FF 5C 4E 64 50 BB
##$RELAX= 
##$RELAX= 
##$RELAX= 
##$RELAX= 
##$RELAX= 
##$RELAX= 
$$ Bruker specific parameters
$$ --------------------------
##$DU= <F:/spectra>
##$EXPNO= 1
##$NAME= <H-F>
##$PROCNO= 1
##$TYPE= <nmr>
##$USER= <she>
##$AMP= (0..31)
100 100 100 100 100 100 100 100 100 100 100 100 100 100 100 100 100 100 
100 100 100 100 100 100 100 100 100 100 100 100 100 100 
##$AQSEQ= 0
##$AQ_mod= 1
##$AUNM= <au_zg>
##$AUTOPOS= <>
##$BF1= 200.13
##$BF2= 200.13
##$BF3= 200.13
##$BF4= 200.13
##$BF5= 200.13
##$BF6= 200.13
##$BF7= 200.13
##$BF8= 200.13
##$BYTORDA= 1
##$CFDGTYP= 0
##$CFRGTYP= 5
##$CHEMSTR= <none>
##$CNST= (0..31)
1 1 145 1 1 1 1 1 1 1 1 1 1 1 1 1 1 1 1 1 1 1 1 1 1 1 1 1 1 1 1 1 
##$CPDPRG= <>
##$CPDPRG1= <>
##$CPDPRG2= <>
##$CPDPRG3= <>
##$CPDPRG4= <mlev>
##$CPDPRG5= <mlev>
##$CPDPRG6= <mlev>
##$CPDPRG7= <mlev>
##$CPDPRG8= <mlev>
##$CPDPRGB= <>
##$CPDPRGT= <>
##$D= (0..31)
0 1.2 0 0 0 0 0 0 0 0.06 0 0.03 0 0 0 0 0.0002 0 0 0 0 0 0 0 0 0 0 0 0 
0 0 0 
##$DATE= 1703584960
##$DBL= (0..7)
120 120 120 120 120 120 120 120 
##$DBP= (0..7)
150 150 150 150 150 150 150 150 
##$DBP07= 0
##$DBPNAM0= <>
##$DBPNAM1= <>
##$DBPNAM2= <>
##$DBPNAM3= <>
##$DBPNAM4= <>
$$ [...]
##$SUBNAM3= <"">
##$SUBNAM4= <"">
##$SUBNAM5= <"">
##$SUBNAM6= <"">
##$SUBNAM7= <"">
##$SUBNAM8= <"">
##$SUBNAM9= <"">
##$SW= 18.0517328524113
##$SWIBOX= (0..15)
0 0 2 0 0 0 0 0 0 0 0 0 0 0 0 0 
##$SW_h= 3612.71676300578
##$TD= 16384
##$TD0= 1
##$TE= 0
##$TE2= 300
##$TE3= 300
##$TEG= 300
##$TL= (0..7)
0 120 120 120 120 120 120 120 
##$TP= (0..7)
150 150 150 150 150 150 150 150 
##$TP07= 0
##$TPNAME0= <>
##$TPNAME1= <>
##$TPNAME2= <>
##$TPNAME3= <>
##$TPNAME4= <>
##$TPNAME5= <>
##$TPNAME6= <>
##$TPNAME7= <>
##$TPOAL= (0..7)
0.5 0.5 0.5 0.5 0.5 0.5 0.5 0.5 
##$TPOFFS= (0..7)
0 0 0 0 0 0 0 0 
##$TUNHIN= 0
##$TUNHOUT= 0
##$TUNXOUT= 0
##$USERA1= <user>
##$USERA2= <user>
##$USERA3= <user>
##$USERA4= <user>
##$USERA5= <user>
##$V9= 5
##$VALIST= <valist>
##$VCLIST= <CCCCCCCCCCCCCCC>
##$VD= 0
##$VDLIST= <DDDDDDDDDDDDDDD>
##$VPLIST= <PPPPPPPPPPPPPPP>
##$VTLIST= <TTTTTTTTTTTTTTT>
##$WBST= 1024
##$WBSW= 4
##$XGAIN= (0..3)
0 0 0 0 
##$XL= 0
##$YL= 0
##$YMAX_a= 485172
##$YMIN_a= -624942
##$ZGOPTNS= <>
##$ZL1= 120
##$ZL2= 120
##$ZL3= 120
##$ZL4= 120
##$ABSF1= 15.48797
##$ABSF2= -2.563879
##$ABSG= 5
##$ABSL= 3
##$ALPHA= 0
##$AQORDER= 0
##$ASSFAC= 0
##$ASSFACI= 0
##$ASSFACX= 0
##$ASSWID= 0
##$AUNMP= <proc_1d>
##$AZFE= 0.1
##$AZFW= 0.1
##$BCFW= 0
##$BC_mod= 2
##$BYTORDP= 0
##$COROFFS= 0
##$CY= -3
##$DATMOD= 1
##$DC= 0
##$DFILT= <>
##$DTYPP= 0
##$F1P= 0
##$F2P= 0
##$FCOR= 1
##$FTSIZE= 16384
##$FT_mod= 6
##$GAMMA= 0
##$GB= 0
##$INTBC= 1
##$INTSCL= 3.70164e-10
##$ISEN= 128
##$LB= 0.24
##$LEV0= 0
##$LPBIN= 0
##$MAXI= 10000
##$MC2= 0
##$MEAN= 0
##$ME_mod= 0
##$MI= 1.114404
##$NCOEF= 0
##$NC_proc= -7
##$NLEV= 6
##$NOISF1= 3.799351
##$NOISF2= 2.8
##$NSP= 0
##$NTH_PI= 0
##$NZP= 0
##$OFFSET= 15.46593
##$PC= 1
##$PHC0= -24597.29
##$PHC1= 14.65273
##$PH_mod= 1
##$PKNL= yes
##$PPARMOD= 0
##$PSCAL= 0
##$PSIGN= 0
##$REVERSE= no
##$SF= 200.130011162373
##$SI= 16384
##$SIGF1= 3
##$SIGF2= 2
##$SINO= 5.538805
##$SIOLD= 16384
##$SREGLST= <1H.CDCl3>
##$SSB= 0
##$STSI= 16384
##$STSR= 0
##$SW_p= 3612.71676300578
##$SYMM= 0
##$S_DEV= 0
##$TDeff= 16384
##$TDoff= 0
##$TI= <>
##$TILT= no
##$TM1= 0
##$TM2= 0
##$TOPLEV= 0
##$USERP1= <user>
##$USERP2= <user>
##$USERP3= <user>
##$USERP4= <user>
##$USERP5= <user>
##$WDW= 1
##$XDIM= 16384
##$YMAX_p= 498133241
##$YMIN_p= -594498
$$ End of Bruker specific parameters
$$ ---------------------------------
##NTUPLES= NMR SPECTRUM
##VAR_NAME=  FREQUENCY,     SPECTRUM/REAL,   SPECTRUM/IMAG
##SYMBOL=    X,             R,               I
##VAR_TYPE=  INDEPENDENT,   DEPENDENT,       DEPENDENT
##VAR_FORM=  AFFN,          ASDF,            ASDF
##VAR_DIM=   16384,         16384,           16384
##UNITS=     HZ,            ARBITRARY UNITS, ARBITRARY UNITS
##FACTOR=    0.220516191357247, 1,           1
##FIRST=     3095.19674054381, 0,            0
##LAST=      -517.520022461968, 0,           0
##MIN=       -517.520022461968, -594498,     0
##MAX=       3095.19674054381, 498133241,    0
$$ Real data points
##PAGE= N=1
##DATA TABLE= (X++(R..R)), XYDATA
$$ [...]
6505I12543J36888P3419p2052l33J83325k6492j22652j61952O9536M3698L9171
6494A075099j3437P5330M0563J31012q932j77431J00180l95j61401K7990m9586
6483A038992j26622J0967J26755J57207q6296J18546l8938j91398k30243J52860
6473I31830J49356R1283J44296k00153j01649N949k9603J42801K0607j08667O3373
6462A109423j36605J38945j05330j57222q0255l2813K6567J23385J56978J43882
6452A186955J33662l9529q6895q3342K2972J70659L8440J53459o6544J6466j4188
6441A432115K2164K86168N3897J1231M5017k52245k15048Q351J06674P9273k279
6430A575318j39832J49005j19934K60379m6881k42588J23339k31393j02229L5916
$$ y = [912543, 1049431, 1122850, 1050798, 1050465, 1233790, 1207298, 1084646, 922694, 992230, 1035928, 1075099, 1061662, 1136992, 1177555, 1308567, 1299635, 1122204, 1222384, 1221989, 1060588, 1088578, 1038992, 912370, 923337, 1050092, 1207299, 1121003, 1239549, 1200611, 1009213, 778970, 931830, 1081186, 1172469, 1316765, 1116612, 1014963, 1020912, 991309, 1134110, 1154717, 1046050, 1109423, 972818, 1111763, 1006433, 849211, 768956, 736143, 762710, 886095, 1043073, 1186955, 1320617, 1281088, 1194193, 1110851, 1133823, 1304482, 1342922, 1496381, 1429837, 1446303, 1432115, 1454279, 1740447, 1794344, 1805575, 1850592, 1598347, 1383299, 1391650, 1498324, 1577597, 1575318, 1435486, 1584491, 1464557, 1724936, 1678055, 1435467, 1558806, 1327413, 1225184, 1261100]
6420A261100o7694N8865J83200m3216p1078m2005J13968J29350j71253J06930
6410A458167m704j33821K7471J14230P9351j03154O5863K5321J11604Q6533r5742
6399A631119q8607J90967R0591j16287o2983j76087L0882J45143N0369p1068k38993
6388A385046L15821j65317J66531n3196l8914J03367m592n2976j35566j59717
6378A360487K31492L9755r6016n7384R046K24245P7981K2619l36823K94010j31818
6367A637594Q9869r9077j69931L51335p3436O4886J23718j17831J0550o677k91729
6356A519271l376O2856L07461m3484j7164q817J8981K39905j05412J21529r7925
6345A993825k6328L0446O2944K5835l0145l5383k94836j27471K64886J84230m3499
$$ y = [1261100, 1193406, 1252271, 1435471, 1392255, 1321177, 1279172, 1393140, 1522490, 1351237, 1458167, 1453463, 1319642, 1347113, 1461343, 1540694, 1437540, 1503403, 1528724, 1640328, 1726861, 1631119, 1542512, 1733479, 1824070, 1707783, 1644800, 1468713, 1499595, 1644738, 1695107, 1624039, 1385046, 1700867, 1535550, 1702081, 1648885, 1609971, 1713338, 1708746, 1655770, 1520204, 1360487, 1591979, 1631734, 1535718, 1478334, 1487380, 1711625, 1789606, 1812225, 1475402, 1769412, 1637594, 1727463, 1628386, 1458455, 1809790, 1736354, 1801240, 1924958, 1807127, 1817677, 1811000, 1519271, 1515895, 1578751, 1886212, 1842728, 1825564, 1816747, 1835728, 2075633, 1970221, 2091750, 1993825, 1967497, 1997943, 2060887, 2086722, 2056577, 2021194, 1726358, 1598887, 1863773, 2048003, 2004504]
6334B004504l3033m3257O0331J24814R5544P9092j17898r2354K5498Q4717r608
6323B178350N172N3101j05065J71771J61831j76594Q9862L90093j32312Q5621
6313B721830k61375q1665J63498J24222L6124m2967l3019k63420K29348j39651
6303B452925j18128J12522K06195K15736j68721m7791J7980M8691L5661M8027
6293B803097J56954J75842j12669K58339Q8703l3740k9934k26523Q077r4240K7767
6282C021673k0851J09491K30529O4684k0673j1296M5299J24246k9017J28516r4209
6271C548392K7334r66J01134J82877J64436Q7288N8677L84953O8549r1122J54258
6260D685810k3032O2480L9265P2463o9709J22012M08487R3475J15370L31124q8699
$$ y = [2004504, 1971471, 1928214, 1988545, 2113359, 2208903, 2287995, 2170097, 2077743, 2103241, 2187958, 2178350, 2183522, 2236623, 2131558, 2303329, 2465160, 2288566, 2378428, 2768521, 2636209, 2721830, 2460455, 2378790, 2542288, 2666510, 2702634, 2659667, 2626648, 2363228, 2592576, 2452925, 2334797, 2447319, 2653514, 2869250, 2700529, 2652738, 2670718, 2719409, 2755070, 2803097, 2960051, 3135893, 3023224, 3281563, 3370266, 3336526, 3306592, 3080069, 3088146, 2993906, 3021673, 3000822, 3110313, 3340842, 3405526, 3384853, 3373557, 3418856, 3543102, 3514085, 3642601, 3548392, 3575726, 3574760, 3675894, 3858771, 4023207, 4110495, 4169172, 4554125, 4622674, 4531552, 4685810, 4662778, 4725258, 4764523, 4836986, 4767277, 4889289, 5297776, 5391251, 5506621, 5837745, 5749046]
6249E749046k11996J21685K42558m5853N2120o0512M8814K15544j01657J25203
6239F134952L75838M6886K80112K88584K6729J5387Q8159M1145J51538L61256
6229G810586r3299L04830Q9563Q3528J86116L04010L79487j06712L36092J84455
6219I478656Q118J28438Q070O8338J13975P2219l4088J18758K87847K25917J02609
6208A0578857K45541M60181K72454j10381L20331J6089K16144M94947J68506K08984
6198A2871653K57995O93990J70937J11724M75713M22648K72603J33041M56001
6189A5866305M19923L95184M1877L96832K54668L68050L09835N36147N55305M51127
6179A9595253Q06369O05129O65357O67854R66262J083066R59196J303339J215993
$$ y = [5749046, 5537050, 5658735, 5901293, 5855440, 5907560, 5847048, 5895862, 6111406, 6009749, 6134952, 6510790, 6557676, 6837788, 7126372, 7153101, 7168488, 7256647, 7297792, 7449330, 7810586, 7717287, 8022117, 8111680, 8195208, 8381324, 8685334, 9064821, 8958109, 9294201, 9478656, 9486774, 9615212, 9623282, 9691620, 9805595, 9877814, 9843726, 9962484, 10250331, 10476248, 10578857, 10824398, 11284579, 11557033, 11446652, 11766983, 11783072, 11999216, 12494163, 12662669, 12871653, 13129648, 13823638, 13994575, 14106299, 14582012, 15004660, 15277263, 15410304, 15866305, 16286228, 16681412, 16723289, 17120121, 17374789, 17742839, 18052674, 18588821, 19144126, 19595253, 20401622, 21006751, 21672108, 22339962, 23306224, 24389290, 25348486, 26651825, 27867818]
6170B7867818J516969J985723K075602K078489K415392L097979L749313M186970
6162D8974255M678420N181824M506480K643782K33407j625642l198263l583980
6154E7810283l167866k353025j712709j094023n32460o9019L65054O76483O31155
6145E0553873R18256J160740J118718J715120K517561L032463L926788M520284
6137F9463803N895450P601921Q630022J0288702J0737026R144949N048021j420688
6129A25389206p589175j0952685j1079746r416983p280057n226549l438341k764110
6121F7641560k060323j557306j833967j689461k141388k011700j845508j198785
6113E3303122m55736J52158J130622J615904K360983L664059M291913M767133
$$ y = [27867818, 29384787, 31370510, 33446112, 35524601, 37939993, 41037972, 44787285, 48974255, 53652675, 58834499, 63340979, 65984761, 66218168, 64592526, 61394263, 57810283, 54642417, 52289392, 50576683, 49482660, 48950200, 48881181, 49246235, 49922718, 50553873, 51472129, 52632869, 53751587, 55466707, 57984268, 61016731, 64943519, 69463803, 75359253, 82961174, 91591196, 101879898, 112616924, 121761873, 126809894, 125389206, 117800031, 106847346, 95767600, 86350617, 79070560, 73844011, 70405670, 67641560, 65581237, 64023931, 62189964, 60500503, 58359115, 56347415, 54501907, 53303122, 52847386, 52999544, 54130166, 55746070, 58107053, 61771112, 66063025, 70830158]
6105G0830158M535370K855521j53984l220502m917177n869875n915034m754841
6097E3389636l627379l068272k127890j980543j898919j738927j481832j906414
6089C5559460j492336j431315j046821n09933k38512J73795J7897P1547k56136
6080C0847646o69152j076985j440673j710819j358133j077136r61172r60142p41486
6071B0851948n29197l38658k55338M9543R4348J12962K53827M36441M80842Q72573
6061B2029291J160103J221047J891037K064857K427262K552570K378286J232868
6053C6957321n12061k409841l252974l305198k562150k229289j739335r95164
6045A9951309j195119q26091p11654m41648m87913j71499j61477o1770J1908K10908
$$ y = [70830158, 75365528, 78221049, 78067065, 74846563, 69929386, 64059511, 58144477, 53389636, 49762257, 46693985, 44566095, 42585552, 40686633, 38947706, 37465874, 35559460, 34067124, 32635809, 31588988, 31079055, 30840543, 31014338, 31032235, 31103782, 30847646, 30178494, 29101509, 27660836, 25950017, 24591884, 23514748, 22553576, 21593434, 20851948, 20322751, 19984093, 19728755, 19778298, 19872646, 19985608, 20239435, 20675876, 21156718, 22029291, 23189394, 24410441, 26301478, 28366335, 30793597, 33346167, 35724453, 36957321, 36445260, 34035419, 30782445, 27477247, 24915097, 22685808, 20946473, 19951309, 18756190, 17930099, 17218445, 16776797, 16288884, 16117385, 15955908, 15894138, 15906046, 16116954]
6035A6116954K86277N72395N23048P39040J017294J323696J196604N96322J15081
6026B2486711p79150j277774j663851j507161j167984r01357r08701m69842k21973
6017A3588918n78153n70400r28869o74815n65856o75879m16610k51363m22662
6008H504311l06671l99356k39099k27252o9346j4230l22551m5383k80211J92980
5998F793192J17413n6741q0320J89247p4103K84701M34549N17480M27371K90373
5988H843162k84159o06565n49633l46475l05548m57430m00131l36360j48098m36260
5978D972503L8002M543o4885l49512j09089p7372M8139J58351M7979J50613J63813
5967D983085K5682M28298M40156J14894J94735M19844J1665j77057o59566l86122
$$ y = [16116954, 16403231, 16975626, 17498674, 18237714, 19255008, 20578704, 21775308, 22371630, 22486711, 21707561, 20429787, 18765936, 17258775, 16090791, 15189434, 14280733, 13810891, 13588918, 13010765, 12440365, 11511496, 10836681, 10270825, 9594946, 9178336, 8926973, 8504311, 8197640, 7798284, 7559185, 7331933, 7262587, 7248357, 6925806, 6880423, 6600212, 6793192, 6910605, 6853864, 6773544, 6962791, 6888688, 7173389, 7607938, 8125418, 8552789, 8843162, 8559003, 7952438, 7402805, 7056330, 6750782, 6293352, 5893221, 5556861, 5408763, 4972503, 5010505, 5015048, 4950163, 4600651, 4491562, 4414190, 4462329, 4620680, 4668659, 4819272, 4983085, 5008767, 5437065, 5877221, 5992115, 6186850, 6606694, 6618359, 6441302, 5781736, 5395614]
5957E395614k98671n03175j26759j46740J08258j63813P7975l9698L9900j96292
5947D146599j62680O0215j56818l4799P3359j18473K83610J93023J32940L7303
5937D454279Q3502o864K61885K31665q7939m21312m27363k9979n2699j06744j14578
5926C783853O8135N289j49381j9881j1738J01413J36406M3404n5045j53997r0301
5915C658157J24523J62897n7022j60559p5618L89941N3269q95P1002j04247l6287
5904D025161K1855J63777N456j15739m3481Q5267m20982J74444Q5245j30169P8194
5893C929028J67308K64184j78551M0519J08614o2280J30633J27110J35168J67832
5883D829565R8866J79586l79216K61662L02355j29302K2766J16405m0472j04405
$$ y = [5395614, 5096943, 4593768, 4467009, 4320269, 4428527, 4264714, 4342689, 4302991, 4342891, 4146599, 3983919, 4044134, 3887316, 3852517, 3925876, 3807403, 4091013, 4284036, 4416976, 4454279, 4537781, 4530917, 4792802, 5024467, 4936528, 4515216, 4087853, 4057874, 4005175, 3898431, 3783853, 3851988, 3857277, 3707896, 3688015, 3676277, 3777690, 3914096, 3957500, 3902455, 3748458, 3658157, 3782680, 3945577, 3888555, 3727996, 3652378, 4042319, 4095588, 4094693, 4165695, 4061448, 4025161, 4047016, 4210793, 4216249, 4100510, 4057029, 4142296, 3721314, 3895758, 3981003, 3850834, 3929028, 4096336, 4360520, 4181969, 4222488, 4331102, 4268822, 4399455, 4526565, 4661733, 4829565, 4928431, 5108017, 4728801, 4990463, 5292818, 5163516, 5186282, 5302687, 5262215, 5157810]
5873E157810o6027O0946r2917O3661M193J7129K68958J06804J50510J98455r3321
5862E776201J56218j9755L37631K29903J57328j14976J08618l8079J8027o0532
5852F550584K77143m061n8909j1671n8878k63234j71470K66081L41608n709l2525
5841F828959K16578j9182J88819r3491K36626R9392K12271P0467k49773n2891
5831G437775N5698N9324J80325L89487R9596l21344K29592K40642J29006o5694
5821H434407O6772N5863J24792j00640j9709n507K09874Q2470j29103M629J35289
5810H859137M1771J69739m7930m1386K68406m780Q2495K09581N1734L64526J50469
5799A0103762J84474J7040J69249L74299L71299J90672L10676K73291J54638m9327
$$ y = [5157810, 5091783, 5152729, 5059812, 5123473, 5127666, 5144795, 5413753, 5520557, 5671067, 5869522, 5776201, 5932419, 5912664, 6250295, 6480198, 6637526, 6522550, 6631168, 6593089, 6611116, 6550584, 6827727, 6823666, 6764757, 6753086, 6694208, 6430974, 6259504, 6525585, 6867193, 6861484, 6828959, 7045537, 7026355, 7215174, 7121683, 7358309, 7457701, 7669972, 7740439, 7490666, 7437775, 7493473, 7552797, 7733122, 8122609, 8222205, 7900861, 8130453, 8371095, 8500101, 8434407, 8501179, 8557042, 8681834, 8581194, 8561485, 8555978, 8765852, 8848322, 8719219, 8723848, 8859137, 8900908, 9070647, 9022717, 8981331, 9249737, 9244957, 9327452, 9537033, 9588767, 9953293, 10103762, 10288236, 10305276, 10474525, 10848824, 11220123, 11410795, 11721471, 11994762, 12149400, 12100073]
5789A2100073j89759J36288J29862K68840M05439K44030r4212N5744J24860M2414
5779A3223579l9779l7951L92907K59279J71541K00221M20448L22368K90791K25595
5769A5428999M27646J64552K80957N39406O01103N64482M53997L14005J69377
5760A8944524J31657K84990P67851L21141K78421N51144M00116L31257N16856
5751B2527957N84586P09623L96272M26441O85765Q25234M02731R81946Q08257
5742B8348812P28767R18025J209450J216826J120682J355163J680555J815448
5734C8393728K019030K321825K547032L248663L757492M649580N788319O443552
5726F9169221O626691N771951L450907l1524l116771m936418n539447m417980
$$ y = [12100073, 11910314, 12046602, 12176464, 12445304, 12850743, 13094773, 13000561, 13056305, 13181165, 13223579, 13183800, 13145849, 13538756, 13798035, 13969576, 14169797, 14590245, 14912613, 15203404, 15428999, 15856645, 16021197, 16302154, 16841560, 17442663, 18007145, 18461142, 18775147, 18944524, 19076181, 19361171, 20129022, 20450163, 20728584, 21279728, 21679844, 22011101, 22527957, 23112543, 23822166, 24218438, 24644879, 25330644, 26155878, 26558609, 27540555, 28348812, 29077579, 29995604, 31205054, 32421880, 33542562, 34897725, 36578280, 38393728, 40412758, 42734583, 45281615, 48530278, 52287770, 56937350, 62725669, 69169221, 75795912, 81567863, 85018770, 84987246, 81870475, 76934057, 71394610, 66976630]
5718F6976630l613437k672744j825603j496003o39914j61351M16286J028071J292821
5709E9304756J468751J761302J999669K428460L043163L719783M612254O334842
5701H4672980P894395J0394556J2372781J2193874P909502Q2715o804750j0978179
5693A17737874j2143311j1016033r064598p163746n208628l533809k463495j489726
5685F5654528m40698j01277k97405j5143p531l1502p59753q96745o72445k36377
5675F2195652K89154J010463K346125K956331L363532L039481J579944n66479
5667G6214203l192039m938715n313072m302968l483513k966485j908297j511973
5659D8597141o87412p19368l39478n96724n75568p79048j083255j122287r94769
$$ y = [66976630, 63363193, 60690449, 58864846, 57368843, 56728929, 56567578, 56983864, 58011935, 59304756, 60773507, 62534809, 64534478, 66962938, 70006101, 73725884, 78338138, 84672980, 92567375, 102961931, 115334712, 127528586, 135438088, 135520803, 128716053, 117737874, 105594563, 94578530, 85513932, 78350186, 73141558, 69607749, 67144254, 65654528, 65213830, 65112553, 64815148, 64800005, 64792474, 64760972, 64001219, 63104474, 62432029, 62195652, 62484806, 63495269, 65841394, 68797725, 72161257, 75200738, 76780682, 76214203, 73022164, 68083449, 62770377, 58467409, 54983896, 52017411, 50109114, 48597141, 47909729, 47190361, 46850883, 46254159, 45678591, 44899543, 43816288, 42694001, 41699232]
5650D1699232j054783j125429p71697j004463n41115n44902k44683O294K89838
5641C6708292K31094J77212N84833P23481P53925R20696J445322J283255J575157
5632D4403267J620610J597052J240587P67066L77108r32191j352654j577480j226624
5623D4916741o98939n63608l25470P6132J32868K54884P03513Q14422J002468
5614D6313011Q07346J072606J215793J074167J202672J521473J870704K477724
5606E7555496K909687L393763L849467L233790J739313l84293j713407k582918
5598F8000898k894977j992873j464213p29126m65675N064K10724N82328O84024
5589F1936174J165157J430178J680048J850121J617789J603665J423368J464108
$$ y = [41699232, 40644449, 39519020, 38747323, 37742860, 37201745, 36656843, 36412160, 36418454, 36708292, 36939386, 37116598, 37701431, 38424912, 39178837, 40099533, 41544855, 42828110, 44403267, 46023877, 47620929, 48861516, 49628582, 50005690, 49073499, 47720845, 46143365, 44916741, 44217802, 43654194, 43328724, 43404856, 43537724, 43792608, 44496121, 45310543, 46313011, 47120357, 48192963, 49408756, 50482923, 51685595, 53207068, 55077772, 57555496, 60465183, 63858946, 67708413, 70942203, 72681516, 72297223, 70583816, 68000898, 65105921, 63113048, 61648835, 60919709, 60454034, 60459098, 60669822, 61252150, 61936174, 63101331, 64531509, 66211557, 68061678, 69679467, 71283132, 72706500, 74170608]
5581G4170608K057395K455368K818758K973797L069737L283729L000894K718015
5573I6548301K014584J360633J439035K078200K788884L616710M948880O049342
5565A20844569O947253Q091589R282011J0498500J1203966J0097956O315964J002011
5557A84283819l676854o710589p130653n696119l837290j402883R46004K953957
5549A59729392L994315M255704L892293L572683K726180L211607M182596O188654
5541A91753424Q426695J1525773J4940855J7850683J9342416J8776140J6426612
5534B99042598J2596367Q718954O395076O066885O417987N387966K136708j919675
5526C44842866o000373j0251460j4861734j8360151j8658355j6719232j5237482
$$ y = [74170608, 76228003, 78683371, 81502129, 84475926, 87545663, 90829392, 93830286, 96548301, 98562885, 99923518, 101362553, 103440753, 106229637, 109846347, 114795227, 120844569, 127791822, 135883411, 145165422, 155663922, 166867888, 176965844, 183281808, 184283819, 180606965, 173896376, 166765723, 161069604, 157232314, 155829431, 156775435, 159729392, 163723707, 167979411, 171871704, 175444387, 178170567, 181382174, 185564770, 191753424, 200180119, 211705892, 226646747, 244497430, 263839846, 282615986, 299042598, 311638965, 320357919, 326752995, 332819880, 339237867, 344625833, 346762541, 344842866, 338842493, 328591033, 313729299, 295369148, 276710793, 259991561, 244754079]
5519B44754079j4962979j4659268j3660119j1467781r255111o524602l820400
5512A70403819j839241j074745j736658l640680n829606p484571q554294r324869
5504A30919155r524970q014968p083348o042180n245191m627472m095730l569946
5496H2715350l809232m008781m036267l931983l241864k785529k662273j970069
5488E6269352j863454j634720j414170j411842j275260r54829r00886r82981p50102
5479D5081108m15035j66751L95133P26830P34993m09449l015482l568715l239976
5470C6122656k350139j617894j586443j090071r88377p65824p59412m52164m21597
5461B6090735l82351l15075m26982j78642N9825o7875k10405j85130m49788k56650
$$ y = [244754079, 229791100, 215131832, 201471713, 190003932, 180748821, 174224219, 170403819, 168564578, 167489833, 165753175, 162112495, 156282889, 148798318, 140244024, 130919155, 121394185, 113379217, 106295869, 100253689, 95008498, 90381026, 86285296, 82715350, 78906118, 74897337, 70861070, 66929087, 63687223, 60901694, 58239421, 56269352, 54405898, 52771178, 51357008, 49945166, 48669906, 47715077, 46814191, 45831210, 45081108, 44666073, 44499322, 44894455, 45621285, 46356278, 45946829, 42931347, 39362632, 36122656, 33772517, 32154623, 30568180, 29478109, 28489732, 27723908, 26964496, 26512332, 26090735, 25708384, 25393309, 24966327, 24787685, 24847510, 24779635, 24569230, 24384100, 23934312, 23677662]
5451B3677662l02816j66929j01255l19512M550k37234l57976r6008J15529J68541
5441B2384552O0990J36761k6549L59154K20461K67366N11540J87291M05513O95771
5431B5202850N71372R33601Q77780J061479J095936J404704J993885K746775L433519
5422C9321901M524956N945855P559434Q434612O946586J858485m930779q641482
5414F1019568q840053p632741o187150m607007l120798k574173j943901j588150
5406B4525595j547871j174936q29048p28961p38421j69250k92698o3927o86008
5397A8294475p13635l61100j84919l32908m68960p14596p25669o26041o16030
5388A3550617l83550n44906l73639k89541p8571j78309l81879j24486K47739j20571
$$ y = [23677662, 23374846, 23207917, 23106662, 22787150, 22791700, 22554466, 22196490, 22100482, 22216011, 22384552, 22445542, 22582303, 22555754, 22914908, 23135369, 23402735, 23914275, 24101566, 24507079, 25202850, 25774222, 26707823, 27585603, 28647082, 29743018, 31147722, 33141607, 35888382, 39321901, 43846857, 49792712, 57352146, 65786758, 72733344, 74591829, 69661050, 61019568, 52179515, 44546774, 38359624, 33752617, 30631819, 28057646, 26113745, 24525595, 22977724, 21802788, 20973740, 20244779, 19506358, 19337108, 19044410, 18980483, 18294475, 17580840, 17219740, 17034821, 16701913, 16232953, 15518357, 14792688, 14166647, 13550617, 13167067, 12622161, 12248522, 11958981, 11880410, 11702101, 11320222, 11195736, 11443475, 11322904]
5378A1322904k13131k04752k36176q5182n3377j38539O6203l5575K5351L9505
5368A0487231o9886N09311M90167M37449L70133K50773k45011j21289l22962n10236
5358A1275680n92087m50955k76012l83633n70746k48640k31735m29146R1364k03772
5348G980318j94036j32869j3154M5780q1306p1704r0365K74810P1236L78324L79667
5337H546701L37612L31190M46689P34925Q00688R94345Q34394M57363l01647q30302
5327A2351958j067144q62112q35474m49283o12470n77936l41414m01420l06914
5318F897791j91326k39348j56304L1203j17581M1876J29708M2430K2197j10614
5308F350032J73372L33265M08317M45313M48397M79027P36056J006910J030918
$$ y = [11322904, 11109773, 10905021, 10668845, 10583663, 10530286, 10391747, 10457950, 10422375, 10447726, 10487231, 10417345, 10926656, 11416823, 11854272, 12224405, 12475178, 12230167, 12108878, 11785916, 11275680, 10683593, 10232638, 9956626, 9572993, 9002247, 8753607, 8521872, 8092726, 8184090, 7980318, 7786282, 7653413, 7640259, 7686039, 7604733, 7533029, 7442664, 7717474, 7788710, 8167034, 8546701, 8884313, 9215503, 9662192, 10397117, 11197805, 12192150, 13026544, 13483907, 13182260, 12351958, 11284814, 10422702, 9587228, 9137945, 8525475, 7947539, 7606125, 7204705, 6897791, 6706465, 6467117, 6310813, 6342016, 6224435, 6266311, 6396019, 6438449, 6460646, 6350032, 6523404, 6856669, 7264986, 7710299, 8158696, 8637723, 9373779, 10380689, 11411607]
5299A1411607P63821P91229Q0168r27459r20709j136867r37895n01791p44137
5290G877967p54844k91092m45511k65144J4279k53333j50078j65528k92016r664
5280E265036J01059J09145J19674n4318j2369K23304l00229J56866J57155m9355
5270E715968K35599K42669M16196N06789K60090m6951k9521l82775k87084n00646
5260F130334k16770j60113k93494l9753J49340r8422J51290R0247k1776r802j0163
5249E670918j97836K9793R2831l45057k88350n3517j8129j58641J58166K7075
5239D917253l5243J63480Q1168l48584q5512j18334l42178J55213K64306O7272
5229D718841k09150J44136N11694M1521j56827K47795K98106J79914K13205q4132
$$ y = [11411607, 12175428, 12966657, 13046825, 12119366, 11198657, 10061790, 9123895, 8622104, 7877967, 7123123, 6832031, 6386520, 6121376, 6135655, 5882322, 5732244, 5566716, 5274700, 5265036, 5366095, 5475240, 5594914, 5540596, 5528227, 5751531, 5451302, 5608168, 5765323, 5715968, 5951567, 6194236, 6610432, 7117221, 7377311, 7330360, 7300839, 6918064, 6630980, 6130334, 5913564, 5753451, 5459957, 5420204, 5569544, 5471122, 5622412, 5712659, 5690883, 5681081, 5670918, 5473082, 5502875, 5595706, 5250649, 4962299, 4908782, 4890653, 4732012, 4890178, 4917253, 4882010, 5045490, 5126658, 4778074, 4692562, 4574228, 4232050, 4387263, 4651569, 4718841, 4509691, 4653827, 5165521, 5207042, 5050215, 5298010, 5596116, 5776030, 5989235, 5905103]
5219E905103O5181O9494m9503J10037j36496p5662j37592n3997L0866n7500j56147
5208E513784n51872k04137l3198k15162p6313l1035J9807J02383J05127q4742
5198D544642o7340J46977P8961L2811l80004J70651K31306k18664L5873L34120
5188D909333J56172q8149k9995J86310J55380j82146r0570q2743k36467j5133
5178D681992j15898l90179m6646L63648K3623p1858j88687p9860M7443j95766
5168D027812n3118P2174J3817j4709q30M5825J75347K02654j38929j71039Q1882
5157D240886J83937P265j15442N3946l6625l8385l5274l6998Q0309o1432l9445
5146D202742m8222j23240J50203o5030k3343K31114M2597P8705O9243j80873K10067
$$ y = [5905103, 5970284, 6039778, 5990275, 6100312, 5963816, 5888154, 5750562, 5696565, 5727431, 5669931, 5513784, 4961912, 4757775, 4724577, 4509415, 4433102, 4402067, 4421874, 4524257, 4629384, 4544642, 4477302, 4624279, 4703240, 4736051, 4356047, 4526698, 4758004, 4539340, 4575213, 4909333, 5065505, 4977356, 4947361, 5133671, 5289051, 5106905, 5016335, 4933592, 4697125, 4681992, 4566094, 4175915, 4129269, 4492917, 4516540, 4444682, 4255995, 4176135, 4223578, 4027812, 3974694, 4046868, 4060685, 4045976, 4045146, 4090971, 4266318, 4468972, 4330043, 4159004, 4240886, 4424823, 4432088, 4316646, 4370592, 4333967, 4295582, 4260308, 4223310, 4303619, 4242187, 4202742, 4154520, 4031280, 4181483, 4116453, 4093110, 4324224, 4366821, 4445526, 4514769, 4333896, 4543963]
5135D543963N307k87357O7469q5674K03639J16651k80257J28294K93588j11332
5125D594291L9290L6788r6060J32443M28844q0541j3083j06320n4868L77043j39964
5114E117863m64207k4930J49962J30904J85632j90742L25969j60483J20695J52162
5104E342825o4548J12898k43798R3312M88510j76287J50049L6058P084j2361M00110
5093F133852L5623n9829L25503j44775j31171j1126J52212j49195J28278K25417
5083F504789K10000L66047Q5280J13212K34391J80653J11019J09092r9J03505
5073H017889K50056J0254L28315j07594L4386M5966J55117J63147q9900j09764
5063H697872P783o2997J30535n0574J19453j09656M7937M67864J04032N4081k88634
$$ y = [4543963, 4549270, 4261913, 4329382, 4243708, 4447347, 4563998, 4283741, 4412035, 4705623, 4594291, 4633581, 4670369, 4574309, 4706752, 5135596, 5055055, 5041972, 4935652, 4880784, 5257827, 5117863, 4653656, 4628726, 4778688, 4909592, 5095224, 4904482, 5230451, 5069968, 5190663, 5342825, 5278277, 5391175, 5147377, 5240689, 5729199, 5552912, 5702961, 5739019, 5746103, 5733742, 6133852, 6169475, 6109646, 6435149, 6290374, 6159203, 6148077, 6300289, 6151094, 6279372, 6504789, 6714789, 7080836, 7166116, 7279328, 7513719, 7694372, 7805391, 7914483, 7914384, 8017889, 8267945, 8278199, 8606514, 8498920, 8533306, 8579272, 8734389, 8897536, 8807636, 8697872, 8705655, 8642658, 8773193, 8722619, 8842072, 8732416, 8780353, 9248217, 9352249, 9406330, 9117696]
5052I117696l0857R4572p5514K2555j11729J00216j9764K7074R5922j72210j01963
5041H945998j51626K8426j82465O9228J06915L6169N7713J41756J36518j76503
5031I012129L36511L18267J85073J7733J70375J01326K99933L21737L97306M15482
5021A1575872J74032K50115L1846J43247k11135l4854J55180P2174j6146p3550
5011A2066781R3922p1600j5625J99010J09662J21731l5909M28269L17912J24204
5001A3338357L48987k451k30445p3293j25502J28430L9489j62503o7048j34331
4991A3059690J31216j36896k45824j95333l76696J43431K0598j73949j93584L6702
4981A2069355j88665p7109l30819j08311P3051j61822K97455K23419j78805j01917
$$ y = [9117696, 9086839, 9181411, 9105897, 9128452, 9016723, 9116939, 9097175, 9124249, 9220171, 9047961, 8945998, 8794372, 8822798, 8640333, 8709561, 8816476, 8852645, 8910358, 9052114, 9188632, 9012129, 9348640, 9666907, 9851980, 9869713, 10040088, 10141414, 10441347, 10763084, 11160390, 11575872, 11749904, 12000019, 12031865, 12175112, 11963977, 11929123, 12084303, 12156477, 12140331, 12066781, 12160703, 12089103, 12073478, 12272488, 12382150, 12503881, 12467972, 12896241, 13214153, 13338357, 13687344, 13684893, 13454448, 13381155, 13255653, 13384083, 13423572, 13261069, 13194021, 13059690, 13190906, 13054010, 12808186, 12612853, 12236157, 12379588, 12400186, 12226237, 12032653, 12069355, 11880690, 11803581, 11472762, 11364451, 11437502, 11275680, 11573135, 11796554, 11617749, 11515832]
4971A1515832K83653n2685o1831q6661K17216L72090J37931Q4531j37697J46802
4961A2419181p5778J09676L45756R8707J15831J11065J29762j4749J67049P2383
4951A3478883K57391L35063J61319L62918K11016L59541L77572M84543L72709
4942A6400955P5883K24284K14242K8554O3137N12067L76563L11566L77714P41189
4932A9326154L71799P71480M59201L28435L22395L71N2096M33236L06126J92674
4922B2563967Q7568L56038L28507L59287L90644L77947L97593N13976O36360L96126
4912B6408013K77111K24312N07294N01097R87469J363329K008662K109441K803740
4903C7190468L648451L315263J271024j359348k366823k662716k750676j990912
$$ y = [11515832, 11799485, 11746800, 11684969, 11598308, 11815524, 12187614, 12325545, 12410076, 12272379, 12419181, 12343403, 12453079, 12798835, 12897542, 13013373, 13124438, 13254200, 13239451, 13406500, 13478883, 13736274, 14071337, 14232656, 14595574, 14806590, 15166131, 15543703, 16028246, 16400955, 16476838, 16701122, 16915364, 16943918, 17007055, 17519122, 17895685, 18207251, 18584965, 19326154, 19697953, 20469433, 20928634, 21257069, 21579464, 21579835, 21631931, 22065167, 22371293, 22563967, 22651535, 23007573, 23336080, 23695367, 24086011, 24463958, 24861551, 25375527, 26011887, 26408013, 26685124, 26909436, 27416730, 27917827, 28905296, 30268625, 32277287, 34386728, 37190468, 40838919, 44154182, 45425206, 44065858, 41699035, 39036319, 36285643, 34294731]
4895C4294731j221493r22335m78802k96490K15246M6749J62321L95150K94361
4886C2489438K35958N48582Q99857P14209O16469O30033Q53180R37663J008585
4877C8933974R55061Q44912R62436J001603J030441J029266J040577J123378R45453
4868D7867101J172631J256058J337533R57619R40630J030761J018424J338036
4860E6918793J837419J729342K012450K117846K441997K714051K974891L429454
4852G6176243L649683M148250M783351N585054O573248P189351Q106973Q123676
4844A24335829P017767L985651J308316p08925j854284j966535j845187j057712
4836A29214920o47863k77349K81555N34540Q02575J242160J681995J924038K307674
$$ y = [34294731, 33073238, 32150903, 31672101, 31375611, 31590857, 31637606, 31799927, 32195077, 32489438, 32725396, 33273978, 34173835, 34888044, 35504513, 36134546, 36987726, 37925389, 38933974, 39889035, 40733947, 41696383, 42697986, 43728427, 44757693, 45798270, 46921648, 47867101, 49039732, 50295790, 51633323, 52590942, 53531572, 54562333, 55580757, 56918793, 58756212, 60485554, 62498004, 64615850, 67057847, 69771898, 72746789, 76176243, 79825926, 83974176, 88757527, 94342581, 100915829, 108105180, 116212153, 124335829, 131353596, 135339247, 136647563, 135938638, 134084354, 132117819, 130272632, 129214920, 128567057, 128289708, 128571263, 129105803, 129908378, 131150538, 132832533, 134756571, 137064245]
4827A37064245L405762M775618O356068P869798R438504J0741119J1065926J0154242
4819B00871282Q121526M790564P27256k572068m102638m634591m721633m666065
4811A93813633m364198m194127l621841l677456l445881l152677l028660k848741
4803A65480052k327979j521671o66521M91790J766909K623215L551132M598713
4795A73995640N076117L911210J861143m92163j706902j880698j602021o72206
4787A78490120Q4718L98091J9406l46214q13076j208746j890088k304476k776445
4778A69653290l114809l242422k540259k416755j665632r96049j082266o41420
4770A53953678l46749J94138j13783L97827M00120J15187K41885L93922P15306
$$ y = [137064245, 140470007, 145245625, 151601693, 159471491, 168909995, 179651114, 190717040, 200871282, 208992808, 213783372, 214510628, 211938560, 207835922, 203201331, 198479698, 193813633, 189449435, 185255308, 181633467, 177956011, 174510130, 171357453, 168328793, 165480052, 163152073, 161630402, 160963881, 161455671, 163222580, 165845795, 169396927, 173995640, 179071757, 182982967, 184844110, 184351947, 182645045, 180764347, 179162326, 178490120, 178574838, 178972929, 178992335, 178646121, 177833045, 176624299, 174734211, 172429735, 169653290, 166538481, 163296059, 160755800, 158339045, 156673413, 155677364, 154595098, 153953678, 153606929, 153801067, 153687284, 154085111, 154485231, 154600418, 154842303, 155236225, 155951531]
4761A55951531J146969J407566J580576J823532J499012J525969J728396J655594
4753A68319145Q91013k49443j410099k528499k885519l155145k750335k492936
4745A53738182k773209k756770k911670k808985k049364k456552k376600k485077
4737A33119955k742090k886817k761231k888737k686222k135109k132814j976643
4729A12910292j904934j949932k286664k401612l058878l704358m217972m069541
4721H9316401m047722l722734l370339l615348l597010l452109l472824l163570
4713F0874745l076406l039452k811497k746750k390457k463277k676662k212671
4705C9457573k237397j728534j653918j475446j330056j194538j269530j127422
$$ y = [155951531, 157098500, 158506066, 160086642, 161910174, 163409186, 164935155, 166663551, 168319145, 169210158, 168960715, 167550616, 165022117, 162136598, 158981453, 156231118, 153738182, 150964973, 148208203, 145296533, 142487548, 140438184, 137981632, 135605032, 133119955, 130377865, 127491048, 124729817, 121841080, 119154858, 117019749, 114886935, 112910292, 111005358, 109055426, 106768762, 104367150, 101308272, 97603914, 93385942, 89316401, 85268679, 81545945, 78175606, 74560258, 70963248, 67511139, 64038315, 60874745, 57798339, 54758887, 51947390, 49200640, 46810183, 44346906, 41670244, 39457573, 37220176, 35491642, 33837724, 32362278, 31032222, 29837684, 28568154, 27440732]
4697B7440732j018224j080325o63047n52493n92126o98101m67634n67959k49262
4688B1551561n00452o66248n63421p69375n75166m85141n22573m17322m20796
4679A6631067n16047m37262m15735k71305m51002m42490k15679k49836k70877
4670A3360834j27908l74634n90854n2161j62085k52176l79464m13021q866n2806
4660A0946859k26704p1098m60850m56979o3915J51840k65428k88012j3123j62898
4650I089692N1283o3960j53619p6985P9391j84462j47048K356O9802j12653j4893
4639H538904J29935n8970j82646J67315O888K68429K66173Q2420j10718j37205
4629H970525P6484k45031j56898q0200m55472m3433j49913l66456j11106o1085
$$ y = [27440732, 26422508, 25342183, 24679136, 24126643, 23534517, 22836416, 22368782, 21800823, 21551561, 21051109, 20384861, 19821440, 19052065, 18476899, 17991758, 17469185, 17051863, 16631067, 16115020, 15677758, 15262023, 14990718, 14539716, 14097226, 13881547, 13631711, 13360834, 13232926, 12858292, 12267438, 12215277, 12053192, 11801016, 11421552, 11008531, 10999665, 10946859, 10720155, 10649057, 10188207, 9731228, 9667313, 9819153, 9553725, 9265713, 9252590, 9089692, 9140975, 9077015, 8923396, 8846411, 8925802, 8741340, 8594292, 8596648, 8666450, 8553797, 8538904, 8668839, 8609869, 8427223, 8594538, 8601426, 8869855, 9136028, 9218448, 9107730, 8970525, 9047009, 8801978, 8645080, 8564880, 8109408, 8065975, 7916062, 7549606, 7438500, 7377415]
4619G377415o0544j03127Q7217n4436l0486K64133j91963j8699J51414Q1423K94586
4608G796933J16178L0717J37695L35029j14062J9310J5456r7131k84705j28084
4598G827336l94515j57488l49232j12769J31741n7618j220q9172J13849K76188
4588G187100p3249m32641M2439M5668k4734j6468J42705P4537N936L00427J55236
4577G406956Q7184K85678L10956K28492J84002M04017R1446j37171Q9374k28281
4567H722653l53072l50915j84931j25804q9369j61820k02326k3429M0093k64502
4557G006578K9299L23799K78314m482n2948O1209r675L85203K38753R9389J85252
4546H540691k8062J93734q5991k06829m1856o6579M6140k47146k84590l51581
$$ y = [7377415, 7316871, 7213744, 7300961, 7246525, 7216039, 7480172, 7288209, 7269510, 7420924, 7502347, 7796933, 7913111, 7943828, 8081523, 8416552, 8302490, 8321800, 8337256, 8240125, 7955420, 7827336, 7432821, 7275333, 6926101, 6813332, 6945073, 6887455, 6886235, 6797063, 6910912, 7187100, 7113851, 6681210, 6723649, 6769317, 6744583, 6728115, 6870820, 6945357, 6951293, 7251720, 7406956, 7494140, 7779818, 8090774, 8319266, 8503268, 8907285, 8998731, 8861560, 8950934, 8722653, 8369581, 8018666, 7833735, 7707931, 7618562, 7456742, 7254416, 7230987, 7271080, 7006578, 7035877, 7359676, 7637990, 7633508, 7580560, 7641769, 7632094, 8017297, 8256050, 8355439, 8540691, 8512629, 8706363, 8620372, 8413543, 8371687, 8305108, 8351248, 8104102, 7819512, 7467931]
4536G467931l05327k51736k86559K0887L10807o5847j58160n1123K4607j9430
4526F686050l919O881J53259J652r3807K00588r2105m9065K03796Q6886J80902
4515G281118M52543J56815m3381j90401k5321N6794j58196m0140L1317l38206
4505G182942m04227J1747q3522k2638o9541J30950J49726k06915j76126K61359
4495F773755J98100K3793K87885l8349P3247O7932r1252J36095J63545J69237
4485G763988p9654l4938j9641k58802j35001j58095n26833J17206J14045j33142
4475F649133q7747m6454J4917j62671J00678J62935p1127j30644j06948N335o8906
4464F258501q7442Q8667k96J00810j6139J37125Q512K43585J62502K2847l463
$$ y = [7467931, 7162604, 6910868, 6624309, 6645196, 6956003, 6890156, 6731996, 6680873, 6705480, 6686050, 6682131, 6689012, 6842271, 6843923, 6750116, 6950704, 6858599, 6809534, 7013330, 7100216, 7281118, 7733661, 7890476, 7847095, 7656694, 7631373, 7688167, 7529971, 7489831, 7521148, 7182942, 6778715, 6790462, 6706940, 6684302, 6614761, 6745711, 6895437, 6688522, 6512396, 6773755, 6971855, 6995648, 7283533, 7245184, 7318431, 7386363, 7295111, 7431206, 7594751, 7763988, 7684334, 7649396, 7629755, 7370953, 7235952, 7077857, 6551024, 6668230, 6782275, 6649133, 6561386, 6514932, 6529849, 6367178, 6467856, 6630791, 6559664, 6429020, 6322072, 6327407, 6258501, 6171059, 6259726, 6259430, 6360240, 6344101, 6481226, 6489738, 6733323, 6895825, 6918672, 6915209]
4453F915209P5627J37253r4077m4660M2670K02830j78204M0018J32740R521K11719
4442G450646n2535k49102M49247j54618K7983M3672j1068L7300J45246L15758
4432H002529k6832K73520J58041J09491j52318j20613L61857M80313j18833O7109
4422I034264L07650j0581Q911M5960J41569M9242r3455n1851n5387J82330K27602
4411I786254K15345q1933J68727K60334n2401m39q8207r2737O330O793M084J42055
4399A0274205P7036L6792K18543K27930o7744Q1279N8184j29671j81455j01041
4389A0494058K29744J84382J68476J03721k8862K16118J39919q0523J33900K20191
4379A1781124O2561J10528j78633p5751J46675j15253m4722j6978j41900P2186
$$ y = [6915209, 6990836, 7128089, 7034012, 6989352, 7032022, 7234852, 7056648, 7096666, 7229406, 7238927, 7450646, 7398111, 7149009, 7598256, 7443638, 7471621, 7515293, 7504225, 7541525, 7686771, 8002529, 7975697, 8249217, 8407258, 8516749, 8364431, 8243818, 8605675, 9085988, 8967155, 9034264, 9341914, 9331333, 9340244, 9386204, 9527773, 9577015, 9483560, 9431709, 9376322, 9558652, 9786254, 10001599, 9919666, 10088393, 10348727, 10296326, 10295887, 10207680, 10114943, 10121273, 10128066, 10132150, 10274205, 10351241, 10388033, 10606576, 10834506, 10766762, 10848041, 10906225, 10776554, 10595099, 10494058, 10723802, 10908184, 11076660, 11180381, 11151519, 11367637, 11507556, 11427033, 11560933, 11781124, 11843685, 11954213, 11775580, 11699829, 11846504, 11731251, 11686529, 11669551, 11527651, 11599837]
4369A1599837L76670O4802N34L57558K64591j79523m6599o8977J61568j08235
4359A2422226J06830L64358J97765J06391K19828K24190J50183k15105J27737
4350A3704403l4624o4333J79769K817j0764j10542k47J76843R7778k50705L05829
4339A3996224p9408l4736J3234m040Q431K92239P7602r8052m9081K46056J35105
4328A4503574o7063J65447N1854J92403j34890l6339J22706K4579J52384K87029
4318A5261684J03430l2004J80290J13084M66815L25894Q0981L64867q7928K22969
4308A7000082j5388r4095J22292J45637J29002K15233J33686R3970K91218K19697
4298A8241334K04723K93927p8653J27260L46345K17482K91070J87901M11548K5357
$$ y = [11599837, 11976507, 12041309, 12041843, 12399401, 12663992, 12484469, 12437870, 12368893, 12530461, 12422226, 12529056, 12893414, 13091179, 13197570, 13417398, 13641588, 13791771, 13576666, 13704403, 13669779, 13605446, 13785215, 13788032, 13777268, 13666726, 13666479, 13843322, 13941100, 13690395, 13996224, 13916816, 13882080, 13895314, 13891274, 13899705, 14191944, 14269546, 14171494, 14122413, 14368469, 14503574, 14436511, 14601958, 14653812, 14846215, 14711325, 14674986, 14797692, 14822271, 14974655, 15261684, 15365114, 15333110, 15513400, 15626484, 16093299, 16419193, 16500174, 16865041, 16777113, 17000082, 16984694, 16890599, 17012891, 17158528, 17287530, 17502763, 17636449, 17730419, 18021637, 18241334, 18446057, 18739984, 18661331, 18788591, 19134936, 19352418, 19643488, 19831389, 20242937, 20268294]
4288B0268294M58480K69305J40867L92297P7950L04741M18233L42109N55774L29263
4278B3557313K88049K14639L45163M80587M06493M32086L81540N68424M17521
4269B7091815M23425P53706N53808M54408P13728P53787O84327R26867Q01373
4260C3157244P56479J020627J048002J200847J197902J160558J239833J252641
4252D2034133J319197R43282J522759J766020J893191K162816J725660K127300
4244E5494358J954113K166601K049536K449624K373851K253911K715785K443524
4236G3901303K465555K474594K763055L017018L092256L088851K895641K952877
4228I6651150K793438K739205K677608K483372K346867K071394K325180J737223
$$ y = [20268294, 20726774, 20996079, 21136946, 21529243, 21607193, 21911934, 22330167, 22672276, 23228050, 23557313, 23845362, 24060001, 24405164, 24885751, 25292244, 25724330, 26105870, 26674294, 27091815, 27515240, 28268946, 28822754, 29277162, 29990890, 30744677, 31429004, 32355871, 33157244, 33913723, 34934350, 35982352, 37183199, 38381101, 39541659, 40781492, 42034133, 43353330, 44296612, 45819371, 47585391, 49478582, 51641398, 53367058, 55494358, 57448471, 59615072, 61664608, 64114232, 66488083, 68741994, 71457779, 73901303, 76366858, 78841452, 81604507, 84621525, 87713781, 90802632, 93698273, 96651150, 99444588, 102183793, 104861401, 107344773, 109691640, 111763034, 114088214, 115825437]
4220A15825437J786092J551693J448203J590282J432224J364796J214638P54849
4212A26968214N65666M6230l05768o71818j311841j216525q85117j002528j223057
4203A20963456j277559j494952j660937j462945j757506k231401k121442k243700
4195A06713014k775237k909947k796369k754516k557919k678484k654739k754896
4187H4830907k420487k162387k300916k297239k153846k179375k081232k245914
4179F6989511j805047j952432j708711j872137j562596j522429j343045j308744
4171E3914370j056962j039466j012645p45168p28916r07208p22775n00388o02030
4162D6598812l25586m79874l69120m38524l47707j49702n0451R4797O4270K945
$$ y = [115825437, 117611529, 119163222, 120611425, 122201707, 123633931, 124998727, 126213365, 126968214, 127533880, 127580110, 127274342, 126602524, 125290683, 124074158, 123189041, 122186513, 120963456, 119685897, 118190945, 116530008, 115067063, 113309557, 111078156, 108956714, 106713014, 103937777, 101027830, 98231461, 95476945, 92919026, 90240542, 87585803, 84830907, 82410420, 80248033, 77947117, 75649878, 73496032, 71316657, 69235425, 66989511, 65184464, 63232032, 61523321, 59651184, 58088588, 56566159, 55223114, 53914370, 52857408, 51817942, 50805297, 50060129, 49331213, 48424005, 47701230, 47200842, 46598812, 46273226, 45793352, 45424232, 44985708, 44638001, 44488299, 44437848, 44532645, 44596915, 44599860]
4152D4599860m6771J45225L10465L43617P50626N65310N56717P07983M68843J52551
4142D8554426M45225M76291L63208L68928O64656N25644Q95916R30682J061605
4133E4286581J032927R69245J201743J421683J029341R77478J013344Q44755R46252
4124F3723349Q98445R83039Q48740J092074J105119J150727J106860J017591J358951
4115G3284895J334179R89164J305690J377575J162806R59120J290882J694333
4107H3398644J974841K079281K430063K416440K371476J692663J227599Q69378
4099I8460385P19007P92739O25369J131850J172584R13481O05285P98725J188319
4090A06407744P20393J110526J175343J196304J312141J624909J330941R97293
$$ y = [44599860, 44553089, 44698314, 45008779, 45352396, 46103022, 46668332, 47225049, 47933032, 48401875, 48554426, 48999651, 49475942, 49839150, 50208078, 50872734, 51398378, 52294294, 53224976, 54286581, 55319508, 56288753, 57490496, 58912179, 59941520, 60918998, 61932342, 62777097, 63723349, 64621794, 65604833, 66453573, 67545647, 68650766, 69801493, 70908353, 71925944, 73284895, 74619074, 75608238, 76913928, 78291503, 79454309, 80413429, 81704311, 83398644, 85373485, 87452766, 89882829, 92299269, 94670745, 96363408, 97591007, 98460385, 99179392, 99972131, 100597500, 101729350, 102901934, 103815415, 104420700, 105219425, 106407744, 107128137, 108238663, 109414006, 110610310, 111922451, 113547360, 114878301, 115875594]
4082A15875594J481504J038372J471328J594486K342778K579620L105913K991397
4074A32480992K535656K010051J983404K024423J944889J827628J840924J726954
4066A48374921J776764J919825J540563J927676K144165J744479J613008J155608
4058A62197009N05361K80670K24193M91417Q59571J344380J103689J246256J160287
4049A69412833Q22158K10841k89809p21372n04749m79609m16611k9137k09544
4040A67795001m46882n88252n59138r91199q12957p65826p39936m78864m01531
4031A62010416q00828j601347k640223k974713k732150k567789k615750k628979
4023A43448637l151864l407735l172093l434952k769354k250574j966600j697889
$$ y = [115875594, 117357098, 118395470, 119866798, 121461284, 123804062, 126383682, 129489595, 132480992, 135016648, 137026699, 139010103, 141034526, 142979415, 144807043, 146647967, 148374921, 150151685, 152071510, 153612073, 155539749, 157683914, 159428393, 161041401, 162197009, 162702370, 162983040, 163207233, 163698650, 164558221, 165902601, 167006290, 168252546, 169412833, 170234991, 170445832, 170156023, 169434651, 168929902, 168450293, 168033682, 168004545, 167795001, 167348119, 166759867, 166200729, 165209530, 164396573, 163630747, 162890811, 162411947, 162010416, 161209588, 159608241, 156968018, 153993305, 151261155, 148693366, 146077616, 143448637, 140296773, 136889038, 133716945, 130281993, 127512639, 125262065, 123295465, 121597576]
4015A21597576j395814j055678j230783j204315j314489j583342j644029j862196
4007A10306930k177308k238314k003982j705037j485730j211088q15158r48733
3999I7721580l85437k18129m29035p64445j629996k221303k569643k399701k274714
3990H4829177k103888j501194j149504r27382q13258q12505j010810j103415j192034
3981G4215187j263009j468029j291572j211042j315123j130094j183338j042917
3973F4310063m74965r24701o16183n71091r63204q78745r14687j152959j002500
3964E6811028o98288m82416p80226n85168l32699o70911l50758k91495o83330
3955E1935737m03415p2743J3971k79030p37435k29717j11670k35190K3931r4011
$$ y = [121597576, 120201762, 119146084, 117915301, 116710986, 115396497, 113813155, 112169126, 110306930, 108129622, 105891308, 103887326, 102182289, 100696559, 99485471, 98670313, 97721580, 97336143, 97118014, 96688979, 95924534, 94294538, 92073235, 89503592, 87103891, 84829177, 82725289, 81224095, 80074591, 79147209, 78333951, 77521446, 76510636, 75407221, 74215187, 72952178, 71484149, 70192577, 68981535, 67666412, 66536318, 65352980, 64310063, 63835098, 62910397, 62294214, 61723123, 60759919, 59881174, 58966487, 57813528, 56811028, 56112740, 55630324, 54850098, 54264930, 53932231, 53261320, 52910562, 52619067, 51935737, 51532322, 51459579, 51473550, 51194520, 50457085, 50227368, 50115698, 49880508, 49904439, 49810428]
3945D9810428k12994M2256j53354j98957j18954N337j62854J41626K96325J78580
3935D9627439K97575O96756K87800O91406O14670K71016N48325N86053L21860
3926E3942900N60408M53134N99221M35958L49183P64339Q13206O60689P61862
3917E9340900R44493O64779J241656Q38142P16177J173853J172398J382984J290620
3908F8766002J238850J521995J313266J521031J472165J341960J438897J278689
3900G9892855R35547R10078R89402R95726J161008R52386J095755R34004R10682
3891H8777443M58869L93456K96259p004K69561K3365j66883J61966J91320J6166
3881I0414518L10800N16614L49972L19296M58555K62812P9825J65247K34232K80333
$$ y = [49810428, 49597434, 49639690, 49486336, 49287379, 49168425, 49173762, 49010908, 49152534, 49448859, 49627439, 49925014, 50621770, 50909570, 51600976, 52215646, 52486662, 53034987, 53621040, 53942900, 54503308, 54956442, 55555663, 55991621, 56340804, 57105143, 57918349, 58579038, 59340900, 60285393, 60950172, 62191828, 63029970, 63746147, 64920000, 66092398, 67475382, 68766002, 70004852, 71526847, 72840113, 74361144, 75833309, 77175269, 78614166, 79892855, 80828402, 81738480, 82727882, 83723608, 84884616, 85837002, 86932757, 87866761, 88777443, 89236312, 89629768, 89926027, 89919023, 90188584, 90211949, 90045066, 90207032, 90398352, 90414518, 90725318, 91241932, 91591904, 91911200, 92369755, 92632567, 92712392, 92877639, 93111871, 93392204]
3871I3392204P70730O93325P37719J185685J550881J737261J905414K302634K288521
3862A06564374K365391K912197L343282L219879L685875M065193M662152M885609
3854A35703952M902128N240280N465184N689722N532385N463270N573751N697397
3846A79268069N328129N554913N568625N437174N787205N891255O147248O068658
3838B25051276O032046N943921N577629N509095N060936M709433M163448M866175
3830B66913959M939793N482147O142566O484507P088375P494618Q080359Q926583
3822C21552907R230844J0023635J1098403J2308522J4011807J5768183J7364944
3815D11359245J8330519J8118146J6659085J4404502J0588127O298570K375047
$$ y = [93392204, 94162934, 94856259, 95593978, 96779663, 98330544, 100067805, 101973219, 104275853, 106564374, 108929765, 111841962, 115185244, 118405123, 122090998, 126156191, 130818343, 135703952, 140606080, 145846360, 151311544, 157001266, 162533651, 167996921, 173570672, 179268069, 184596198, 190151111, 195719736, 201156910, 206944115, 212835370, 218982618, 225051276, 231083322, 237027243, 242604872, 248113967, 253174903, 257884336, 262047784, 266913959, 271853752, 277335899, 283478465, 289962972, 297051347, 304545965, 312626324, 321552907, 330783751, 340807386, 351905789, 364214311, 378226118, 393994301, 411359245, 429689764, 447807910, 464466995, 478871497, 489459624, 495758194, 498133241]
3808D98133241j670405n017058o653615p554555p123901o592890n345131m743502
3800D53432184m713734n147838o630135r065767j2840827j6371954j9962053k2784423
3792C55915453k4023105k4634446k4115297k2275914k0682854j8870815j6354837
3785B04958185j4473315j2859980j1490772r876588q462209p629131o862984n790751
3777A27512455m922755m721635m240403l392754k793957k601384k332325k122889
3769A00384353k265157j870617j641156j651228j573246j379620j644278j369294
3761H6989757j094699j078176j095799j132823p48687j083333j146758p14468
3753G8895014r51784r88749j028341j432370j457527j597531j816818k088027
$$ y = [498133241, 496462836, 491445778, 484792163, 477237608, 470113707, 463520817, 458175686, 453432184, 448718450, 443570612, 436940477, 427874710, 415033883, 398661929, 378699876, 355915453, 331892348, 307257902, 283142605, 260866691, 240183837, 221313022, 204958185, 190484870, 177624890, 166134118, 156257530, 147795321, 140166190, 133303206, 127512455, 122589700, 117868065, 113627662, 110234908, 107440951, 104839567, 102507242, 100384353, 98119196, 96248579, 94607423, 92956195, 91382949, 90003329, 88359051, 86989757, 85895058, 84816882, 83721083, 82588260, 81839573, 80756240, 79609482, 78895014, 77943230, 76954481, 75926140, 74493770, 73036243, 71438712, 69621894, 67533867]
3745F7533867j638347j503540j597561j446264j556505j123860j247500j221410
3737E6198880j084364r71012j071669j022643q75309j150299q23370r07399p26002
3728D7566813p35079j099383r85057q51086j047264r71931o69636m86237p63818
3719C9957322p98504n71276n26670k94899n35746m64398m67416k77742l04072
3710C5716599j29542j63196k36114j09248j88262k96237j25673k7729l60846m43666
3700C3636086m69549l45596k33179j53844k12912R2065l29595j08825r289k10112
3690C1655250k14104p5982j95989j44206k87491J88714Q1616j04870j7094j50673
3680C0735171O1289l1420Q1372L3458j9530K45945N09151J69695R0132J89895
$$ y = [67533867, 65895520, 64391980, 62794419, 61348155, 59791650, 58667790, 57420290, 56198880, 55114516, 54143504, 53071835, 52049192, 51173883, 50023584, 49200214, 48292815, 47566813, 46831734, 45732351, 44747294, 43896208, 42848944, 41877013, 41207377, 40721140, 39957322, 39158818, 38587542, 38060872, 37765973, 37230227, 36765829, 36298413, 36020671, 35716599, 35587057, 35423861, 35187747, 35078499, 34890237, 34594000, 34468327, 34440598, 34079752, 33636086, 33166537, 32820941, 32587762, 32433918, 32221006, 32313071, 31983476, 31874651, 31865362, 31655250, 31441146, 31365164, 31169175, 31024969, 30737478, 30926192, 31007808, 30902938, 30885844, 30735171, 30796460, 30765040, 30846412, 30879870, 30860340, 31106285, 31615436, 31785131, 31875263, 32065158]
3670C2065158q9152l6662J78599J82522J38219o5743l8490R9567N73661K62506
3660C3270185K26174L86999N95090Q91625Q92949R01788Q10361J057065R83744
3651D0015980J110530J223545J025437Q23504L94614K36652J07231q6268k52575
3642D4598650l07159k8614l7566k59701j26711J05146J6049j52383J37740l64951
3632D3580500o06081m17478r99095j127625r78319q33915j171976j014505m64004
3623C5967502p60290n28801l17345m03685j96496j55647N4634j99031j17144k60831
3613C3082866Q0766P5827k11388j71464j47338O8q8551j13189P7707L5341j22309
3602C2498336J21395K0278m9384J02118K52296L27080K97808J46341L22912j72772
$$ y = [32065158, 31976006, 31939344, 32117943, 32300465, 32438684, 32372941, 32334451, 32434018, 33007679, 33270185, 33496359, 33883358, 34478448, 35370073, 36263022, 37164810, 37975171, 39032236, 40015980, 41126510, 42350055, 43375492, 44198996, 44593610, 44830262, 44937493, 44851225, 44598650, 44291491, 44262877, 44225311, 43965610, 43838899, 43944045, 43960094, 43807711, 43945451, 43580500, 42974419, 42556941, 41557846, 40430221, 39451902, 38617987, 37446011, 36431506, 35967502, 35207212, 34678411, 34361066, 33957381, 33760885, 33605238, 33659872, 33460841, 33343697, 33082866, 33163632, 33239459, 33028071, 32856607, 32709269, 32709337, 32620786, 32507597, 32585304, 32620645, 32498336, 32619731, 32640009, 32590625, 32692743, 32945039, 33272119, 33569927, 33716268, 34039180, 33866408]
3592C3866408K02524J48998J43666K84337L63837J57474K55140L22267L80605
3583C6125256q513R9963M82554K00562K60002L2739q45L97009L44560J54868L57280
3572C8445435L82143M81129M01166M31554J73345N18929N68403M87736P36120
3563D2625960O31371Q05248N74097L74126M93797K68122J26865J72295N1548L54912
3553D6478341M34580M05558L61421N13961P77987N16257M78366R52184P16801
3544E1635456N18298P14871J140824J193475Q03449J168399Q45375R30020R24462
3535E9874629P22195O62386R30944O77160P95208P52202Q43374Q04687Q78166
3526F6940951J029399R63445R40253J040263J271334J076520J259146J310642
$$ y = [33866408, 34068932, 34217930, 34361596, 34645933, 35009770, 35167244, 35422384, 35744651, 36125256, 36116743, 36216706, 36699260, 36899822, 37159824, 37192563, 37191718, 37588727, 37933287, 38088155, 38445435, 38827578, 39308707, 39709873, 40141427, 40314772, 40833701, 41402104, 41889840, 42625960, 43257331, 44062579, 44636676, 45010802, 45504599, 45772721, 45899586, 46071881, 46123429, 46478341, 46912921, 47318479, 47679900, 48193861, 48971848, 49488105, 49966471, 50918655, 51635456, 52153754, 52868625, 54009449, 55202924, 56006373, 57174772, 58020147, 58950167, 59874629, 60596824, 61259210, 62190154, 62867314, 63662522, 64414724, 65258098, 66062785, 66940951, 67970350, 68933795, 69874048, 70914311, 72185645, 73262165, 74521311, 75831953]
3518G5831953J169531J260826J549736J574731J754670J750536J540190J868203
3510H8300376J835131J840741J859915J913636K279397K767733K965232L081889
3502A06844050L692038L896892M357373M746902N149467N622766O391557O985035
3494A47686080P451662P769655P744289P547972P220002O177823M702269K624684
3486A98924436j78064l185408n854110p540008q458490q395053q074154p350228
3478A49888921o282457n053792m216341l247594k487626k940582l259036l601273
3470A18800220l784952l160656k902973k565317k360266j820394j470155j277793
3462I9457714q19591o51114j207527r47783p22530r11765j89856K76966J059858
$$ y = [75831953, 77001484, 78262310, 79812046, 81386777, 83141447, 84891983, 86432173, 88300376, 90135507, 91976248, 93836163, 95749799, 98029196, 100796929, 103762161, 106844050, 110536088, 114432980, 118790353, 123537255, 128686722, 134309488, 140701045, 147686080, 155137742, 162907397, 170651686, 178199658, 185419660, 191597483, 196299752, 198924436, 198746372, 195560964, 189706854, 182166846, 173708356, 165313303, 157239149, 149888921, 143606464, 138552672, 134336331, 131088737, 128601111, 125660529, 122401493, 118800220, 115015268, 111854612, 108951639, 106386322, 104026056, 102205662, 100735507, 99457714, 98638123, 97987009, 96779482, 95831699, 95109169, 94197404, 94007548, 94284514, 95344372]
3453I5344372K051627L528861N042631O130362L405620m137959p688660o614637
3445I7062217n146287l067386j411048k82919o23728j936738k748923k767726
3437G9077462l015824l039007k674335k501385j827846j149883n23042n65786
3429F3780354k05610Q7940K64537J190173K398749L745317N740658O652716J620627
3420H5275461n171071p147403o015439n054216l508421k225697j467559q41854
3412E3843801m59859J20174N87661N69283K55824l09550k09091P34862J605054
3403E6738159K444780K961541J919779j495093m733792m985727m166415l090233
3395D5592999k324262j958388j422820r42576q31750p20837p93271n05739l60171
$$ y = [95344372, 97395999, 100924860, 105967491, 112097853, 115503473, 111365514, 103676854, 97062217, 91915930, 88848544, 87437496, 87154577, 86530849, 84594111, 81845188, 79077462, 76061638, 73022631, 70348296, 67846911, 66019065, 64869182, 64346140, 63780354, 63574744, 63662684, 63927221, 65117394, 67516143, 71261460, 77002118, 83654834, 85275461, 80104390, 72956987, 66941548, 61887332, 58378911, 56153214, 54685655, 53843801, 53383942, 53504116, 54091777, 54661060, 54916884, 54607334, 54398243, 55133105, 56738159, 59182939, 62144480, 64064259, 62569166, 57835374, 52849647, 48683232, 45592999, 43268737, 41310349, 39887529, 38944953, 38113203, 37392366, 36599095, 36093356, 35733185]
3386C5733185k48907k18554k55720j38537L2916K47021M19559O35226J165027
3377C7371216J854128K549572L322811L745790K182746j955763m346933m296053
3369D0427514l475064k860116k120575j360939r63032q99974p96360n02718n84290
3360B6864446k61433n70137p89411m49176l62547l92855j74869o7445n64812l17687
3350B2914074l21506m07937r4626j26463k12601l9373m69017k20246R5182k75244
3340B0842243j32509o7459k99176N1821P2529k82233j87868k25779k12387M8181
3330A9607363J1625j14442j69632K9552J81324m06532l61904j04949o9930Q1864
3320A8684339j79248k09970j27201j44416j50489j66724J7978n8010l28972m8357
$$ y = [35733185, 35484278, 35265724, 35010004, 34871467, 34904383, 35151404, 35570963, 36206189, 37371216, 39225344, 41774916, 45097727, 48843517, 51026263, 49070500, 44723567, 40427514, 36952450, 34092334, 31971759, 30610820, 29647788, 28747814, 27951454, 27448736, 26864446, 26603013, 26032876, 25243465, 24794289, 24431742, 24038887, 23864018, 23796573, 23231761, 22914074, 22592568, 22184631, 22090005, 21963542, 21750941, 21711568, 21242551, 21022305, 21117487, 20842243, 20709734, 20642275, 20343099, 20394920, 20467449, 20185216, 19997348, 19771569, 19559182, 19607363, 19618988, 19504546, 19334914, 19364466, 19545790, 19139258, 18777354, 18672405, 18602475, 18684339, 18505091, 18295121, 18167920, 18023504, 17873015, 17706291, 17724269, 17666259, 17337287, 17288930]
3310A7288930k31170k08507K6671r3789j19818R0113j02727k2598J57884k28630
3300A6556359j29960p3424m8911l23522n41299J34732o4590J4863j10299N1772
3290A5465721j50797K5166J275k11994q7390k02436M7733j77957J04128k97087
3280A4516362j20131j0751k25060k87021r410J12788j69420k02653N3049j15856
3270A3541897j21299Q9232j30054k7860L9780J12482L2170j34337j07771L26688
3260A3620928O4627o5836J14159O8251J37814l9949p3374K93912J49846J0671
3250A4281049L778O132N6544j58320K05257m4814O7517J73794Q3923J00253J5584
3239A4790697o9992m3634K22686M36673K60552K40700J49342J78732M62011P6347
$$ y = [17288930, 17057760, 16849253, 16875924, 16782135, 16662317, 16752430, 16649703, 16627105, 16784989, 16556359, 16426399, 16352975, 16304064, 15980542, 15439243, 15573975, 15509385, 15524248, 15413949, 15465721, 15314924, 15340090, 15341365, 15129371, 15041981, 14839545, 14887278, 14709321, 14813449, 14516362, 14396231, 14385480, 14160420, 13873399, 13863989, 13976777, 13807357, 13604704, 13657753, 13541897, 13420598, 13509830, 13379776, 13351916, 13391696, 13504178, 13536348, 13402011, 13294240, 13620928, 13685555, 13619719, 13733878, 13802129, 13939943, 13899994, 13826620, 14120532, 14270378, 14281049, 14284827, 14290959, 14347503, 14189183, 14394440, 14349626, 14417143, 14590937, 14674860, 14775113, 14790697, 14720705, 14677071, 14899757, 15336430, 15596982, 15837682, 15987024, 16165756, 16627767, 16704114]
3229A6704114P4747J12024J47204J27329o5350L79401J69736M03246J23499J78155
3219A8354105L11004N8214J81878j29011q522K33676J05624n0758Q2093L93517
3209A9531820L45290Q7990K03673j26356Q1239K87245N06835O56933L79811O06723
3199B2561203N87059O57150L15456N1825K67931J04915J67814M98870O12854P78651
3189B6603728R13378O60369N29906N09490K57179N56741M93718M71619P00867
3180C1696995O03897P51745P25880Q35166O85521N19289O40131M40723K58857
3171C7158204M62298N54558K12845M80293O44385M94006K10159L44864N88137
3162D1149749K92820Q45324R51177P79650J360840J262443J282174J378514J800495
$$ y = [16704114, 16778861, 16890885, 17038089, 17165418, 17100068, 17479469, 17649205, 18052451, 18175950, 18354105, 18665109, 18723323, 18905201, 18776190, 18767668, 19001344, 19106968, 19056210, 19138303, 19531820, 19877110, 19965100, 20168773, 20042417, 20123656, 20410901, 20917736, 21574669, 21954480, 22561203, 23148262, 23805412, 24120868, 24172693, 24440624, 24545539, 24713353, 25212223, 25825077, 26603728, 27517106, 28177475, 28707381, 29216871, 29474050, 30030791, 30524509, 30996128, 31696995, 32300892, 33052637, 33778517, 34613683, 35299204, 35818493, 36458624, 36899347, 37158204, 37620502, 38175060, 38387905, 38868198, 39512583, 40006589, 40216748, 40561612, 41149749, 41442569, 42287893, 43239070, 44018720, 45379560, 46642003, 47924177, 49302691, 51103186]
3153E1103186J807486J769928K251310K099910K380149K182551J918286R19678
3145F6432484M49658l34976j552038k196266k515669k181047j863026j682166
3137E4556954j140693n83913m01473n2685K81103N13076N40936R40080J350834
3128E6004219J101089J500449J350252J335798J535219J434148J193106J179172
3120F6633452R19204M20631j19420q41037j351373j748038j945504j961022k688843
3111E7318050k459035k147820k259664j641156j348467j133352p41985n72914
3103D5013657m37746J66395J38995J21364K44200J81766j13147q8653k71018o60423
3093D4295390o88598j006812j043374j264709j798255j984301j838117j805201
$$ y = [51103186, 52910672, 54680600, 56931910, 59031820, 61411969, 63594520, 65512806, 66432484, 66882142, 66547166, 64995128, 62798862, 60283193, 58102146, 56239120, 54556954, 53416261, 52832348, 52430875, 52378190, 52659293, 53172369, 53713305, 54653385, 56004219, 57105308, 58605757, 59956009, 61291807, 62827026, 64261174, 65454280, 66633452, 67552656, 67973287, 67853867, 67012830, 65661457, 63913419, 61967915, 60006893, 57318050, 54859015, 52711195, 50451531, 48810375, 47461908, 46328556, 45586571, 45013657, 44575911, 44742306, 44881301, 45002665, 45246865, 45428631, 45315484, 45226831, 44955813, 44295390, 43606792, 42599980, 41556606, 40291897, 38493642, 36509341, 34671224, 32866023]
3085C2866023j813222j476313j435342j237686j012553j346498q87478o93538
3077B2963393r85729m16415o47021p38842o36713l52343l21531m72681k91662
3068A8100456n2312k52676m95322n89180k49066k77195l41998q74210n48452l93188
3058A4026857m87245o85339k43877N0843m45553l18149l13025l09828k86743k40366
3048A0747575l04242l72820l04301k80113j17146o4546j73285l4322q1913j08227
3038H906660j77813k73570j92519Q9983Q6036j61701m9153j39914l55587j3265
3028G719157j45505l2271k6852l35884k22623j79644k41672K3648k20948l1642
3018F305764j60518j25485k94127l20466m1307O4922L098j09346k16100J46865
$$ y = [32866023, 31052801, 29576488, 28141146, 26903460, 25890907, 24544409, 23656931, 22963393, 21977664, 21561249, 20914228, 20175386, 19538673, 19186330, 18864799, 18392118, 18100456, 18048144, 17795468, 17300146, 16710966, 16461900, 16184705, 15842707, 14968497, 14420045, 14026857, 13539612, 12854273, 12610396, 12661239, 12215686, 11897537, 11584512, 11274684, 10987941, 10747575, 10443333, 10070513, 9766212, 9486099, 9368953, 9304407, 9131122, 9096800, 9014887, 8906660, 8728847, 8455277, 8262758, 8352741, 8438777, 8277076, 8227923, 8088009, 7732422, 7719157, 7573652, 7541381, 7514529, 7178645, 6956022, 6776378, 6534706, 6558354, 6337406, 6305764, 6145246, 6019761, 5725634, 5405168, 5363861, 5428783, 5431881, 5322535, 5106435, 5253300]
3008E253300j53668N0070j6754j069K9139n2012k24401Q5538m9260j65926k33143
2997D521814j12104M40809j73716l73252k17492K13361J1711r7135k38755j50659
2987C824582o2739j20930l54936p7695J76790R2841L0924k6935l70569M2062j25971
2976C027424q0433L0336m8240j72676q0593J49792Q6604J24615l0231k65894k34617
2965B506087j01789j12690O9524j8573k1951Q2146O3411j81878Q9764R6598n1323
2954B419326p2744j33592k71108j17516L87484K03898j33921R177O9073j45137
2944B214940k9597J05950m4850l84167L5838P2450J52285p9264j60429k39579
2934A643577m9276M52555J10251j75454j91538P672o3451p3521J74148P202J26173
$$ y = [5253300, 5099632, 5149702, 5132948, 5131879, 5161018, 5109006, 4884605, 4970143, 4920883, 4754957, 4521814, 4409710, 4850519, 4676803, 4303551, 4086059, 4299420, 4311131, 4213996, 3975241, 3824582, 3761843, 3640913, 3285977, 3208282, 3385072, 3477913, 3508837, 3481902, 3111333, 3153395, 3027424, 2946991, 2977327, 2929087, 2756411, 2675818, 2825610, 2912214, 3036829, 3006598, 2740704, 2506087, 2404298, 2291608, 2361132, 2342559, 2320608, 2402754, 2466165, 2284287, 2374051, 2470649, 2419326, 2346582, 2212990, 1941882, 1824366, 2211850, 2415748, 2281827, 2291004, 2360077, 2214940, 2185343, 2291293, 2246443, 1862276, 1898114, 1970564, 2122849, 2043585, 1883156, 1643577, 1594301, 2046856, 2157107, 1981653, 1790115, 1797787, 1734336, 1660815, 1834963, 1842165, 1968338]
2923A968338n6338l36983Q7987J31289J10704l5056j73541K08116k95263O3732
2913A672985J02059j53390R985J29306N3477q7283r9052m5501L4439j37032j5169
2902A464824j03612j29397J15695K51021m3J70071k19905p025O6787j6341j30568
2891A461507J00224m9117j19916j67R6361j19098M6378o3018k38848J00018N305
2880A219629K71499J89664k11814n0841o8456Q5428m2922q6290N9691r8016j50732
2869A116840J14908J26982r7350J04522l1186L4586K17811l267j88101j48659
2859A247086J59702J2877j68400j29453P1902R6656N3185M5717n8355k75411j53383
2848I02123L2014K95855l2419m9620l9501R392k6277j47095J05613L0226Q1244
$$ y = [1968338, 1912000, 1575017, 1663004, 1794293, 1904997, 1869941, 1696400, 1904516, 1609253, 1672985, 1775044, 1621654, 1631639, 1760945, 1814422, 1727139, 1628087, 1582586, 1617025, 1479993, 1464824, 1361212, 1231815, 1347510, 1598531, 1598488, 1768559, 1548654, 1541629, 1608416, 1592075, 1461507, 1561731, 1512614, 1392698, 1392531, 1488892, 1369794, 1416172, 1353154, 1114306, 1214324, 1219629, 1491128, 1680792, 1468978, 1418137, 1349681, 1435109, 1392187, 1305897, 1365588, 1267572, 1116840, 1231748, 1358730, 1261380, 1365902, 1334716, 1369302, 1587113, 1583846, 1395745, 1247086, 1406788, 1419665, 1251265, 1121812, 1193714, 1290370, 1343555, 1389272, 1330917, 1055506, 902123, 934137, 1229992, 1197573, 1147953, 1108452, 1117844, 1091567, 944472, 1050085, 1080311, 1161555]
2837A161555M7144N1128J1497R840k26413n2336N2270l5245o6279K69054J8721
2826A240936k14952n694m2988J19254p2097J1932L19866k83175j67750o6139k5739
2815H13454L1814j01454Q7480J21062j46846o9503R0891L2545P3541J2762o6956
2804H78790j64225l2745K05468p6640J23956R8869K83330l64760l03998J43507
2794G91552o9768j39357P9667K0357P6141J60368R4356j3080K5946l21301j71484
2783E33397N6531L06925k7346k39462K6420K6410J74140o0175q0624j03841O8479
2772F80854O2584r6873j72070J9384J07739N206p6353k6591q3645K76633n9461
2761F37407k0159J32520R950K1941j40799R6710K6603q524q4202j15825l705n5009
$$ y = [1161555, 1208699, 1259827, 1271324, 1281164, 1054751, 1002415, 1054685, 1019440, 953161, 1222215, 1240936, 1025984, 1020290, 977302, 1096556, 1024459, 1036391, 1356257, 1073082, 905332, 839193, 813454, 845268, 743814, 831294, 952356, 805510, 736007, 826898, 859443, 932984, 945746, 878790, 714565, 681820, 887288, 810648, 934604, 1033473, 1316803, 952043, 648045, 791552, 721784, 582427, 662094, 682451, 758592, 918960, 1013316, 1000236, 1026182, 704881, 533397, 589928, 896853, 869507, 630045, 656465, 682875, 857015, 796840, 716216, 612375, 680854, 743438, 646565, 474495, 493879, 601618, 606824, 530471, 503880, 420235, 696868, 637407, 617248, 749768, 759718, 781659, 640860, 737570, 764173, 755649, 671447, 555622, 551917, 496908]
2749D96908j48579l937N2152O2946J33476k98590J13721M9673J97350j04886P5158
2738F25392J03704n4410r6036r2135J99524j01375J9110P9644j42406J5271r2887
2727D63396r06J27464J84291j64129k7702r560l78228j15736J60788J68456J12990
2716E21124L6663J608N0936j97753N7824J87280j01223k02737j47028J85362M0417
2705D32473J21159j20571J24087j16705l11461J3209L14371L09691l49659O4044
2695D80638K21712j44631j90360P2616M867R9338k78306j84121Q8635K30732j63229
2684B37891j3689K18867k45025r7568J99219K511J15935l8945k01353R2358J10722
2673C80923r6999j14841J8924M8359q9031L7836K00283j68787n8489J0551P1915
$$ y = [496908, 348329, 344392, 396544, 459490, 592966, 294376, 408097, 457770, 655120, 550234, 625392, 729096, 674686, 578650, 486515, 686039, 584664, 603774, 683418, 541012, 556283, 463396, 462490, 589954, 774245, 610116, 582414, 572854, 194626, 78890, 239678, 408134, 521124, 557787, 559395, 610331, 412578, 470402, 657682, 556459, 353722, 206694, 392056, 432473, 553632, 433061, 557148, 440443, 128982, 142191, 456562, 766253, 416594, 480638, 702350, 557719, 367359, 439975, 444842, 544180, 265874, 81753, 170388, 401120, 237891, 224202, 443069, 198044, 100476, 299695, 302206, 418141, 379196, 177843, 270201, 380923, 283924, 169083, 188007, 236366, 147335, 185171, 385454, 216667, 158178, 168729, 240644]
2662B40644J33078M6649j05820J10340J44845k55080k01855L8409K61375j39122
2652B73463n4633O9049J41137j8109J1018j14792P4852m1362q7597P238l3261
2641B27003P930L530M8319J27037N7193L230j11002R2968J5475K0328l34453M1129
2629A98687J60104M4569O1342j12112K30768j09862l406n9865p1249j52976K27909
2618D13909K09946K26602J07458n6363p0219o0058j53651R4941J5713k47135k16444
2607B64699O6910l19144K76228L64738R3970j24075m51227O6436K0837J09318
2597C68690L508j11501q5727K91939r9139J6527O0863j62222L0374j77876k0565
2586A14871J93421K26657k58539Q8480J2366r7483j71282L54997K086k12707l7762
$$ y = [240644, 373722, 420371, 314551, 424891, 569736, 314656, 112801, 151210, 412585, 273463, 218830, 287879, 429016, 410907, 421925, 307133, 381985, 340623, 253026, 260264, 227003, 234933, 238463, 286782, 413819, 471012, 474242, 363240, 456208, 471683, 492011, 157558, 198687, 358791, 403360, 464702, 352590, 583358, 473496, 470090, 410225, 338976, 186000, 413909, 623855, 850457, 957915, 901552, 831333, 771275, 617624, 712565, 728278, 481143, 264699, 331609, 12465, 288693, 653431, 747401, 623326, 172099, 238535, 259372, 368690, 372198, 260697, 174970, 466909, 367770, 384297, 445160, 282938, 313312, 135436, 114871, 308292, 534949, 276410, 364890, 377256, 279773, 108491, 463488, 465574, 252867, 215105]
2575B15105N1278m304J88577r2465j20381J13998j02375j27524K33168M1360j45400
2564B51037P958k8931k1148m6823P3859j34097J07483p0749R0299m2543N6264
2553B42609L2734p669J42846o1224k17917K32255K1365R5598k34176J30215P0690
2542D47326O7277M3123j81122n1860j8417n2522M5082K84382j4392j78092Q5184
2531D75969L9586o2054M1481P4334l16997j093K46504J6926j41802J0928o1803
2520C21979q2096j38981Q4174J69630q1602j01996J16536K32635J06342r4590
2510E32031l3865J98170J31859J50837J77824j11502j41554q4453O8636j8956
2500H69027m18619N8448n9595l8322j40662K38302J56737N2263K9003j887j51234
$$ y = [215105, 266383, 262079, 450656, 358191, 237810, 351808, 249433, 121909, 355077, 396437, 251037, 258995, 230064, 208916, 162093, 235952, 101855, 209338, 138589, 228888, 186345, 242609, 275343, 267674, 410520, 349296, 131379, 363634, 384999, 480597, 246421, 376636, 447326, 514603, 557726, 376604, 324744, 306327, 253805, 298887, 583269, 568877, 390785, 475969, 515555, 453501, 494982, 569316, 252319, 251226, 497730, 514656, 372854, 383782, 321979, 239883, 100902, 185076, 354706, 273104, 171108, 287644, 520279, 626621, 532031, 498166, 696336, 828195, 979032, 1156856, 1045354, 903800, 819347, 887983, 869027, 450408, 508856, 449261, 410939, 270277, 508579, 665316, 717579, 746582, 744695, 593461]
2489E93461J69581J53291l3111Q3447n9988m2866k1351J54235K3921J5104l1016
2478A004708J10392O5496j37896K77J70920J79523p2861j70382q2912K200q2814
2467I86651K3783J9175P2208N1318J21371J13256M8595k49866j0058K80930J6072
2456A473435k66273k6961Q5755J03473M7148O0247J60228P5807l1108M01503J60015
2445B243269J28895L6515j24224l0817j59632L3871j50027K23435L34485K67179
2435B802949k8395n2454q7865j2989J02459o0183N3430n3999J5099K79962P6278
2424C034292J09027p1638J71151J45811j5428P1023p5578O796k8830J83347K52194
2413C782167j5221K96250K17999j46079N0003J56736Q8030m0818p5789K98488
$$ y = [593461, 763042, 916333, 883222, 966669, 906681, 863815, 842464, 996699, 1020620, 1035724, 1004708, 1115100, 1180596, 1042700, 1042977, 1213897, 1393420, 1320559, 1150177, 1067265, 1069465, 986651, 1010434, 1029609, 1101817, 1153135, 1274506, 1387762, 1436357, 1186491, 1176433, 1457363, 1473435, 1207162, 1180201, 1265956, 1369429, 1416577, 1476824, 1637052, 1712859, 1681751, 2083254, 2243269, 2372164, 2408679, 2284455, 2253638, 2094006, 2127877, 1977850, 2201285, 2535770, 2802949, 2774554, 2722100, 2634235, 2621246, 2723705, 2663522, 2716952, 2662953, 2678052, 2958014, 3034292, 3143319, 3071681, 3242832, 3388643, 3373215, 3444238, 3368660, 3375456, 3346626, 3529973, 3782167, 3766946, 4063196, 4281195, 4135116, 4185119, 4341855, 4429885, 4389067, 4313278, 4611766]
2403D611766K44816k5575J70285K66452L09979J52729K21618o610J50158M97949
2393F593567K10419J88083L96720M70267L14807O9882K12393K80500L46818L47351
2383I430807N38040M40990K46406N70978K78591L41855K58905K73657M34272L84597
2373A3199098M72861N84509L46701P23153N20780M63115P47207R90376J075804
2364A9123604J295699J968793J902365J497857O98567J002938J582239K086532
2356C1158594K979569L903752N520397P014213R411822J3484016J8193812K5259761
2348A16925936L3126676K4473804j0078226l1889589k8266907k3678623j7795789
2341F2817282j1938870q676748o447231m815717l740789k602374j857748j404975
$$ y = [4611766, 4856582, 4831007, 5001292, 5267744, 5577723, 5730452, 5952070, 5945460, 6095618, 6593567, 6803986, 6992069, 7388789, 7859056, 8173863, 8243745, 8456138, 8736638, 9083456, 9430807, 9968847, 10409837, 10656243, 11227221, 11505812, 11847667, 12106572, 12380229, 12814501, 13199098, 13671959, 14256468, 14603169, 15326322, 15847102, 16310217, 17057424, 18047800, 19123604, 20419303, 22388096, 24290461, 25788318, 26486885, 27489823, 29072062, 31158594, 34138163, 38041915, 43562312, 50576525, 59988347, 73472363, 91666175, 116925936, 150052612, 174526416, 164448190, 132558601, 104291694, 80613071, 62817282, 50878412, 42201664, 35754433, 30938716, 27197927, 24595553, 22737805, 21332830]
2333B1332830q63441q73270j255587j720436j748018j204441j084950j217038
2325A1365649j002094r33926o30131l83542m33550l97736l42414n36489k92384
2316F413383l11713l68169l38927k99538k13655J59020o2189j95238j77343k02250
2306D403381j73201k02844j48721k25255n9169j35645k2887p7281l9520l62318
2296B956540m19184L5765m8842n2537p1813k60014j17327L14593R9147j73256
2286B263072k22537Q2721m3083k39108Q1075m5063K7938k4183k07558k07987j56063
2275A309224J05649p575J15821n420j79884J048K0066q6383k7691J19390k516
2264A361729L74947j41270j11572j86412l23321O7507r8925j61505m83O6731J01829
$$ y = [21332830, 20469389, 19596119, 18340532, 16620096, 14872078, 13667637, 12582687, 11365649, 10363555, 9429629, 8799498, 8415956, 7982406, 7584670, 7242256, 6705767, 6413383, 6101670, 5733501, 5394574, 5095036, 4881381, 5040401, 4978212, 4782974, 4605631, 4403381, 4230180, 4027336, 3878615, 3653360, 3594191, 3458546, 3435659, 3358378, 3318858, 2956540, 2537356, 2573121, 2524279, 2471742, 2399929, 2139915, 2022588, 2337181, 2436328, 2263072, 2040535, 2123256, 2080173, 1841065, 1922140, 1877077, 1905015, 1880832, 1673274, 1465287, 1309224, 1414873, 1407298, 1523119, 1517699, 1337815, 1338863, 1358929, 1272546, 1244855, 1364245, 1361729, 1736676, 1595406, 1483834, 1297422, 974101, 1041608, 942683, 781178, 780695, 847426, 949255]
2253I49255K64981j60102r2089j51310k47965N2415J9342j22160k14908J51907
2243D49366J58103n4161n2366J45701R47l415J32915j8813l1039j64780m0272
2232E22186k1141Q9738O8912J78646l28896n6626K05474k214L9350m4909k03620
2221D46900k60548r6234R0131K10020j47053j06505M1250J10163j15578p9724
2211I2822J8412J35879J6218k34870J13559P8725n761J8982K13551j04916m9973
2200B92628K9249R3850J66401k3966j70031m2935j03554p8066n9661l6652O0530
2189A27793j23820K9086J30323j00196P9878j52923m2784J60711N8490L22094
2179D88652j3295O3883m4735K7948k1827J51915K3960k20118k19414J6746j6239
$$ y = [949255, 1214236, 1054134, 962045, 810735, 562770, 615185, 634527, 512367, 297459, 449366, 607469, 553308, 500942, 646643, 647590, 644175, 777090, 758277, 727238, 562458, 522186, 501045, 590783, 659695, 838341, 509445, 452819, 658293, 656079, 695429, 650520, 446900, 186352, 90118, 180249, 390269, 243216, 136711, 177961, 288124, 172546, 92822, 111234, 247113, 263331, 28461, 142020, 220745, 214984, 233966, 447517, 342601, 292628, 321877, 415727, 582128, 558162, 388131, 345196, 241642, 163576, 103915, 67263, 127793, 3973, 33059, 163382, 63186, 143064, -9859, -52643, 108068, 166558, 488652, 475357, 539240, 494505, 522453, 500626, 652541, 676501, 456383, 236969, 253715, 237476]
2168B37476J4487j44583m858L04536j06952j08809j20513L95106m2912j80824
2158B42154J89870k05776k4760j4975p4729n8836l8336j73191P5543J07384j8400
2147E948l8353J03767J4737J57394O8845j38301K7447K7887k20017P799n7807
2136d0654K6881R151L3648j04680M8326k6416o1727K08016O9356j61264j07846
2125a07209R3885Q0374O0193P2691K8633l9818j38288j09222J54671k33843K33690
2114I5757M6234p628N5629J02598j38868j39509L9961l0336j10161P3702q8965
2103a01586o9587o4192R4120R0672p963P8767J34773K31807j61894j30177J20166
2092B14906k29191o660K92401L9107j10743r7215J66246l0317K30655j02273R5721
$$ y = [237476, 251963, 107380, 102522, 407058, 300106, 191297, 70784, 465890, 422978, 242154, 432024, 226248, 201488, 186513, 111784, 52948, 14612, -158579, -83036, 24348, 5948, -32405, 71362, 86099, 243493, 312338, 174037, 201484, 229371, 9354, 17153, -40654, -13773, -4622, 29026, -75654, -27328, -53744, -115471, 92545, 161901, 637, -107209, -13324, 67050, 127243, 199934, 228567, 188749, 50461, -58761, 95910, -137933, 95757, 141991, 134363, 189992, 292590, 153722, 14213, 54174, 23838, -86323, -12621, -101586, -171173, -235365, -141245, -50573, -58536, 20231, 155004, 386811, 224917, 94740, 214906, -14285, -20945, 271456, 310563, 199820, 102605, 268851, 238534, 469189, 366916, 462637]
2081D62637J66007p2428Q1601M6871Q8915l7668k58682j74092m9536q6918J44146
2070C10853j00611Q8382q6609M6393r8566L3621q1815r7464J9901k6461R3858
2059A01482P4923N6024m05485P6967K15996j24177p5467L3731J58390j43767o9126
2048a00509k5973N0765J40620j58239J22469n1300o0505K8572J66083J46827N3555
2037C12365m1383o5944j31087j15794j64532O1600o0239K82807J8053l8314K2459
2026G9991o7539M09J0936M2374R0453j00881j9963K8446j31665n2121p6790J00793
2014i5557n819J76497J22317M272j82178o483J48099j27909J6488K7142m4179
2003C2690l6762j11265J16534P5634J32658L9812o6335j03825l52j44867R3759
$$ y = [462637, 628644, 556216, 637817, 684688, 773603, 735935, 477253, 303161, 253625, 166707, 310853, 210242, 298624, 212015, 258408, 159842, 193463, 111648, 14184, 34085, 7624, 101482, 176405, 232429, -173056, -96089, 119907, -4270, -79737, -46006, 112384, -31383, -100509, -126482, -75717, 64903, -93336, 29133, -22167, -82672, -54100, 111983, 258810, 312365, 270982, 205038, 73951, -41843, -206375, -144775, -205014, 77793, 95846, 57532, 79991, 12452, 12861, 23797, 66171, 156624, 55743, 35780, 64226, -67439, -119560, -196350, -95557, -101376, 75121, 197438, 201710, 19532, 13049, 161148, 33239, 49727, 76869, 32690, -4072, -115337, 1197, 76831, 209489, 249301, 182966, 79141, 78789, -66078, 27681]
1992B7681L1683J8516L6015j27328p2929j43665J28753Q1219M0047q923m6389
1981c5320J0756J64107k12017p6789J44483J3514J04564l72592L3546R4145k0338
1970a51941L96147j01332l22925R9893r4666M3173J2027j12828l9748J96245K23286
1959A47331J67432j52212k51232J12674M7225k6862j27241k73295L13970Q7325
1949D5115P7550p9085J468j22730M7616l663n1468L05025r3344j46284P3199L3433
1937H6832p7114o5811N569K30832O4845J64973k36048R436K12425q331o09878
1926b22270j49063J40151J36501m5798J87655k26667j8028L61177k08461o0050
1916a04853P4806J2242j21606M4830j9070P4389k2711o132n9400Q8650J72676
$$ y = [27681, 59364, 77880, 113895, -13433, -86362, -230027, -101274, -20055, 19992, 11069, -35320, -24564, 139543, -72474, -149263, -4780, 8734, 113298, -259294, -225748, -131603, -151941, 244206, 142874, -180051, -80158, -174824, -131651, -119624, -232452, -272200, -75955, 147331, 314763, 162551, -88681, 23993, 71218, 44356, -82885, -356180, -42210, 45115, 122665, 43580, 45048, -77682, -30066, -33729, -85197, 219828, 126484, -19800, 53399, 86832, 9718, -56093, -50524, 180308, 245153, 410126, 174078, 183514, 395939, 387608, -222270, -371333, -231182, -94681, -140479, 47176, -179491, -197519, 163658, -44803, -104853, -30047, -17805, -139411, -94581, -113651, -39262, -61973, -68105, -127505, -38855, 133821]
1905A33821L7006p3584k69895l2354N6508M4870n4976N2257N4843P9327r2203
1894f4380J31898m8807L72j0461p8177m5096J24338O6126l0121J60986l59360
1883a52682k78851J53568K36544R3211j09893j40627K3366r6718P2616J20672
1873g8794R0828K3709n3600J84895J36887l89336n6811K3419p2593l4321L17884
1862I2167q1825k57003J30747P2968J84526l2574J74897m0411l35172j4221K19398
1851A13497k63702j36417K05475n1238P7034m0857M0240J07909j60203k6669K7079
1840a07852P5824J17786k63237p3584J64643K0364j21192L2865P1875j02015O8025
1829a16498j1662P2306m8787j37792J62532J11595j52540k10895O3853J75840
$$ y = [133821, 170827, 97243, -172652, -205006, -148498, -103628, -158604, -106347, -51504, 27823, -64380, 67518, 18711, 19083, 8622, -69555, -114651, 9687, 75813, 45692, 206678, -152682, -431533, -277965, -41421, 51790, -58103, -198730, -175364, -272082, -199466, -78794, 12034, 35743, -17857, 167038, 303925, -85411, -142222, -118803, -191396, -225717, 92167, 10342, -246661, -115914, -42946, 141580, 109006, 283903, 243492, -91680, -105901, 113497, -150205, -286622, -81147, -132385, -55351, -96208, -55968, 51941, -108262, -134931, -107852, -32028, 85758, -177479, -251063, -86420, -66056, -187248, -154383, -82508, -184523, -116498, -128160, -55854, -104641, -242433, -79901, 31694, -120846, -331741, -267888, -92048]
1819i2048q409r6890L01889K5167k05165l6625K41518R5488q2479j36837J3215
1808A8824j11043j23508J29048j75748J5953k61338J05373J04863R8990O5992
1798a32594N3136Q7395j23174P2998n0486p5183m5522J00349j20223j60179J31614
1787b61869l6125J19184K2271r6835J17784l2218j35525K10099K14129n3530l2420
1776C4945m4319J2848N3075J28560j52429k27998j08748R4198J32108K97534j58311
1765F1463k11858O6222p615P6786l1642J47175J37011n1820k54858M0640P0645
1754D2149J21518J28824l19184J28555J7918J24501r8745J6780p8249j08825Q0412
1743E5654K36556j05730k02087J97615j83992j69146K04779j12779n0634K21430
$$ y = [-92048, -100457, -197347, 104542, 129709, -75456, -112081, 129437, 224925, 142446, 5609, 18824, -92219, -215727, -86679, -262427, -246474, -507812, -402439, -297576, -198586, -132594, -79458, 7937, -115237, -42239, -92725, -167908, -213430, -113081, -233304, -393483, -261869, -297994, -178810, -156539, -253374, -135590, -167808, -303333, -93234, 120895, 67365, 34945, -9374, 3474, 56549, 185109, 32680, -195318, -304066, -209868, -77760, 219774, 61463, -150395, -84173, -91788, -15002, -46644, 100531, 237542, 185722, -69136, -28496, 42149, 163667, 292491, -26693, 101862, 119780, 244281, 145536, 162316, 84067, -24758, 55654, 292210, 186480, -15607, 182008, -1984, -171130, 33649, -79130, -129764, 91666]
1733I1666j13096R5248k48797J29537j03620l5554O8972K36424p819n1851r4255
1722c3145j45902O3729Q7454J58514N1593j47749j33131Q4779J32998j19340L2391
1711C2191j16782k86750J59558k3637J43703J35769K6188k11240J15512L60961
1701C35473k5024k52097K3601K0440p30R766j0894J3059l2706K1179r560j31672
1689c9165j43290P3113L31021l2434k12537n1519j1135j43187j7152k2897K19582
1678d9600L77370k63709m3154J00993k61711j77549L2293K01177K10029K9500
1668A55639n1633J1462J28769k32955j2639K37466M0519l20513k79877N5339K15923
1657e2500j8375j30347J57630J01922L8497j99722k26093k9118K77291J17514
$$ y = [91666, -21430, 73818, -174979, -45442, -149062, -184616, -115644, 120780, 112961, 61110, -33145, -179047, -115318, -27864, 130650, 182243, 34494, -98637, -13858, 119140, -200, 32191, -84591, -371341, -211783, -235420, -91717, 44052, 70240, -141000, -25488, 335473, 310449, 58352, 81953, 102393, 101663, 111429, 100535, 113594, 80888, 102067, 92507, -39165, -182455, -109342, 221679, 189245, -23292, -74811, -85946, -229133, -246285, -269182, -49600, 327770, 64061, 20907, 121900, -139811, -317360, -285067, -83890, 126139, 155639, 104006, 115468, 244237, 11282, -1357, 236109, 276628, -43885, -323762, -268423, -52500, -70875, -201222, -43592, 58330, 96827, -102895, -328988, -358106, -80815, 36699]
1647C6699o1824j9625j22411J38563j31699q6896P0323J19843j5599j08419P0797
1636a10248J29382J32395O1280k27150J12663L7870q7219j40121M2523K68676
1626B20051k37807N8653m9700k31756j77772N5659J17101Q27K8995K63965n5120
1615f904m4421K2392k10274J3541k1834J38745J53146j10536P7685o9174l5595
1604i3229K3381p7067j9208J47949R7655O524P5083j90210N3561q6365J12363
1593E0437J0356M9265k73015L0262K23870k5259j98908J61011q4449j47302J9124
1582a84608L29494J03336j04281r1250r0322p7690p1691K69768J6037J9775O4184
1571A82752k58707R3903P8629j30573J38119k12305r171M6995j0070j77205M360
$$ y = [36699, -25125, -44750, -167161, -28598, -160297, -247193, -176870, -57027, -72626, -181045, -110248, 19134, 151529, 212809, -14341, 98322, 136192, 48973, -91148, -48625, 220051, -17756, 40897, -8803, -240559, -418331, -362672, -245571, -244744, -215749, 48216, -6904, -51325, -28933, -239207, -225666, -247500, -108755, 44391, -66145, 11540, -57634, -93229, -69848, -146915, -166123, -18174, 79481, 86005, 161088, -29122, 24439, -61926, 50437, 60793, 110058, -162957, -132695, 91175, 65916, -132992, 28019, -56430, -203732, -184608, 144886, 248222, 143941, 52691, -37631, -115321, -187012, 82756, 98793, 118568, 182752, -75955, 17948, 96577, -33996, 104123, -108182, -117353, -70358, -80428, -257633, -253273]
1560b53273j3343L00831j13782Q0295j02389k4227J9219M8617m5105m6611r295
1549a59063J61899m4252K7544J19627J06383O8068j49947j43198q2056k46624
1539c41619J01435j18300O6538J19262M1944K65550R0500k01613j7205N9975n2015
1528A4452n4670J49076J80666q0326k17544j66846J04536m0394P0791Q6688j22921
1517g6492N9520L7377n9700J15845J65516k50731j01145J17701K5581J84079j12154
1506A05397k38843j23418O3438J42782P202P0819J55668M2966j02443m3974P8902
1495A58496l77360J34925J71565p5412J0168N2594j07253j8980k4739N2374L1031
1484G409q5895q1578K95812j07084o5345k51647J69453N1922L6330J5841l4101
$$ y = [-253273, -266616, 34215, -79567, 728, -101661, -125888, -106669, -58052, -103157, -149768, -159063, 2836, -41416, -13872, 105755, 212138, 280206, 130259, -12939, -94995, -341619, -240184, -358484, -291946, -172684, -130740, 134810, 225310, 23697, 6492, 66467, 14452, -40218, 108858, 289524, 209198, -8346, -175192, -70656, -111050, -40259, 46429, -76492, -16972, 20405, -39295, 76550, 242066, -8665, -109810, 7891, 33472, 217551, 105397, -133446, -256864, -193426, -50644, -43442, 27377, 183045, 226011, 123568, 79594, 158496, -218864, -83939, 87626, 12214, 22382, 74976, -32277, -51257, -75996, -23622, 7409, -78486, -160064, 135748, 28664, -36681, -288328, -118875, -66953, -30623, -14782, -48883]
1473d8883l5611j00781J10972J74004k5157n4929N0337K5649o4199o3876q7587
1462a20061M40J56017n8501K17960N8692k30375j53439M302r0694j00500L26785
1451A0626r0750J79555J1641k14126J41704q5695K50911n9822r7427J591j50067
1440a01859K97302n8102l3059m3398q6399j22396L2240j20305J40526m6757J0846
1429a31361L31128j21305J8390K8206Q292l6625j57820l7864o8387j48083K60098
1418e5331J84074j03259J8807q896J6777J17732k37606n4580k7597L31123j59820
1407B1424M6754J9440K6333k8984j69490j33391N0836J34543j18629j72006K2960
1396c00210o938o735J46795R7418Q2827k74541J8389L41323k03071o5874J05028
$$ y = [-48883, -84494, -185275, -74303, 99701, 74544, 19615, 69952, 95601, 31402, -32474, -120061, -119621, 36396, -22105, 195855, 254547, 24172, -129267, -124965, -215659, -316159, 10626, -80124, 99431, 111072, -103054, 38650, -47045, 203866, 144044, 46617, 48208, -101859, 195443, 137341, 104282, 60884, -25515, -147911, -115671, -235976, -95450, -142207, -131361, 199767, 78462, 96852, 125058, 133350, 96725, -61095, -98959, -167346, -315429, -55331, 128743, 25484, 44291, 35395, 52172, 169904, -67702, -122282, -149879, 181244, 21424, 68178, 87618, 113951, 84967, -84523, -217914, -167078, -32535, -151164, -323170, -300210, -307148, -313883, -167088, -69670, 13157, -261384, -242995, 98328, -104743, -170617, -65589]
1385f5589k28415K16419K30182L7661m1966j84398j76710l6974L58772j3987K9019
1374A24014j6857j52360K2350O4367j41663Q26Q9024j22436K4813M1122P6378
1363I578o657j62492L6772J3402O4548N2623q0595k0477K03445j99648M59k40221
1351c29263Q7988L2484J04898J15730J59033O6736l49185j57500r827j1374K70888
1340a9392K36718j81919k81773J36668m354O4932N8470r7308j0206N147P3421
1329a9596j24174j04356J0113J06099j0824J28146k07198O9778n2264J8506K110
1318a83660J53376L3600K02258M8939k59183O457J30140J2325k20363q6135R183
1307a53063p8421J48167J41056p4995O685J43594j23320l6049P6324N2125O1009
$$ y = [-65589, -294004, -77585, 152597, 190258, 148292, -36106, -212816, -249790, 108982, 94995, 124014, 107157, -45203, -22853, 41514, -100149, -99323, -10299, -132735, -107922, -66800, 9578, 2921, -159571, -122799, -109397, -44849, 7774, -72821, -93298, 110147, -89501, -89042, -329263, -241275, -208791, -103893, 11837, 170870, 237606, -111579, -269079, -278906, -290280, -19392, 217326, 35407, -246366, -109698, -114052, -49120, 9350, -87958, -98164, -93017, -19596, -143770, -248126, -238013, -131914, -142738, -14592, -221790, -152012, -204276, -185770, -183660, -30284, 3316, 205574, 254513, -4670, 1787, 131927, 144252, -76111, -162246, -153063, -231484, -83317, 57739, -17256, -10571, 133023, 9703, -26346, 49978, 102103, 163112]
1296A63112J1783j97616M07m0911K29240J1043j55512L4946N4191n7256p4678
1285b1251k4720J87560J26762j5836j2491j35737j5729j33133j13609O3998j23690
1274b17876J11548R8352J44710k30010j46050J59439J44152j49626J2583K8587
1264d4191P0324O3346k6296j1716j536j52111L3614J12112K9011j00817j2675
1253d0935P0731P7620M1095o0995k1045p1428O484r1889r9521K6969L55845q4330
1241A08601j02076m2705j27451K36466J5416l107j0643O507K31083M370j28095
1230A88366o5807o3092j49202Q2271j01855K95599k6387k77206o1189J53256j42130
1219a67376N6296J07062j0613L3520L6864o4959k04351j29257K75853P5706j99879
$$ y = [163112, 174895, -22721, -22314, -63225, 166015, 177058, 21546, 56492, 110683, 53427, -21251, -45971, 141589, 268351, 252515, 240024, 104287, 88558, -44575, -158184, -94186, -217876, -106328, -7976, 136734, -93276, -239326, -79887, 64265, -85361, -72778, -44191, 26133, 89479, 63183, 51467, 49931, -102180, -68566, 43546, 72557, -28260, -40935, 29796, 107416, 148511, 87516, 66471, -4957, 1527, -90362, -189883, -162914, 192931, 108601, 6525, -36180, -163631, 72835, 88251, 85144, 74501, 81008, 312091, 316461, 188366, 122559, 59467, -89735, -7464, -109319, 186280, 159893, -117313, -178502, -25246, -167376, -111080, -4018, -14631, 18889, 55753, -9206, -213557, -342814, -66961, 8745, -191134]
1208a91134K60814M3452r1452J23439j97156M7851n6150K07353j28821j03289
1198h5093j52925l8754K39441J98831L7566n4823j04609k69944J15518l1383L00873
1187A54698o2704j68529L02193k33571k0777m6283J44571L4261j41078k0286O870
1176e0635j0260j81900l1905M6728J46560R3556l9999J36965k4340p2668p465
1165D637j45198J09577K0844J77189N7493j50153K3791L9236r4948j51455q10
1154a09797L28404j68282J1801J59696l50368J3997R1175J52312N9669j1814j98149
1143b1356j26313J7594J19031R2206k12409J17539K08923K01517k72841l30060
1133b06169J81253J05849k20360M3681o7579j5114K38554K10155l81217j36670
$$ y = [-191134, 69680, 113132, 21680, 145119, -52037, -4186, -60336, 147017, 18196, -85093, -238018, -276772, -37331, 161500, 199066, 144243, 39634, -230310, -114792, -146175, 154698, 91994, -76535, 225658, -7913, -28690, -74973, 69598, 103859, -37219, -57505, -50635, -60895, -242795, -274700, -227972, -81412, 12144, -27855, 109110, 84770, 12102, 4637, -140561, -30984, -10140, 167049, 224542, 74389, 98180, 137416, 42468, -108987, -109797, 218607, 50325, 62126, 221822, -128546, -114549, -23374, 128938, 188607, 176793, -21356, -147669, -130075, -11044, 81162, -131247, -13708, 195215, 396732, 123891, -206169, -24916, 80933, -139427, -95746, -163325, -178439, 60115, 270270, -110947, -247617]
1123b47617k1435J11996j46073J65853N8610Q2797j67939k48044M0898R0129J88674
1112i2151Q6014j76383J006R1850M5994j5691N4060j2557J36755J50472m86779
1101b17410K211J96421m3126j98671Q2891O9578K6653P6631n3724k954J05859
1090D4359J38178m9248k53849l2209n6142J66303p500R1699j14445M8925L18588
1079B94659J1062l23238P3918M5775k06855p4355M4274J13416J41701j17689r539
1068f871J05152R9107P8074j23092j43114Q4904J23720r8382j3129r2275L8316
1057E2410J73065n2803j50760q513p9315J86627q7100j20331Q1460o8938r3463
1046a67661K12047k9722j75385R1290L7078j90950N6301L60323j2859P3333r127
$$ y = [-247617, -269052, -157056, -303129, -137276, -78666, 4131, -163808, -411852, -370954, -280825, -92151, -6137, -182520, -181514, -89664, -43670, -59361, -5301, -17858, 118897, 269369, -217410, -215199, -18778, -61904, -260575, -177684, -108106, -81453, -4822, -58546, -61500, 44359, 182537, 133289, -120560, -152769, -208911, -42608, -50108, 41591, -72854, -23929, 294659, 305721, -17517, 56401, 102176, -104679, -179034, -134760, -21344, 120357, 2668, -6871, 98281, 197388, 275462, 152370, 9256, 94160, 217880, 119498, 106369, 14094, 52410, 225475, 172672, 21912, 13399, -65916, 120711, 33611, -86720, -5260, -74198, -167661, 44386, 14664, -160721, -69431, -32353, -223303, -167002, 193321, 180462, 253795, 244668]
1035B44668k80112j72998K50321L1781k47847o1526L29128m9397n9441M15849
1025D00426k72089j98832k4217K36676j1425l28445L62183J16350j60110M5800
1015A66317M7602j63790R457k18147l3505N8079J76893Q809q1957n6191n5904
1004a42337p365j8357K63290j36118J91720M3994l37092R5234L0380J3512L093
993d6M7957n1473k64271J76880m0101J71681k89712J08496J69171L7335k756k22994
981a59833N1939J51398K39646j624j08451k86718j8479Q9324O472p3437o6999
970a76762K3559J29934K42607j00250R7211K0219j59275k4513j47769O5069J1193
959a8777j29834J97683K35145l97258r1572O1943J89486K02320k47400j4465O274
$$ y = [244668, -35444, -208442, 41879, 73660, -174187, -235713, 93415, 44018, -15423, 400426, 128337, -70495, -94712, 141964, 130539, -197906, 164277, 280627, 120517, 166317, 213919, 50129, 59586, -158561, -192066, -133987, 42906, 51715, -30242, -86433, -142337, -149702, -168059, 95231, -40887, 150833, 194827, -142265, -47031, -16651, -3139, -46, 47911, -3562, -267833, -90953, -131054, 40627, -249085, -140589, 28582, 65917, 63161, -159833, -107894, 43504, 283150, 281526, 173075, -113643, -132122, -42798, -36326, -109763, -176762, -153203, -23269, 219338, 119088, 216299, 236518, 77243, 52730, -95039, -29970, -18777, -148611, 49072, 284217, -113041, -204613, -142670, 46816, 249136, 1736, -12729, -6455]
948f455l6729K16522k25716j34149J76972m7313j93266M0921J12710m677J7007
937h4173K62462m3714j78281L5731k73555l0277J49011O755J5451J00765J49543
926A09718Q4787J2040k91430N8321K80681r8895L756k2452m43o9978j98790J02951
914b9734j90710l4216K67671J0297J56943l8435l8237P8188j51533R391k6868
903A2757m4772n4251o1631J14696N2605J76457k3785k23771j47452j2700J51866
892e9981J29020K2953o1217O4600n4302j03959L5616p9514J35565o4786k6529
881f2534J08387j42047M2527R763J8080n2139J23609j44678Q6144M0310j2991
870A4431l4971j21919j11078Q0100M93198j69585J9543j42520M0265l5851j03084
$$ y = [-6455, -43184, 173338, -52378, -186527, -9555, -56868, -250134, -209213, -96503, -101180, -84173, 178289, 134575, -43706, -7975, -281530, -311807, -162796, -156041, -140590, -39825, 109718, 194505, 206545, -84885, -26564, 254117, 155222, 158978, 136526, 136083, 66105, -132685, -29734, -220444, -254660, 13011, 23308, 180251, 141816, 103579, 181767, 30234, 39625, 12757, -32015, -86266, -147897, -33201, 19404, 195861, 172076, -51695, -199147, -211847, -59981, 69039, 91992, 30775, 95375, 41073, -62886, -27270, -106784, 28781, -36005, -62534, 45853, -96194, -53667, -43904, -25824, -77963, 45646, -99032, -12888, 27422, 14431, -20540, -142459, -253537, -173437, 319761, 150176, 169719, 27199, 67464, 31613, -71471]
859g1471R9096J01016O4435L3832j51444k67611R1884n1506K07551Q8212j05573
$$ y = [-71471, 27625, 128641, 193076, 226908, 75464, -192147, -100263, -151769, 55782, 143994, 38421]
$$ [...]
##END NTUPLES=NMR SPECTRUM
##END=
