##TITLE=1H_EC-3306nk
 CDCl3
 8 sc, 
 27.4.2024
##JCAMPDX= 6.0         $$ Bruker NMR JCAMP-DX V2.0
##DATA TYPE= NMR SPECTRUM
##DATA CLASS= NTUPLES
##ORIGIN= UXNMR, Bruker Analytische Messtechnik GmbH
##OWNER= root
$$ XWIN-NMR		Version 3.5
$$ Sat Apr 27 13:49:41 2024 Russian Standard Time (UT+4h)  she@DPX200
##.OBSERVE FREQUENCY= 200.1309
##.OBSERVE NUCLEUS= ^1H
##.ACQUISITION MODE= SIMULTANEOUS
##.ACQUISITION SCHEME= undefined
##.AVERAGES= 8
##.DIGITISER RES= 18
##SPECTROMETER/DATA SYSTEM= spect
##.PULSE SEQUENCE= zg30
##.SOLVENT NAME= CDCl3
##.SHIFT REFERENCE= (INTERNAL, CDCl3, 0, 14.0336)
##AUDIT TRAIL= $$ (NUMBER, WHEN, WHO, WHERE, WHAT)
$$ ##TITLE= Audit trail, XWIN-NMR		Version 3.5
$$ ##JCAMPDX= 5.01
$$ ##ORIGIN= Bruker BioSpin GmbH
$$ ##OWNER= she
$$ F:/spectra/data/she/nmr/H-F/1/pdata/1/auditp.txt
$$ ##AUDIT TRAIL=  $$ (NUMBER, WHEN, WHO, WHERE, WHAT)
(   1,<2024-04-27 13:48:03.93 +0400>,<she>,<DPX200>,
      <created by zg, POWCHK disabled, PULCHK disabled
       configuration hash MD5:
       00 E9 B6 7A A2 85 ED C7 34 08 36 98 17 FE 4E 26
       data hash MD5: 16K
       41 D0 F7 73 80 3B 46 12 7D EA 23 BA 55 96 12 44>)
(   2,<2024-04-27 13:48:15.12 +0400>,<she>,<DPX200>,
      <Start of raw data processing
       efp BC_mod = 2 LB = 0.24 FT_mod = 6 PKNL = 1 PHC0 = -25380.79 PHC1 = 8.38731 SI = 16K 
       data hash MD5: 16K
       32 39 64 0B 59 3B 2D CE 0E 9B DB 1D 54 1C D1 51>)
(   3,<2024-04-27 13:48:32.96 +0400>,<she>,<DPX200>,
      <pk PHC0 = 79.45351 PHC1 = -0.8000001 
       data hash MD5: 16K
       48 E5 5C 29 BB 04 A8 4A 9E 2B EC 1F 25 A9 CA BB>)
(   4,<2024-04-27 13:48:36.04 +0400>,<she>,<DPX200>,
      <abs ABSG = 5 
       data hash MD5: 16K
       D7 D4 C0 61 5E A8 46 39 B8 88 E3 0B AB A5 4D 68>)
$$ ##END=
$$ 
$$ hash MD5
$$ CC 0A 7B 23 5B 97 16 93 00 32 97 E0 3A EC AF E8
##$RELAX= 
##$RELAX= 
##$RELAX= 
##$RELAX= 
##$RELAX= 
##$RELAX= 
$$ Bruker specific parameters
$$ --------------------------
##$DU= <F:/spectra>
##$EXPNO= 1
##$NAME= <H-F>
##$PROCNO= 1
##$TYPE= <nmr>
##$USER= <she>
##$AMP= (0..31)
100 100 100 100 100 100 100 100 100 100 100 100 100 100 100 100 100 100 
100 100 100 100 100 100 100 100 100 100 100 100 100 100 
##$AQSEQ= 0
##$AQ_mod= 1
##$AUNM= <au_zg>
##$AUTOPOS= <>
##$BF1= 200.13
##$BF2= 200.13
##$BF3= 200.13
##$BF4= 200.13
##$BF5= 200.13
##$BF6= 200.13
##$BF7= 200.13
##$BF8= 200.13
##$BYTORDA= 1
##$CFDGTYP= 0
##$CFRGTYP= 5
##$CHEMSTR= <none>
##$CNST= (0..31)
1 1 145 1 1 1 1 1 1 1 1 1 1 1 1 1 1 1 1 1 1 1 1 1 1 1 1 1 1 1 1 1 
##$CPDPRG= <>
##$CPDPRG1= <>
##$CPDPRG2= <>
##$CPDPRG3= <>
##$CPDPRG4= <mlev>
##$CPDPRG5= <mlev>
##$CPDPRG6= <mlev>
##$CPDPRG7= <mlev>
##$CPDPRG8= <mlev>
##$CPDPRGB= <>
##$CPDPRGT= <>
##$D= (0..31)
0 1.2 0 0 0 0 0 0 0 0.06 0 0.03 0 0 0 0 0.0002 0 0 0 0 0 0 0 0 0 0 0 0 
0 0 0 
##$DATE= 1714211283
##$DBL= (0..7)
120 120 120 120 120 120 120 120 
##$DBP= (0..7)
150 150 150 150 150 150 150 150 
##$DBP07= 0
##$DBPNAM0= <>
##$DBPNAM1= <>
##$DBPNAM2= <>
##$DBPNAM3= <>
##$DBPNAM4= <>
$$ [...]
##$SUBNAM3= <"">
##$SUBNAM4= <"">
##$SUBNAM5= <"">
##$SUBNAM6= <"">
##$SUBNAM7= <"">
##$SUBNAM8= <"">
##$SUBNAM9= <"">
##$SW= 18.0517689322627
##$SWIBOX= (0..15)
0 0 2 0 0 0 0 0 0 0 0 0 0 0 0 0 
##$SW_h= 3612.71676300578
##$TD= 16384
##$TD0= 1
##$TE= 0
##$TE2= 300
##$TE3= 300
##$TEG= 300
##$TL= (0..7)
0 120 120 120 120 120 120 120 
##$TP= (0..7)
150 150 150 150 150 150 150 150 
##$TP07= 0
##$TPNAME0= <>
##$TPNAME1= <>
##$TPNAME2= <>
##$TPNAME3= <>
##$TPNAME4= <>
##$TPNAME5= <>
##$TPNAME6= <>
##$TPNAME7= <>
##$TPOAL= (0..7)
0.5 0.5 0.5 0.5 0.5 0.5 0.5 0.5 
##$TPOFFS= (0..7)
0 0 0 0 0 0 0 0 
##$TUNHIN= 0
##$TUNHOUT= 0
##$TUNXOUT= 0
##$USERA1= <user>
##$USERA2= <user>
##$USERA3= <user>
##$USERA4= <user>
##$USERA5= <user>
##$V9= 5
##$VALIST= <valist>
##$VCLIST= <CCCCCCCCCCCCCCC>
##$VD= 0
##$VDLIST= <DDDDDDDDDDDDDDD>
##$VPLIST= <PPPPPPPPPPPPPPP>
##$VTLIST= <TTTTTTTTTTTTTTT>
##$WBST= 1024
##$WBSW= 4
##$XGAIN= (0..3)
0 0 0 0 
##$XL= 0
##$YL= 0
##$YMAX_a= 125560
##$YMIN_a= -191181
##$ZGOPTNS= <>
##$ZL1= 120
##$ZL2= 120
##$ZL3= 120
##$ZL4= 120
##$ABSF1= 15.21585
##$ABSF2= -2.83603
##$ABSG= 5
##$ABSL= 3
##$ALPHA= 0
##$AQORDER= 0
##$ASSFAC= 0
##$ASSFACI= 0
##$ASSFACX= 0
##$ASSWID= 0
##$AUNMP= <proc_1d>
##$AZFE= 0.1
##$AZFW= 0.1
##$BCFW= 0
##$BC_mod= 2
##$BYTORDP= 0
##$COROFFS= 0
##$CY= -3
##$DATMOD= 1
##$DC= 0
##$DFILT= <>
##$DTYPP= 0
##$F1P= 0
##$F2P= 0
##$FCOR= 1
##$FTSIZE= 16384
##$FT_mod= 6
##$GAMMA= 0
##$GB= 0
##$INTBC= 1
##$INTSCL= 3.70164e-10
##$ISEN= 128
##$LB= 0.24
##$LEV0= 0
##$LPBIN= 0
##$MAXI= 10000
##$MC2= 0
##$MEAN= 0
##$ME_mod= 0
##$MI= 1.114404
##$NCOEF= 0
##$NC_proc= -8
##$NLEV= 6
##$NOISF1= 3.799351
##$NOISF2= 2.8
##$NSP= 0
##$NTH_PI= 0
##$NZP= 0
##$OFFSET= 14.0336
##$PC= 1
##$PHC0= -25301.34
##$PHC1= 7.58731
##$PH_mod= 1
##$PKNL= yes
##$PPARMOD= 0
##$PSCAL= 0
##$PSIGN= 0
##$REVERSE= no
##$SF= 200.129897814547
##$SI= 16384
##$SIGF1= 3
##$SIGF2= 2
##$SINO= 5.538805
##$SIOLD= 16384
##$SREGLST= <1H.CDCl3>
##$SSB= 0
##$STSI= 16384
##$STSR= 0
##$SW_p= 3612.71676300577
##$SYMM= 0
##$S_DEV= 0
##$TDeff= 16384
##$TDoff= 0
##$TI= <>
##$TILT= no
##$TM1= 0
##$TM2= 0
##$TOPLEV= 0
##$USERP1= <user>
##$USERP2= <user>
##$USERP3= <user>
##$USERP4= <user>
##$USERP5= <user>
##$WDW= 1
##$XDIM= 16384
##$YMAX_p= 352406628
##$YMIN_p= -4136153
$$ End of Bruker specific parameters
$$ ---------------------------------
##NTUPLES= NMR SPECTRUM
##VAR_NAME=  FREQUENCY,     SPECTRUM/REAL,   SPECTRUM/IMAG
##SYMBOL=    X,             R,               I
##VAR_TYPE=  INDEPENDENT,   DEPENDENT,       DEPENDENT
##VAR_FORM=  AFFN,          ASDF,            ASDF
##VAR_DIM=   16384,         16384,           16384
##UNITS=     HZ,            ARBITRARY UNITS, ARBITRARY UNITS
##FACTOR=    0.220516191357247, 1,           1
##FIRST=     2808.54290465432, 0,            0
##LAST=      -804.173858351446, 0,           0
##MIN=       -804.173858351446, -4136153,    0
##MAX=       2808.54290465432, 352406628,    0
$$ Real data points
##PAGE= N=1
##DATA TABLE= (X++(R..R)), XYDATA
$$ [...]
15590 -469203 127708 350516 -49288 464505 705843 347555 230525 326752 -602551 79234
15580 79234 29367 -267984 684798 1016552 245596 122629 533411 544993 352867 180082
15570 180082 47324 -228324 -457301 358559 805159 -37375 -126916 41909 110065 181325
15560 181325 323967 -5544 242227 113080 -560185 258983 -51909 277237 251724 -418389
15550 -418389 -340515 193501 -649115 -49328 271665 381068 -140324 -55479 307422 -147838
15540 -147838 -168432 -145770 255284 1346603 1407267 1068058 -206900 -615947 317727 -358527
15530 -358527 51235 -169028 -398522 -689284 -429273 393136 252968 404350 -2583 -301789
15520 -301789 -316806 -675999 -321867 149823 -179239 -378698 -610528 128940 1345309 465781
15510 465781 -221248 -113516 -146658 -62596 -665369 83374 369514 36409 -223510 -173457
15500 -173457 640165 107081 651373 -28948 -343345 -60118 -130258 268906 116874 -439084
15490 -439084 -131692 -457371 -37343 456250 801744 943759 934983 596475 67459 582656
15480 582656 686352 339338 -93843 106472 288355 18181 434636 -447256 -706650 -383362
15470 -383362 200027 -212568 174603 324962 450927 15717 -413888 272520 -91169 120752
15460 120752 -280528 -546441 -149302 284417 328754 208739 494766 344649 381658 312693
15450 312693 28827 -114771 -453996 226994 32290 -406698 -245863 -254387 -194905 -603129
15440 -603129 -730742 152274 409521 -459109 -315561 525667 514098 194454 452323 310846
15430 310846 460009 657026 -107962 -327327 -230077 -116488 415954 508421 524109 110641
15420 110641 197418 167446 285569 12230 163361 381577 160243 582993 311563 141289
15410 141289 -168216 -237099 5081 -107342 318678 -362651 -414102 -572430 -387568 510301
15400 510301 374691 538246 -201933 -19495 162975 89990 229818 518475 59849 128200
15390 128200 193341 -397193 -1071306 -788121 -586695 -583028 -258773 275 -360704 -639391
15380 -639391 -563728 -229401 -346555 -1188193 -851120 -155464 -262163 -266285 -78068 390336
15370 390336 -50091 -314367 -235912 -559689 -111731 448432 502626 285803 219015 357317
15360 357317 912956 540460 299280 41571 -89016 -228781 197566 296912 185610 -221612
15350 -221612 -463932 -98015 297506 318645 168156 1075151 654108 330595 149458 272943
15340 272943 26116 -32398 379959 397934 -257811 3045 216867 253759 42009 -545640
15330 -545640 -534027 25478 -194528 330439 855791 223412 -197782 -477461 -307384 -421517
15320 -421517 -449663 180582 37002 -480942 -190929 -95915 414722 -23130 -155523 172189
15310 172189 917654 1371350 -28797 -833760 -423306 -307015 -582949 -337722 -69435
15301 -69435 203446 -18783 202820 -43412 -648328 -813682 -97588 -263354 400405 120031
15291 120031 -305554 20498 -240439 -434906 -251756 217009 -371198 -754040 -326114 -431149
15281 -431149 -510976 -847646 -688747 -621974 -170782 -290224 -485341 124432 324103 -92067
15271 -92067 -173538 660296 388752 423654 258907 588761 357160 193796 -197509 -251083
15261 -251083 -83137 330235 -311841 -41010 792504 955576 311771 -109410 714214 509522
15251 509522 246749 617586 -27369 429100 230429 707004 35029 -697608 -815748 -263864
15241 -263864 209627 -144661 -19348 236318 301618 654144 323138 94284 198908 529448
15231 529448 507392 -322485 -732222 -385726 -441827 -1069972 -1353009 -546959 -126848 -109941
15221 -109941 -477218 -548123 303382 -279291 -519988 129369 617265 1412477 1100788 719457
15211 719457 192515 -253599 -427350 -624154 -248695 -560998 -408354 372907 785705 840180
15201 840180 528810 -213192 -329912 63560 476409 658183 415608 346712 251107 -188045
15191 -188045 534676 222780 -220092 247913 97605 391402 782837 460448 466639 64335
15181 64335 171372 -163466 -218494 -404237 -638825 -701659 -51177 -266154 91416 529721
15171 529721 -155971 251162 381644 -90138 119182 -33177 -828341 -577660 -168632 318693
15161 318693 187937 -514402 27734 497420 251409 230563 81541 -414603 -718845 -878951
15151 -878951 -175697 -375158 -14661 265291 -217224 -353899 201181 536169 184843 664697
15141 664697 860898 455728 238975 84477 -267886 -132352 -269321 -618071 -277018 -30174
15131 -30174 31460 -220530 -141795 -216253 -562021 -884885 -674361 -493268 -60902 -209996
15121 -209996 -284891 17495 -121080 -349311 571727 566946 779977 221557 110115 277429
15111 277429 212104 -427349 -274708 -316827 -233973 -279737 -220653 -72336 -84582 586389 238036
15100 238036 475685 214889 123815 826397 930147 -303826 -186636 -186550 329756 204602
15090 204602 585476 585173 712572 779684 530212 279951 -235085 848537 181443 -41721
15080 -41721 115969 -240903 270221 -326978 371012 46176 -350954 -173751 526422 634539
15070 634539 756548 385144 291822 -19049 -178216 -229717 -537305 -323986 -193023 -8010
15060 -8010 311825 83914 -286435 -767884 -1127478 -295397 -219270 24171 -98350 -523611
15050 -523611 353187 -11528 -437808 -717158 -535580 -410391 -379823 -272901 -24150 -44147
15040 -44147 3627 123226 243701 -328796 237793 319877 185432 208867 -681871 -383901
15030 -383901 -7745 3998 -163882 -169083 184451 441120 -324884 -310139 60163 159810
15020 159810 -51681 191158 340700 83014 -497794 -419647 -538738 -1192432 -568154 -129637
15010 -129637 -186108 50221 52717 101596 -205326 -397772 -430894 -380798 147059 405382 666470
14999 666470 484086 -417571 -117608 -7890 -336183 -830606 -183939 192877 -447371 47902
14989 47902 -80851 -271824 -1009682 -686498 151735 387958 205171 -568210 -730408 -419269
14979 -419269 -96022 -575567 5323 390386 272913 -147704 45645 -73689 122543 -334363
14969 -334363 -156465 128057 715447 130472 -134983 -18354 -104629 -179554 -97631 -8213
14959 -8213 -575121 80754 -292344 -239583 65802 443172 146085 411609 380902 456515
14949 456515 560280 219909 -703 359502 968808 16031 75155 413335 920724 459278
14939 459278 232067 739774 546520 -178177 20871 438901 173992 954270 992193 91507
14929 91507 -314537 -221633 -65878 -86076 -205760 -237029 484933 733398 613034 45768
14919 45768 -133083 -417085 132479 117785 -202880 -478104 -616656 -199214 9878 321496
14909 321496 -237504 366478 -135999 -467487 -584462 532149 775682 489276 485496 193895
14899 193895 -453475 -1065865 -572410 358234 506119 290543 536351 350706 -353687 -421089
14889 -421089 109242 258378 399973 155339 353401 409512 300004 570180 1465602 842280
14879 842280 -52288 41 195656 -278808 -78790 301244 339822 303631 -258237 -84914
14869 -84914 486658 1041317 908680 65692 -558024 241722 -71735 -311816 -262579 -128473
14859 -128473 -547804 -471727 -879 44551 -227242 -200950 85942 59088 -206226 -592163
14849 -592163 -234074 -659074 -649037 -569462 -408565 272183 324899 12852 -172090 -360608
14839 -360608 -596566 -376617 -650484 -199802 39608 869723 1006569 879390 677139 349426
14829 349426 71748 334101 570177 502418 565044 389101 395645 396476 280801 836612 821940
14818 821940 399558 490667 553571 326759 182575 344015 797420 981213 455239 196382
14808 196382 -39724 -480600 329184 503893 -6400 242355 232914 -137792 -576637 326427
14798 326427 72582 217438 378782 479483 59043 311995 -8559 113974 283335 292848
14788 292848 -139583 70764 -67349 -238006 -54325 189228 -127556 -571476 -730214 -634756
14778 -634756 -345071 -155245 -301499 -221026 54172 -322150 11775 81819 149709 413943
14768 413943 233903 157205 -106699 -341832 157292 8610 393176 787532 296279 656905
14758 656905 641468 205519 54194 549432 60619 -24519 -75122 -658532 -452375 -789783
14748 -789783 -762096 -478261 -497142 -260822 -106692 67189 311891 -281591 96778 -203553
14738 -203553 125593 358679 354768 337095 506422 -553157 -707418 -261674 -376532 10113
14728 10113 278798 190942 160107 160496 174266 -100160 -26998 -104001 -36683 -94807 278211
14717 278211 31947 -168613 401284 -281990 -186762 -248665 -309169 -727666 -391035 -339091
14707 -339091 -133004 151438 -98513 -320822 -715433 -111862 250434 162601 694786 724614
14697 724614 320898 415430 444059 52586 -212895 -516275 -724 -297473 -353839 -98060
14687 -98060 -81491 -18230 -151450 215436 362699 11560 -384119 -578637 -47368 -301320
14677 -301320 109982 624174 -169083 68002 -288832 -476029 -506627 -729228 -868941 -473068
14667 -473068 330709 397009 107869 -308384 -450796 408232 902182 -403235 -599496 -486734
14657 -486734 -247715 68665 -413952 -746583 -617480 459402 -48291 -250550 -128138
14648 -128138 -242368 310972 78719 -438093 -384364 158216 -186742 -127074 200598 -242532
14638 -242532 -654057 -814472 -80351 -367320 -463552 -242180 -124188 -677958 64973 -24756
14628 -24756 -101429 143191 600692 -41842 -422106 -13833 384680 -117237 -459936 -94521
14618 -94521 -447100 -806560 -870942 -229103 47452 -442160 -948976 -776993 -527124 -868455
14608 -868455 -881851 17857 -418422 96415 97282 134062 307222 -358327 310410 106289
14598 106289 -94515 375875 -190000 47261 442202 276701 15292 443253 250036 48979
14588 48979 -265295 -303520 -542461 -293107 63534 539855 -298166 -184781 -528498 -828328
14578 -828328 -403062 -164176 -203457 -145306 131463 138737 -288262 -215350 477568 222747
14568 222747 -229201 -14240 -410438 -204452 -72574 -82868 -389972 -383438 -163974 -214243
14558 -214243 33526 57317 514901 447050 555582 764665 827315 785690 609760 562325
14548 562325 178669 -590106 -161445 51685 188019 -262793 -23080 -395787 -500114 -300709
14538 -300709 285145 361973 442341 183192 4755 807903 825327 328495 507927 738729
14528 738729 216156 443785 705549 70818 -185186 -439666 -347773 22621 -543457 -408759
14518 -408759 -673096 -819463 9555 -160004 25080 375675 -157910 -88449 -97153 -639929
14508 -639929 -183868 -238885 -452366 299271 357037 219637 413567 284051 15327 -404158
14498 -404158 -646084 179018 -101352 -218979 369562 -218851 -265274 -453381 -319299 524303
14488 524303 661841 501958 264043 665560 543324 -394155 -626862 -684222 -193712 839858
14478 839858 861167 507206 601656 837412 -179423 -569790 -330555 -568190 -658229 -917067
14468 -917067 -816976 -367992 167285 -494114 -633250 -266646 -228381 -340857 -657144 325039
14458 325039 625690 433305 26864 -466299 266067 347764 22039 -117113 -238497 -289173
14448 -289173 -99840 -196156 -364232 -779583 6130 -28237 -215949 -275613 -445607 -275129
14438 -275129 -536341 -502259 -324492 -32432 -255717 -136433 586037 894025 488167 456114
14428 456114 501044 727886 1180266 447674 326833 150337 -54933 509056 363226 -316821
14418 -316821 -209959 168521 -151029 -238645 -141846 -227626 -173951 11936 -72055 -293326
14408 -293326 280601 362702 -349120 -418180 -382968 -125286 99628 -50792 356242 478885
14398 478885 460821 250429 -290832 47567 -368811 -682117 208588 630770 39991 -343453
14388 -343453 -593282 216668 -160580 20689 -27821 -73536 219965 383951 602297 307216
14378 307216 85801 -575251 -1074669 -669293 -372828 310503 81944 138279 691193 661844
14368 661844 351595 243441 -135674 -341560 274381 385901 292502 603744 417561 -235559
14358 -235559 519084 -284531 115832 345679 -469472 -52869 574857 225292 251044 457644
14348 457644 329350 210664 159219 -22442 40398 -571146 -603179 -319452 -253636 -247773 -206045
14337 -206045 -39015 -350820 -218389 517894 494724 382275 378140 -360404 -266257 -273628 -316021
14326 -316021 -162394 398381 449385 446219 390339 260974 654724 806672 1249644 1131200
14316 1131200 568988 701651 -481443 -720837 -592024 -83069 -206557 61062 604259
14307 604259 805807 404005 622358 1101855 439743 466382 331469 530012 478863 442094
14297 442094 -704809 -708330 -99784 -109804 358257 86429 576843 269294 6323 -471420
14287 -471420 -1103633 -253072 469596 -405092 -801603 -697682 306136 -40855 -257108
14278 -257108 -178151 -280134 -176998 -9397 291071 -323825 -79749 600469 893552 -55128
14268 -55128 -604761 -197693 -72402 -1173386 -444241 -91813 -560951 -195523 600704 708645
14258 708645 553295 765404 810579 149062 -251604 436102 226868 -117394 -427542 -172193
14248 -172193 183562 129900 207807 152291 561141 789007 719457 50675 274963 -182319
14238 -182319 -302377 -114811 424926 1146315 681382 100225 23275 -244358 -139169 -207222
14228 -207222 44605 115783 577826 209099 207735 305228 361953 75834 227465 -226149
14218 -226149 -77282 647193 501261 -546506 -210457 696444 -57190 45028 408799
14209 408799 351791 -100584 -181624 -56116 -236656 195209 384902 333788 -286819 5234
14199 5234 -217893 -232345 -67973 -107124 -392865 -213920 689413 193395 521431 554849
14189 554849 175963 -248482 218945 32986 -57656 -308550 5522 60789 -287914 -485956
14179 -485956 -196720 196238 -108520 -507705 -131462 -795485 -60375 -355238 -556473 64014
14169 64014 -39307 131624 -179875 255953 2287 -594948 -387375 -7790 -119500 -194084
14159 -194084 -631371 -864826 -389344 336920 324754 -435268 -532829 -534453 35104 -91940
14149 -91940 45865 -288938 -79140 -589849 819 583402 184083 -427494 -147321 -836045
14139 -836045 -787314 309725 481319 413561 158972 99956 -86181 255416 -124508 -122366
14129 -122366 486817 640108 830547 221536 -796715 -655912 -555516 -474735 -271960 109411
14119 109411 210523 -43970 -28067 -438246 -237555 -138583 407155 295417 -236441 -384117
14109 -384117 -49242 17567 56409 99504 -514790 -1205770 -724895 -153381 -596003 -832547
14099 -832547 -391146 168473 157779 346383 1015979 849709 -566280 -77819 629001 692630
14089 692630 704818 835361 577496 239853 610952 272562 195873 -182398 -173164 584943
14079 584943 888369 814761 753528 464155 -248903 -815248 -627160 60457 257841 315808
14069 315808 311020 372879 -178123 358508 265524 301507 206664 393146 -700793 -469844
14059 -469844 -31360 482422 156021 -2456 -282505 -403978 -426693 609111 722905 -155383
14049 -155383 -197442 56188 278304 109770 -38064 346408 217702 218853 98305 136452
14039 136452 -289071 352566 958484 566546 -445263 -379059 653419 601136 503078 -335261
14029 -335261 594022 340942 -541010 -850629 -783978 252433 444481 -90135 -578012 -187784
14019 -187784 118457 -258492 -142140 492705 567389 -37021 134120 204005 -217361 -205855
14009 -205855 -1130748 -362313 -176706 38134 368827 260003 -16087 -577207 -340242 -78350
13999 -78350 472619 784083 162343 -441107 -443236 -93184 109870 -563250 -481043 -43303
13989 -43303 -239483 -420296 -20621 73476 815303 29184 440361 193029 329751 422611
13979 422611 847689 423191 471564 436281 -130341 -602639 -249752 -255524 -449429 -314852
13969 -314852 -130356 113473 476663 -449524 -628040 -183403 481622 460937 -166600 -776649
13959 -776649 -241995 -468250 -541735 335436 580767 243925 106719 310094 232861 -22586
13949 -22586 -64589 72669 215373 -560795 -388465 236000 451649 694181 789193 1117514
13939 1117514 850433 109905 -472077 -491786 -291065 -152586 10580 -419300 -713945 -113975
13929 -113975 -172177 125951 187849 10790 -5304 129718 -104538 73315 -279233 -266031
13919 -266031 -514904 -334811 -428204 -388192 325956 411261 -598650 -348045 -271259 -381362
13909 -381362 -466939 -92113 198383 547068 37670 -197393 -288973 15658 -349434 -481241
13899 -481241 -226073 292907 244852 207572 130542 244679 921084 -5098 -762135 -833107
13889 -833107 -878787 -370323 -701669 -297813 338549 -64409 -547571 -1022278 -816908 -545790
13879 -545790 117080 367170 330339 -267744 73312 88079 -83505 315048 447733 343488
13869 343488 -148471 -204242 65309 710783 1038157 278261 492661 24206 -901852 -935412
13859 -935412 -269603 -330662 -711139 -604062 -261949 164298 -314049 -610844 -415564 172051
13849 172051 392310 -311687 -79147 -349635 -36796 206529 -38736 502719 357527 1103808
13839 1103808 957941 491793 584380 95772 -211260 -441952 -751620 -604964 -215646 -262996
13829 -262996 27088 -33432 129605 -262603 -387499 212401 988126 767878 -98990 319078
13819 319078 308388 -207167 -701023 -271458 183139 358907 348778 438478 277193 -39734
13809 -39734 -322101 -658757 48428 -82279 27573 292113 173781 539743 517249 926853
13799 926853 294384 157743 -192816 -105128 -861536 75402 205458 -878533 21398 760462
13789 760462 765797 227576 319029 422789 450143 361232 361067 903878 478011 302444 -158925
13778 -158925 144305 -110190 -890099 -594362 -730982 -1118032 -1124036 -228641 -248424 158586
13768 158586 218216 380827 319213 325711 502152 -71442 130718 -309783 -688257 -411282
13758 -411282 -219754 -83291 -96526 1314 315724 294013 245737 702964 478942 242347
13748 242347 -536527 -744328 -275884 453006 -526922 -128300 -38464 -158996 -79924 74147
13738 74147 1077179 437964 -447899 29885 -514592 -205717 -53449 407496 510010 -60972
13728 -60972 -131548 -39461 283063 544039 258895 19222 349625 209649 508643 372696
13718 372696 251768 446651 108228 246543 103326 249948 128872 -563061 -827359 -461810
13708 -461810 -291743 -64498 -205218 -207538 -323377 -581190 -984028 -652458 -903976 -276529
13698 -276529 614736 232548 -62454 -549053 -58202 -291445 -328698 -215351 78723 30411
13688 30411 -410234 -334574 -84330 86083 -717263 -587978 356958 -146698 217892 -218983
13678 -218983 148712 274220 31294 -153698 125315 559183 931123 658269 219821 216940
13668 216940 82905 -369148 389872 32753 112564 197362 305371 -76243 -356109 231392
13658 231392 747334 749932 -55742 -698242 -225630 -151294 -163241 91419 116111 -246006
13648 -246006 137958 154989 -539752 -209390 -133297 98819 111151 332708 342047 85350
13638 85350 397084 206743 24297 208715 530 598795 352742 403587 231064 -110262
13628 -110262 -647889 -884805 -178483 69936 12939 -92126 25796 340606 473293 99207
13618 99207 -215262 392482 57318 480205 498432 -57052 411157 816232 287242 450806
13608 450806 -14701 339686 461177 230682 382832 321123 245530 801552 908522 454458
13598 454458 -212895 -788409 -307799 63640 -6926 -315642 -285272 -489226 -374769 -235630
13588 -235630 -14895 -61615 336640 135222 233081 338012 -18347 162631 221077 131497
13578 131497 371688 882918 428730 -103636 437016 315113 -829314 -998033 -674122
13569 -674122 -243270 607504 -1264 349448 538306 -497495 -634873 244221 -166840
13560 -166840 -604188 -705970 -492846 -677576 -502691 -1227016 -942389 -130981 248790 -132364
13550 -132364 -176848 672933 366166 -104934 -586457 -374496 -170415 606984 520104 443531
13540 443531 684552 301457 71330 -178103 -216234 36435 334221 445820 195344 40009
13530 40009 -4998 -891397 -960441 414908 168976 175095 130504 413230 64625 12442 -453047
13519 -453047 -607151 -75984 382345 414349 55441 -259409 -356602 205066 348263 239302
13509 239302 50302 -41826 252831 -227946 -231074 416342 825575 1021669 481203 306771
13499 306771 -383500 -984150 -629390 316510 734503 -60580 -365440 -402513 -791446 -573057
13489 -573057 369304 -61158 -245813 206484 256673 -135562 416450 138946 39625 223714
13479 223714 7969 130124 -15846 -256662 623183 874175 695756 595592 -249683 -19659
13469 -19659 378975 370257 80495 -696677 -580446 -131579 -697322 -672313 -203696 -166053
13459 -166053 -377179 312249 238283 367867 27016 -94565 -288737 529526 791210 291857
13449 291857 -369859 -454010 -297226 -154936 -245766 61567 -140369 -10325 449263 -105234
13439 -105234 -109436 -139754 -270516 -210112 306833 499061 403938 572582 104875 494260
13429 494260 930730 360443 347542 25051 -206526 -334848 -347377 406702 823799 869028
13419 869028 429745 -401579 -882884 -1062920 -336301 -449659 -219634 -267123 108871 766291
13409 766291 608374 248011 168116 146457 292698 20631 -102331 -376518 -160379 -305338
13399 -305338 -420428 -421144 -800589 -582291 -110919 95121 -425787 -808720 -414033 -374280
13389 -374280 -513465 3356 647124 844510 -192054 -441528 -471034 -394234 -709634 -642842
13379 -642842 -513221 -161418 253671 458505 333810 -100275 -25946 485856 416193 186537
13369 186537 146966 330406 -553685 -186999 -84501 -67183 392736 961155 -32643 -268819
13359 -268819 135275 20879 279288 -225259 -625284 -525807 287157 -10054 346327 520730
13349 520730 154816 -162583 -440417 -349637 -184531 -170538 -180489 -730798 -425491 -38136
13339 -38136 529314 -143972 -262057 -143427 164543 224001 249431 296236 494670 146778
13329 146778 -63259 191408 -21076 -33005 365358 390414 307598 427903 130491 -224816
13319 -224816 134340 -313068 -495416 -390608 -81444 184047 21639 138247 -404793 -330734
13309 -330734 13660 -216865 59071 68661 -75509 -148819 -1060603 -586066 -186202 -36665
13299 -36665 -333603 -676987 -110945 -188631 -720611 -727468 -446015 -194850 -680073 -563546
13289 -563546 81582 814568 342332 143525 319092 -41129 -158552 224157 -121808 507402
13279 507402 222741 488166 356211 -65582 -42844 79161 955933 447928 720795 596051
13269 596051 366783 497462 121209 -227218 70937 63472 192653 487351 -93402 181976
13259 181976 615791 -152835 -25841 345913 215587 -323470 -36169 -695730 -509058 -464960
13249 -464960 -909647 -528439 -653996 -1082308 -851407 -993943 -1504047 -293740 -357928 -512279
13239 -512279 -362410 -674556 -163584 847954 415024 250725 -12281 316208 431690
13230 431690 114338 -282532 -22299 -201162 -799561 -315392 -217445 -517948 221334 186616
13220 186616 -415582 -196941 222584 227530 -362060 -333640 -261123 -170299 -580484 -209368
13210 -209368 -139028 -324002 -273166 235477 376220 1151029 451886 103196 565673 702077
13200 702077 377023 240347 -493588 -482713 -250036 38851 104994 -549195 -801761 -725793
13190 -725793 -477451 -223924 125087 969308 152216 -1044832 -749643 -359647 -103730
13181 -103730 -370325 -496437 -296980 155630 256930 475768 535056 119693 -256111 -545518
13171 -545518 -723089 -245417 -552895 -396374 146067 748849 -38299 -1033106 -739726 -319565
13161 -319565 -321185 -402079 -159290 -258017 -401444 -336158 -614217 -512023 -1060810 -1108147 -322835
13150 -322835 -49186 137163 279972 602008 797836 234306 -202569 -340365 -569505 -400218
13140 -400218 -165878 36643 432834 204543 -291906 277846 290242 -682599 -965036 -389024
13130 -389024 97501 -190701 -141798 82269 -82126 -411198 -138235 -75753 -65759 64157
13120 64157 -325457 -446168 778025 306212 43927 -655 -84775 -59506 -988742 -540439
13110 -540439 -397641 -271230 131845 310758 -72767 -252113 -19768 -97112 -243407 -200125
13100 -200125 146541 63455 669869 847397 111150 -255762 195709 -309398 -110762 -3417
13090 -3417 -763942 -263533 -371474 -186583 137689 -355930 -339246 393454 -195217 -423476
13080 -423476 -23112 152253 386544 -538260 -224710 898684 688368 28510 -44713 39533
13070 39533 64416 -27133 -518913 320663 376086 10773 156671 387906 684958 231364
13060 231364 -156722 -21540 530941 17169 -8044 62888 304195 -35254 -254507 467624
13050 467624 534495 -2666 -270060 480844 139805 -120305 128373 248856 169818 -8567
13040 -8567 28347 -641546 -668827 -278604 -577389 207150 496628 451325 899313 1187693
13030 1187693 644971 146458 -853184 -835019 -380754 -28602 -96602 -167256 -293409 -560909
13020 -560909 -597485 -647312 -475104 -153763 -220602 -54559 90358 557497 785842 436808
13010 436808 -448274 -757412 -367101 -198076 -192670 -84738 -588696 -972202 -692941 -867605
13000 -867605 -547427 -91748 -567610 -808991 -374068 142910 -647249 -1027488 -451634 -1372774
12990 -1372774 -940795 328044 677912 732660 521312 519032 451267 219337 349086 446036
12980 446036 343108 -121711 166055 540458 561062 -161544 172086 113463 501836 427505
12970 427505 -182386 236887 271855 -35625 41789 312184 232923 16549 -181283 569326
12960 569326 770983 -85031 -69082 293295 -738968 -329833 262252 -78785 -28188 127780
12950 127780 394947 123393 -278917 -18163 254745 367665 499740 -331883 10056 356832
12940 356832 -27600 204498 124462 -85079 -361075 -252973 -43769 -126406 -122613 -142852
12930 -142852 151848 243790 576841 279329 -207155 38998 -193642 -486422 -326189 -494645
12920 -494645 -477923 -171327 175889 328853 238483 -412368 -310012 -310996 -32350 107977
12910 107977 -11552 92495 101511 481536 346609 319677 132386 -264129 -102670 -808955
12900 -808955 -803219 -246910 -225709 492249 510210 295832 305962 -350194 -452425 -682878
12890 -682878 -896702 -671716 -764080 -458840 -315095 -53912 -128610 -393687 -46910 -404062
12880 -404062 -164474 532214 -478910 -203277 -302363 -454649 -218811 -132642 -312107 102997
12870 102997 -298103 -109409 327897 663129 949340 215617 10985 -277453 -441577 -737847
12860 -737847 -47928 328501 837271 468650 -11936 -105089 165970 171331 -423568 104932
12850 104932 -580559 -518614 -256124 -84120 329587 -219795 -111468 -86978 -127728 -27855
12840 -27855 -10117 -611181 -485782 183717 34958 -496038 -234207 -9910 -225946 -406968
12830 -406968 -29496 -64468 -494017 -1017963 -967724 -851631 -991580 -663961 -575140 -865124
12820 -865124 -553508 -711299 -676914 -817478 -1347148 -903261 -286040 628389 207510 300861
12810 300861 509929 913589 1040294 614139 42760 -221556 -144650 -398242 -308177 281410
12800 281410 249670 10404 -208986 -375902 -482865 -1218060 -593094 -865547 -541497 -282075
12790 -282075 -346972 -75712 -717736 -304227 268984 862381 772398 343428 280926 536973
12780 536973 919425 1328079 1076968 760562 582788 1200769 1740772 1384170 1145997 1319111
12770 1319111 1065111 891229 297906 50272 616559 1219812 867634 19946 -232235
12761 -232235 31643 -285065 -194725 330600 163305 -10027 -110680 -242561 118052 268243
12751 268243 400752 -510844 360786 1068864 240917 410728 405244 95207 164758 -239354
12741 -239354 218850 686069 181722 85495 -327492 40322 114067 -350179 30600 645436
12731 645436 790233 572534 -69006 53843 -162083 -302883 -267610 -63726 -645990 -725241
12721 -725241 -270643 -285052 -387213 -36950 642493 873535 585547 372756 332659 222339
12711 222339 -202597 -124908 -120853 -445480 -516516 -203756 -298303 211911 722983 446996
12701 446996 437962 -43227 65228 38455 90320 873075 363797 441999 -103969 11254
12691 11254 -82180 689005 918119 681684 303389 -572820 -265240 127306 327741 -85191
12681 -85191 -594352 -1045971 -447000 -172211 -423839 292697 227624 295668 6150 127958
12671 127958 591353 1160618 1400337 1052221 768410 416918 238262 -98775 -35947 237861
12661 237861 273852 -244379 266433 286895 389408 -235231 -672986 -99842 400588 388725
12651 388725 552719 495029 -70854 -363940 -311000 -79181 -319850 -421204 -443717 208570
12641 208570 -171813 -174364 208434 75546 92697 -472958 -231076 -207297 -271963 142355
12631 142355 387415 387072 106149 11473 540582 221139 -312098 213810 763046 401149
12621 401149 698293 53371 57029 -116735 -531557 18 42793 11250 -51338 -562848
12611 -562848 -420363 -297914 -43901 -95350 5598 -109143 -599082 -583507 -616146 -1470957
12601 -1470957 -970541 -225861 -89082 444961 540133 240335 165764 342883 978439 1378133
12591 1378133 715030 160895 -91484 218871 160894 182556 35219 -183522 -213832 -669803
12581 -669803 -352424 108940 403424 520644 580137 195760 526713 621421 349204 736450
12571 736450 78482 -330032 -414993 -242300 -170834 -58347 -82274 136689 -68312 -242861
12561 -242861 -679647 -113815 -464059 -1125543 -987103 -464642 -39183 339063 214032 -24031
12551 -24031 -186705 -191351 -327007 22158 -89384 -379874 -628852 -118251 353171 8478
12541 8478 335626 368098 119811 -530466 -236350 -691600 -474596 -274789 71039 106296
12531 106296 -210755 -70649 300196 234587 192785 67217 -273936 -972985 -709057 -125493
12521 -125493 -475065 -5246 367289 309632 -378847 -477056 -775829 -513007 -371374 -805875
12511 -805875 -892882 -479042 -31675 -402216 146919 357220 -212204 264892 399778 212633
12501 212633 317894 253310 -311426 -12210 -93136 252793 450316 270127 368244 -506111
12491 -506111 -125342 195177 83178 -674987 -148300 262538 -85762 -3373 -214773 -97258
12481 -97258 -41556 404935 355557 31140 252275 790060 712242 589331 73380 -552126
12471 -552126 -822765 -163442 -278809 -144675 457937 535036 88692 -95952 465171 -93768
12461 -93768 -993742 -1021063 31884 -73837 -6841 -165251 -462998 -83386 -61626 -122895
12451 -122895 464484 471989 524198 445670 424991 832898 493755 -166596 -251666 -698270 -238497
12440 -238497 -534738 -995571 -606547 -578035 -902012 -33911 319126 203960 300806 -368127
12430 -368127 13650 47459 196085 -181549 -471506 -275495 -1059966 -909781 -359187 -400768
12420 -400768 -143090 -45139 -282625 -374137 -105891 164103 -562284 -390275 264013 -88834
12410 -88834 -168440 -185672 -515675 -2984 395657 416460 526133 390433 704212 370105
12400 370105 104119 -199523 82936 460438 1091439 433362 -169335 -1092817 -1049667 -676616
12390 -676616 -387846 -635752 153977 1205481 347692 -418073 196515 65129 199145
12381 199145 564101 1084041 830623 773007 597677 423359 309159 -69116 262480 -527435
12371 -527435 -593574 -692525 -187933 -131165 -367720 -329838 -580558 -706699 511791 251296
12361 251296 -321918 90552 -305257 -181055 -306151 -805904 -620937 -85319 -147455 -76526
12351 -76526 282284 330917 593371 722571 365676 -99444 396374 767384 620302 101488
12341 101488 49794 389864 304918 432099 466672 -704345 -972442 -664443 -158796 -72012
12331 -72012 237071 625906 578362 -68094 -277506 -21643 -98528 -101061 -165689 -867116 -505070
12320 -505070 93177 -345874 7259 -14333 -243182 -70854 -443636 -525240 -250491 249753
12310 249753 10694 -226538 370238 923895 546633 -133249 -336398 -245731 165996 244829
12300 244829 -113099 117878 -78171 -1407703 -1551965 -768474 -608693 -350839 -491841
12291 -491841 -613475 -168116 -440986 -410639 -177057 -254197 391600 312128 -687404 -750994
12281 -750994 -131153 249457 667583 166134 -125765 -4629 153095 489030 403721 -381342
12271 -381342 -401399 -371991 -91311 194557 -53652 73800 -424686 -176483 -67125 -84684
12261 -84684 288407 367678 253880 32148 -178536 -468524 -1008736 -685744 -173929 -187603
12251 -187603 -19995 -91573 91815 74002 -23651 85379 -164108 453623 -205150 -47407
12241 -47407 -677680 -471575 -389289 -872602 -827636 -335464 -271639 42622 -231335 -808696
12231 -808696 -652958 -29543 323022 181055 576485 140592 153679 338538 -205616 -140879
12221 -140879 -231092 -575544 -1172926 -475039 -296046 -564723 -383478 -927954 -402529 -189083
12211 -189083 -104402 42113 -195387 -770595 -191650 -396303 -955692 -796106 -12059 92782
12201 92782 -1006324 -448114 -160140 -352901 483857 184434 -180376 210714 577924 -113939
12191 -113939 -394422 -144866 391272 -40848 150350 -271706 -892402 -48635 -134464 -228341
12181 -228341 493904 375942 -153607 -145568 -279042 -340986 -511816 -505059 -823022 -624459
12171 -624459 -337455 316878 417733 157686 -353022 -641809 -159857 232431 -164381 -594821
12161 -594821 87604 365303 9237 -517788 -156096 -244718 -201811 -393395 -743090 -793629
12151 -793629 312118 431643 5977 -442673 -654136 -306671 -906915 -1075186 204048
12142 204048 275094 -386888 -335042 -526231 -116126 -55465 284868 309837 161239 246145
12132 246145 209388 -283912 126575 147774 725440 639666 100212 -57945 -196484 309339
12122 309339 458608 58549 75513 -127992 261586 377855 473941 461740 556958 378060
12112 378060 404368 534172 -251078 -313341 -207237 529178 399609 230108 -321082 -326075
12102 -326075 -68086 -284241 -385346 -191763 -309021 -264438 -194200 -482442 -160376 319376
12092 319376 469456 719065 75368 -303843 -181556 -121671 175350 175858 17683 -21262
12082 -21262 122904 -354240 -67515 275316 787626 503689 -168768 -299087 -335402 -920652
12072 -920652 -564144 66911 -337684 -676359 -794660 -446663 -40004 52688 -125941 80077
12062 80077 90180 181213 9266 280391 -503839 -790527 -515604 -519908 -677403 -150882
12052 -150882 130864 704932 452737 27356 -418620 -117027 -352309 -166761 428013 -405161
12042 -405161 -1202241 -388404 -213332 -737424 -738640 -145380 117999 -73172 -152655 -273618
12032 -273618 132409 289131 303209 140891 -198197 -279315 314479 474902 -164743 169492
12022 169492 557606 152195 339406 482447 399027 -142907 308205 535632 482052 -44670
12012 -44670 -559047 -876161 -219180 -376024 67742 147513 455889 319023 258939 -1518
12002 -1518 -386625 -576709 -18525 70979 506441 135142 -326243 -270235 142887 356800
11992 356800 -316935 -824622 -292837 371270 -164356 -657413 -186715 -315119 -435627 -161915
11982 -161915 -720713 -478832 -32492 -184954 -574490 -247134 -177362 -51665 187822 98125
11972 98125 347613 -40663 187964 483381 385902 980177 752399 677103 1076040 431545
11962 431545 -525746 -729120 -335867 186737 -398024 -44485 -306574 -235607 -336638 242208
11952 242208 163832 240492 314664 635703 1265724 975823 821534 210433 459300 33612
11942 33612 -205315 119875 -34582 36968 -66449 114302 153173 77195 -824706 -1037335
11932 -1037335 -532660 124067 -163557 221621 500698 -222051 235291 169378 333769 392334
11922 392334 -1751 288856 647694 321947 -143550 -214807 -239403 -532478 -59685 -388020
11912 -388020 -1017996 -354705 355178 -15680 44530 -385445 -190943 235690 381888 192109
11902 192109 -24175 94622 409124 511563 -198403 -254788 163393 -14115 -68230 92112
11892 92112 390628 -490032 -283930 106863 -15656 357348 404962 735831 114840 266902
11882 266902 366300 185016 -308814 -727919 -279286 138411 38768 87627 -369355 -208014
11872 -208014 -357514 247302 529914 740456 174254 -76427 -227109 -396197 167412 103922
11862 103922 75637 -445882 -611019 -254057 -682071 -823819 -230403 -555463 -398666 234274
11852 234274 -411338 -431328 -383199 -396516 -123543 -548775 -644096 -961787 -188545 361820
11842 361820 446174 383952 -277223 -811929 -615039 -147008 -380126 -21944 327138 -117992
11832 -117992 -359101 -174438 -283664 -6430 491579 -534954 -590806 57980 231166 315466
11822 315466 1040248 684364 602950 573822 563491 126202 40661 -55090 271839 348305 -77971
11811 -77971 512452 238995 454012 -148733 -159171 -413078 -605595 -658068 -582032 -674595
11801 -674595 -400665 136390 270645 -340656 -307321 -352031 -177080 -212559 -75086 -165747
11791 -165747 234768 315419 -272531 147129 240308 372141 266895 -293763 134517 889485
11781 889485 856515 89225 -645430 -192837 -55283 -150624 570914 571926 -64440 767778
11771 767778 -778572 -1005787 -220202 271069 -137747 -731985 -912621 -630468 -363855
11762 -363855 -488103 -461896 -805136 -721475 -366606 -62016 -428138 -688637 -1069825 -567166
11752 -567166 6142 -225043 195419 -368510 -631752 -625096 -111626 100646 245570 341947
11742 341947 523366 276937 236555 -32243 -92957 91834 -332427 116197 278659 213306
11732 213306 -123952 286913 73007 146960 -265882 -132440 501439 154558 87644 -84284
11722 -84284 672422 52584 -122998 343435 297619 185333 80403 342278 327727 110783
11712 110783 385827 853435 1003843 325755 243467 -56766 -82237 167549 -583663 -321269
11702 -321269 -27038 -67894 58105 210302 -328940 -33665 157414 7934 -76487 -55724
11692 -55724 -19856 -91351 -170400 -286727 -395851 -716769 -229595 578419 346062 -161573
11682 -161573 -585739 -238683 -42723 73137 252207 -403169 -258965 302288 -219474 -164277
11672 -164277 -101217 -107603 -721826 -207803 359727 325897 215071 578471 460563 -250182
11662 -250182 -140758 -149334 -289469 -198399 1966 311850 165233 -144129 -301824 -239795
11652 -239795 -239173 -227569 -453563 -185013 493498 836807 441104 503009 937078 842334 613068
11641 613068 133694 -350253 -357396 -316101 120770 226286 240312 6354 -300035 -59991
11631 -59991 -1000606 -1134545 -1063649 -425516 -210263 96922 -13038 -204489 -132796 -94768
11621 -94768 161884 59107 65265 -297464 -89807 -158148 -289910 53481 -296773 -96125
11611 -96125 177281 142362 798651 61144 -414781 455048 -135446 -429406 -29550 -241450
11601 -241450 -223126 -443702 -451983 -34242 176149 379292 502550 501154 442058 259876 294761
11590 294761 77425 164970 -338719 -388950 50350 140158 715437 -64067 -317213 253154
11580 253154 -132201 -55224 715568 -62274 -344361 -857380 -950892 -120576 441823 785494
11570 785494 618750 770760 323581 -360756 -147845 305380 206111 612002 313282 587567
11560 587567 1056419 835949 574635 152947 -141597 -367947 709266 952156 31977
11551 31977 -203634 -462005 -109632 -45515 -271059 212883 -413453 -342421 178053 -165147
11541 -165147 -274799 -284621 28900 -65749 -218082 -210424 -360769 15097 339101 202661
11531 202661 55387 -180741 -349476 -506951 -600915 -598169 -687456 -802372 -307083 96943
11521 96943 133272 420652 436285 -11628 -22765 335683 -153974 56278 135502 736846
11511 736846 759875 578896 217807 -214350 125825 58695 79730 170332 -264021 139158
11501 139158 -140601 -180825 -907588 -508072 -895231 -374329 -364121 35452 117942 -288560
11491 -288560 -256528 -160274 135448 333309 183254 -255986 -399949 -363805 82922 -90525
11481 -90525 230950 499871 771190 717048 975548 183739 337776 426429 288400 269074
11471 269074 326606 -42540 -80257 -922011 -471959 -26632 288050 707699 525634 464781
11461 464781 391543 311521 410918 -33953 -112283 -237025 -390524 -502239 -406117 -233169
11451 -233169 -4444 -389401 -224331 231782 69354 -64229 15549 -155672 92383 -27079
11441 -27079 168552 1136632 739018 394486 541898 577777 324621 275951 364069 248739
11431 248739 173681 282573 744402 934353 1311178 944756 1060240 712676 1067784 1109627
11421 1109627 940392 1185674 666168 440024 1016891 1255349 1140791 737023 557588
11412 557588 618023 1449477 1230368 899922 922263 927468 370150 240831 604193 327796
11402 327796 524265 505464 -157540 -312030 274013 -98969 -576781 159532 170760 -134997
11392 -134997 91463 -305943 204243 312278 204263 548106 449322 560339 69118 604504
11382 604504 780086 -144305 78311 -171402 -235949 -73455 41073 -119795 198472 554648
11372 554648 1290271 91695 -196665 2567 466628 110687 -81730 -347199 452563
11363 452563 456624 550875 658346 286154 127512 192776 500762 1052539 620410 921845
11353 921845 820146 760534 881487 606169 759342 692079 604022 1220665 714949 181853
11343 181853 1108810 997789 317420 136250 396152 282917 -10473 -433070 -153636 -377827
11333 -377827 -855731 -68017 34527 443345 468933 521994 329544 354769 857800 913076
11323 913076 381301 45592 654017 648610 469306 253801 557010 816447 1068474 1555790
11313 1555790 1338360 829399 1248243 1551871 1566763 689179 425194 13254 157958 269512
11303 269512 313390 381327 389539 135839 -261788 173939 844383 215305 150748 478768
11293 478768 1163763 559488 148060 386323 976523 1351678 559119 152052 635986 558960
11283 558960 102631 -1898 60144 -16382 348715 308660 40167 -37342 207252 -106594
11273 -106594 -572337 -404496 62140 336216 606959 -253706 12234 255164 -633574 99915
11263 99915 434427 459479 308024 492309 767436 575282 306118 379679 75525 -127735
11253 -127735 -161028 -387735 -286185 311937 1160216 978621 703265 386836 94548 420074
11243 420074 711721 844731 1028331 984018 658479 672751 803834 831424 686035 141001
11233 141001 590010 909720 858922 955559 906132 876111 578346 504128 301764 54819
11223 54819 97455 200192 523031 769226 356418 149307 538661 348331 278161 707598
11213 707598 517389 404996 397845 -50006 -51652 996313 967611 1057008 588594 405641
11203 405641 917148 1196307 1119163 964900 453495 -1239 517743 825102 310996 293051
11193 293051 499950 601434 514542 577587 400178 523923 663886 863520 504272 755602
11183 755602 749751 598342 919625 1693997 1595036 492044 587300 324971 160092 -154806
11173 -154806 190206 1086894 1372218 1387699 1200470 1093690 755836 1284064 1275114 1407156
11163 1407156 1427586 691500 1013440 1189941 948840 1027461 1468393 1165564 727316 465087
11153 465087 816746 951381 1289039 1261318 1073877 410849 -153233 717549 1628006 1802531
11143 1802531 2023721 1806954 1402750 1086351 1475791 1310505 1202793 1405060 1211881
11134 1211881 1176408 903980 1096013 1336393 1826772 1850379 1629579 1215656 1438559 1559344
11124 1559344 2075354 1891372 1594251 2420886 2413612 2007573 1597549 1799392 1790304 1741841
11114 1741841 2114170 1713899 2243625 1739051 1821547 1638421 773333 1665370 1945048 1640440
11104 1640440 2017306 2118344 2043991 2020192 1506643 1728799 1811366 1779031 1638967 2638695
11094 2638695 2975893 2540062 2502802 2678906 2156781 2606908 3080577 3194889 3438485 3842877
11084 3842877 3258696 3043015 3031625 3039642 3830946 4091104 3261257 3052945 3320319 3610828
11074 3610828 4343944 4381223 4006557 3462169 3689297 3652646 3950214 4971983 4323478 3884448
11064 3884448 4880323 5153829 4740974 5248100 5380850 5175979 5379936 5391857 5503987 5164204
11054 5164204 5623514 6239335 5787541 5866241 6210527 6406469 6701917 7428386 7714684 7566419
11044 7566419 8377913 8283731 8821825 9212515 9088090 9726310 10283633 10346846 10733275 11026580
11034 11026580 11526443 10866696 11595140 11588431 12055089 13142062 13655446 13808757 14085363
11025 14085363 14748807 15572036 16392092 16070477 17259726 17823571 17896528 18646985 19356650
11016 19356650 19948945 21283364 22416468 22670878 23875249 25298211 26222844 27637836
11008 27637836 29082380 31158201 33228263 34615781 36793264 39637448 42526650 45847787
11000 45847787 51007176 57835176 64668663 73005607 84234184 97059383 108646386 118897248
10992 118897248 127961434 135960806 142772796 145945120 143944407 139271751 133600353 126412283
10984 126412283 117417454 106955127 95282080 85454191 78286520 72447783 66736283 62909592
10976 62909592 58717545 55748835 53346534 50903510 50250959 49301832 49183501 49136505 50483695
10967 50483695 52734660 55764030 59378460 64464574 71471866 80164516 90874746 103328084
10959 103328084 115119855 125419952 134644907 144225877 152762106 155176391 151702623 144699521
10951 144699521 136640203 128279639 117788997 106556282 93459336 82078603 73430316
10944 73430316 64803547 57631048 50923967 45071826 40655158 36862646 33467267 30639094
10936 30639094 28185082 26335369 24420113 23072708 22062438 20281342 18976311 18773365
10928 18773365 18444039 17193176 16614051 16030214 15732882 16038067 16169136 15333296 15259499
10919 15259499 15966282 16169006 16658281 16629272 16922205 17467437 17049650 17237385 16609006
10910 16609006 15783920 15816798 14872759 14830486 13429779 12089161 11642147 10984614 10517783
10901 10517783 10094227 10379244 9693989 8785120 8831158 8005321 8069536 8188302 8097643 7920470
10891 7920470 7934447 7689332 7873958 8422309 8631049 9434719 9120566 9245360 9652532 10182358
10881 10182358 11186003 11095882 11004289 11548053 11803455 11749664 11169839 10648343 10080829 9521919
10871 9521919 8633894 7462945 7128795 6517938 5874501 5566643 5332284 4724957 4889708
10862 4889708 4459748 3774988 3895632 3778224 3860779 3788334 3336027 3101479 2794258 3054114
10852 3054114 2775618 2253663 2312487 2234518 2388655 2244966 2024066 2166857 2230972 2343435
10842 2343435 2710660 2161422 2337232 1925289 1632274 2056890 1765293 1376654 1872096
10833 1872096 2212566 2799680 2659519 1950487 1872029 1772492 2310852 3000431 2370379 1618267
10823 1618267 2393762 1872462 1880978 2318704 2143998 2068021 2215042 1734884 1351122 1159744
10813 1159744 1786821 1897233 1683881 1112357 1124082 1510245 1336897 2176698 2021836 2796490
10803 2796490 2800929 2038886 1929256 2324093 1620673 1455808 1366302 868376 1092741 1561505
10793 1561505 1747177 1592211 925869 644351 954644 1293145 1517449 2194818 1758754
10784 1758754 1297604 537818 1315127 2171196 1648346 1203931 1420610 1641019 1175961
10775 1175961 1345364 1508450 1650171 1060503 1225133 1448934 1521242 1563278 1051477 917333
10765 917333 611552 964807 1336332 1372440 1654763 1350966 906584 1910014 2123199 1284155
10755 1284155 942338 1341667 1614795 1556558 2172615 2298841 1791992 2394634 2774115 2428401
10745 2428401 2641706 2180709 1362625 1192532 1381690 1117917 1685919 1604998 1741259 1893401
10735 1893401 1962341 1301747 1130120 1615701 1515311 930206 1048069 1175296 1492732 1596222
10725 1596222 1218920 1092738 1536632 1400852 1177732 1197042 1542489 1406458 2065760 2591291
10715 2591291 2374922 2218981 2314387 1679531 1834343 2051929 2882246 1902926 2281707 2495390
10705 2495390 1408625 1335354 1323066 2101177 2033736 1964711 1290250 1652446 2159051 2353287
10695 2353287 1814966 1985464 2065209 2317231 2226287 2601432 2315221 2905563 2267660 2173763
10685 2173763 2672353 2591103 2684448 2096947 2168809 2473086 1997444 2939411 3043546 2329306
10675 2329306 2422810 2547487 2546153 2605847 2824948 2459069 2964784 2967478 3036266 3484139 3685039
10664 3685039 3854756 4053301 4219610 4579864 4827561 5549264 5781726 5632611 5706753 6036118
10654 6036118 5598602 5782421 6069545 5493515 5174077 6114424 6789425 6716208 7256366 7406073
10644 7406073 6179224 5492900 5436151 4927311 4213071 4651759 4493386 4280132 4362763 4648212
10634 4648212 3854032 3322739 3622475 4114303 4667926 4586354 4675160 4209285 4773112 4463981
10624 4463981 4235974 4031909 5296173 5337288 5559901 6181986 6797474 7971987 8008441
10615 8008441 7224894 6979250 6900183 6858247 6527969 5883294 6061636 6082115 6517179 7455807
10605 7455807 7328013 7745342 6890920 6628142 6434878 5354409 5411102 5135696 5059358 4480971
10595 4480971 4377762 3861448 3940310 4301351 4130458 4124863 3780886 4159781 3990887 3653633
10585 3653633 3740556 4055470 3953078 4101787 3923739 3425433 3258634 3440467 3774231 3130218
10575 3130218 2593774 2550472 3431849 3259177 3453239 4261548 3750432 3371622 3309652 3310667
10565 3310667 3163716 3377618 3695077 3446008 3785614 4131768 4751618 4432251 4528648 4949903
10555 4949903 4501740 3943895 3801185 3808061 4014192 3568935 3362987 3042199 3334192 3540322
10545 3540322 3198809 3928299 3865802 4504554 4348242 4470144 4611849 4760136 4678564 4058970
10535 4058970 4297406 3978652 3055240 3067545 3948688 4251464 4249522 4198686 4675127 4792556
10525 4792556 4485671 4327130 4582920 4532585 4714756 5352001 5872002 5294728 4769756 4805693
10515 4805693 4414828 4546112 4965867 5128193 4878304 4996869 4950374 4259818 4408936 4642769
10505 4642769 5289316 5835614 5863240 5636497 5949840 5273032 5246806 5252412 5063725 5303942
10495 5303942 5061420 5068226 5406462 5925420 6562033 6316467 5876049 6363573 6627484 6910727
10485 6910727 7015256 6765273 7027400 7902392 8146320 8102428 7989191 7992596 8327405 8403262
10475 8403262 8196160 8736795 8997132 9209142 9650395 9607637 9455661 9963245 9672050 10393443
10465 10393443 10419747 10576644 10552053 10907262 11599048 11616529 12428887 12465590 13244385 13594365
10455 13594365 13977139 14335453 14599054 15244121 15773669 16797630 17565290 18461505 19025649
10446 19025649 18978320 19668706 20757833 21610732 22631140 23935747 24856106 26652489 29094016
10437 29094016 31863576 34283133 36461722 37883347 38639411 38925571 39300413 40836377
10429 40836377 40729931 40272293 39775636 39883543 39893391 40606576 41488917 42484119 43905866
10420 43905866 46159034 47782476 48812322 50834249 51684501 53090703 54723535 56972633
10412 56972633 58318461 60437554 62510211 64036912 66366862 69359022 73404134 77683520
10404 77683520 83326546 90549069 98600594 108792327 122268879 136416065 148200667
10397 148200667 155550524 158838212 160912692 165609775 169943775 170332975 167236815 161435749
10389 161435749 156452192 156803207 162080740 171535080 184873335 199939089 213742259 224841179
10381 224841179 233117372 238065356 240975493 242987951 245942015 253541861 269714695 293782264
10373 293782264 321125912 342727273 352057271 352406628 348151992 337717246 318709123
10366 318709123 288993684 250491047 212022615 179566003 155053285 137162840 124379190
10359 124379190 114891771 108283910 103777707 99733290 98050090 96803209 96362268 96469732
10351 96469732 97151854 98770812 101562226 106678466 112052604 115809852 117038729 115228476
10343 115228476 111749931 108015542 102884429 95796110 88069350 80421022 72800020 66347578
10335 66347578 60744376 55788487 50558264 46696622 42746323 39427871 36927273 35404322
10327 35404322 34344982 32424227 30948852 30604048 30143620 29332993 29128420 27988993 27599061
10318 27599061 27109873 26762452 26445616 25556533 25456716 26014537 26039342 26033322 27317760 27920399
10308 27920399 28730138 29424006 29751834 30656447 30111663 29757947 29147471 28096255 27901254
10299 27901254 27598223 26433461 24740183 23111639 21324976 20045838 20029817 19221961 18305323
10290 18305323 18606866 17603634 17192639 18093419 17969592 17916720 17633571 17417640 17240387
10281 17240387 18117585 18942680 19043725 18908573 19261692 19146654 18759400 19506768 19317003
10272 19317003 19752424 20835525 21686404 22072299 22201617 23361055 24598057 25506415 25674927
10263 25674927 26951037 27170335 27948824 29301394 29849089 30111702 29307485 29221295 29455495
10254 29455495 28993662 29052256 30242129 30206986 30516849 31812122 32225838 33290778 34804737
10245 34804737 35347563 37280206 38680264 40782840 42566809 45253988 48756618 53001128
10237 53001128 58796808 65665950 72879197 80310667 89499844 97405226 99618363 97320196
10229 97320196 91789208 86730430 84138728 83618013 86248873 90344474 95064796 100883206
10221 100883206 106931566 110656998 112004118 111518165 109994722 110887363 116329282 124363441
10213 124363441 137490135 154666938 167861997 171374594 166386472 153925896 141961119
10206 141961119 131886710 122896652 114644821 108113518 105574655 106481343 109904959 116137888
10198 116137888 124670423 133083400 138760998 139607317 134620849 124602465 113693826 105672943
10190 105672943 100032282 95948383 94405766 94306993 94925075 95780409 94630727 91495220
10182 91495220 85526271 79094298 73941929 69790038 67264237 66467645 67479588 70063952
10174 70063952 73488607 77479522 79957111 79349369 75689656 70128869 65448357 61853038
10166 61853038 60036673 58471645 58661263 59709251 61858165 64865239 68023647 67028922
10158 67028922 63330949 57153164 50147727 44675036 40362674 36229856 33901669 32713804
10150 32713804 31366358 28809183 27275155 26006816 24755009 24805368 24679456 25369799 25102387
10141 25102387 24564484 23684784 22497114 22145572 22267101 23293973 23901468 23905256 23889511
10132 23889511 24104621 24255012 23708237 22910980 22043252 20348280 19220140 18438673 17911787
10123 17911787 17856633 17587028 16792460 16648421 17121857 17328115 17432525 17487230 17983930 18217854
10113 18217854 18169575 17662295 18524450 19409181 20135248 20490970 21445306 22453233 23721882
10104 23721882 25052547 26526557 28031864 29040993 29482321 30249984 31197583 32876537
10096 32876537 33738990 35412857 38645813 41973407 47259747 52266276 58505171 65467880
10088 65467880 71392646 74463860 76496686 77111569 77042555 78761791 80489756 83169828
10080 83169828 84579820 85603556 85634965 84645130 82229596 78690956 73167324 66282580
10072 66282580 59629006 54020542 49903788 47170563 45802334 46323696 47540533 49820736
10064 49820736 53417804 57685129 61050211 63314043 63411313 60629732 56510623 52180904
10056 52180904 48043341 46033543 45136609 45057994 45599410 47296656 49819282 53579997 59124808
10047 59124808 66149360 73815759 83220358 91488569 97450469 100801386 100946355 97705428
10039 97705428 91615493 86057860 80221915 77003809 75712968 75506523 75380444 74469916
10031 74469916 71454742 67941273 62672671 57719838 54595011 54501255 55719069 58847939
10023 58847939 62094226 64001145 65598832 63493102 58314937 51839356 44686842 38745930
10015 38745930 32882638 28287443 24684216 22206227 20058473 18047660 17020832 15944451
10007 15944451 15407278 14738609 12959643 12349833 13064072 12167218 11354516 11139626 10620872
9998 10620872 10222074 8899806 8602208 8703093 9161137 9519248 8660511 8251546 7687490
9989 7687490 6868518 6913400 7354217 7232448 7405965 7547079 7280471 7215051 6448213 5930307
9979 5930307 5438382 5087075 5213904 4578781 4973906 5338692 5038053 3963457 3994465 4342184
9969 4342184 4308044 4735866 4533718 4420128 3793408 4358589 4405879 3761984 4562969 4792620
9959 4792620 4351757 3952637 3762158 3554789 4023002 4343812 3864506 4209326 3920093 3518525
9949 3518525 3262354 2537287 2665940 3218148 3299858 3085279 3276774 3475724 3994955 3580758
9939 3580758 4380708 3926986 3472431 3222513 3293778 3100233 2814230 2742614 2327697 2792344
9929 2792344 3442379 3870884 4307333 4382750 3468437 3315642 3423662 2768975 2665831 2935672
9919 2935672 4140298 4127097 4472242 4211939 3967593 3816079 3569074 3793041 4277261 3808427
9909 3808427 3686574 4509440 4121246 4147950 3481160 4485649 4499097 4410064 5129614 4847255
9899 4847255 4717210 5239111 5464537 6190992 6459763 6495242 6659869 6728255 7235243 7397965
9889 7397965 7603649 8590661 9002527 8717353 9441722 11167663 11882571 12641457 13383698
9880 13383698 14066000 14782299 16975388 19860174 22731645 26329664 30129945 33236920
9872 33236920 34764020 34727605 32368014 29320509 27203759 25580211 26034384 26828648 28128396
9863 28128396 29940698 32036506 33560626 33240607 30885517 27188859 23418735 20911099
9855 20911099 19220359 17493070 16374836 15843099 15403973 15417493 15179165 14704627 15107856
9846 15107856 15106184 15327473 15873438 16145890 16519863 18028127 20374865 22298397 23983543
9837 23983543 26719595 30354968 34060391 38664396 44323817 48984043 51434986 51881861
9829 51881861 49985091 46428705 42514281 39688720 38122695 38291793 40695311 43172744
9821 43172744 45151284 46572178 46783582 43806294 39340889 33797275 28928346 25770837
9813 25770837 22580289 20133426 17985000 16547488 15678890 14995575 14806143 14317128 13094349
9804 13094349 12276121 12608938 12845941 12429511 12029077 12305852 12754126 13953873 13849593
9795 13849593 14259535 16032609 17663642 20165870 22138833 23325472 23964297 22706064
9787 22706064 20721364 19214451 17429506 16805857 16666142 16779401 17908524 19119752 20731024
9778 20731024 20086886 19190003 17603383 14945586 12401907 10417918 8919027 7879955
9770 7879955 6799615 6146624 6033585 5901346 5167359 5086956 4801466 4271126 3979983 3610906
9760 3610906 3315971 2719434 2548197 2497273 2174214 2562997 3057854 2871837 2869131 2594234
9750 2594234 3177999 2612828 2437635 2333511 1842764 2044443 1881431 1344146 1317453 1744536
9740 1744536 2028655 2180389 2156433 1798774 2467384 2426913 1464638 2260007 2210184 2004258
9730 2004258 2193218 2053977 1849385 1580314 1633645 1831206 1794888 1360493 1854477 2108170
9720 2108170 1728947 1120360 1159074 744154 1165390 1257610 1310689 1210460 1186611 1640787
9710 1640787 1281933 1787580 2007055 1772028 1534541 708482 402546 612193 1124102 1031791
9700 1031791 1076668 1649950 826815 1193048 1643743 1057463 710219 533661 566334 287912
9690 287912 1086978 1034418 753507 1197228 1619394 934602 306696 29094 510201 812171
9680 812171 865427 943245 1105969 411269 496860 952315 1422886 1093038 549887 917775
9670 917775 1148925 362176 509231 981975 240784 471067 964053 1026312 506823 668720
9660 668720 920940 1040414 346075 -309837 -682596 -418494 -199290 229566 382524 303497
9650 303497 -40391 438773 205175 -27970 -115730 165905 150569 184747 294066 368262
9640 368262 536576 544905 19065 -413894 28325 994669 726517 225344 432953 133641
9630 133641 -689432 -635705 -601794 -164016 564275 204414 775036 424681 226516 34574
9620 34574 -113549 45819 -56957 -321465 -587060 -775 418322 15706 414698 580337
9610 580337 -539057 -978129 -949363 -188279 68162 -349615 -529940 -949288 -698734 -778814
9600 -778814 -320043 78237 93366 449685 207726 -399509 -26362 41465 -46611 689820
9590 689820 1014619 355182 232773 462881 505016 321057 -507971 -858273 -106686 158144
9580 158144 187302 310852 286970 356892 -86006 -39396 469110 498261 33366 93647 -98792
9569 -98792 -302377 -644607 -637325 -169035 361095 -187982 -188181 420035 361603 -189443 -680965
9558 -680965 -377408 17039 -240732 284137 199116 238993 -139187 245733 57247 -538567
9548 -538567 -300790 364738 67871 -895468 -836959 24002 191646 -182234 -445663 -473432
9538 -473432 -290341 -277630 -22290 -251239 320298 50961 -92151 -94813 -56887 -121486 -271957
9527 -271957 -363070 -482252 243023 715497 3986 32946 46325 -857539 -611826 126865
9517 126865 -79078 184073 263726 13158 -338491 -558626 -560701 497178 751306 610132
9507 610132 338986 630681 868941 404324 167512 6690 68872 289674 3077 428194
9497 428194 456811 406128 200767 301071 -164675 101846 -70067 -643 -48058 -857870
9487 -857870 -528237 -740900 -810984 352857 448435 -68274 9378 -82029 -170458 -228584 140778
9476 140778 167839 514950 517091 822030 554343 301949 237636 271248 -249696 -643207 120290
9465 120290 91805 532057 947647 663282 724527 999330 137398 -121596 11002 306327
9455 306327 102158 247263 241449 144571 603269 480137 308082 9491 -176954 -154979
9445 -154979 -429157 -443873 -528312 -33810 699607 710369 395947 -782859 -671384 -312062
9435 -312062 -459694 -420173 -113710 -640756 -501182 -430405 74776 407000 499032 -188013
9425 -188013 400160 -200350 -8481 67657 -320921 -235158 473790 526884 273543 908134
9415 908134 124305 -385901 -359135 -141370 455278 27963 -87859 637329 374258 253280
9405 253280 365342 -76528 -327299 -250642 -129093 -245000 -244678 -49594 138959 -446375
9395 -446375 -2839 246519 -153171 -453569 -511321 -824430 -809491 -544931 -949420 -237177
9385 -237177 -539194 -274911 143365 -55245 -591466 -447234 78733 -181024 -788723 -529317
9375 -529317 -315317 -86800 -95359 -310489 -577988 -509904 -650225 -903973 150749 -81955
9365 -81955 -38722 208291 -873457 -858215 -169832 -365172 -235681 -224259 -193503 195480
9355 195480 -118173 376566 407297 -109231 -327594 -181861 -404757 -830288 -668444 103248
9345 103248 -101713 -526005 -662541 -52504 -400974 -787671 -397938 274993 406620 557068
9335 557068 378109 -193084 -414498 -591519 -170847 16471 -419863 -609243 -196042 6233
9325 6233 -459040 -667883 -755138 -620054 -62630 598198 548689 49205 -174845 26091
9315 26091 8449 150214 -94480 -361233 324757 100993 235559 351017 -91335 -970882
9305 -970882 -1023157 -480356 -406418 -17066 -160766 -372098 215580 494190 -61717 -149582
9295 -149582 258058 404866 413150 401487 210530 -15247 375227 638527 876531 380435
9285 380435 23606 53334 -2964 293022 506098 337566 454586 445068 -519398 -26896
9275 -26896 810843 556686 349693 -155818 -433715 -501054 -378557 66626 -739300 -815537
9265 -815537 -310174 -490653 -265442 -189120 -94394 -123069 -617065 -848446 -563295 -580074
9255 -580074 -165410 -173225 256824 105439 -344288 552808 74909 -306461 153933 120734
9245 120734 484145 491546 292466 504698 490118 -128088 -693273 -975608 -1121637 -1077502
9235 -1077502 -225230 -367372 -1029762 -944126 -828959 -322711 240418 50015 -542892 -193677
9225 -193677 300295 544718 704271 149362 -395446 -187887 402166 312918 -177951 -421479
9215 -421479 -228925 -355635 -602473 303510 961823 202173 607190 374468 618547 609816
9205 609816 478180 355351 131810 310301 -384192 -175325 -178085 225183 585629 433789
9195 433789 -286994 -276643 766358 565941 201165 226731 220088 -461536 -428387 -320645
9185 -320645 -680452 -222739 142348 358280 4756 -356567 -498303 -724176 -241553 -281088
9175 -281088 -699075 -207367 -742912 -721521 -210848 210631 499707 -99463 -147614 397838
9165 397838 -403504 89579 474360 -356983 65031 131135 241380 1567 -425190 -302553
9155 -302553 215637 919088 -157838 -795380 -31872 640419 564043 -490154 -764086 -652492
9145 -652492 -227733 -317726 -716592 -396373 -179804 20585 -306109 -35371 -183796 -202673
9135 -202673 -138675 -29749 -320455 630831 703848 -641324 -549864 -226638 -523812 -440669
9125 -440669 358954 -562376 -797212 -161325 -12088 118859 456610 46600 -1186 374809
9115 374809 256523 413989 326245 -78817 895930 998135 1005882 879935 364495 121059
9105 121059 -117120 457074 371130 244150 280501 218069 -194128 604292 510962 36691
9095 36691 42298 -454906 -640076 -272371 -537051 -118493 372566 16782 -610262 -651452
9085 -651452 -744993 -692187 -773091 -650284 4075 209836 -445523 -263330 -153565 -574801
9075 -574801 -760325 -956118 -833357 -865496 -992917 -59184 59225 -221486 34663 -158648
9065 -158648 -12532 -227292 329747 -177252 -200840 -438416 -518571 -376802 -342044 -727799
9055 -727799 -1204438 -919314 -68222 156525 122545 57738 -232588 -1199122 -180468 559516
9045 559516 108019 -204348 -301906 -534323 -380988 -604143 -714472 -990259 -251290 -297277
9035 -297277 -890621 -359105 31495 -16309 135376 296586 -321723 -530585 -130833 197409
9025 197409 403910 284754 175533 30038 -652160 -195244 -272305 -610969 -427169 65572
9015 65572 -653308 28180 269658 -469242 -155003 -366917 -5923 -245197 -816772 -622464
9005 -622464 -398076 311587 531051 575122 417821 822384 897183 582148 -361846 -701950
8995 -701950 -430959 268121 247132 154696 417812 -28662 156110 -31221 -267401 -564616
8985 -564616 -251860 186233 -313747 -146702 -1065 14442 129972 -532442 -379922 -135972
8975 -135972 69123 1153872 482347 223202 255156 -782438 -817834 -739756 -422625 252462
8965 252462 -43896 -476312 -922352 411066 408390 -12061 7440 -471290 47031 337954
8955 337954 251210 -17640 -33808 -128757 31100 -30226 255573 24674 -322265 704901
8945 704901 653580 334538 -143646 -1007925 -951382 -100909 -46667 -427015 -754341 -704177
8935 -704177 -407631 -324006 -275041 188669 760291 451854 -585 -34507 -135637 238489
8925 238489 123185 403545 206684 38324 266601 -465241 -325044 -365215 293818 -373409
8915 -373409 -377780 169986 189965 -374518 -209838 -527471 -705315 -122844 641716 344925
8905 344925 -86249 -220586 6212 367192 53731 208247 619266 174103 95040 -194768
8895 -194768 -82294 -11865 -125731 564255 421061 -178532 -518100 -480519 -236939 4743
8885 4743 -392215 -596416 -88651 220079 126320 -137878 21490 128022 10056 -607018
8875 -607018 -406524 127241 112046 188398 414657 197717 186875 -128394 -514053 668750
8865 668750 177516 -269039 -612478 -587110 -11342 160063 -116245 3294 297454 -280799
8855 -280799 -149478 328420 92356 174043 150916 -499149 -361134 270798 359578 584826
8845 584826 244582 331632 240449 -422059 -187951 297113 493432 199510 -249100 -624201
8835 -624201 -255703 -56857 -315898 -692641 -303951 279565 -118677 212577 -491499 281721
8825 281721 335537 105941 368296 274823 -91912 -156351 363669 114441 308257 170911
8815 170911 -616222 -39425 -315485 -106358 -372660 21895 190299 751738 558331 322159
8805 322159 223082 81883 287175 518535 964576 229729 -312907 -503171 26659 -59730
8795 -59730 161271 -504141 -546198 -468546 -160889 -459397 -747721 65534 636326 -111762
8785 -111762 136711 421240 653233 236400 -312866 -651611 37263 337002 -353909 -804668
8775 -804668 -587282 -502104 -45445 391490 -244526 -496933 -629188 -507749 247503 -73519
8765 -73519 -343149 494775 1192912 445995 290527 -109515 151397 678404 551628 -25751
8755 -25751 -10555 43237 245006 734060 144205 160201 240266 -11613 45805 168135 225441
8744 225441 636314 1484457 1218314 899934 960693 218730 -509288 -925624 -599826 -43339
8734 -43339 -308463 -981551 -844219 -778643 -42783 -552818 -143486 42483 -113780 64565
8724 64565 125190 487120 366611 -530959 -338301 -247070 -433677 592908 983406 1165838
8714 1165838 318100 79183 978268 307497 -457618 -1015409 -679764 328483 708140
8705 708140 -9518 -44364 -31559 -109856 -195659 -929265 -641142 -367588 -127371 8656
8695 8656 196102 -344900 -563948 -144720 -637154 -290686 635476 204819 -208531 -290865
8685 -290865 -89265 542717 -62362 -321820 -418369 -187858 511042 118188 432014 -50233
8675 -50233 -431518 -150805 -1095 325162 543306 30039 -197649 -114655 -144020 -126987
8665 -126987 533338 326348 549839 1170531 617860 186467 291669 952964 561353 -176505
8655 -176505 -195424 28306 -515067 -525707 -31850 256565 593471 448970 49917 -131498
8645 -131498 -187214 -272405 -499677 34666 292912 147712 -227258 -244616 -278284 161919
8635 161919 684422 966315 421262 150327 149997 275855 280080 581651 -132932 -617520 -438710
8624 -438710 -426560 -178045 176764 -282552 -344872 -284486 29304 123059 -15773 103202
8614 103202 -122716 289492 690108 510050 -582373 -313841 251765 135525 504685 132431
8604 132431 324459 595253 420385 134788 -219170 151417 -222469 287874 123773 541158
8594 541158 159084 -442607 188890 908284 679579 719059 833544 556629 340762 446062
8584 446062 -810187 -255723 511862 316868 223669 76198 -536908 -155581 771388 677722
8574 677722 210783 -526188 -486402 -506172 -481407 -443205 -282224 -736679 -523984 -181019
8564 -181019 -67908 -335526 -410800 -455806 -774418 -985985 -645248 -914675 -851605 -745175
8554 -745175 -469215 58338 147013 -136305 -446141 -285030 -172985 -363415 -126077 -204186
8544 -204186 126001 485536 494517 -204824 -636357 86314 -27684 204478 123432 -171866
8534 -171866 -246396 256558 568006 149981 141447 346918 343284 120328 204443 580480 321568
8523 321568 249689 330764 619812 557336 219451 -420834 -715694 74098 300079 -536273
8513 -536273 -1134207 -897927 -727819 -54408 439042 -108460 -210401 492625 510149 -75095
8503 -75095 -197027 -400060 323016 -11522 -284250 -102370 -655593 -536658 -521680 -145902
8493 -145902 27252 -5353 -84894 -236063 166582 -354102 -278422 -645318 -568495 -284993
8483 -284993 -589348 -84977 393809 -271846 -110683 414241 -72342 -181038 -130721 -771774
8473 -771774 -1085181 -1204581 -961683 -438778 -444375 -47523 -52957 305782 201394 -305772
8463 -305772 -691847 -662793 -600055 -148762 51434 -505095 -922223 -638815 10379 614464
8453 614464 523695 534850 417851 -237769 73109 518132 463044 636805 443380 762702
8443 762702 672343 604903 -8563 -292939 -502441 -836519 -512782 -33794 -242190 -175959
8433 -175959 -447942 -394770 112882 -298380 -258775 -271108 -510017 158492 447548 459540
8423 459540 376102 409717 301600 466430 -75911 284271 531013 465677 533053 -31442
8413 -31442 -371440 -427088 361142 515419 -108888 156831 -240751 -231897 294186 159519
8403 159519 43977 431787 108217 -452121 -19968 -313919 -504558 83124 293286 348798
8393 348798 -170165 -375987 -295771 -401781 -230700 336082 877361 248424 167937 528788
8383 528788 474080 320657 369704 332122 62439 -13396 77341 -361448 121877 -167558 -398942
8372 -398942 -51581 179485 -293080 -780552 -711804 -225936 -128967 -235772 -328120 338172
8362 338172 -119831 -656090 -259206 -392361 -207961 484798 -314780 58146 281785 448130
8352 448130 -165198 93907 535938 648189 543628 254138 -794785 -685318 133228 21202
8342 21202 -33570 -6867 -85929 392771 311037 -3761 240549 84004 -140995 -132999 -104612
8331 -104612 -319595 -30292 318131 415904 43279 -38906 248381 320090 519642 732657
8321 732657 96011 203571 241754 616120 282579 451411 -62127 51774 515136 705547
8311 705547 1548481 1867982 1121521 1459944 1409044 571055 267237 577440 877295 783253
8301 783253 798557 559874 25760 243328 459389 392607 397830 674086 204051 -52997
8291 -52997 25068 165827 643783 -390522 -122085 171902 -492265 -1056301 -95760 106426
8281 106426 328983 502460 278784 148635 -86420 -187531 -383308 -287182 -335627 276500
8271 276500 34079 130136 43023 146853 38766 72236 373601 386335 537637 330654
8261 330654 -200990 354799 183926 91409 -28917 149434 44158 -214207 -406922 244720
8251 244720 574691 781975 670094 3429 245560 -217949 -89866 -477228 113869 -32476
8241 -32476 171956 117620 201077 -138904 -352552 -415947 -477838 -275015 -810981 -697793 -640025
8230 -640025 -1275896 -1456213 -682059 -352056 -500665 -1161656 -835602 40857 299049 286587
8220 286587 114172 -49774 471351 188884 326115 207913 -265226 -307553 -90474 -6827
8210 -6827 12028 33643 -684946 -495478 -18231 -393789 -205795 -791860 -468186 -863903
8200 -863903 -567626 -225527 -774638 -1180225 -1037653 -1856396 -1663908 -4136153 -1094594
8191 -1094594 3762499 1590265 1349702 651929 727154 708496 1044799 684718 241293 -45782
8181 -45782 -137378 -74008 305857 567225 682670 786173 1052659 493764 408897 407356 282634
8170 282634 338105 1070040 1126933 1044560 405091 649118 708413 541160 287786 75951
8160 75951 188339 86943 62324 301177 279378 763885 968338 787367 573806 495529
8150 495529 1021648 47920 945163 1127985 1364761 241002 450065 1053043 59891 -41461
8140 -41461 196657 361767 177273 -423037 -723390 163775 14506 30745 490216 427989
8130 427989 -465771 -391064 -199069 -3432 72819 -94520 368325 567837 958666 836787
8120 836787 359337 487807 707291 405922 228778 432514 313537 -75854 -461210 -178620
8110 -178620 173840 -208414 82627 405786 -138238 -277545 -105147 175849 411603 455481
8100 455481 549674 874158 808779 386480 586492 578355 -109558 114281 47836 290072 676020
8089 676020 656020 813530 755535 328611 255316 160187 -84767 110785 358095 -329414
8079 -329414 49671 150793 335597 150074 152154 237745 -11748 704961 854547 622473
8069 622473 762099 374562 38815 282772 561865 1080526 642229 833818 470848 200642
8059 200642 384320 -328644 -267470 288377 172790 689615 847917 200035 132425 -81094
8049 -81094 -87823 -25398 -45852 16460 -284251 -326292 -384875 -367833 -227784 211983 543991
8038 543991 679103 1001342 208648 219670 262819 -239808 537464 384039 -271328 -93611
8028 -93611 478161 496865 341198 -261235 -234652 -414858 -419197 -292144 433126 416791 301420
8017 301420 297385 584652 -167172 171552 303426 372309 550719 448328 570508 966728
8007 966728 485676 272726 475435 558940 90001 646026 1092899 1161283 985845 944424
7997 944424 1370806 533869 224245 159643 464919 462825 730834 984242 746224 136994
7987 136994 657609 934978 565490 404994 412825 485828 75757 -281833 548747 1092220
7977 1092220 710358 357297 1212106 1747340 1086260 1027758 1245772 1034623 1064574 584451
7967 584451 1080950 1649189 1467293 1378852 1338209 1704530 1607147 827334 832168 335008 103195
7956 103195 258069 483887 341501 1300175 1168892 58238 -388690 537718 920771 1004678
7946 1004678 1555165 955815 1247089 1483466 1220179 1398812 1109172 1329470 1538114 1576048
7936 1576048 1067733 1042784 1089003 337964 451229 565652 779830 900058 493050 1009663
7926 1009663 736399 -7537 96638 -248414 794441 1035717 119889 -402208 -471192 741877
7916 741877 1356613 1693614 1051160 817914 1187822 733160 836811 1218808 1295262 777317
7906 777317 475216 573533 646712 606790 823706 761204 642601 848787 1049753 1111928 1225182
7895 1225182 1079067 1560905 1580821 1058295 1067011 1252250 1263401 1495954 1461000 1150442
7885 1150442 1073693 918141 1221423 686904 698075 776622 509914 1008606 1046821 1332653
7875 1332653 1199302 862128 546283 895651 996212 1139812 1058451 886593 569521 373916
7865 373916 1009632 1141355 1265289 1362661 1335963 1202983 1449596 1151982 828153 622328
7855 622328 1088252 1061411 923565 1333807 1438785 1473205 1706768 1829876 1601525 1121948
7845 1121948 1079284 1564950 1767179 2084110 1980962 1267916 1485051 1742799 2082733 1783204
7835 1783204 1489276 1446131 1315069 1319331 1402151 1788979 1268911 1242025 1873771 1422685
7825 1422685 1103619 1000871 1090006 1376605 1131538 995566 1866388 2177311 1699451 1191705
7815 1191705 1330240 1283767 1227262 1748172 2000525 1607412 1277248 1721516 1209832 1691434
7805 1691434 2050411 2025256 2173399 2482274 1983260 2203620 1689660 2512222 2506331 1537967
7795 1537967 1705517 2320468 2117660 2085961 1734855 1948246 2620396 2404714 2547228 2814810
7785 2814810 3247930 3201891 2937236 2500894 2524717 2808865 3083009 2901993 2935228 3203268
7775 3203268 2789779 2321967 2137131 2223142 2967074 3924993 3510204 3575720 3291702 3255450
7765 3255450 3670348 3736376 3995856 3679466 3486345 4430365 4656861 5043350 4736063 4576031
7755 4576031 4037895 4341454 5027824 4584753 5115009 4773178 5352756 4695646 5188297 5442028
7745 5442028 5689047 5283782 5613288 6586328 5883942 5886949 6862944 7206533 7154725 6808826
7735 6808826 7093290 7993037 8261296 8702665 8812869 8825078 9222390 9903135 10170796 10047983
7725 10047983 10640815 9993684 10640897 11370014 10568640 11017032 11324263 11535105 11260358
7716 11260358 11700256 12032894 13005062 13567877 13905639 14069207 14289122 15354408 15504669
7707 15504669 15822980 16621112 17638226 18688287 19459549 20622748 21473453 22306146 23455545
7698 23455545 24526672 26137269 27434925 29126912 31223123 34184238 36991511 40528486
7690 40528486 45484696 51344982 57318384 65024412 72476556 78737007 81570625 81204409
7682 81204409 77787726 72620732 66178670 60728853 56535439 52993248 50112308 47864426
7674 47864426 46551015 46290405 47392369 47581806 48502419 50638111 54067407 57864655 62872941
7665 62872941 68282289 75196839 84668072 96752117 111023592 126831225 142480590 154926703
7657 154926703 159702271 155607266 143025676 125704000 108599454 93561349 81498805
7650 81498805 71883785 63892716 58183973 54255080 50822744 48344889 47083189 46809533
7642 46809533 46443956 47219728 47826183 49731174 52091540 56042979 60470350 65939999 72681745
7633 72681745 80005514 86584463 90079644 89850178 84589837 75805024 67746338 59471812
7625 59471812 51728055 45180725 39959994 35897819 32238060 30257049 28291353 27818968
7617 27818968 26545138 25014912 23899793 23699136 23499680 23866237 24224338 23562404 22932624
7608 22932624 21760700 20218179 19162446 17745834 17366493 16083755 15149677 15025818 14731388
7599 14731388 14537730 14366059 13865240 13337599 14245711 14579018 13783597 14548796 15127540
7590 15127540 15988399 17789174 19477604 20575697 22267301 23700461 23917351 24114472 23102557
7581 23102557 20422382 18302557 16487319 15280693 12965433 12129063 11996254 11714902 11108740
7572 11108740 10353556 10197478 11117568 11164843 10825827 11149987 11332854 11319347 11155811 12175446
7562 12175446 13085928 13969567 14943782 15493424 15523032 15062983 14570736 13187262 11890475
7553 11890475 11451158 10133743 9512353 8670707 8936902 8956075 7742103 7275653 7608105
7544 7608105 7250193 7891018 7711171 7478843 7849989 7900718 7931745 7470954 8050266 8670153
7534 8670153 9085232 9770201 10711636 11348853 11662483 11853623 11855453 11651660 11217316 10970071
7524 10970071 10273994 10214470 8971352 8253834 8096072 8527977 8219610 7905746 7652022
7515 7652022 7781687 8350157 7934645 7938247 9185917 9845683 9952642 10803509 12002914 13454549
7505 13454549 15233081 17640311 18257313 18646525 18638510 17246853 15578319 14125251 12651055
7496 12651055 11174714 9937363 9250193 8855800 8321400 7761316 7658691 6686590 5999740
7487 5999740 6436375 6602052 6471722 6765090 7261087 7301887 7735428 8590424 9538219 10458882
7477 10458882 11314687 11013390 10870627 10613628 9556417 8388725 7434433 6715853 5764579
7468 5764579 5235940 4825531 4551819 4483570 4565118 4115991 3081008 2852404 2466468 2944447
7458 2944447 3239747 2642158 2371208 2724226 2404188 2743857 2814738 2366574 2363951 2684795
7448 2684795 2649123 2579343 2227455 1995400 2469630 2793432 2631073 2612049 2629998 2375413
7438 2375413 2780138 2487635 2821477 3156079 2885867 3061858 2981664 2962779 2655907 2774662
7428 2774662 2793793 2229251 1999123 2050101 2444544 2778925 3125490 2355657 2544725 2845182
7418 2845182 2769977 2213211 1914983 2433548 2634257 2275757 2380883 2207747 2518628 2790425
7408 2790425 2751379 3359683 3690354 4081602 3389075 3550517 3582318 2840404 2910995 3244351
7398 3244351 2902445 2843480 3235254 3035616 3342542 3756637 3688787 3417686 3160081 3756528
7388 3756528 3570875 3701497 4480022 4540606 4924704 4623850 3926386 4512361 4382703 3784239
7378 3784239 3991219 4338114 4054334 3970690 4311094 4669644 4293558 4252440 4776324 4551020
7368 4551020 4848053 4155425 3817273 4034655 4440272 4642300 5634138 5304273 4626787 4180884
7358 4180884 4572264 4813327 5118269 4931553 5504284 6578643 6156117 5709989 6107726
7349 6107726 6531891 6761099 6262324 5562524 6096421 6400193 6387170 5876604 5566947 5878228
7339 5878228 5879327 5734830 6546977 5950585 5588471 6049808 6344000 6790569 7052610 7103975
7329 7103975 6990282 7288444 7655249 7609734 7430114 8432943 9119191 9181700 9644594 9606731
7319 9606731 9953997 9762543 9133704 9648738 9776804 9736812 10158955 10340933 11115746 11568970
7309 11568970 12402109 12100825 12025219 13058276 13441959 12857662 13380680 14104703 14049343 15252605
7299 15252605 15614799 15987581 16052886 16581646 17362516 18214383 18552892 19920376 21374408
7290 21374408 22167476 23543626 24816854 25907696 27358625 28934440 31746854 34705933
7282 34705933 37780079 41585204 45823606 51024089 57162202 64925733 71600428 76030348
7274 76030348 78674853 78174414 74665228 69710369 65314267 60583301 55672203 52457249
7266 52457249 49854315 48688558 47390809 47273028 47297625 48663677 49900171 51888222 54798829
7257 54798829 58663922 64431731 70119569 77674943 86963683 98736781 112025185 127342799
7249 127342799 141658378 151792318 155707788 151395809 140602780 124690246 107549879
7242 107549879 92981421 81739287 71981562 64522821 58401676 54090611 51614798 49695202
7234 49695202 47063285 46119763 45647768 46438287 47350821 48734529 51233311 55041146 60296466
7225 60296466 66154722 72785845 79617415 85227873 88587351 87286425 82382167 75278470
7217 75278470 66666656 58076059 49977452 43884288 38824667 34631516 31399348 28110866
7209 28110866 25654268 23211890 21145250 19918157 18361411 17522762 16959297 16032302 15470121
7200 15470121 14843008 13932069 13475386 12459618 11441056 10981740 10511003 10256562 10278218
7191 10278218 10496498 10703085 10282265 9593153 9343226 9901714 9704618 9209830 8577986
7182 8577986 9174696 9131299 8833040 9071633 8991594 8285565 8071686 7605844 7782470 8001737
7172 8001737 7878491 7673025 7884659 7383494 7478426 7698859 7677593 7412795 6943541 7866674
7162 7866674 8213412 8400375 9109922 9143636 8940858 9137561 9561881 9779382 9168400 9481785
7152 9481785 10128837 9537726 8787489 8368513 8743053 9168796 9487404 9559532 10021386 9706982
7142 9706982 9567093 9881512 10339617 10755073 10466486 10769461 11175150 11280035 11346461 11049123
7132 11049123 12005561 12382715 12349287 13034222 14192470 14408331 14555261 14514418 14040544 14485432
7122 14485432 15286040 15479020 16413870 16824306 18239640 18104840 18080535 19363284 19596614
7113 19596614 19853647 20423035 22002231 22994685 24247910 24739175 26055079 27937234 28533140
7104 28533140 30536726 32725807 34880834 38437950 41416280 45688750 50640119 57039747
7096 57039747 64305860 73889748 83201300 91404779 95544487 96484282 92706657 85247694
7088 85247694 76655590 69299140 62803968 57480766 54814173 52417415 50676556 50237427
7080 50237427 50486455 50500628 51080741 52856964 55567499 58473032 62639871 68047629 75785299
7071 75785299 84455368 96918523 112086067 129530083 147455908 160952096 165738420
7064 165738420 159924155 145836433 127321913 109914861 94183085 81052407 71195242
7057 71195242 63661178 58219534 53567722 50125923 47874495 46082395 44329937 44053104
7049 44053104 44112872 43722998 45567280 47630599 50095819 54267044 59732551 64991743 70664311
7040 70664311 76693203 81102446 80653295 77368336 71440172 63249445 54914609 47941392
7032 47941392 42739255 38053839 33874693 30714675 27806999 26124838 24943685 23254216
7024 23254216 22156159 21336937 19993369 19887584 20084302 19530743 19539246 19553011 19191132 19673844
7014 19673844 20679193 20714307 20749818 21791166 23335381 22482641 21698805 20896973 19534728
7005 19534728 18543882 17273700 16452852 15659100 15604908 15424775 15804892 15620424 15692907 15318703
6995 15318703 15148121 14568265 15090433 15730214 16149005 17535510 18222005 19422693 21315642
6986 21315642 23675288 25431115 25680549 25817583 25679812 23586872 21524602 19423852 17939663
6977 17939663 16856715 16581840 15013007 14349620 14572159 14633050 13788207 13938017 13897605
6968 13897605 13709892 13375951 13325528 13169322 13393163 13874127 13864293 15125479 16976503 17512194
6958 17512194 17535371 17495148 16752616 16619720 17172437 16725518 16606955 15629335 15575728 16395856
6948 16395856 16803755 17950176 18363304 19069786 18940230 18708463 17974726 16411244 15329055
6939 15329055 14203604 13843218 14055399 13025467 12911074 12825260 12339753 12959218 12921436
6930 12921436 12481387 12607416 13046243 13681363 15052162 16262442 16856482 18020420 19911826
6921 19911826 22085853 23544942 25077730 25285905 24010906 22350085 20216463 18185722
6913 18185722 16646432 15484695 13939720 13449295 13386223 12637830 12214894 11996607 12002273
6904 12002273 11854192 11388283 12068504 12328320 12150079 12365358 13203653 14768127 15913144
6895 15913144 16141120 16799374 17317040 16757743 16104660 15344282 14632404 13449483 13382735
6886 13382735 12961596 12128562 12662286 12141563 11641888 11148372 11688007 11716794 11629408 12117056
6876 12117056 11809498 11464145 11425603 12084557 12834560 13228802 12904862 13039366 12801372 13157692
6866 13157692 13952741 14356105 14805364 14981846 15473725 15596372 15608805 16224603 16177155 16606366
6856 16606366 16568910 17239813 17893881 18461008 18055756 18770835 19928673 20335951 21512132
6847 21512132 22467134 23144632 23949223 24123608 24709606 25158287 26265208 26942391 27257224
6838 27257224 28505791 30287362 32093577 33563635 35199651 37676826 40537966 43621381
6830 43621381 46374055 50472839 55449493 61856710 70084256 79008308 88154486 96907533
6822 96907533 104713991 107541248 105688776 99564175 91279713 82984672 76561424 69606041
6814 69606041 64351728 61293753 59143908 57297804 57045237 57345054 57746525 58614087 60588498
6805 60588498 63475885 66984692 72116687 78679700 87741171 98058273 110483838 125432007
6797 125432007 142248714 158431793 167664877 167913417 159478010 143823282 127066703 111686246
6789 111686246 98082692 86166825 77197851 70065321 64344885 60070651 57630969 55640688
6781 55640688 54329624 53903388 53710568 54083601 54877601 57647528 59829116 62698487 66506118
6772 66506118 71218903 76713571 82181702 87990173 90715519 89763171 86577577 80321354
6764 80321354 73554859 67631664 62146857 56972971 54005941 51339643 48954414 47810458
6756 47810458 47030087 46914803 47241095 47831278 48367544 50960771 54086248 56931371 59317013
6747 59317013 61678786 63915245 64996111 65756188 66632550 69206908 71348467 73229970
6739 73229970 74468869 74985693 76155168 77471735 79913121 83423137 87668298 91913854
6731 91913854 97046944 101397441 103513682 104065403 102864794 101153042 99238169 100135593
6723 100135593 102672342 103059395 104050665 104640285 105167229 107105753 110184384 115575656 123153940
6714 123153940 130012535 134554510 136840587 137611798 138455609 142112825 148039481 154976902
6706 154976902 161464419 166158353 167467838 164416549 157639432 148166737 135921235 123731705
6698 123731705 112608891 103294593 96698112 90403736 86516578 83973289 82260042 82050377
6690 82050377 82360390 83370890 86760113 90737317 96294651 104236798 112844254 124041469
6682 124041469 135776935 147252357 157798337 164145498 167162920 167008022 163056281 156764583
6674 156764583 149170875 142664314 139629873 138733997 139566806 138235354 135045164 130296059
6666 130296059 126147621 124243315 124560284 128177691 134083427 140950454 147241998 152333054
6658 152333054 153187701 149253235 143282773 136369956 128980360 120901443 112693025 104527433
6650 104527433 95527087 87342693 81011441 76044717 71312999 68525970 66585823 64281229
6642 64281229 61722588 58995142 56030110 52988554 50804090 48542832 46866793 45227427
6634 45227427 41848769 38231305 34898177 31306437 28067367 26247113 24027017 22544332
6626 22544332 21263327 19566591 18807351 17832481 16477785 16327111 15224779 14012201 13760827
6617 13760827 12916845 12525984 12098386 11428318 11040976 10869277 10172992 9732111 9659418 9200848
6607 9200848 9334191 8990806 8851733 8574039 8085099 7827773 7011826 7120299 6637306 6790202
6597 6790202 6575170 6783046 6412069 5958065 5633137 5235920 4995918 4814093 4792530 4146893
6587 4146893 4539092 4083667 4552637 4617790 4476030 4766381 4980051 4401408 4210361 3739512
6577 3739512 3382220 3830541 3899388 3622193 3644184 3589685 2927995 2703293 3219772 3441895
6567 3441895 3395027 2913889 2686337 2650712 2508444 2259218 2869365 3084935 2407179 1953997
6557 1953997 1723137 2177599 1946255 2076116 2423441 2772365 2530820 2567105 2993987 2727528
6547 2727528 2375027 2163213 1727913 2320047 2466745 2574919 2608176 2600742 2296880 2363748
6537 2363748 2396214 2557797 2584082 2220404 1020746 1123060 1085206 1345094 1319367 1320874
6527 1320874 1280773 1698288 1993834 1725208 1417405 1333517 2224824 2097733 2041620 1805627
6517 1805627 1757638 2218213 1517659 1058903 882080 924872 1489179 1089124 1023153 1759454
6507 1759454 1323407 1375885 1811123 1824024 1983512 1553760 1334160 1847846 1651133 1840138
6497 1840138 2049807 1323963 1726393 1651550 1672981 965879 924599 1048401 1184307 1420566
6487 1420566 1814158 1623342 1628296 1419606 1381316 1081765 1716393 1296399 1291425 1420931
6477 1420931 1344460 877177 1683582 1830238 1572341 2216934 2382476 2210020 1645860 1425767
6467 1425767 1132156 344870 718442 1470265 1408075 1562280 1160255 680990 858724 1381440
6457 1381440 1320150 1284176 1687965 1739617 1218675 870548 272031 907007 443390 419914
6447 419914 1038116 1163745 1392183 1409019 1480151 1834547 1823522 1389429 1243493 1115810
6437 1115810 1011734 1115574 1782231 1731291 1524499 1709453 1869247 1648729 1363947 2061897
6427 2061897 2010796 1226341 1022099 991772 1281999 1456111 1163665 2047562 2027190 2634552
6417 2634552 2342804 1576283 1503986 1345487 1672345 1848150 1525379 1324844 2075333 1973773
6407 1973773 1023397 853473 942989 1375734 1486422 1544978 1432947 1534899 1166204 1892472
6397 1892472 2179102 1610107 1148687 1522141 1576884 1591656 1381065 1001039 994423 1397853
6387 1397853 1239417 514329 1708561 2279892 1845364 1416537 1516822 1491124 1178528 1368933
6377 1368933 1097262 1173285 1202817 957431 1770949 1501140 1388134 1207804 1473606 1544084
6367 1544084 949323 1557193 2028476 2008037 2105313 2023331 1660851 1957616 2273278 2120135
6357 2120135 1929737 1760145 2220845 1801654 1212779 1495802 1815224 1673844 1686254 1579686
6347 1579686 1916271 1795988 1772186 1679553 1875384 1806888 2020627 2217974 2634223 2474524
6337 2474524 2262472 2367696 1977578 2297592 2340768 2449452 2016597 2398004 2554939 2750143
6327 2750143 2336645 2127473 2532470 2879501 3265609 2762563 2467907 2591795 2393420 2505058
6317 2505058 3009633 3000590 2788768 2929171 2912764 2067803 1701757 2305354 2413908 1951298
6307 1951298 2385183 2303157 2049914 1720161 1974867 2450750 2522383 2723334 2885144 2465711
6297 2465711 2097213 2484613 2478946 1860377 1713483 1094070 1805821 2394046 2590124 2486260
6287 2486260 2228720 2154221 2502614 2327651 1472691 1405273 1394581 1910460 2250874 2595407
6277 2595407 2525705 1569741 2478949 2802689 1880359 2177930 2255122 2220028 2184789 2096219
6267 2096219 1802926 1471407 1606909 2133177 2470697 2131074 1763304 1958126 1654159 1328830
6257 1328830 1643545 1491577 1665351 1890316 1732062 2044389 1899426 2055395 2344395 2426897
6247 2426897 1758580 2472938 2723989 2393237 2253272 1955138 1815061 2278725 2248717 2039565
6237 2039565 2074786 2014934 2195461 2126671 2140946 2493397 1712923 2056443 1836363 1829504 2726686
6226 2726686 2968489 2632915 2377578 2681343 2448536 2513642 2332283 2079281 2350561 2214741
6216 2214741 1810837 2231958 2510871 3156311 2791695 2189293 2223939 2138938 2781370 2889929
6206 2889929 2813595 3221528 2801394 2889783 3142228 3422953 2695455 2764500 2967160 2767464
6196 2767464 2818029 2651763 2664102 3262336 2583513 2204195 2742831 2598909 2578605 2085467
6186 2085467 2679993 3142336 3816532 3262189 3018574 3571167 3460615 3439265 3672665 3454684
6176 3454684 3557178 3832585 3472852 3014779 3201347 3509487 3732786 3390969 3650738 4161803
6166 4161803 3970857 3895843 4276314 4509765 4258053 3551680 3841212 4377776 4503809 4371808
6156 4371808 4665626 4259028 3908344 4246284 4471530 4723872 4928768 5110109 4825498 5511079
6146 5511079 5567742 6345531 5810966 5172689 5261314 6073616 5669433 5168187 5309545 6549283
6136 6549283 6328117 5679234 5616129 5567139 5104559 5621138 6229038 5901544 5748531 6256891
6126 6256891 7187591 6611271 7032478 7452545 7568668 7493245 6977554 6965388 7280964 7455974
6116 7455974 8594016 8209078 7725461 8016831 9023452 9840949 9889080 9597238 10143745
6107 10143745 10386121 9908727 10474729 11333215 11598055 11692546 12139425 12956116 13887290 14326895
6097 14326895 13986731 14129087 14283533 15088689 15664778 16514446 17144678 17174309 18052886 18556052
6087 18556052 19009102 19215878 20475715 21192895 21928432 23099138 23859276 23816110 25127552
6078 25127552 26068958 27212586 28055554 29649705 30687587 31333658 32988897 34672883 36019388
6069 36019388 37377630 39525104 41807047 44976715 47622352 50276685 52926653 56553510
6061 56553510 59568425 62725680 65838464 68817361 72067219 75586515 78943907 82401083
6053 82401083 84711823 86743479 89263149 91277088 92802643 94429721 95797313 97334160
6045 97334160 99900793 103069255 106760591 111163117 115164757 120091702 126330903 132211253
6037 132211253 138029377 143407476 148486562 153509635 157618730 160301816 162966938 165666392
6029 165666392 168699730 170410143 171922755 173103254 174102983 174775395 175439169 176173697 176635848
6020 176635848 176539036 175965493 176035494 174777685 174049306 173352862 172477661 171893157 170632868
6011 170632868 168743042 167078991 165215412 162596823 158591776 153672249 148391853 141587654
6003 141587654 134986318 128292832 121714139 114844039 109166890 103312104 98926797 95521162
5995 95521162 91779846 89228177 87072418 85205730 83719591 82026820 80145694 78687430
5987 78687430 76387125 74155711 71104564 67636535 64160265 61564377 58258340 55370242
5979 55370242 51432076 48008646 45498079 42262752 38687287 35773056 33329830 30935452
5971 30935452 28555630 26904445 25142950 23149420 22534043 21083685 20225977 18922897
5963 18922897 18687127 17689872 16476184 16685107 16453759 15801688 14582655 13876798 12868312
5954 12868312 12004725 11917319 11782197 11196592 10963059 10366009 9378029 9072876 8818028 8653056
5944 8653056 8068474 8294869 8418307 8098098 7851857 7933182 7573815 6953173 6314330 5815809
5934 5815809 5849289 5515460 5777284 5995043 5980948 5861159 5577279 5470468 5113148 5382616
5924 5382616 5134303 5064869 4829047 4316784 4715551 4576244 4269278 4474999 4499456 4320737
5914 4320737 4599081 4715112 4597040 4668166 4303118 3538397 3454386 3356443 3325214 3827420
5904 3827420 3476083 3218330 3330673 2837884 2716374 2377668 2608497 2442948 2485343 2627506
5894 2627506 2137334 2387813 2463346 2120178 2741146 2251868 2398147 2593161 2521462 2851960
5884 2851960 2177674 1445015 1711348 2166727 2230608 2586205 2919732 2197078 1752224 2169074
5874 2169074 1696433 2000558 2634195 2115335 1640067 1290965 1882549 2005004 1868453 2226834
5864 2226834 1923423 1969430 2001043 1304066 1391376 1803062 1904868 2063333 1930050 1728515
5854 1728515 1495805 1844005 1597331 1482137 1312210 1237661 978131 893103 1255380 864434
5844 864434 926341 2186169 1694329 1477924 1319576 896845 1327885 1374024 1403917 2601337
5834 2601337 2176835 1797732 2050390 2099600 1474455 1135788 1292564 1106497 1011234 1198475
5824 1198475 1133452 1577537 1801052 1583322 1383970 721433 844307 856926 1302972 1551451
5814 1551451 2541999 2182799 1514096 610815 979728 1549013 1200348 774223 925471 786238
5804 786238 505253 1116885 981760 1254269 1252929 2029847 1296004 993287 1253269 1658699
5794 1658699 1690808 1043982 1496406 1563403 411983 493813 1560103 1745970 1634422 1260368
5784 1260368 1134142 1444701 1157083 1169126 1182166 1329843 1379874 1060634 795870 1024596
5774 1024596 954385 1280527 1406513 769341 1173731 409734 405494 942898 845769 808401
5764 808401 1442120 1041977 781330 1099435 1746525 1816536 1324798 1475445 1834220 1388655
5754 1388655 1400251 1034170 1211428 1167419 847379 1153185 1765643 1640760 1709258 1956324
5744 1956324 1808171 2037242 1514862 1263581 1604940 1555774 2050609 1943227 1860538 1925552
5734 1925552 2228150 2278251 2393062 1691035 1389263 1534299 1410422 1779498 2212397 2036020
5724 2036020 1823363 2366213 2162282 1956535 1953839 1028726 342260 577677 541964 888129
5714 888129 1180254 901837 689570 1338658 1852195 1337217 969414 1305589 1364626 1924724
5704 1924724 2001866 2054932 1647216 1021168 905963 1572943 1126947 1202857 923602 1250374
5694 1250374 1476125 1862261 875193 1459719 1345362 1192215 1501219 1202655 1680737 1406074
5684 1406074 1600947 1406578 1490947 1629268 1714889 1363314 1580270 1308750 759315 408568
5674 408568 155271 394496 1090360 1199886 869000 513567 637142 1412828 1225835 1163857
5664 1163857 707144 431974 633224 898432 1341975 1489559 1521031 1865405 2131307 1929652
5654 1929652 1736358 1896527 1898895 1516589 1402222 837124 1392406 1759625 2267502 1783853
5644 1783853 1303879 1964908 2007339 1418225 1546935 1580596 1919460 1821037 1333726 1542513
5634 1542513 1963589 1206416 1032233 1799847 2401936 1678506 1606916 2047386 2663602 2817107
5624 2817107 2595514 2335004 1870891 1549323 1651018 1822826 2274410 2510985 2258276 2291075
5614 2291075 1723259 1479454 1487696 2373648 2402763 2099674 1743565 2337142 3049662 2748475
5604 2748475 3305976 3081342 2924781 2650671 2984884 2914201 2996572 3070994 2638275 2308496
5594 2308496 2401854 2251780 2302498 2357863 2502594 2084706 1721082 1620578 1261600 1470430
5584 1470430 1516303 2099160 2022012 2432642 2173287 2802437 2439664 2143572 1944380 1716977
5574 1716977 1124368 1974384 2243518 2166107 2181185 2223495 2767628 2289358 2144537 1803500
5564 1803500 2122349 2612784 2238994 1689141 2223256 2667634 2235928 1903525 1393460 1830242
5554 1830242 2221233 2478754 2819483 1901901 771832 1195848 1949131 2309465 2055305
5545 2055305 2253897 1875495 2056238 2529489 2753051 2506802 2329321 2213549 2466611 2469237
5535 2469237 2387546 2694665 2771164 2102979 1843635 1575665 1874943 1960572 1344725 1298507
5525 1298507 1961696 2451837 2605943 2547886 2384340 2784697 2322733 2405164 2600021 1940387
5515 1940387 1645063 2172800 2060800 2261859 2174064 2459192 2857362 2928627 2994911 2462282
5505 2462282 2251760 2517054 2302939 2127269 2188271 2625395 2594535 2584986 2277203 2871712
5495 2871712 3559412 3593767 3023697 3276966 3359264 3398886 2890684 2309487 2219752 2818126
5485 2818126 2693943 3202099 3245990 3251311 3114888 3670064 3460497 3145228 3106671 3096678 3219985
5474 3219985 3709408 3679901 3173664 3209611 3654260 3554931 3591975 3838062 4219464 4298904
5464 4298904 3952323 4079625 4277633 3668061 3297763 3725808 4292724 4744025 4249148 3880047
5454 3880047 3249446 4340562 4505127 4597499 4694220 4841188 4364240 4457822 4740207 4681349
5444 4681349 4747379 5327776 5017511 5005613 5960994 6232977 5706900 5814393 5728497 5778353
5434 5778353 5899822 5723608 6311402 5972129 6622225 7718301 7858318 7677657 7931037
5425 7931037 8028146 8173484 7501443 7785324 8025905 8692161 8457064 8833088 9854065 9806441
5415 9806441 10238605 10379840 10388741 10460150 11184047 11311253 11971660 12692142 13532277 13174777
5405 13174777 13846294 15407739 15726328 16458881 17264576 18548711 18957626 19682144 20229616
5396 20229616 21274582 22136874 22554043 23646844 24580957 24939645 25338273 26788699 27104352
5387 27104352 27282955 27573721 29078578 29109964 29618513 31051455 32236806 32592268 32931259
5378 32931259 34470270 34821762 35436284 36774071 37994544 39164509 40058994 40882456 41496960
5369 41496960 43032357 43718180 45199817 46657481 48253350 50179800 51037539 52408037
5361 52408037 54304593 55163288 56505624 58098916 59841443 61351179 63606400 64527163
5353 64527163 66168415 67149137 68280073 69163112 69845261 70090916 70699505 72238617 73239552
5344 73239552 74845059 76453941 78287719 79802403 81891641 83818801 85885402 87394671
$$ [...]
##END NTUPLES=NMR SPECTRUM
##END=
