##TITLE=1H_EC-3306-Hex
 CDCl3
 8 sc, 
 19.12.2023
##JCAMPDX= 6.0         $$ Bruker NMR JCAMP-DX V2.0
##DATA TYPE= NMR SPECTRUM
##DATA CLASS= NTUPLES
##ORIGIN= UXNMR, Bruker Analytische Messtechnik GmbH
##OWNER= root
$$ XWIN-NMR		Version 3.5
$$ Tue Dec 19 13:56:49 2023 Russian Standard Time (UT+4h)  she@DPX200
##.OBSERVE FREQUENCY= 200.1313
##.OBSERVE NUCLEUS= ^1H
##.ACQUISITION MODE= SIMULTANEOUS
##.ACQUISITION SCHEME= undefined
##.AVERAGES= 8
##.DIGITISER RES= 18
##SPECTROMETER/DATA SYSTEM= spect
##.PULSE SEQUENCE= zg30
##.SOLVENT NAME= CDCl3
##.SHIFT REFERENCE= (INTERNAL, CDCl3, 0, 15.3811)
##AUDIT TRAIL= $$ (NUMBER, WHEN, WHO, WHERE, WHAT)
$$ ##TITLE= Audit trail, XWIN-NMR		Version 3.5
$$ ##JCAMPDX= 5.01
$$ ##ORIGIN= Bruker BioSpin GmbH
$$ ##OWNER= she
$$ F:/spectra/data/she/nmr/H-F/1/pdata/1/auditp.txt
$$ ##AUDIT TRAIL=  $$ (NUMBER, WHEN, WHO, WHERE, WHAT)
(   1,<2023-12-19 13:55:26.70 +0400>,<she>,<DPX200>,
      <created by zg, POWCHK disabled, PULCHK disabled
       configuration hash MD5:
       00 E9 B6 7A A2 85 ED C7 34 08 36 98 17 FE 4E 26
       data hash MD5: 16K
       C3 0B AD 61 1F 4F F9 83 35 16 B2 1A 87 DA BC BC>)
(   2,<2023-12-19 13:55:29.26 +0400>,<she>,<DPX200>,
      <Start of raw data processing
       efp BC_mod = 2 LB = 0.24 FT_mod = 6 PKNL = 1 PHC0 = -24589.79 PHC1 = 10.05272 SI = 16K 
       data hash MD5: 16K
       10 1E 65 86 41 A7 9A A3 16 BB A6 CB 6B B3 43 5D>)
(   3,<2023-12-19 13:55:56.82 +0400>,<she>,<DPX200>,
      <pk PHC0 = -3.048968 PHC1 = 2.4 
       data hash MD5: 16K
       BB 1E 1D 5D CB 6C F8 1E 65 29 26 A4 F1 40 1B A1>)
(   4,<2023-12-19 13:56:00.26 +0400>,<she>,<DPX200>,
      <abs ABSG = 5 
       data hash MD5: 16K
       BA 2C 08 83 BB A1 5D 76 BD 32 03 03 8D 19 7F 84>)
$$ ##END=
$$ 
$$ hash MD5
$$ 76 E2 59 AD 61 36 98 2D 35 A4 53 21 72 2D D9 DC
##$RELAX= 
##$RELAX= 
##$RELAX= 
##$RELAX= 
##$RELAX= 
##$RELAX= 
$$ Bruker specific parameters
$$ --------------------------
##$DU= <F:/spectra>
##$EXPNO= 1
##$NAME= <H-F>
##$PROCNO= 1
##$TYPE= <nmr>
##$USER= <she>
##$AMP= (0..31)
100 100 100 100 100 100 100 100 100 100 100 100 100 100 100 100 100 100 
100 100 100 100 100 100 100 100 100 100 100 100 100 100 
##$AQSEQ= 0
##$AQ_mod= 1
##$AUNM= <au_zg>
##$AUTOPOS= <>
##$BF1= 200.13
##$BF2= 200.13
##$BF3= 200.13
##$BF4= 200.13
##$BF5= 200.13
##$BF6= 200.13
##$BF7= 200.13
##$BF8= 200.13
##$BYTORDA= 1
##$CFDGTYP= 0
##$CFRGTYP= 5
##$CHEMSTR= <none>
##$CNST= (0..31)
1 1 145 1 1 1 1 1 1 1 1 1 1 1 1 1 1 1 1 1 1 1 1 1 1 1 1 1 1 1 1 1 
##$CPDPRG= <>
##$CPDPRG1= <>
##$CPDPRG2= <>
##$CPDPRG3= <>
##$CPDPRG4= <mlev>
##$CPDPRG5= <mlev>
##$CPDPRG6= <mlev>
##$CPDPRG7= <mlev>
##$CPDPRG8= <mlev>
##$CPDPRGB= <>
##$CPDPRGT= <>
##$D= (0..31)
0 1.2 0 0 0 0 0 0 0 0.06 0 0.03 0 0 0 0 0.0002 0 0 0 0 0 0 0 0 0 0 0 0 
0 0 0 
##$DATE= 1702979726
##$DBL= (0..7)
120 120 120 120 120 120 120 120 
##$DBP= (0..7)
150 150 150 150 150 150 150 150 
##$DBP07= 0
##$DBPNAM0= <>
##$DBPNAM1= <>
##$DBPNAM2= <>
##$DBPNAM3= <>
##$DBPNAM4= <>
$$ [...]
##$SUBNAM3= <"">
##$SUBNAM4= <"">
##$SUBNAM5= <"">
##$SUBNAM6= <"">
##$SUBNAM7= <"">
##$SUBNAM8= <"">
##$SUBNAM9= <"">
##$SW= 18.0517328524113
##$SWIBOX= (0..15)
0 0 2 0 0 0 0 0 0 0 0 0 0 0 0 0 
##$SW_h= 3612.71676300578
##$TD= 16384
##$TD0= 1
##$TE= 0
##$TE2= 300
##$TE3= 300
##$TEG= 300
##$TL= (0..7)
0 120 120 120 120 120 120 120 
##$TP= (0..7)
150 150 150 150 150 150 150 150 
##$TP07= 0
##$TPNAME0= <>
##$TPNAME1= <>
##$TPNAME2= <>
##$TPNAME3= <>
##$TPNAME4= <>
##$TPNAME5= <>
##$TPNAME6= <>
##$TPNAME7= <>
##$TPOAL= (0..7)
0.5 0.5 0.5 0.5 0.5 0.5 0.5 0.5 
##$TPOFFS= (0..7)
0 0 0 0 0 0 0 0 
##$TUNHIN= 0
##$TUNHOUT= 0
##$TUNXOUT= 0
##$USERA1= <user>
##$USERA2= <user>
##$USERA3= <user>
##$USERA4= <user>
##$USERA5= <user>
##$V9= 5
##$VALIST= <valist>
##$VCLIST= <CCCCCCCCCCCCCCC>
##$VD= 0
##$VDLIST= <DDDDDDDDDDDDDDD>
##$VPLIST= <PPPPPPPPPPPPPPP>
##$VTLIST= <TTTTTTTTTTTTTTT>
##$WBST= 1024
##$WBSW= 4
##$XGAIN= (0..3)
0 0 0 0 
##$XL= 0
##$YL= 0
##$YMAX_a= 463365
##$YMIN_a= -511587
##$ZGOPTNS= <>
##$ZL1= 120
##$ZL2= 120
##$ZL3= 120
##$ZL4= 120
##$ABSF1= 15.31718
##$ABSF2= -2.734666
##$ABSG= 5
##$ABSL= 3
##$ALPHA= 0
##$AQORDER= 0
##$ASSFAC= 0
##$ASSFACI= 0
##$ASSFACX= 0
##$ASSWID= 0
##$AUNMP= <proc_1d>
##$AZFE= 0.1
##$AZFW= 0.1
##$BCFW= 0
##$BC_mod= 2
##$BYTORDP= 0
##$COROFFS= 0
##$CY= -3
##$DATMOD= 1
##$DC= 0
##$DFILT= <>
##$DTYPP= 0
##$F1P= 0
##$F2P= 0
##$FCOR= 1
##$FTSIZE= 16384
##$FT_mod= 6
##$GAMMA= 0
##$GB= 0
##$INTBC= 1
##$INTSCL= 3.70164e-10
##$ISEN= 128
##$LB= 0.24
##$LEV0= 0
##$LPBIN= 0
##$MAXI= 10000
##$MC2= 0
##$MEAN= 0
##$ME_mod= 0
##$MI= 1.114404
##$NCOEF= 0
##$NC_proc= -6
##$NLEV= 6
##$NOISF1= 3.799351
##$NOISF2= 2.8
##$NSP= 0
##$NTH_PI= 0
##$NZP= 0
##$OFFSET= 15.38109
##$PC= 1
##$PHC0= -24592.84
##$PHC1= 12.45272
##$PH_mod= 1
##$PKNL= yes
##$PPARMOD= 0
##$PSCAL= 0
##$PSIGN= 0
##$REVERSE= no
##$SF= 200.130028139791
##$SI= 16384
##$SIGF1= 3
##$SIGF2= 2
##$SINO= 5.538805
##$SIOLD= 16384
##$SREGLST= <1H.CDCl3>
##$SSB= 0
##$STSI= 16384
##$STSR= 0
##$SW_p= 3612.71676300578
##$SYMM= 0
##$S_DEV= 0
##$TDeff= 16384
##$TDoff= 0
##$TI= <>
##$TILT= no
##$TM1= 0
##$TM2= 0
##$TOPLEV= 0
##$USERP1= <user>
##$USERP2= <user>
##$USERP3= <user>
##$USERP4= <user>
##$USERP5= <user>
##$WDW= 1
##$XDIM= 16384
##$YMAX_p= 341808703
##$YMIN_p= -264818
$$ End of Bruker specific parameters
$$ ---------------------------------
##NTUPLES= NMR SPECTRUM
##VAR_NAME=  FREQUENCY,     SPECTRUM/REAL,   SPECTRUM/IMAG
##SYMBOL=    X,             R,               I
##VAR_TYPE=  INDEPENDENT,   DEPENDENT,       DEPENDENT
##VAR_FORM=  AFFN,          ASDF,            ASDF
##VAR_DIM=   16384,         16384,           16384
##UNITS=     HZ,            ARBITRARY UNITS, ARBITRARY UNITS
##FACTOR=    0.220516191357247, 1,           1
##FIRST=     3078.21800737892, 0,            0
##LAST=      -534.49875562686, 0,            0
##MIN=       -534.49875562686, -264818,      0
##MAX=       3078.21800737892, 341808703,    0
$$ Real data points
##PAGE= N=1
##DATA TABLE= (X++(R..R)), XYDATA
$$ [...]
9428 2846659 2777582 2854839 3003130 3049589 3028925 3031974 3130561 3273772 3407361 3381023 3418232
9417 3418232 3491822 3646525 3713139 3723225 3801376 3934477 4091732 4296511 4467150 4607720
9407 4607720 4705094 4599356 4482085 4435306 4415734 4271305 4186845 4258720 4419154 4565222
9397 4565222 4557689 4574016 4496909 4461962 4354266 4217754 4127305 4112607 3971251 3923768 4016957
9386 4016957 3967725 3866182 3954336 3987888 4022667 3988642 4003316 4000623 4058914 4133258 4146676
9375 4146676 4133910 4127934 4170756 4337326 4346998 4469580 4706743 4826979 4996287 4948409 4897484
9364 4897484 4801754 4566823 4442254 4463441 4566945 4699975 4789771 4921899 5031996 5077113
9354 5077113 5028353 4872067 4676052 4618389 4573787 4455033 4409452 4462543 4389721 4374766 4355998
9343 4355998 4352888 4385280 4367008 4175953 4164999 4210934 4317324 4299146 4313445 4369447 4306276
9332 4306276 4232408 4250460 4218360 4246177 4402520 4358854 4414428 4306694 4256795 4384277 4348115
9321 4348115 4470715 4641881 4530029 4496776 4573698 4553611 4569107 4585728 4659058 4684225 4733553
9310 4733553 4779367 4758931 4707291 4626866 4728681 4776274 4913086 5044140 5060017 5120331 5160028
9299 5160028 5185122 5237669 5253720 5165462 5343805 5426907 5404201 5396172 5411504 5388008 5470918
9288 5470918 5585792 5512210 5534481 5581559 5659911 5809382 5749729 5730564 5816346 5910945 6027161
9277 6027161 6080284 6158909 6199729 6167851 6255654 6363384 6423453 6447175 6510528 6643996 6808129
9266 6808129 6875539 6864059 6973237 7032586 7076491 7078600 7218969 7330519 7279701 7443888 7573694
9255 7573694 7683077 7837539 7954306 8054603 8210692 8372187 8493154 8526286 8732578 8846921
9245 8846921 8978307 9237282 9408747 9622616 9876009 10057912 10044538 10217539 10395805 10516977
9235 10516977 10744589 10875139 11046585 11149916 11266208 11535174 11721618 11928407 12178240
9226 12178240 12460670 12749389 13016356 13266755 13616510 13838484 14114398 14539936 14790990
9217 14790990 15045048 15393270 15647149 16021596 16521310 16773791 17146784 17607852 18055720
9208 18055720 18542348 19003726 19412175 19807840 20314571 20752629 21093154 21604348 22097098
9199 22097098 22557690 23080895 23670013 24431960 25053598 25939014 26918610 28140061 29466312
9190 29466312 30970229 32751243 35039459 37526941 39514328 40715814 41328565 41882562
9182 41882562 42689806 43531665 43979206 43534350 42840745 42294374 42184653 42547111 43268856
9173 43268856 44368991 45849216 47416798 48857353 50148889 51466359 52978153 54696273
9165 54696273 56436798 58134731 59753326 61476483 63489417 65885699 68319422 70382769
9157 70382769 72269298 74792750 77989999 82105100 87403770 93756397 101474220 110343043
9149 110343043 118795568 123773444 125370915 126012204 127258191 128848940 128039874 123145873
9141 123145873 115893898 108668077 102796468 98496961 95969474 94787279 94807481 96161454
9133 96161454 98461596 101452876 105532728 110797954 117890997 127431877 139755619 154504981
9125 154504981 170310120 185746739 200740839 215097628 224892261 227202664 225509955
9118 225509955 225150073 228415305 232117021 229658537 219510429 205608381 190385561 173934625
9110 173934625 155844825 137841161 121462881 107908667 97314000 89025654 82657243
9103 82657243 77655282 73512845 70085432 67038490 64463926 62523536 61018775 59844872
9095 59844872 58804789 57775348 57025551 56716647 57083979 58113435 59808828 61593064 62675540
9086 62675540 62779580 62168034 60897208 58707803 55624221 52588700 49947540 47830406
9078 47830406 46047318 44312772 42576002 40880678 39066823 36970397 34961088 33240012
9070 33240012 31697727 30537231 29674219 29017703 28574958 28150271 27965414 27797655 27554456
9061 27554456 27323356 27244756 27153940 27279014 27279649 27341815 27307715 27263372 27223408 27268068 27301414
9050 27301414 27283870 27211393 27148550 26959891 26662718 26340182 26154707 25893221 25819763 25831492
9040 25831492 25917419 25899469 25834458 25828102 25670410 25511497 25322994 25314174 25319658 25286247 25411305
9029 25411305 25652187 26059609 26589643 27114871 27655741 28415762 29212626 30192991 31109785
9020 31109785 31729473 32271698 32472455 32481769 32518523 32536470 32444025 32270432 32173608 32198692 32213242
9009 32213242 32286649 32524361 32806484 33361042 34136057 34961269 35644293 36653313 37850813
9000 37850813 39133015 40444105 41958214 43700012 45473458 47471556 49574663 51923951
8992 51923951 54780204 58569494 63300227 69226973 75624890 80300836 81347909 79675122
8984 79675122 77233079 75493828 75349503 76887990 79502596 82656034 85011287 84865054
8976 84865054 82132069 78085469 73934835 70429986 67846601 65703734 64325167 63545174
8968 63545174 63150923 63497625 64392052 65930634 68450384 71973680 76333030 81609310 86790760
8959 86790760 89901959 90176644 89161079 88849456 90503778 94670464 100856682 106967637
8951 106967637 110471258 110545029 107720351 103697329 100460634 98375859 97727282 98329828 99294613
8942 99294613 98833018 95713818 90464433 84394003 78760039 74286353 70846284 68276820
8934 68276820 66474289 65265352 64702186 64836523 65892219 68049841 71715172 77182340
8926 77182340 83892740 88174525 86850663 81931470 75956968 70669827 67255151 65695457
8918 65695457 65740439 67127456 69261193 70822157 70355252 67970610 64479910 60638584 57131969
8909 57131969 54292447 52184817 50310639 48401379 46060106 43788133 41840115 40200959
8901 40200959 38816008 37842500 37094372 36357873 35597507 34653191 33815405 33052075 32426729
8892 32426729 32120617 31982696 31884877 31772211 31760948 31777707 31789993 31867907 32019843 32330201
8882 32330201 32659920 33124956 33537987 33929339 34417670 34932959 35546143 36276140 37137457
8873 37137457 37741470 37914105 37927858 37912400 38099499 38688341 39247623 39463403 39468515 39441763
8863 39441763 39518505 39966895 40749654 42270654 44634390 47624077 51287419 54877607 57663669
8854 57663669 59102401 58934127 57381606 55335963 53703205 52951448 53345881 54913824 57486633
8845 57486633 60602593 63293982 64657485 64582635 63027904 60497697 57915474 55822123
8837 55822123 54373611 53400316 52469886 51586857 50735412 50089787 49755075 49557924 49350870
8828 49350870 49223744 49552306 50430638 52143751 54253105 55818365 56382359 55964551 54395051
8819 54395051 52499658 51047572 50430292 50962027 52460275 54950890 58135226 61298355
8811 61298355 63867298 65255137 65286783 64560245 64105204 64929894 67353471 70825170 74162783
8802 74162783 76527109 77249543 76048611 73074477 68601445 63124826 57222716 51821032
8794 51821032 47241866 43765957 41448143 40042114 39329641 39274605 39997289 41618860 44161075
8785 44161075 47287216 50490557 52633419 52877600 51139074 47698498 43513268 39272401
8777 39272401 35730337 33074660 31124981 29765807 28853841 28423922 28372518 28783861 29709713
8768 29709713 31050847 33146236 36085657 39333631 42452694 44150760 43869963 41641873
8760 41641873 37888363 33513845 29331051 25999325 23348923 21336258 19836132 18710891
8752 18710891 17687733 16773282 16144083 15584637 15093983 14676965 14233850 13731455 13300068
8743 13300068 12917731 12668196 12341963 12037629 11634207 11418799 11228077 11088136 10886968
8734 10886968 10777039 10701150 10645579 10555767 10544201 10390571 10165784 10018075 9929119 9694378
8724 9694378 9656517 9591093 9290670 9148216 9312634 9423675 9453032 9434763 9435976 9632907 9816414
8713 9816414 10009187 10062137 10234758 10220086 10117012 9921296 9844123 9734600 9539473 9435296
8703 9435296 9422573 9386617 9473521 9533622 9641519 9741795 10022529 10162554 10375269 10576129
8693 10576129 10766914 10986703 11029173 10797633 10638090 10472044 10179539 9990284 9810016 9623202
8683 9623202 9654704 9638059 9573504 9526395 9399824 9246293 9193465 9229848 9223945 9247227 9222268
8672 9222268 9321154 9348468 9312997 9451746 9531651 9653464 9774821 9832311 10043060 10242617
8662 10242617 10542826 10823057 11020826 11295306 11489092 11509881 11598787 11741663 11947020 12166534
8652 12166534 12316861 12368524 12369449 12425795 12547889 12795673 13080647 13407908 13878082 14317317
8642 14317317 14875691 15611833 16715155 18000404 19629618 21716040 24209201 26551885
8634 26551885 28147047 28519176 27637682 26171092 24526812 23430277 22983901 23117893 23902815
8625 23902815 25404254 26971343 28159824 28343055 27320215 25537758 23380584 21435528
8617 21435528 20041564 18901417 18102331 17630285 17275996 16931816 16680561 16556675 16549197
8608 16549197 16552994 16506715 16589167 16944592 17336523 17743194 18504102 19456601 20455687 21895733
8598 21895733 23849038 26206277 29182105 32489506 35729574 38199452 39398321 39107113
8590 39107113 37355009 34933183 32829404 31335078 30929156 31505622 32907516 34461860
8582 34461860 35775299 36381522 35546617 33404104 30359570 27064461 24053385 21570593
8574 21570593 19689547 18215980 17131579 16234998 15501070 14948015 14405580 13968167 13643782
8565 13643782 13352956 13188947 13140458 13057609 13094214 13308232 13471648 13802698 14284283 15053768
8555 15053768 16174350 17564971 19111237 20311268 20704903 20169329 18910292 17498681
8547 17498681 16328640 15726165 15449422 15717425 16329266 17177952 17999342 18382156 17925014
8538 17925014 16694963 15112515 13556475 12256824 11075568 10323179 9671565 9189754 8824316
8529 8824316 8483975 8202292 8035544 7815529 7718618 7631562 7445956 7344535 7364704 7335172
8519 7335172 7316578 7211906 7187172 7157334 7151533 7318569 7268829 7320264 7461910 7423782 7554671
8508 7554671 7758946 8038882 8238924 8482963 8833988 9172834 9556300 10019325 10780962 11654939
8498 11654939 12751326 14095398 15548351 17024215 18469879 19652050 20501262 21120629
8490 21120629 21269289 20794015 20059498 19080230 17702807 16238411 14741479 13404467 12314640
8481 12314640 11330015 10391096 9823366 9438964 8974265 8550922 8352857 8163346 8028605
8472 8028605 7849419 7812010 7843695 7890325 7954291 8080122 8243543 8480076 8903333 9398603
8462 9398603 9970449 10759762 11752986 12844929 14067489 15244325 16168633 16842304 17311808
8453 17311808 17220766 16667236 15819480 14738247 13474664 12216277 10979179 9822083 8777823
8444 8777823 7927575 7186942 6437661 5943960 5540442 5256945 4932245 4647297 4537591 4328473
8434 4328473 4232119 4192600 3934151 3632771 3485448 3384926 3301767 3126543 3015576 2944795
8424 2944795 2776627 2701965 2552282 2479060 2382078 2316496 2186783 2047819 2036595 2016119 2040335
8413 2040335 2012090 2064694 1956410 1803174 1702157 1600292 1468917 1479813 1526520 1484806
8403 1484806 1413361 1494657 1411563 1362339 1304335 1333030 1308530 1279064 1236388 1229450 1258063 1187201
8391 1187201 1269593 1215019 1061042 1020066 1007801 1014285 997207 909148 933630 959517 869094
8380 869094 943141 960048 924356 828290 799234 802336 807499 794296 657839 682272 683127 629637
8368 629637 556965 621771 705833 650438 566104 609430 702902 721957 635256 610626 571564 583149
8356 583149 638805 666096 596310 589946 490860 443179 347577 341621 408067 434958 388784 437379
8344 437379 487145 408032 467843 391380 327247 389423 441302 512806 454934 408303 444283 486131
8332 486131 469550 385355 347020 342871 407191 400242 371655 339693 404497 501429 484730 588139
8320 588139 612057 490220 469628 460728 364972 300732 397829 384802 433328 399059 438947 457463
8308 457463 414840 419192 371825 362717 382365 359730 401464 290150 375824 526667 431554 441993
8296 441993 448146 499622 430559 451812 535188 489517 474913 548898 549586 485760 354099 419110
8284 419110 434878 436579 501399 470053 375422 468233 522967 547120 598087 593754 675500 626060
8272 626060 546015 464120 538496 490078 564471 672232 607651 619421 571355 576151 582616 491499
8260 491499 456146 409948 525674 552116 610675 538450 405117 430917 409759 442997 548752
8249 548752 587232 573094 485650 461599 528662 543303 536681 534752 610369 587843 600708 610340
8237 610340 603451 621896 655860 695869 780281 733563 706957 720262 725963 809669 848857 848922 879404
8224 879404 827226 864829 992240 924233 938774 928191 833690 812870 714111 751653 889970
8213 889970 844089 805895 849678 851038 957535 970861 902432 760185 769038 736595 796071 846794
8201 846794 853576 834313 907777 847573 902102 936897 1001045 938378 1255667 1142268 574239
8190 574239 759744 794099 948063 908717 873281 781049 778037 653967 619497 540238 449865
8179 449865 514467 484182 442105 482956 474167 521830 483538 471625 461532 530233 468117 479606
8167 479606 501467 455443 374378 314793 442150 376283 268090 226848 243317 247741 331232
8156 331232 324634 231033 227194 311239 293700 362525 372094 338687 245923 324419 387085 317119
8144 317119 282014 251223 204734 247481 232318 123618 143022 154029 234579 244371 275498 266814
8132 266814 244402 253281 257466 194375 180551 244717 127324 228026 218455 236790 139348 81315
8120 81315 156007 95879 238215 251774 238395 300383 283683 323738 385356 305987 273420 300245
8108 300245 147440 149597 103141 198909 192905 242355 272223 67507 53669 108551 239962
8097 239962 315712 292111 274735 342575 249575 161638 155010 176768 140976 200008 225428 197454
8085 197454 161850 178800 168273 221277 312030 302400 221913 154411 218831 265040 267760 276200
8073 276200 312816 360715 273176 297029 337841 363156 278171 366039 426803 527137 560507
8062 560507 513905 514639 421023 472614 386934 260232 209697 117201 132094 195728 204725 41504
8050 41504 -87698 39602 28105 -51130 -4837 -29254 -22177 -10730 -39035 -22898 -25043 -83357
8038 -83357 -42101 50555 32545 22046 -17911 -17998 -45027 -35812 55688 -31920 -48799 -91748 -91597
8025 -91597 -68613 -111852 -166114 -140947 -179309 -184449 -62781 -58781 3280 92256 -40761 -88501
8013 -88501 19059 33650 75311 -53234 25818 40696 -833 7308 71169 29540 58616 43487
8001 43487 46986 81532 119923 153501 214272 135033 158653 112261 83644 99982 56953 16841
7989 16841 42480 40627 1631 -65082 571 62740 87209 46838 -16073 32267 64317 99217
7977 99217 127825 45108 -12896 130486 174556 181370 121185 143227 78373 132036 134564 141673
7965 141673 208101 216247 236178 254055 250448 164177 68519 157225 287022 335056 307610 270245
7953 270245 152396 140138 182466 189499 206838 230854 298783 232347 185842 263406 298876 193443
7941 193443 223066 331289 392563 432261 380152 291342 294352 364495 310298 295403 259831 217861
7929 217861 222067 278755 240768 249224 287227 383291 348802 358764 372556 373472 402653 407791 409117
7916 409117 308668 353231 320424 327480 431255 437073 459514 624164 490696 494667 517256
7905 517256 382027 424706 401112 278030 242688 272596 301225 257187 250362 242175 243562 286820
7893 286820 331762 342177 196142 171763 196067 228159 85559 82783 169967 273171 174458
7882 174458 129484 251072 284516 201119 138784 98396 54097 152261 152025 154180 261553 281731
7870 281731 155508 112640 232829 208691 129582 148451 178415 164968 98698 179519 258151
7859 258151 300066 287018 274495 282032 246198 188671 182342 189883 222466 286048 350752 249468
7847 249468 281654 266893 183037 191360 287827 350952 349158 411345 432259 363672 325674 298741
7835 298741 297007 261356 180099 223067 132605 219648 235982 278637 266132 362827 417855 386745
7823 386745 485059 578124 714876 695690 697889 718861 596852 589949 519957 433145 412331 438386
7811 438386 431521 400435 373324 339448 374845 397605 435444 486767 442765 237343 -6956
7800 -6956 95472 195528 31420 100131 132811 134783 183546 127448 163603 137136 93076 90012
7788 90012 164074 204401 182115 186584 192207 129305 113279 92260 68518 127582 106628 113701
7776 113701 112827 210186 171766 206044 189633 124555 70092 76900 48207 145545 127910 54128
7764 54128 32889 107282 90812 61164 102522 171446 117143 42366 50423 20995 120312 269923
7752 269923 160385 67269 17679 174656 191365 188919 155940 78587 23306 -1664 91240
7741 91240 129094 38707 111457 219263 159615 210762 232571 179036 185952 186207 94882 132662
7729 132662 128499 188748 218313 197182 197044 146722 237625 278021 173904 197916 392777 430797
7717 430797 474317 531758 569150 610383 541496 389258 462378 466511 383188 396428 260808
7706 260808 312285 249663 202760 157618 260494 259056 185600 141681 171045 102271 135833 100997
7694 100997 82519 125691 46263 -52075 -63441 -46170 -6189 -42042 104511 83298 9271
7683 9271 -34192 3075 43822 112618 82914 61323 43135 7557 16049 4789 83229 19397
7671 19397 33689 61685 72182 67079 92825 118821 63329 -9303 58329 50186 -76909 -101897
7659 -101897 -59730 -34250 -75853 -4784 -28028 -1984 -36548 -74892 -27114 -72703 70293
7648 70293 13555 -33913 -15176 -38032 37149 -19495 53241 19091 -85879 -13644 17818 -29980
7636 -29980 -12192 36317 39015 -91664 -102341 14327 55221 27580 89570 57187 -69616
7625 -69616 -123536 -13169 7379 -20508 -76983 -194186 -131010 -60861 -109777 -132430 -114393
7614 -114393 -88344 -75842 -154139 -134934 -219584 -128139 -75108 -62205 -120600 -74586 -46105 -108565
7602 -108565 -76080 -116471 -163516 -116343 -88065 -117048 -82126 19147 -100914 45976 29558
7591 29558 -23931 -52386 -37778 -59658 -80963 -94302 -100643 -144534 -71483 -95439 -194944 -134985
7579 -134985 -139166 -120067 -92184 -69459 13050 -22157 -40758 -63516 -64723 -29940 -125533 -106234
7567 -106234 -77013 -103443 -4216 18995 -80801 2281 -87353 -116772 80403 88595 4517 -14304
7555 -14304 -108316 -140328 -130541 -160754 -81182 -13839 -74649 -46639 -81306 -19591 -11758 -73135
7543 -73135 -98370 -129253 -149393 -85921 -86408 -91313 21834 5426 -77385 -102393 -82538 -109910
7531 -109910 -74419 7224 53080 57513 59911 92438 85358 19007 124369 48205 -12112 18069
7519 18069 25748 68876 48891 67408 162528 160577 98327 114141 21191 9375 -7286 41047
7507 41047 91552 71595 49909 -43899 39325 77634 48431 86359 24009 25292 -1091 -17279
7495 -17279 -17573 145410 155047 177720 151178 56503 86782 169469 281904 266742 187616 122050
7483 122050 103264 116869 121847 169590 72634 74287 84132 99949 71782 66829 27289 97591
7471 97591 127283 94292 116418 82339 111753 201157 206964 171126 256258 242448 274518 242189
7459 242189 241868 160084 142894 201615 187594 215946 239471 258367 220681 95608 183749 180278
7447 180278 41512 71298 149826 161607 89582 113845 232816 258689 155335 82140 83411
7436 83411 123008 83560 172751 214151 226777 172808 66716 78669 117714 146334 48952 16612
7424 16612 82454 89924 115761 213602 210584 185532 123805 132237 188023 163253 92256 70343
7412 70343 163214 107668 88385 179418 146534 105768 53341 60475 85808 104047 7904 60055
7400 60055 206492 285681 232872 223924 198899 69361 54448 74552 52272 20029 -24934 -115568
7388 -115568 -111962 36340 129801 -19370 -35217 -37015 18767 -10473 45106 34810 22484 -5280
7376 -5280 19562 14300 -132013 -135148 -58170 -67973 -8514 21710 -85454 -89760 -71172 -33676
7364 -33676 3160 -52065 -67981 -37736 -21541 -28462 -53759 6617 39847 32219 -106729 -154560
7352 -154560 -51498 37786 -51351 69115 17072 -78865 -104748 -65055 -69695 -88866 -21159
7341 -21159 -81962 -112820 -136110 -122611 -118687 -70791 -83927 -200441 -136324 -103286 -98419 -114727
7329 -114727 -67426 -21276 -90329 -120827 -84055 -77773 -49546 -23154 -31056 -82857 -33395 31872
7317 31872 16799 -47125 -206160 -128664 -98862 -166559 -157740 -242345 -122441 -88273 -218384
7306 -218384 -173574 -24204 -119503 -46281 -5802 5488 -54590 -147415 -84976 -90789 -77006 -86427
7294 -86427 -189109 -152136 -56067 -63006 -27226 -40705 -114156 -24678 -57415 -157491 -87857 -59459
7282 -59459 -41475 -103009 -83579 -123673 -20709 -11368 -38531 -67699 -140314 -161978 -33584 1384
7270 1384 -118043 -180720 -154662 -108884 -130771 -103618 -143532 -172726 -91825 -101434 -74840 47237
7258 47237 50337 -35550 -45248 -74419 -66267 -70637 -19869 -84211 -116278 -67132 -95206 -118923 -98835
7245 -98835 -129998 -148131 -250793 -184423 -211122 -194249 3458 -6683 -15133 64572 108328 28247
7233 28247 -1179 -153207 -113600 -127945 -120545 -87922 -165343 -127271 -73863 -11563 -53178 -87778
7221 -87778 -51241 61249 72165 20284 48330 96434 84214 -98523 -41116 21671 30156 35065
7209 35065 -22136 -21450 -73765 -69071 -101463 -116678 -127143 -51664 -24973 -7677 -91019 -107208
7197 -107208 -75725 -20214 -110225 -217233 -209131 -103746 -114820 -117537 -36261 -29514 -113780 -131652
7185 -131652 -55401 -97384 -82834 -37549 -33296 -26359 -50445 -36532 -24313 -57800 -89677 -10302
7173 -10302 5009 3218 -94909 -15137 -72101 -126390 -85855 -61984 -9595 -59095 -63651 37328
7161 37328 98660 -11809 -37676 -11709 19845 22668 91552 44155 15533 37668 -49672 -12672
7149 -12672 -15726 -82099 18224 19801 -65122 -85998 -104431 -46893 47454 -32999 -39032 -49897
7137 -49897 -6992 46020 102825 32534 -17112 -21271 -12015 139005 121854 -26087 -39519 -62105
7125 -62105 -9629 -27039 42604 54884 35785 96594 113962 85384 75673 2241 61490 -48214
7113 -48214 -19031 -120096 -72424 -48424 -14705 2131 -10330 -87027 -125252 -165435 -33505
7102 -33505 6048 -74056 -28860 -24763 34143 94494 63957 -4899 -105502 -2618 -18946 -89100
7090 -89100 -82449 -125875 -149850 -57978 122256 104103 58226 -58265 19105 70032 -37026
7079 -37026 -42655 37994 -19537 -56356 -46412 -18676 -46151 -5365 3307 18499 -25163 -23959 -44813
7066 -44813 -46743 -31841 -22301 -107346 -37662 -26298 -88437 -69915 46188 62991 69999 98161
7054 98161 107749 73068 27014 -16894 -68849 -111965 -35329 -67782 -149433 -25081 93729 43097
7042 43097 -15729 -28625 24156 -42083 -115512 -23936 -82923 -98115 -7760 -46788 50728 48387
7030 48387 17476 -51844 -105775 -128367 8888 87067 827 -58646 -2367 33204 -27574 7208
7018 7208 31299 25713 125787 57138 56540 33772 50720 73265 13535 36385 10703 61864
7006 61864 -29678 -29580 73506 66625 -55018 -91164 -41863 8140 73737 5490 40306 60077
6994 60077 84494 54508 15657 14476 -71669 -28039 29142 8923 -9661 14841 40541 53422
6982 53422 130054 37125 15599 -1884 30195 -7058 -31910 19244 85047 81811 88805 79061
6970 79061 129871 131876 145563 91266 100035 49331 -57307 24186 13531 82312 118145 79373
6958 79373 22491 1679 -38104 -35806 -93931 -16540 -45562 584 1754 48644 96028 135405
6946 135405 108592 171778 119211 56769 36546 240014 232241 222296 136895 10816 97337 141551
6934 141551 85244 125086 118109 205963 137029 120215 171742 158075 103330 155851 114716 121466
6922 121466 286221 319729 246739 163165 262835 339070 396989 393854 325097 322210 467801 518315
6910 518315 727613 756975 652679 613466 450163 443729 387538 251063 251235 258162 235311 177145
6898 177145 183030 160685 148373 300387 311772 255136 262646 322378 271397 265224 226989 101626
6886 101626 192428 72631 112098 141850 175811 213325 154095 113710 109311 112431 57174 84338
6874 84338 92233 107300 102929 115170 157920 71177 166430 227748 241677 277815 186598 140578
6862 140578 161377 129467 139836 171692 160510 173084 101804 104500 147164 118646 142977 86406
6850 86406 93473 190383 144540 8132 67350 142789 177285 155337 44988 178057 252839
6839 252839 222674 231868 279070 261124 252068 211468 283191 280246 225273 264292 173002 182312
6827 182312 193324 261316 187053 81588 142434 113054 208186 235449 181157 181929 173464 171525
6815 171525 200129 260950 215226 212144 137158 160115 106245 138781 206618 55279 126337 212587
6803 212587 213443 280132 317635 306612 211057 178004 200420 300070 249667 303780 252489 188395
6791 188395 257580 278318 286749 299428 387907 385614 393796 374761 333550 319041 314033 322194 301662
6778 301662 364192 284812 204432 238721 294542 239498 360801 407531 286252 320865 307403
6767 307403 219562 296561 330063 340003 298831 394685 476591 282122 317702 332148 372856 429621
6755 429621 335885 314560 262038 367459 459072 454141 539610 578207 421641 440759 473404
6744 473404 501728 518857 327293 380223 422896 418350 433541 411630 364423 442315 461180 557389
6732 557389 528310 334197 340907 541357 575209 468496 443271 475243 500054 472525 490716
6721 490716 558989 502634 565122 550152 630418 707721 686737 612773 630828 613172 620292 567862
6709 567862 652614 742106 689666 703139 668584 714884 699423 627048 659306 562616 636288 692124
6697 692124 752364 711671 684954 650217 648154 792049 787708 778251 797821 853380 889035 970279
6685 970279 937810 942117 962517 1029783 985668 926401 910245 828293 987231 959082 892459 856960
6673 856960 842452 904698 870321 809938 811730 760620 845001 976310 858620 924251 937719
6662 937719 967293 1002990 1030398 1038857 1035590 975213 955391 1022224 1086160 1097257 1095746 968388
6650 968388 941896 928937 974051 997163 988021 1088648 1113046 1085444 1107992 1134907 1091365 1125753
6638 1125753 1067455 1007666 1027805 1144881 1096713 1056936 1132382 1107902 1169655 1161332 1090110
6627 1090110 1097415 1203145 1183766 1112934 994313 1055111 1226518 1226907 1206743 1098098 1089613
6616 1089613 1035046 991303 1104565 1215466 1220973 1256191 1243552 1284467 1206161 1172354 1224625
6605 1224625 1254531 1235508 1141646 1209875 1202023 1246218 1206215 1305008 1298841 1381418 1396867 1351593
6593 1351593 1383200 1346025 1411883 1537655 1589777 1466445 1465875 1581311 1552218 1562165 1563582 1697210
6581 1697210 1689946 1619515 1611092 1625898 1749731 1721628 1712417 1868822 1966281 1915181 1933035 1867634
6569 1867634 1806287 1856523 1889442 1868835 1829674 1818872 1855421 1921540 1986629 1977940 1976627 1955130
6557 1955130 1901906 1984445 2084245 1975559 1971641 2006059 2066750 2127193 2065396 2163306 2310676
6546 2310676 2193603 2181536 2174703 2136919 2222372 2250389 2197455 2197150 2243272 2370567 2349923 2307014
6534 2307014 2335690 2430666 2509864 2441993 2534797 2496278 2579083 2617976 2600273 2642201 2739165
6523 2739165 2808216 2871427 2914679 2915170 2985314 2974376 2990786 3141493 3171434 3204642 3202987 3248955
6511 3248955 3333546 3451708 3456055 3539561 3630559 3653323 3810555 3936422 3977569 4098916 4225696
6500 4225696 4314873 4348199 4532266 4658005 4617090 4575218 4596177 4656140 4617437 4906463 5066897
6489 5066897 5145166 5232482 5435448 5466482 5657388 5907416 6115969 6326813 6460415 6595353
6479 6595353 6870909 7229925 7595045 7937993 8259730 8540709 8922677 9269087 9631746 9997489
6469 9997489 10181256 10299433 10207188 10061101 9969719 9956900 9953704 10047794 10107914 10116815 10253523
6458 10253523 10328041 10597315 10838502 10925567 11180618 11619025 12026738 12600325 12984728 13369067
6448 13369067 14017656 14656743 15349018 16161641 16985858 17768662 18265558 18377807 18251279
6439 18251279 17737420 17203246 16951325 16797671 16737024 16961256 17157911 17288984 17464829 17634015
6429 17634015 17862883 18228226 18561438 18951633 19459488 20127291 20850334 21447224 22181138
6420 22181138 22923027 23768104 24736469 25677889 26677968 27594408 28558809 29554711 30593919
6411 30593919 31951920 33621380 35574284 38143914 41140701 44890974 48962274 53048688
6403 53048688 56726092 58782399 58922931 57379082 54620556 51426327 48453953 45978890
6395 45978890 44069521 42620222 41568812 40898177 40737378 40886644 41500140 42475274 43809454
6386 43809454 45698707 47999166 50848529 54520337 58912081 64318569 70970217 78740815
6378 78740815 87423315 96061268 102818708 105333817 102653448 95391208 85908576 76273703
6370 76273703 67810238 60866230 55520117 51433947 48105213 45517166 43432286 41845650
6362 41845650 40809105 40017366 39698113 39828489 40335808 41263326 42642997 44679391 47428539
6353 47428539 50555423 54107299 57810624 60651509 61678610 60456199 57130822 52431423
6345 52431423 47220419 42302544 38203091 34700766 31985081 29698997 27875610 26272058
6337 26272058 24906386 23653973 22541833 21435504 20402149 19449678 18799533 18280033 17758639
6328 17758639 17254466 16860609 16505084 16058761 15656610 15113188 14610422 14165094 13786537
6319 13786537 13391562 13100400 12873278 12759392 12770319 12865753 12866154 13067793 13108089 13219162
6309 13219162 13249143 13147391 12860751 12625626 12292748 12116875 12097808 12138911 12301711 12451311
6299 12451311 12461372 12203497 11822626 11250437 10677852 10150455 9742552 9427894 9153331 8794310
6289 8794310 8784264 8826050 8827418 8923026 8958872 8981511 8932935 8830202 8663808 8358573 8274254
6278 8274254 8167194 8069791 7994568 8003584 7980004 7904685 7735247 7410500 7065255 6791991 6494836
6267 6494836 6376670 6115837 5970614 5823693 5759396 5796939 5800894 5712214 5557315 5464595 5386354
6256 5386354 5352200 5243061 5267924 5286390 5178390 5105281 5044443 4835209 4803623 4840338 4917293
6245 4917293 4849884 4758981 4806205 4981812 5171605 5405428 5488613 5652577 5728848 5710186 5549193
6234 5549193 5355967 5196331 5175347 5143275 5024159 4882408 4799502 4725032 4684064 4736363 4652847
6223 4652847 4723454 4648401 4769078 4934662 5026800 5269320 5471706 5781805 6175803 6558026
6213 6558026 6945609 7231169 7378724 7136496 6732870 6287193 5819733 5446547 5072038 4878189
6203 4878189 4811804 4693233 4514952 4314893 4291824 4201004 4216332 4267939 4324681 4336503 4502390
6192 4502390 4581595 4613201 4732457 4918070 5038118 5187994 5304437 5258632 5079864 4890800
6182 4890800 4729079 4513490 4344568 4141126 4010420 3949250 3868809 3748897 3706916 3686522
6172 3686522 3616532 3580584 3538667 3517494 3545477 3542938 3556873 3555146 3621857 3581467 3559246 3567035
6160 3567035 3535964 3523181 3606730 3599675 3574509 3524198 3518305 3576589 3517592 3552818 3641695 3652753
6148 3652753 3727167 3721420 3747755 3736949 3746054 3767086 3826134 3935093 3976588 3936122 3994531 4098160
6136 4098160 4130910 4192909 4199373 4128261 4141116 4174845 4087418 4103779 4086996 4053565 4120179 4180794
6124 4180794 4234532 4211120 4312366 4233861 4307597 4505942 4562777 4526771 4582669 4599624 4561292
6113 4561292 4664995 4879744 4859945 4909569 4963080 5185161 5413517 5502407 5720639 5840803
6103 5840803 6002369 6019420 6190192 6370358 6365209 6377477 6313949 6268530 6273327 6183105 6079545
6092 6079545 6041736 6080503 6112506 6177550 6278817 6333542 6299715 6520185 6635062 6647012 6831772
6081 6831772 7054865 7308029 7598304 7881036 8226041 8570154 8885516 9290573 9553954 9698685
6071 9698685 9657546 9302240 9103783 8963404 8829880 8799035 8700182 8798576 8908467 8904918 8930873
6060 8930873 8931793 8933507 8991056 8993045 9098100 9195472 9271056 9536024 9763936 9964296 10252850
6049 10252850 10476540 10791737 11158053 11331040 11348825 11327359 11357184 11352189 11469201 11635536
6039 11635536 11817966 11863197 12017074 12316080 12589086 12682983 12873111 13125434 13215233 13382759
6029 13382759 13620149 13723827 13976532 14311937 14481162 14613340 14980180 15399844 15850081
6020 15850081 16304650 16697598 17081338 17553910 18158933 18967122 19502715 20262830 21191037
6011 21191037 22154497 23198850 24325106 25669784 27264733 29106022 31079097 33611278
6003 33611278 36376817 39526693 43208596 47135862 50775478 53369029 54382611 53756359
5995 53756359 51906077 49281059 46617644 44288809 42266343 40862682 39683902 39052853
5987 39052853 38842741 38989163 39597419 40523637 41675036 43380790 45628384 48456769 51850093
5978 51850093 55892024 60783312 66754684 73671233 81294674 89462297 96640654 101225009
5970 101225009 101435936 96902922 89073364 80011559 71233818 63716306 57738135 52932439
5962 52932439 49219033 46347311 44058216 42311835 41198173 40607525 40384467 40539374 41112942
5953 41112942 42169188 43742938 45710197 48214458 51144005 54385098 57770230 60752025
5945 60752025 62404582 62128135 59756490 55706193 50757079 45716024 41043929 37067516
5937 37067516 33748947 30952201 28602710 26600712 25054333 23676710 22566645 21539177
5929 21539177 20747954 20151648 19584143 19139428 18736192 18147450 17596899 17154136 16672613
5920 16672613 16135352 15472357 14982791 14740134 14461922 14121238 13854337 13684663 13602118 13574951
5910 13574951 13571981 13696259 13866224 13932312 14210631 14588358 14932998 15072687 14910334 14638951
5900 14638951 14192212 13670894 13315891 13061093 12891146 12739749 12711428 12783140 12721126 12761909
5890 12761909 12773039 12838641 13001550 13161027 13322184 13491126 13885466 14388541 14905293 15470027
5880 15470027 16347774 17165043 17919945 18501963 18629644 18251197 17655455 16965607 16344463
5871 16344463 15838549 15624140 15540027 15405572 15402158 15514212 15513200 15518043 15555219 15701693 15806654
5860 15806654 15993301 16288182 16643751 17010013 17309728 17857706 18320811 18852474 19386500
5851 19386500 19686854 19855362 19923820 19944253 19967630 19903958 19915115 19896152 20070133 20273288
5841 20273288 20439289 20682247 20974047 21267174 21718589 22153820 22644587 23135711 23835944
5832 23835944 24479741 25151917 26090644 27062226 28206898 29468555 31012131 32810579 34688960
5823 34688960 36928739 39893166 43276068 47194553 51743523 56739851 61879223 66090770
5815 66090770 68213606 67726637 64953372 60812647 56577844 52739757 49458219 47100943
5807 47100943 45332568 44145481 43384134 43000783 43109997 43654487 44592643 46018394 47906364
5798 47906364 50264667 53474083 57362147 62281159 68426177 76260379 85672490 96040227
5790 96040227 105445061 110537311 109272044 102752809 93226709 83080421 73993725 66255438
5782 66255438 59988617 55034688 51102411 47927375 45535560 43769271 42399429 41373857
5774 41373857 40665288 40379627 40456977 40771256 41563863 42765381 44438443 46679825 49385481
5765 49385481 52620789 55712608 57955265 58658847 57031245 53510967 48979210 44499626
5757 44499626 40322863 36727484 33853238 31433883 29505224 27918261 26563158 25431701
5749 25431701 24594152 23809191 23000548 22150174 21433662 20916431 20396682 19900639 19596935
5740 19596935 19338153 19130333 18974909 18801751 18608714 18218942 17963574 17752988 17649502
5731 17649502 17552780 17600641 17498597 17423169 17328869 17085404 16768323 16489062 16306074 16078914
5721 16078914 15887504 15791343 15551123 15473101 15510999 15543725 15713126 15835755 16084293 16360442
5711 16360442 16678419 16786225 16709121 16511502 16339144 16278204 16376357 16523510 16736718 16842272
5701 16842272 16658996 16289610 15732537 15309072 14876217 14621456 14331322 13947903 13785084
5692 13785084 13705437 13646020 13654430 13639418 13708757 13790759 13924465 13993190 13979476 13954774 13828581
5681 13828581 13622516 13638487 13538198 13378533 13519342 13455241 13408039 13263511 13166958 12943949
5671 12943949 12856251 12818907 12696524 12688308 12760814 12855335 12954830 13254026 13525839 13764829 14071107
5660 14071107 14168088 14114109 14161067 14092298 13867829 13859300 13842210 13845162 13825725 13736012 13705110
5649 13705110 13690085 13555281 13435397 13527274 13559130 13560564 13686679 13909912 14116447 14509932
5639 14509932 14849813 15262026 15861298 16449651 16834124 16909165 16880764 16715033 16509802 16326236
5629 16326236 16403472 16635126 16876526 17013434 17037289 16857451 16665315 16349957 16084401 15985475
5619 15985475 15986503 15929387 15782255 15807265 16055011 16285253 16702697 17016300 17343465 17617046
5609 17617046 17698278 17768720 17831208 17934030 18004559 18135561 18387989 18781782 19165648 19695206
5599 19695206 20125154 20357571 20411553 20311425 20390257 20450233 20521037 20596161 20654780 20741779 20802404
5588 20802404 21016286 21262193 21633889 21912284 22335337 22987420 23660772 24324352 25228242
5579 25228242 26139664 27176511 27970252 28517094 28907232 29057266 29391859 29724892 29879467
5570 29879467 30119629 30476311 30984273 31575870 32312659 33311531 34415947 35640396 37265631
5561 37265631 39151565 41372369 43739939 46051301 48581517 51396396 54408774 57699465
5553 57699465 61314641 65616833 70841775 77050513 83721906 90114435 95239284 98836981
5545 98836981 101040948 100896154 97037377 90203765 82826636 76462217 71815272 68688318
5537 68688318 66911737 65978605 65522990 65412633 65732278 66609785 67863945 69474894 71677138
5528 71677138 75049708 79685050 85602334 93124516 102256990 112320003 121260230 126328535
5520 126328535 125763924 120306472 112007244 102740258 94079126 86717814 80691268 75597115
5512 75597115 71375406 67827220 65064346 63018883 61486789 60467659 59764115 59391601
5504 59391601 59327669 59577709 60234416 61447850 63064410 65269965 68045228 71159059 74117506
5495 74117506 76395400 77092909 75990853 73288473 69411548 65146442 61047077 57470464
5487 57470464 54474929 52186273 50479201 49099330 48130622 47511435 47251107 47067990 47151107
5478 47151107 47377623 47866688 48585856 49652869 50967472 52506821 54156771 55466540 56547911
5469 56547911 57442172 58183974 59092831 60361973 61717897 62921838 63978455 64730606 65372838
5460 65372838 66168361 67559174 69536151 71937534 74558572 77412263 80101627 82144029
5452 82144029 82863757 82541454 81810182 81355111 81761827 82892580 84361482 85942709 87566429
5443 87566429 89405734 91700130 94518660 97919928 101614559 105183766 107281578 107763613
5435 107763613 107595733 107966017 109687179 112850852 116826756 120426816 122548390 122564103 120197031
5426 120197031 115641254 109314536 101997540 94836732 88451634 82865176 78581912 75392871
5418 75392871 73181042 71676377 70835776 70707531 71144772 72044154 73870480 76423876 79893744
5409 79893744 84498180 89958434 96225744 102742577 108452035 112739536 114962047 114934170
5401 114934170 112610968 108581447 103746651 99444792 96751847 95594387 95419095 94730173
5393 94730173 92340508 88643990 84534730 80900132 78496308 77046275 76344785 75864836
5385 75864836 75359241 74686206 74320343 74757839 76122011 78269678 80598363 81944555 81899612
5376 81899612 80553787 77438012 73071162 68072437 63603129 59981192 57090948 54859265
5368 54859265 52880943 50867638 48851710 46891310 45144611 43285723 41643298 40088937
5360 40088937 38292996 36255713 34065285 31827300 29733008 27848344 26251329 24856639
5352 24856639 23516850 22367914 21273679 20234136 19185560 18394435 17662647 16997046 16387157
5343 16387157 15866225 15235776 14672684 14124816 13701085 13306365 12909226 12567676 12228625
5334 12228625 11945955 11718754 11387371 11048453 10788720 10471706 10123519 9927115 9636505
5325 9636505 9420912 9316649 9078275 8947475 8881470 8701202 8471505 8195249 7995971 7701176
5315 7701176 7483183 7359306 7225565 7107109 6913578 6786735 6650456 6538993 6458587 6317668
5305 6317668 6304467 6276073 6262721 6209219 6059706 5943486 5877392 5679541 5530602 5419284
5295 5419284 5367906 5259257 5053352 5070255 5070056 4937303 4934359 5009453 4919596 4775559 4747267
5284 4747267 4732924 4606699 4558522 4523111 4415683 4256236 4248187 4163960 4153144 4141187 3950184
5273 3950184 3923269 3825934 3794116 3709947 3653507 3676405 3496131 3445452 3425589 3386837 3329675
5262 3329675 3309918 3262739 3230430 3346472 3193348 3101772 3211793 3199301 3245436 3214086 3105088
5251 3105088 3087745 3171213 3111954 3055110 2990457 2933968 2897689 2855830 2879325 3043156 3003498
5240 3003498 2885419 2787775 2655605 2734844 2741123 2800598 2684868 2684864 2615818 2640964 2753722 2634334
5228 2634334 2545565 2631484 2762405 2722079 2640312 2577671 2578992 2590715 2658757 2698966 2753599
5217 2753599 2713610 2641987 2693479 2716237 2757962 2606542 2515663 2512562 2491547 2479280 2420353
5206 2420353 2476781 2423183 2325944 2379667 2520461 2544697 2520917 2516279 2596486 2564257 2597049
5195 2597049 2602107 2458945 2406527 2366604 2334051 2271247 2207966 2275943 2329685 2288033 2243379
5184 2243379 2214337 2226345 2276484 2230438 2304460 2241388 2121315 2223940 2325630 2315247 2328632
5173 2328632 2530347 2492413 2406501 2452506 2474621 2455038 2477772 2531078 2528728 2487678 2356226
5162 2356226 2420224 2425929 2460595 2427748 2385833 2371891 2322527 2338265 2317178 2320343 2478338 2498912
5150 2498912 2391249 2440000 2571456 2568512 2566633 2648894 2698354 2722494 2678427 2707596 2772439
5139 2772439 2588854 2460645 2553765 2655437 2684227 2638501 2665274 2635852 2608845 2597519 2559664
5128 2559664 2590235 2585321 2516079 2431867 2358388 2384328 2498392 2569062 2588433 2518656 2543445
5117 2543445 2468171 2426648 2458474 2435753 2472952 2388426 2314106 2376183 2371103 2257461 2352947
5106 2352947 2443892 2395166 2314872 2303491 2393155 2457265 2442747 2469604 2394834 2411324 2511051
5095 2511051 2652117 2647069 2519091 2533883 2558943 2518037 2509451 2422898 2502519 2530223 2528741 2559617
5083 2559617 2565712 2537009 2528812 2473287 2495486 2474129 2532342 2709355 2740946 2701547 2730361 2765526
5071 2765526 2861114 2878361 2858651 2913084 2840995 2780945 2897070 2988143 3004562 2988879 2894571
5060 2894571 2958300 2899948 2843567 2801345 2893831 2983851 2943711 2943735 2895749 2876933 2941411 2910871
5048 2910871 2882411 2936475 3010284 3042315 3127654 3223911 3211303 3221356 3154563 3089415 3077817
5037 3077817 3067848 3141868 3165487 3187783 3214280 3123346 3069689 3020753 3169392 3248181 3263736
5026 3263736 3198861 3174076 3229633 3275328 3254352 3305898 3373752 3342701 3347688 3335699 3314810 3293952
5014 3293952 3308900 3307481 3353033 3405690 3509145 3519726 3636527 3708026 3580484 3560835 3630037
5003 3630037 3768773 3848694 3949162 4030009 3941551 4037437 4202469 4088813 4118674 4180200 4138406
4992 4138406 4163033 4155104 4144403 4115984 4167985 4134805 4059785 4158682 4202643 4134854 4265746
4981 4265746 4171658 4120754 4139454 4254856 4274496 4296799 4392925 4499109 4523796 4556376 4694863
4970 4694863 4884747 4779108 4784045 4884541 4867144 4819698 4787561 4881577 4859054 4820384 4818282
4959 4818282 4808191 4733510 4721464 4760962 4775658 4713612 4816988 4869641 4850888 4894129 4907929
4948 4907929 4878566 4980802 5026756 5045501 5116054 5130930 5155650 5111169 5232760 5317114 5404704
4937 5404704 5407386 5411089 5456435 5568451 5718826 5780850 5921681 5959637 6014074 6056245 6099410
4926 6099410 6173825 6282770 6344055 6492483 6561701 6596156 6745266 6961707 7309139 7674722
4916 7674722 8076832 8184625 8071707 7902587 7589414 7343885 7108981 7014269 6955535 6999563
4906 6999563 6955826 7056294 7088652 7066171 7168496 7168559 7242177 7385322 7532315 7723611 7723816
4895 7723816 7762868 7902993 7978996 8133002 8404038 8579462 8577632 8680656 8921214 9054567
4885 9054567 9234471 9353246 9439195 9518783 9601237 9693110 9744498 9949424 10164378 10302268
4875 10302268 10448857 10542376 10694570 10952626 11120511 11329935 11481446 11740724 11909271 12172777
4865 12172777 12331151 12568453 12769366 12987024 13348983 13634518 13868185 14083800 14400783
4856 14400783 14607688 14866424 15240993 15606960 15934735 16235137 16569966 16967126 17376869
4847 17376869 17709600 18134596 18406197 18726617 19254207 19768905 20238365 20742345 21224934
4838 21224934 21734511 22286598 22914147 23654554 24349885 25090941 25800509 26663090 27534238
4829 27534238 28324098 29273287 30348570 31363830 32440973 33606364 34983148 36422140
4821 36422140 37844042 39535296 41200983 42942943 44790755 46589665 48382631 50257634
4813 50257634 52202716 53996677 55762739 57384758 58958156 60312966 61341128 62194201
4805 62194201 62772220 63213356 63684028 64192848 64937126 65879347 66965456 68260412 69873942
4796 69873942 71536773 73564738 75891683 78689507 81901554 85358283 89006589 92902219
4788 92902219 96782070 100711811 104587107 108173212 111551118 114245562 116301404 117570946
4780 117570946 118271522 118224043 117681532 116776497 115618873 114292836 112719242 111159370 109831592
4771 109831592 108527669 107446465 106769972 106326583 106199573 106331653 106774557 107492150 108384216
4762 108384216 109497514 110857482 112240889 113638611 114690997 115312195 115643085 115543900 114825676
4753 114825676 113576785 111655711 109141677 106205008 102872493 99122167 94957773 90596534
4745 90596534 86086985 81376961 76876924 72704282 68860567 65647628 62927949 60754115
4737 60754115 58944064 57572037 56538391 55739653 55191039 54716342 54424655 54157932 53656093
4728 53656093 53172067 52464726 51536521 50342610 48929426 47209566 45395405 43568895 41650701
4719 41650701 39828449 37790299 35902450 34041883 32106530 30192677 28505558 27010593
4711 27010593 25541496 24244507 23111232 22121887 21141425 20180259 19416380 18638956 17794043
4702 17794043 17163968 16554489 16089845 15543537 14989878 14530479 14130621 13725708 13318842
4693 13318842 12949859 12672586 12417556 12087541 11754744 11480548 11329323 11153965 10900346
4684 10900346 10694764 10441944 10149757 9932055 9790842 9505411 9285020 9144255 9059259 8937095
4674 8937095 8769956 8661160 8560791 8616770 8449452 8239225 8053444 7931780 7883279 7892453
4664 7892453 7856445 7666409 7591036 7453343 7375941 7388932 7466355 7425955 7364798 7262773 7251676
4653 7251676 7211044 7216110 7206204 7186073 7084531 7047158 7064831 7026271 7104147 7060554 7225353
4642 7225353 7249116 7204161 7220144 7179542 7206879 7124781 7215648 7344737 7208171 7172849 7287339
4631 7287339 7395535 7492947 7541865 7575033 7497066 7282950 7042812 6737601 6414845 6254506
4621 6254506 6109099 5931479 5782630 5671050 5565673 5485991 5436182 5449279 5466582 5409242
4611 5409242 5294630 5293574 5327442 5240077 5190405 5075377 4974015 4958498 4942314 4771443 4718507
4600 4718507 4634777 4517683 4377269 4313197 4321658 4268835 4168937 4117251 4031514 4036811 3973552
4589 3973552 3966087 3899722 3843462 3854707 3874570 3861285 3861927 3833807 3832934 3758657 3740428 3610713
4577 3610713 3537064 3500538 3574788 3595707 3485230 3449000 3496368 3455832 3546253 3550538 3477205
4566 3477205 3451313 3521758 3481928 3538504 3596041 3492072 3540684 3557367 3566914 3540994 3556348
4555 3556348 3550120 3507290 3577889 3506129 3483896 3497188 3541255 3569557 3619346 3689615 3723165 3713500
4543 3713500 3735810 3755905 3822899 3915170 3922637 3913032 3989270 4102798 4118747 4186229 4151589 4252678
4531 4252678 4171678 4133397 4021712 3973247 3837105 3872117 3990071 3949011 3900352 4060432 3939709
4520 3939709 3920820 3984947 4020462 4012679 4002099 3942663 3978763 3999086 3937046 3916920 3923862 3933924
4508 3933924 3862747 3761438 3747739 3804291 3912248 3852459 3963307 4019716 3994584 3931445 3966799
4497 3966799 4019455 4070759 4077766 3990518 4072906 4058533 4126469 4217048 4312271 4514469 4640141
4486 4640141 4661475 4673763 4729674 4681258 4602578 4636668 4576630 4578579 4632439 4715363 4748755 4862738
4474 4862738 4939502 4866666 4918831 4987240 5052628 5007430 4976042 5217564 5389773 5356248 5412179
4463 5412179 5481047 5571759 5602217 5623952 5673673 5769091 5901468 5981053 6172563 6441327 6784304
4452 6784304 7224869 7816601 8452032 8778976 8676389 8252098 7872160 7438448 7213814 7218801
4442 7218801 7234576 7180206 7320155 7279910 7329973 7505012 7448048 7500979 7491222 7546530 7639874
4431 7639874 7790114 7988460 8104480 8250754 8434894 8497490 8494569 8526467 8631566 8686286
4421 8686286 8792680 8927401 9115628 9296717 9495617 9636812 9785856 9965352 10131194 10237817
4411 10237817 10426964 10703005 10911094 11107041 11178574 11224510 11445974 11605422 11806569 12042013
4401 12042013 12277745 12578958 12802854 13067591 13223933 13267954 13583795 13938504 14306631 14630057
4391 14630057 15054107 15456985 15935599 16289909 16761697 17250582 17712935 18246367 18857739
4382 18857739 19462856 20153303 20768907 21294126 21674030 22092134 22599580 23257810 23862398
4373 23862398 24400454 25001946 25801555 26384651 27164091 27928886 28810640 29477082 30239674
4364 30239674 30973430 32049587 32978962 33851756 34778359 36144749 37636880 39350843 41441610
4355 41441610 44009009 46833398 50293067 54242805 58888319 64214099 70864515 79315782
4347 79315782 90648532 105361789 125722862 154392151 195002975 251646637 318440396
4340 318440396 341808703 302891387 248175220 193057439 151463859 123635180 103342654
4333 103342654 88376397 76740469 67675235 60508217 55109296 50891591 47380008 43900612
4325 43900612 40793544 38015139 35722322 33657151 31806207 30112405 28448667 26839375
4317 26839375 25711790 24792589 23751633 22865706 22133207 21409214 20457413 19577399 18828247
4308 18828247 18030580 17337374 16728023 16299435 15599198 14902452 14330595 13678441 13106027
4299 13106027 12714288 12436619 12168033 11893802 11623918 11355336 11159897 10884866 10674631
4290 10674631 10398185 10257385 10023800 9666135 9457668 9269087 9075276 8920663 8687130
4281 8687130 8738203 8596795 8468234 8436222 8424340 8304498 8269444 8190711 8180093 8062018 8025938
4270 8025938 8162126 8366935 8364813 8285652 8164319 7970231 7860854 7630887 7448071 7471921
4260 7471921 7406009 7330157 7291542 7289853 7242220 7107299 7099995 7134641 7274263 7308095 7269430
4249 7269430 7211527 7313573 7300733 7169334 7080199 7028357 7022763 6906728 6835251 6855100 6877478
4238 6877478 6833239 6955755 7053726 6967455 6901181 6881824 6865694 6796161 6836246 6924256 6889744
4227 6889744 6854625 6819912 6903461 7063274 7261925 7308273 7198959 7113870 7123092 7170119 7151001
4216 7151001 7131377 7150002 7191427 7356405 7433895 7439977 7420337 7442134 7587039 7668053 7648818
4205 7648818 7701776 7621960 7645841 7879734 8037838 8044574 8165089 8123579 8217389 8235438 8297149
4194 8297149 8419955 8660597 8800701 8881002 9122392 9273150 9373384 9505046 9559652 9637588
4184 9637588 9723517 9945177 10060965 10112886 10319155 10472809 10527396 10745225 10961490 11148921
4174 11148921 11334047 11442531 11654926 11805968 12116529 12335558 12519317 12699842 13019408
4165 13019408 13280901 13426664 13745405 14083325 14469034 14861451 15277818 15678530 16114859
4156 16114859 16610566 17144913 17548097 18077153 18665706 19271898 20039831 20731979 21266875
4147 21266875 21787244 22353805 22957341 23532119 23964214 24491153 24925518 25446914 25842358
4138 25842358 26357195 26817086 27395483 28029710 28667611 29394570 30185738 30943084 31563923
4129 31563923 32215621 32793293 33356565 34019192 34600313 35376799 36002740 36700435 37368149
4120 37368149 38179585 39026792 39837865 40837777 41961484 43007191 44002808 44883850 45773248
4111 45773248 46723882 47790683 48964482 50196317 51613128 53080154 54585821 56140153
4103 56140153 57219574 58268819 59112432 59955344 60772928 61465540 62259219 62991363 63662318
4094 63662318 64329811 65017500 65999595 67268876 68501192 69916213 71614330 73386369 75359922
4085 75359922 77594266 79852972 82443703 85095524 87903989 90889612 93975669 96785934
4077 96785934 99363236 101352546 102927193 104167430 105120199 105600254 105739644 105607459 105339446
4068 105339446 104878297 104349925 103866599 103342590 102919334 102680731 102593094 102385982 102142352
4059 102142352 101963355 101877580 101821491 101694020 101820258 102039266 102321776 102584032 102874793 102867698
4049 102867698 102389069 101512366 100055801 97958530 95205392 92115262 88848904 85682129
4041 85682129 82760058 79879533 77272090 74971782 72686036 70509392 68480769 66642482
4033 66642482 64980138 63318238 62022233 60810280 59595833 58569567 57663262 56783525
4025 56783525 55771961 54886532 53993187 53196374 52403828 51625528 50677113 49560536 48247959
4016 48247959 46880921 45318197 43853001 42514362 41354614 40358127 39421629 38411587
4008 38411587 37381998 36339194 35197036 34105226 32921592 31916324 31014691 30183626
4000 30183626 29511087 28811378 28124513 27547553 27059833 26562723 26018804 25524155 25039295
3991 25039295 24506156 23778658 23094144 22387445 21727896 21109662 20482210 20008964 19559464
3982 19559464 19099117 18684914 18118658 17692633 17216117 16790993 16356645 15969488 15512341
3973 15512341 15096918 14678880 14264474 13867981 13388456 12915642 12634140 12389109 12066665
3964 12066665 11845793 11642717 11459782 11138545 10955940 10837638 10598354 10400530 10271838
3955 10271838 10194215 10034542 9921899 9738111 9614511 9551038 9380253 9249551 9098881 9040837
3945 9040837 9041902 8923199 8784913 8667159 8569965 8458194 8336571 8254108 8080327 8165689
3935 8165689 8145084 8039966 7916726 7788822 7789611 7651248 7545806 7461461 7460090 7386853 7097782
3924 7097782 7130477 7082160 7054684 7031128 6885187 6748888 6672717 6721766 6589876 6443005 6495392
3913 6495392 6364405 6359981 6366832 6219407 6134876 6083405 5936425 5828985 5759132 5703044 5780990
3902 5780990 5707888 5596944 5572367 5512185 5419364 5353293 5316517 5296229 5288867 5205929 5197275 5251741
3890 5251741 5267715 5099197 5088520 5096076 4999052 4984061 4942658 4956779 4900263 4873443 4751440
3879 4751440 4633757 4630417 4588497 4563748 4580335 4589933 4624297 4588914 4560899 4649366 4590555 4571813
3867 4571813 4401898 4292351 4403024 4303737 4298248 4294951 4362456 4346485 4386894 4480205 4357627
3856 4357627 4314509 4235881 4234163 4270976 4164036 4146585 4105031 4091256 4150355 4140243 4165785
3845 4165785 4182904 4172361 4099704 4066268 4030759 4028862 4084913 3973023 3968659 3927712 3956868 4037923
3833 4037923 4052726 4072287 3991604 3925415 3907435 4035448 4051749 4033290 4057830 4095429 4065258
3822 4065258 4062268 4097653 4094029 4011969 3906674 3906454 3930391 3998060 4047326 3973609 3952347 3884415
3810 3884415 3898519 3781327 3691050 3756317 3736728 3742951 3739735 3763665 3772349 3764391 3736411 3754631
3798 3754631 3694319 3750163 3682034 3751609 3717858 3677911 3560479 3519510 3531120 3533060 3524765 3538647
3786 3538647 3633515 3572219 3585614 3669720 3559560 3492292 3539175 3601606 3553517 3396180 3393300
3775 3393300 3539131 3518859 3505750 3379522 3327603 3416035 3439755 3524409 3528602 3471227 3460406
3764 3460406 3370084 3217176 3375160 3358242 3284286 3290529 3260353 3289345 3312383 3378135 3380161
3753 3380161 3383322 3476331 3429567 3372845 3327710 3178621 3144435 3151922 3117140 3315602 3245311
3742 3245311 3205339 3214945 3247834 3304618 3275613 3259778 3275603 3140459 3193989 3306345 3280197
3731 3280197 3240083 3232607 3159097 3163323 3169853 3121145 3150852 3144193 3226989 3199467 3187145 3280749
3719 3280749 3268202 3184238 3248384 3268637 3268896 3281195 3332496 3384320 3521631 3530598 3463821 3430354
3707 3430354 3452184 3382782 3377200 3346188 3303539 3316189 3352676 3471974 3397233 3430288 3501312
3696 3501312 3516933 3507446 3425517 3421878 3467101 3414633 3389395 3421664 3533923 3521379 3536497 3527693
3684 3527693 3554400 3619757 3665422 3699137 3745421 3791781 3715050 3787143 3772298 3739934 3854905
3673 3854905 3935323 3964256 4046981 4013933 3996112 4058593 4181833 4335664 4410244 4603753 4542813
3662 4542813 4517912 4450980 4471205 4480007 4447999 4561419 4592024 4599036 4559877 4645020 4677698 4683239
3650 4683239 4790098 4875546 4858767 4948308 5065227 5121376 5133041 5289991 5298577 5302008 5365074
3639 5365074 5493799 5648080 5731601 5754805 5807299 5947282 6086115 6218654 6364636 6393175
3629 6393175 6421975 6402855 6383085 6499234 6526856 6652636 6679618 6837329 6911034 6997715 7138940
3618 7138940 7290242 7470503 7677047 7857855 7979409 7994265 8064516 8236322 8384360 8616063
3608 8616063 8795828 8817906 8943666 9080864 9274297 9532409 9629026 9771573 9956472 10119479
3598 10119479 10250887 10405161 10469154 10715745 10856470 11097484 11234031 11446823 11812842 12061917
3588 12061917 12173173 12525700 12845592 13008245 13358705 13770072 14124390 14520191 14877332
3579 14877332 15272814 15747160 16347357 16947662 17546210 18252874 19155916 20097090 21005437
3570 21005437 22065594 23184732 24356783 25381767 26512015 27685764 28687513 29621656
3562 29621656 30273944 30545419 30684445 30376063 29612364 28494993 27279152 26061686 24858815
3553 24858815 23777251 22831623 21966654 21364505 20603596 20153679 19683408 19232613 18987136
3544 18987136 18667058 18642411 18619308 18657179 18736239 18941889 19351385 20050851 21064222 22547489
3534 22547489 24562897 27255865 29652426 30351123 29066533 26335443 23195922 20307351
3526 20307351 18163023 16551993 15291673 14271179 13523200 12893069 12233671 11660841 11191960
3517 11191960 10746986 10310049 10053031 9816275 9562502 9381961 9149930 8952125 8737745
3508 8737745 8758337 8606926 8452000 8279406 7998787 7870665 7606700 7412318 7202026 7057026
3498 7057026 6863984 6696705 6593201 6429620 6328145 6196683 6025566 5964264 5891932 5867040
3488 5867040 5663177 5509056 5581201 5522395 5511134 5447881 5405793 5479482 5483478 5470141 5485934
3477 5485934 5614067 5660613 5717805 5825845 5871571 5732200 5439496 5215289 5070078 5016528
3467 5016528 4853186 4698797 4588219 4488347 4339137 4184478 4173300 4160243 4166950 4150569 4109408
3456 4109408 4208009 4190306 4172382 4057607 3970859 4005801 4023224 4050340 3980694 3964924 3910401
3445 3910401 4014361 4019986 4051814 4049806 3972148 3963644 3814052 3816019 3757128 3710052 3552438 3478174
3433 3478174 3352364 3276073 3345589 3318604 3332389 3198740 3186061 3156912 3132283 3045597 3114740
3422 3114740 3131029 3147686 3105982 3005977 2992848 3045611 2948740 2859385 2963778 2962550 2943856
3411 2943856 2789715 2765505 2824340 2875455 2875577 2884615 2828644 2803061 2886596 2801783 2750056 2649170
3399 2649170 2714126 2637092 2604556 2651708 2536666 2398341 2488212 2513859 2562393 2451955 2434046
3388 2434046 2490151 2334434 2291726 2419678 2426563 2276272 2246193 2318870 2472003 2464203 2389867
3377 2389867 2315187 2242240 2185261 2221916 2243322 2305443 2239214 2239070 2186631 2152198 2187476 2141028
3365 2141028 2107904 2028388 2074705 2101171 2151749 2170909 2151551 2079738 2059535 2024011 2014300 2041836
3353 2041836 2072767 2061635 1927279 1932383 1844141 1770120 1818546 1837483 1778317 1895429 1985821
3342 1985821 1989116 1823364 1893225 1888369 1865666 1985454 1886317 1901375 1940161 1833543 1900993
3331 1900993 1838525 1907059 1872564 1830526 1897875 1996065 1946922 1909564 1927929 2001844 2076754
3320 2076754 2119757 2179404 2113711 2116538 2155492 2225190 2229220 2179395 2173333 2205881 2184209 2231678
3308 2231678 2290319 2268512 2248504 2187176 2267959 2296632 2456335 2473705 2489440 2583295 2555394
3297 2555394 2515825 2509654 2598165 2723979 2732363 2836741 2964693 2941990 2965443 3013991 3071897
3286 3071897 3073631 3158050 3135849 3176974 3246843 3335650 3280115 3388764 3332817 3274081 3337495
3275 3337495 3413943 3419858 3470380 3588635 3632398 3636015 3737197 3790084 3894094 3888359 3939342
3264 3939342 4191415 4283458 4354232 4406471 4546374 4822733 4907380 5110840 5370478 5623389
3254 5623389 5806525 5845544 5945002 6132836 6207533 6388658 6444891 6519328 6742828 6824798 6689681
3243 6689681 6820893 6997362 6986338 6905342 6948660 7086144 7131884 7221620 7297473 7558007 7687348
3232 7687348 7824732 8013996 8227123 8432228 8663535 8960321 9255200 9570719 9964691 10427702
3222 10427702 10913789 11413854 11772290 12061142 12004400 11672468 11314164 10672651 10208687 9853072
3212 9853072 9562803 9209796 9058970 9014175 8979601 9059389 9130904 9072547 9102449 9211680 9265618
3201 9265618 9414747 9517984 9764490 9791342 9741688 9921459 10127989 10106198 10031624 10016977
3191 10016977 9983264 9806360 9641088 9388042 9147691 8878949 8536265 8177720 7997483 7744053
3181 7744053 7478758 7346428 7266033 7102611 6902104 7014041 6954758 6896606 6902822 6797966
3171 6797966 6529317 6477307 6423671 6319878 6013553 5889741 5637647 5332527 5053919 4828462
3161 4828462 4646174 4473073 4290294 3990215 3838165 3738591 3667519 3513899 3359160 3251394
3151 3251394 3174228 3148465 3026798 2954918 2924414 2753878 2686804 2595818 2486470 2482036 2388946
3140 2388946 2348937 2383116 2348410 2228049 2142548 2064517 2024032 2050127 1956852 1922905 1903808
3129 1903808 1804062 1716862 1638771 1669503 1607789 1582069 1538288 1409928 1421751 1588066 1572741
3118 1572741 1490585 1411075 1299922 1367065 1412764 1342083 1173284 1228693 1241343 1209949 1230156
3107 1230156 1247497 1178925 1153084 1110778 993939 967341 928177 946311 983095 1050848 1061938
3096 1061938 1081980 1060071 1041047 938233 885821 858393 850315 807088 721330 766775 730740
3085 730740 718497 617501 661066 693685 652128 675491 730871 692445 671184 667250 611829 627668
3073 627668 663049 519695 562282 625622 586970 579173 571378 589838 555166 521575 502638 517439
3061 517439 491945 524168 510246 472999 565733 449165 377762 346259 424731 530483 491258
3050 491258 405163 390477 327314 458761 565841 434138 368011 376558 322751 418325 482477
3039 482477 450228 381235 364319 347537 285176 294638 246909 381317 383977 322197 328194 326188
3027 326188 316624 305367 340802 264745 177310 245055 224282 198429 179192 161125 229059 336254
3015 336254 360808 321957 312348 258290 164386 188872 192269 166023 261119 370727 370226 281878
3003 281878 127672 122605 131996 178814 100102 116234 111895 113749 126376 206275 241820 197834
2991 197834 185132 105715 152313 181897 153296 170462 172974 166719 76673 189036 273587 148981
2979 148981 114831 169941 89731 55139 146880 129579 108231 143422 136860 139751 181279 153513
2967 153513 123353 108408 144706 155257 171837 167158 69010 90644 197306 146750 215366 226785
2955 226785 235746 229042 144580 165228 105532 119492 97409 106188 172518 128774 184223 166790
2943 166790 254185 266168 190068 128436 170545 267720 231962 152709 154625 200214 260130 211443
2931 211443 211431 312147 292517 179204 151756 99893 93391 80875 121916 122007 152179 113231 165012
2918 165012 202704 160271 218670 152724 195135 129387 195492 123353 114139 64064 110238 109732
2906 109732 113212 135181 51759 8616 47117 108836 82182 151237 130828 192714 104593 71728
2894 71728 153014 90417 -23846 -44482 -29188 -24919 48752 82443 166464 163646 172952 159550
2882 159550 133131 166291 33870 82456 67296 16735 -1781 -11719 43987 70471 73688 67676
2870 67676 63992 105008 122836 71308 49149 -1124 -12781 17931 81531 -16722 -16477 60679
2858 60679 120707 124751 116056 106175 52647 95070 119395 78654 82484 144238 108430 16081 -27187
2845 -27187 -88846 -49148 96419 -57053 -8707 -38452 -106176 -18911 21170 -105 46531
2834 46531 -6519 -58023 -63231 -13224 -24301 -9076 -23022 -72661 -12324 21919 144527 77306
2822 77306 140510 119621 86213 99683 96733 133939 96228 58027 104490 135453 162281 104527
2810 104527 129031 98669 92019 12705 78376 70120 63399 74393 80609 67979 104979 50930
2798 50930 115203 121045 -16917 -19785 -80749 -81032 -98660 19510 -50270 -15374 -26422 -106484
2786 -106484 -147853 -111854 -46999 -79285 -98105 -66679 -84153 -2566 -17269 -58293 -4514 -2748
2774 -2748 14201 27699 -18755 -84868 -133058 -91121 16772 124055 -920 -75794 -13812
2763 -13812 -25616 -45924 -88446 -56837 -35294 -61134 -51107 -34453 -83037 15202 16742 -289
2751 -289 17614 -50887 -59564 -25360 4348 -58972 -15901 26256 -30534 -15710 55710 -35
2739 -35 -29622 -78562 -143151 -162877 -83803 15311 37703 48674 12703 -10295 -5530 71130 25507
2726 25507 -19769 74711 43188 -28853 -39911 15440 -80784 -96787 -22991 59071 36441 -7973
2714 -7973 -24887 -126407 -120763 -99665 -68048 -49638 -16390 -1218 44771 29158 107727 96075
2702 96075 76409 -50005 -90608 -64800 -811 -30779 -29823 -33746 -67173 -29085 82354 111090
2690 111090 -16027 -43897 15640 -10535 -54300 32906 67529 62622 41738 65119 30137 -84781
2678 -84781 -71026 41963 -55952 -181996 -156301 -63653 -71693 25687 -15621 -53521 -90502 -109802
2666 -109802 -31504 -15186 -87221 -139853 -113201 -8435 -17649 -48163 -56061 33337 62114 -75083
2654 -75083 -38401 -43150 -40706 23856 -42356 -11896 -56582 -44950 68348 101346 43141 -64228
2642 -64228 -142857 -49881 -49316 -28751 9623 -8178 69236 57775 6467 -79268 -79020 -21590 -4318
2629 -4318 -51891 -38812 -58807 -92403 -16973 10268 -7874 -31984 -58419 43356 116186 -27404
2617 -27404 -17255 26177 -45388 -33792 -74540 -49042 -40868 -35344 -21424 73970 125700 135685
2605 135685 93184 48624 77176 82297 -15473 49537 51134 115267 92838 70294 37768 70611
2593 70611 83098 122242 192135 161023 118831 54369 72175 68455 53185 104676 111421 86143
2581 86143 10875 66313 51398 69917 -6358 25703 172925 160799 170302 49108 24364 48340
2569 48340 73510 83170 35055 8334 -53418 86017 120914 -2976 -27626 50067 78579 69508
2557 69508 44802 26896 13135 -83228 -19255 3121 102076 19008 78880 74554 -6854 23942
2545 23942 86832 91439 176894 248495 222232 206173 151905 134639 190179 70303 73321 84779
2533 84779 16451 45241 118694 75981 116239 75692 150404 197474 258557 224285 232261 331991
2521 331991 328029 288472 226567 186216 213245 310957 323733 373543 395603 352798 355164 391035
2509 391035 319016 439076 389242 425070 441373 403368 353801 365127 365967 411814 499760 479401
2497 479401 468792 273556 411491 515217 526998 563835 590859 573072 597360 522651 562981
2486 562981 551100 554458 628639 661344 703779 689808 685574 712045 742792 654300 602397 681844
2474 681844 866697 804581 759459 835353 916136 1016423 1010219 1018018 1208674 1247954 1279052
2463 1279052 1255422 1295666 1278620 1337454 1333782 1348436 1354411 1498908 1503404 1660614 1693429 1710727
2451 1710727 1762455 1755741 1813628 1902929 1968203 1999794 2156035 2264639 2335900 2449392 2655921
2440 2655921 2837696 3081085 3297736 3500693 3589518 3720457 4081578 4474690 4745903 5337441
2430 5337441 6069909 7014969 8391549 10589609 13489844 17323452 21244758 23446299 22528990
2421 22528990 19189452 15525331 11976236 9439907 7738456 6497103 5610223 4839071
2413 4839071 4378555 3970572 3718806 3653244 3443918 3214178 3044109 2657998 2409336 2223024
2403 2223024 2090144 1950102 1763253 1574494 1531697 1604443 1494558 1430518 1343626 1312404
2393 1312404 1218406 1065494 1096413 1115131 980836 942825 856927 821428 865821 730504 647862
2382 647862 619094 626369 678625 589702 624142 568204 538534 511909 516204 542519 505843 559680
2370 559680 508505 462518 387908 405160 455691 357799 239317 259143 245800 177997 174089 260621
2358 260621 285767 271419 230447 309507 295878 253290 163054 184741 221157 205595 168781 101743
2346 101743 108029 260511 282464 284216 305246 243893 158251 116516 76293 91888 226076 255103
2334 255103 222256 234376 220396 148550 168917 92437 171578 139025 93201 116449 155451 58807
2322 58807 88417 137127 101663 95982 124423 66799 109358 93223 9851 5599 27432 35791
2310 35791 126445 201643 68583 55975 57463 112639 135091 205837 102763 73901 43544 9023
2298 9023 -11069 -55103 23221 -40620 -4637 12674 32208 -56185 -138267 -74864 -16691 11446
2286 11446 -43169 12833 76766 74011 64328 33114 -67010 -97474 -44238 45552 23443 -91038
2274 -91038 -44941 -23857 -80810 -2736 9855 78456 55649 -41354 -945 -31232 -200 24756
2262 24756 -38432 58116 5948 -139221 -72664 -83907 -86465 -111280 -199698 -144856 51722 57956
2250 57956 92816 79161 26866 -23764 -39690 2842 -29514 38505 -13894 38915 4094 -14868
2238 -14868 -34004 7604 3950 6503 -9311 -53147 -28962 40516 -22987 -29951 -158719 -137215
2226 -137215 -95349 7956 29050 6902 -67448 -177349 -92745 -6155 -27256 -33196 -71291
2215 -71291 -158262 -56236 -41515 -78380 -126420 -49949 855 105545 25785 7416 -68907
2204 -68907 -24591 -3952 19652 -33034 -178894 -252975 -72922 -136847 -123170 -112179 -82719
2193 -82719 -14243 -5079 -42300 -66514 -40091 64795 -831 -11267 -59273 -51606 76405 57867
2181 57867 17651 32580 73272 175317 92166 -24622 35851 -32764 -28950 40402 127636 21162
2169 21162 -12479 -107283 -53470 15916 63957 99932 115682 37774 -16805 83843 113473 11322
2157 11322 76924 184499 141027 51712 42730 59901 34338 -66741 -31736 25328 30269 -2101
2145 -2101 25596 20426 10945 13471 -54725 -76512 -64892 -41877 -78057 15131 46063 5603 149386
2132 149386 57959 -66633 77027 62258 103767 62901 33347 -14666 -145694 -64670 -59858
2121 -59858 -59152 -100886 -112308 -66516 -90132 -14033 -28671 -92309 -60148 13572 20950 -37080
2109 -37080 11949 47563 -12864 10221 31287 -39070 -17450 -35688 -5356 -1936 -106157 -175193
2097 -175193 -185585 -201918 -103166 -50370 7241 -16183 -63787 -100003 -120879 -130815 -108821 53393
2085 53393 -3148 -64485 -60684 -23936 35796 46973 -23116 -145781 -54095 -41361 -150795 -39253
2073 -39253 -32056 -63007 -48632 -22002 -2809 -24483 -140577 -143392 -70757 -62749 -139493 -114591
2061 -114591 -64152 -109004 -46384 30404 -80761 -211983 -239078 -212086 -112181 -82603 -26556
2050 -26556 -63301 -97217 -59918 53907 32371 -138048 -176748 5613 -10666 -70024 -58547
2039 -58547 13278 20794 -71159 -29726 42953 -89041 -91247 -56793 -30812 -46923 -154384 -105507
2027 -105507 -59032 66546 10782 10692 -12070 -11855 -42626 2363 19035 36495 100560 66416
2015 66416 72944 -16638 -96323 24756 59910 16410 53702 -41600 -106590 -39599 -18891 -99547
2003 -99547 -98956 -50607 14126 48842 -15154 -38957 41274 -9786 -36317 -17757 -62974 -86561
1991 -86561 -39857 6591 50207 -35075 -130241 -41078 -84344 -63236 4811 8571 15008 37290
1979 37290 -11002 -84265 -100631 -52773 -69653 -152456 -101547 -23322 -25471 -29603 -40634 -62849
1967 -62849 -1984 14466 -96292 -79377 8323 -3930 -31741 71368 74183 51889 -59678
1956 -59678 -109118 -44981 6728 -12468 3245 -61774 -54580 -39432 -100653 -75598 -86921 -76742
1944 -76742 -107598 -116608 -60085 -31208 -43576 -56331 -12579 158195 10707 -64867 -45362 -42074
1932 -42074 -122615 -101035 -37096 -19608 9844 -30946 -42596 -71470 -110663 -95186 -53971 -65876
1920 -65876 -19270 59546 -19725 -136087 -102526 -145053 -141778 -135229 -70677 -118112 -137742 -5427
1908 -5427 42124 27631 -43350 -68534 -39991 -41647 17474 34031 -42951 -127929 -120000 -164161
1896 -164161 -69028 109254 12054 -58975 -93897 -32976 -52599 -140258 -49643 -50330 -123087 -102754
1884 -102754 -115252 -86850 -22354 -13334 43369 -32482 -20657 7436 -32764 -27095 -7142 -93841
1872 -93841 -3523 61594 49183 26100 60091 52108 1352 -53918 -56606 -28217 -92012 -49079
1860 -49079 -163608 -147939 -89662 -22637 -37587 74981 -255 -117487 -59249 -21563 -45891
1849 -45891 21420 36264 -38622 -39745 -57939 39164 -8650 -98153 9805 -96118 -139265 -208155
1837 -208155 -205456 -106074 -78809 -90191 -37395 -114212 -72627 28148 33901 54520 -90952 -126178
1825 -126178 -52203 -19759 20125 -64143 -27402 -23490 -22259 -69170 -23132 -23064 -35281 19379 69922
1812 69922 8157 -110977 89469 88407 -42228 -67944 -78451 -92604 -48161 -31279 -110727
1801 -110727 -55042 -74132 -81357 -11904 44070 -53957 -112888 11669 -32600 23070 14302 -21790
1789 -21790 -24064 107798 19568 -67678 -60507 -8282 -47666 -292 -75548 -14182 103787 116847
1777 116847 125225 118039 55341 103731 -28896 -49918 -56104 -35499 79360 45827 34242 11638
1765 11638 -3245 -40944 10948 43665 119510 171132 94920 22132 11819 10490 -57820 -76894
1753 -76894 -38757 -7483 -21255 -8007 -51744 -56930 8627 -50011 37767 11850 -30131 63717
1741 63717 6310 -104947 -95254 -71435 19697 42844 -95870 -96482 35437 -10893 70451 36272
1729 36272 -82033 -135755 -75749 35155 -22439 -10110 -25851 -83829 -41672 99025 11159
1718 11159 -97984 -191481 -78069 -6768 -134994 -74873 -4165 79840 12405 -27357 34208
1707 34208 -23135 23763 45715 -56682 44621 86478 59680 2640 -55929 11303 -20377
1696 -20377 5058 -99894 -47379 -22625 -61174 26331 57885 93432 -31503 -50322 -78410
1685 -78410 -50156 -1342 51933 92492 28445 -2087 741 46637 -70248 -93448 23362 -74296
1673 -74296 -163767 -194585 13925 11471 5080 -14376 -50815 -81354 -72860 -34653 -101710 -66805
1661 -66805 -48063 -42444 -33799 -18945 -25729 -47778 -39470 -10092 -35654 -52645 7830 -70902 19483
1648 19483 -34516 -47870 -37859 -26764 -95660 -112022 -3417 -15720 4866 45733 15663 -76194
1636 -76194 -65271 10608 -41847 -33407 41233 57816 44111 -7625 26966 -80438 -99517 -115688
1624 -115688 -124991 -44183 -15751 105546 127972 54028 65715 33102 51634 52511 78654 86124
1612 86124 79473 -53130 -47747 -15999 26305 -26340 -17916 -22183 33606 115827 26291 46387
1600 46387 -6337 33333 7811 -89135 -40250 -98829 -3946 -7184 -10849 18141 8003 14702
1588 14702 -109017 -34313 -56701 -159046 -132671 9534 -30932 -57810 15296 57305 13974
1577 13974 -180234 -108068 51062 57867 -6601 -94813 -53948 41899 51965 16572 -40089 -3405
1565 -3405 99562 41465 -58939 120492 24393 -52493 13615 21507 -28566 -45197 -44589 -63649
1553 -63649 -79630 -67594 -58422 10492 14410 44697 71663 -9937 -126240 -177637 -87499 -82000
1541 -82000 -17489 -49855 -200177 -127346 -50461 -37253 -172325 -121510 -42309 -7858 -47060
1530 -47060 -80817 -59280 52782 93259 75763 31958 -8122 32131 -67775 -58762 -11576 481
1518 481 37198 -68171 -160507 -35140 -9120 -28115 -63879 26637 14330 4419 -67451 5362
1506 5362 -55122 -30665 -37233 -16726 45513 60724 -78144 -97180 17050 -31800 -46891 38378
1494 38378 -25785 -19719 -90838 -86136 -58046 -26507 -41265 -17647 45432 10193 -34174 -24255
1482 -24255 -41115 58813 90428 112274 22391 -176318 -63150 102305 99134 22048 68832
1471 68832 71995 53025 -4534 -22271 -197823 -113904 -3617 1120 9662 26198 1226 25646
1459 25646 -14277 -32379 21972 139514 203951 136889 51038 76231 47883 -114706 -44223
1448 -44223 23749 26699 3200 -49426 -74260 -28339 31406 -103598 -129035 -17132 56743 -47785
1436 -47785 1377 -104808 -145165 -93426 -18833 -1671 -39146 -41696 -44760 -24973 -89730 -90911
1424 -90911 -51162 -152573 -172133 -55842 -11922 87678 -52360 -104882 -123433 -1627 4130
1413 4130 -75834 13494 98223 178645 93793 49997 115221 28092 -31601 -91983 -50266 -31834
1401 -31834 -17387 38136 94554 -11753 -48570 24402 -10479 -90507 -149235 -152020 -102450 1979
1389 1979 -72636 -74195 14861 90989 -48928 -122790 -72675 80003 43060 -42096 -67487 -11367
1377 -11367 68503 41765 -4235 1505 49702 72449 61964 6774 -37757 -94965 -190353 -83222
1365 -83222 -50662 -80766 -92285 -18791 50683 79538 124677 10793 -102070 -97469 -48906 9775
1353 9775 -30875 -46400 71094 53765 -4946 -64572 -62105 -84085 -138445 -46152 -4889 -39124
1341 -39124 22939 39608 57150 -66657 -2028 -41581 -65380 33305 -3538 4633 -62105 -87617
1329 -87617 -73984 -57825 -29513 -44245 -13640 -18366 -50070 -39368 -13510 -141368 -155020 -6627
1317 -6627 30352 4848 1857 62764 46931 2664 -37691 29861 45437 49757 -48888 -79408
1305 -79408 50424 -89315 -93272 -106442 -44303 24713 -134484 -95724 -39531 -124345 -30896
1294 -30896 -54930 -107990 31439 11649 13402 -16402 16186 16560 148112 108393 48364 37764
1282 37764 -58697 -7682 -94579 -20706 -34050 -36192 -39936 -52829 -37757 51007 58760 57664 5683
1269 5683 131540 69242 -75567 -53479 69091 128011 42718 36801 -42678 -66723 14740 27664
1257 27664 35596 -31139 24062 -15869 33800 12660 -50635 -18254 -47451 28026 -8836 -46430
1245 -46430 -72933 11472 -14325 47123 124568 86545 94381 72339 -34053 -15605 -82476 -52558
1233 -52558 -133473 -86781 -7600 -38901 -83055 -34742 -39372 -10775 85135 74508 -37716 24150
1221 24150 3934 29401 71292 115103 72397 43250 -61701 -46280 9543 -49333 1651 -49358
1209 -49358 -56679 -57178 -75198 -8469 46934 7037 120894 68563 -51677 -57277 -26736 -55447
1197 -55447 44214 22906 -88077 -100327 -94147 -70386 -40595 -15881 96461 29032 6255 41239
1185 41239 -57347 -30371 -4385 -9075 37569 5475 283 -6146 39502 30116 -5806 -771 -58562
1172 -58562 9080 72213 -33954 -20432 -1552 -50832 19397 21798 38511 30452 89842 23713
1160 23713 35630 101103 7978 -18288 56550 48116 -86922 -153994 -94240 -27601 100519 31936
1148 31936 67846 56124 -21159 -3035 45974 20994 -5168 -13135 -97133 -28548 44638 57051
1136 57051 -23346 3733 68462 17106 -33502 -39913 -51966 -46295 -21385 74005 31776 18978
1124 18978 -108 -36648 -54294 50680 4910 53402 66008 75919 78243 -8288 -32357 -47814
1112 -47814 -56730 -29395 -14368 -45497 -72122 -142369 -159292 -757 -17944 -31102 20487 140769
1100 140769 156475 146641 84758 144685 186078 80273 34951 56245 63468 49101 26268 -6083
1088 -6083 11065 -25179 -24569 -34506 -30791 40166 141059 106109 38439 -93593 39742 86772
1076 86772 117447 67607 41518 82528 72227 3436 -12459 -39077 -28741 -4588 133869 71900
1064 71900 12246 97847 51540 24455 -34632 -5273 71773 34215 4955 -25862 11970 -3934
1052 -3934 -46213 39623 -17662 34606 62039 14706 -103921 -39099 22367 38214 59346 -7049
1040 -7049 -72834 14597 39328 995 30739 -19325 8038 -11210 -2700 145621 137315 114861
1028 114861 -4734 -70257 54907 25661 -7619 -5114 -30659 41345 -3147 -70156 -37918
1017 -37918 28950 9373 -73430 67858 39358 -4792 27949 72906 29610 -4742 -35769 -45564
1005 -45564 3411 44854 127090 141797 -1303 -62871 40556 41419 -6316 -17261 51637 52242
993 52242 -16074 10596 -64402 11050 -87442 -140234 -110980 -57896 -71928 -74381 -13596 -15016
981 -15016 -7691 -44297 -64888 -61427 -43276 47355 90730 43237 -46501 -139534 -53267 -110421
969 -110421 -37971 14529 57185 105070 67388 90250 2920 -6142 28650 -83493 -112668 -51126
957 -51126 -57405 -48184 -27165 -21302 17912 -99705 -157652 -100906 -100381 -51996 46470 44422 -69373
944 -69373 -113478 -88535 33282 21684 -48008 5015 91052 137216 109441 112289 78349 17960
932 17960 19649 12472 45018 104566 81152 59228 -30776 12161 -18046 -97601 -15445 88358
920 88358 5537 -51572 8502 9819 -10809 36914 18069 29078 34474 -9475 -30406 65746
908 65746 68178 26182 -2152 76245 29752 77323 92526 16371 45395 13927 -22164 49662
896 49662 -55266 -10352 59988 45945 14969 -13481 7384 -126292 -63067 -53483 -25928 69539
884 69539 41758 52532 40885 -16338 -29211 -77054 -41912 -108963 -90031 -148768 -95216 -57227
872 -57227 -49992 -191177 -187938 -153527 -59776 -114476 -108641 30167 -14253 7588 -16256 -72191
860 -72191 62088 27596 3570 43115 -21803 49842 64461 39753 59204 92256 74608 69227
848 69227 88997 69449 -4909 6893 3105 56954 2522 77591 3044 -83105 -69006 57958
836 57958 112078 135784 58479 -35651 -38183 16619 -182 -9058 12715 -30480 84068 50045
824 50045 35296 47211 62282 6726 -34818 6517 83876 71804 -14701 -19660 -67601 5305
812 5305 58229 -81387 -42017 -13472 79414 30557 7079 -30262 -102037 -60638 -65314 -10171
800 -10171 67117 -53451 -109597 -835 -45891 -85787 -59289 -116930 -104765 -86377 -91545 -77027
788 -77027 -37420 15582 60264 56430 13060 50162 19856 -12917 -30705 29723 13876 -6964
776 -6964 -38496 -36128 -2216 -46778 -101215 -47780 -64983 -88589 -12523 33964 -3374 -53999
764 -53999 -27793 -88607 43898 113328 68468 27025 30383 26816 8663 -42227 -23031 -73143
752 -73143 -76290 -41029 -51184 1921 52538 17542 47693 79722 34859 68440 23522 355
740 355 11056 -41509 -7474 128816 57515 -11270 7692 94611 50687 -101315 -75183 -18360
728 -18360 -30623 -24521 -11044 -69364 62783 146634 17994 -13621 -28486 -20321 18874 16312
716 16312 75642 115188 150566 167010 115661 68722 20894 146711 55346 47922 59466 -42606
704 -42606 -121700 -77851 -6829 108106 30094 24955 -14029 7494 1209 -4219 12530 -20499
692 -20499 11106 68349 70998 57109 79720 117374 108074 52459 -24891 -57546 -61503 -70180 2354
679 2354 27268 38609 79360 129628 66358 -62898 -80885 -9543 -61381 -36758 -119157 -190765
667 -190765 -92013 -108513 -24965 -3510 -71963 96811 46661 -69228 -66492 -45163 -50732 42702
655 42702 -47637 -44544 -54815 -36213 -22110 86181 87827 91778 14892 -18627 -2829 -59616
643 -59616 -90208 4022 27544 11473 4708 23140 -14959 -104135 31529 -47663 -20248 -46549
631 -46549 -107712 -13527 15790 604 5650 -76348 -58817 22836 -10914 34196 -3188 -13553
619 -13553 31118 -49377 -39906 -22844 -15112 -63898 -28987 10972 17725 10336 73019 90694 36951
606 36951 -8153 -39972 -5529 -48688 37981 16899 13427 -3513 -53657 38975 155350 87239
594 87239 -23725 54036 120854 167047 70302 42993 26984 51433 57683 -16702 -50735 -115049
582 -115049 -65420 -24748 -41935 10006 103519 88124 47026 102873 62862 32247 42993 69265
570 69265 125877 62140 35304 18732 20630 124368 61811 40112 21887 -20650 -12669 7950
558 7950 94841 -44598 -114835 89804 -39779 -118902 26887 3574 -90063 -121010 -135311
547 -135311 -44496 34502 39747 44185 76708 54172 62664 159761 126494 44306 8624 -37731
535 -37731 -38251 3290 62949 12695 -28835 59006 131905 165542 206003 155490 123931 -87214
523 -87214 -151490 -23977 28341 22507 58705 -17147 -138094 -103548 9964 85717 66002 -88889
511 -88889 -99958 -7092 28873 -37039 13323 67502 10628 55760 -35495 -41485 34128 44675
499 44675 -46513 -15026 -29985 -5628 28887 80900 41257 -7591 32362 126525 70163 104669
487 104669 43216 -27255 75362 -6935 -31535 56145 15020 94007 125678 139622 88521 42224
475 42224 49246 4619 -26090 -11313 -110094 -16643 85386 -41198 16256 61177 -69267 -10385
463 -10385 -49293 -69168 -913 -31991 22188 9225 -69215 -64919 70604 58024 59314 43288
451 43288 -8939 33436 1867 -38726 -35960 26159 81438 -7540 -137775 -119448 -24079 11237
439 11237 28774 96345 26596 -48083 89202 38814 -30168 -52008 -25162 38771 35387 56280
427 56280 21805 -27235 -10989 24947 78178 -52863 -6650 9289 -65593 14807 -67588 -122411
415 -122411 22914 102274 94872 74955 84491 75672 -39792 -28368 56058 102941 29514 20493
403 20493 -31703 26492 76827 39503 70971 67814 -16170 -121766 -14932 46076 108159 79886
391 79886 122511 145040 12177 -67809 -87942 -25762 14192 -12182 -8332 -145542 -56559 -50549
379 -50549 -131655 -26494 6950 29526 74419 -32812 -11950 45903 14287 -42295 -12892 65845
367 65845 107403 50688 44124 15732 63781 27495 29941 -60474 9239 55020 8780 21687
355 21687 46168 124482 100165 17408 -9286 -49515 -52275 -42996 -55599 8491 53729 45000 -5097
342 -5097 90704 102804 164245 95987 26091 -44695 27901 28333 -8345 -7539 106040 80272 83309
329 83309 137266 91724 63856 88938 133260 67870 -3376 70742 12309 53819 17948 3841
317 3841 -2075 43091 87146 71669 50035 3920 13808 -54964 -38889 48230 109929 1909
305 1909 -34742 98858 12916 -35234 32398 100723 153644 -5461 -40227 -13376 -52187 -12619
293 -12619 -3875 -40720 -19076 -1099 -17888 -77450 -15489 81250 173147 7778 -40695 -68863
281 -68863 -60139 67978 -15686 -61101 -68165 -82632 -71235 -27257 76121 154195 163797 131242
269 131242 72679 75249 25580 19694 22014 56449 -9476 -19016 -46640 -66751 -43948 21601 -12884
256 -12884 51197 105251 44820 16649 63931 44922 96972 70807 74790 57426 131830 124923
244 124923 74088 18476 -15296 48571 21100 -29323 -334 -47045 -20563 46959 97573 78106
232 78106 9363 13454 -59597 -58130 33035 102096 -18454 -73558 58313 109862 -14966 90816
220 90816 84301 63767 38303 47144 -25926 -54858 -193845 -202926 -157974 -68787 -55654 -34194
208 -34194 -94245 -39368 60012 141640 60005 19897 43962 14259 -50054 50221 70310 16126
196 16126 41871 100419 81977 92064 88278 81978 78957 58177 91852 69085 54380 51717 -9893
183 -9893 41709 23675 -70693 1661 -39568 -62949 -58434 41864 179737 86862 82667 89452
171 89452 124005 115301 -5754 -6819 27992 40619 -15506 25383 55710 22831 -50705 108772
159 108772 214783 169878 37801 21354 -42584 -53008 -32673 91226 141486 50954 -4871
148 -4871 32491 26189 42981 67079 56852 83423 55985 62485 77316 79561 10632 23551 44022
135 44022 44070 66009 50872 117213 113163 45866 42910 -1498 60200 82156 12081 17674 81985
122 81985 40557 -61524 -6498 144552 207726 140330 73763 39247 6720 -32708 -52668 -53129
110 -53129 -20348 46303 79686 65738 64323 -10747 -13106 -83887 -43694 -14057 26163 9480
98 9480 -3710 49482 135000 79961 115785 113266 110677 50677 32545 61196 -76826 -67443 54265
85 54265 24205 43767 24142 -30295 17438 21095 -20400 13072 6583 -61544 25335 63822 86479
72 86479 85138 51414 85341 70110 35335 11925 93015 83539 69805 111407 74569 95189 60783
59 60783 60486 35045 98635 42319 28147 95381 69708 45241 46455 3494 -22438 -43706 -66510
46 -66510 -79989 50079 5698 10665 80759 136852 95889 45607 9499 -10875 -5 8390
34 8390 50148 3727 13499 84549 91263 41898 3690 29815 97093 93672 833 -63174 -16505
21 -16505 3820 28377 15668 14510 37341 11417 -6179 -8255 35267 53794 71297 30902 50986
8 50986 71909 86674 77736 65725 133274 50041 82852 130791
0 130791
$$ Imaginary data points
##PAGE= N=2
##DATA TABLE= (X++(I..I)), XYDATA
16383 -1046598 -1001222 -966033 -874667 -869026 -899827 -849991 -816323 -789745 -748991 -659971 -568293
16372 -568293 -591652 -524667 -476830 -423387 -394268 -350596 -308049 -315830 -338741 -345635 -301771 -245859
16360 -245859 -233250 -204510 -191286 -245890 -153274 -88016 -278 56835 22944 90667 106176
16349 106176 103210 142116 189224 193328 220725 274380 309931 328513 298347 314612 411819 402209
16337 402209 452220 498462 488225 476101 529876 663030 687915 687385 687941 801400 794998 781815
16325 781815 782996 785642 851539 850864 956740 1005518 994445 991741 1077353 1102405 1110552 1104554 1125759
16312 1125759 1227851 1272166 1216404 1246506 1314196 1374394 1359889 1402632 1401610 1415781 1439090
16301 1439090 1491826 1468369 1571280 1584736 1612045 1692807 1706497 1717851 1705504 1784733 1802838
16290 1802838 1839067 1812488 1935333 1869931 1862244 1928368 1989373 1989628 1995417 2067103 2053517 2092506
16278 2092506 2143337 2211003 2153687 2192090 2252938 2265388 2264813 2217150 2274435 2316535 2329538 2389394
16266 2389394 2306633 2341478 2357131 2367353 2421196 2452908 2434387 2504011 2496968 2531925 2638031
16255 2638031 2579579 2635203 2644252 2596121 2647262 2694616 2724162 2643870 2690478 2781415 2778504 2791964
16243 2791964 2776908 2758554 2735652 2811847 2773537 2835421 2921527 2988355 2930161 2875486 2877949
16232 2877949 2985939 3011558 3070768 3024940 3033772 3109969 3049024 3059908 3157695 3176166 3141665
16221 3141665 3102225 3123114 3235266 3251380 3274485 3238528 3236047 3280640 3289186 3292808 3329149 3427712
16209 3427712 3406269 3408902 3396154 3350813 3251027 3280174 3328634 3377640 3354728 3358763 3397308 3393600
16197 3393600 3426603 3506870 3526808 3528991 3481776 3532775 3460841 3405760 3531530 3562476 3597312
16186 3597312 3616664 3552194 3586322 3668515 3690826 3712675 3637477 3635503 3679450 3679725 3706655 3721244
16174 3721244 3736401 3760321 3758186 3776562 3722666 3681440 3843887 3867741 3745407 3753259 3763873
16163 3763873 3805422 3834384 3892866 3970682 3999757 3936383 3833048 3780952 3804057 3768789 3865116
16152 3865116 3886351 3845522 3896460 3904575 3846295 3848309 3850765 3879870 3860649 3912163 3867384 3866939
16140 3866939 3902230 3935480 3967321 4124919 4100976 4008563 4033918 4103393 4120290 4013078 3984729
16129 3984729 3967500 3975247 4003676 3996448 3989869 3889806 3851627 3946939 4032650 4070504 4040399 4065973
16117 4065973 4113698 4048979 3960488 4021077 4044760 4059281 4112724 4119124 3996212 3988664 4073057
16106 4073057 4062225 4082285 3997939 4084413 4093392 4086579 4094919 4002672 4071585 4119282 4189775 4227588
16094 4227588 4178500 4185329 4086638 4079592 4062704 4006786 4062127 4149500 4222162 4139192 4125140 4143985
16082 4143985 4164032 4118571 4199795 4191443 4237371 4265346 4223712 4216872 4249303 4255147 4226909 4160459
16070 4160459 4122204 4168956 4204433 4260269 4254594 4197424 4228073 4286610 4235229 4152280 4217218
16059 4217218 4229077 4205809 4254012 4140658 4149203 4086699 4173362 4221051 4207345 4218053 4165803
16048 4165803 4158472 4021625 4094052 4158848 4093304 4046898 4156751 4209327 4224317 4186012 4120521
16037 4120521 4161142 4333795 4316775 4239165 4226704 4242241 4248853 4185685 4186359 4187251 4250997 4216662
16025 4216662 4110840 4086905 4215933 4287939 4257676 4200143 4254329 4315153 4258319 4086235 4109640
16014 4109640 4181789 4256446 4237992 4171678 4241489 4165554 4162178 4199507 4240527 4283510 4254729
16003 4254729 4181456 4187897 4202271 4217572 4243215 4248150 4240654 4246443 4259569 4327348 4315436 4351881
15991 4351881 4276416 4278694 4141367 4108138 4259346 4288595 4310009 4269599 4208624 4235383 4204929
15980 4204929 4224480 4270539 4288008 4288523 4385636 4386813 4323543 4274604 4248966 4278307 4312140 4381189
15968 4381189 4271309 4272753 4267098 4200054 4170582 4302658 4298642 4240155 4162487 4194373 4212808
15957 4212808 4224278 4191451 4267138 4305095 4352162 4309111 4266004 4272955 4199867 4267195 4367983
15946 4367983 4286054 4278385 4224699 4276937 4297113 4247168 4316471 4229778 4102064 4286219 4342292
15935 4342292 4306516 4377729 4295656 4186449 4225189 4211737 4281682 4374455 4381641 4322080 4233545
15924 4233545 4304931 4342812 4207905 4153740 4258181 4277500 4340382 4257201 4251060 4274790 4363182
15913 4363182 4394116 4227816 4208950 4188433 4298836 4359802 4247397 4302428 4379234 4338092 4352194
15902 4352194 4377381 4316841 4312100 4158839 4237642 4295215 4285274 4194722 4185171 4199458 4135086 4161929
15890 4161929 4302181 4317315 4299479 4284865 4235973 4229472 4305431 4243250 4313231 4245101 4248453
15879 4248453 4337102 4301410 4248568 4245674 4274303 4224867 4327096 4319656 4261222 4375350 4358740
15868 4358740 4340063 4282678 4279174 4309812 4270857 4238876 4150713 4251875 4304685 4307484 4409673
15857 4409673 4366291 4242545 4301816 4344950 4301570 4251889 4241308 4155331 4232832 4218288 4114962
15846 4114962 4190611 4331768 4311899 4309575 4292081 4294825 4329711 4375736 4327077 4407450 4370514
15835 4370514 4328991 4297504 4298431 4365038 4310043 4292106 4340691 4210371 4220533 4238104 4275537
15824 4275537 4268675 4283881 4361369 4310586 4310313 4262951 4275351 4324035 4319376 4357722 4391904 4406663
15812 4406663 4391759 4313666 4378265 4376899 4393931 4464494 4404683 4384176 4433894 4278271 4338833
15801 4338833 4402167 4352294 4331902 4315187 4334446 4227562 4215849 4288999 4324816 4326001 4313116
15790 4313116 4379353 4317372 4314190 4345507 4347297 4356213 4342190 4309886 4342480 4350007 4472770 4531894
15778 4531894 4446258 4350735 4292498 4272682 4279462 4381686 4389225 4356236 4244829 4364550 4423213
15767 4423213 4412081 4358218 4340961 4483147 4491679 4455605 4442347 4444340 4370000 4299776 4276649
15756 4276649 4342629 4238151 4180307 4294407 4300961 4256635 4337461 4351039 4408062 4400271 4349611
15745 4349611 4381155 4317371 4485830 4547191 4453997 4336458 4412726 4467150 4449128 4383512 4374218
15734 4374218 4413016 4261482 4283404 4343160 4460549 4515831 4503983 4459182 4345799 4313331 4314513
15723 4314513 4387725 4437499 4335194 4425879 4392499 4386418 4417147 4374399 4375002 4300731 4358064 4391292
15711 4391292 4402646 4364621 4433770 4431320 4342586 4373111 4389701 4371265 4308769 4357404 4305879
15700 4305879 4316013 4362589 4345212 4434665 4369653 4389141 4293035 4360080 4426300 4397642 4352692
15689 4352692 4427251 4467223 4454859 4401331 4418831 4418033 4378902 4389811 4298250 4390913 4358347 4377546
15677 4377546 4397054 4401591 4470947 4484035 4456401 4456272 4529665 4467475 4431068 4491679 4470988 4464405
15665 4464405 4473223 4500149 4453604 4423150 4355266 4370463 4389068 4465958 4512836 4547099 4470305
15654 4470305 4514103 4495026 4371441 4434606 4516940 4510344 4464350 4386942 4392501 4463864 4419864
15643 4419864 4397214 4414082 4478362 4553424 4439978 4425109 4514481 4454668 4388581 4401327 4440787
15632 4440787 4401255 4464159 4481156 4446706 4428339 4429766 4405687 4393106 4350901 4354619 4334589 4395012
15620 4395012 4524727 4526634 4476344 4501260 4515398 4517985 4454372 4402063 4566946 4567682 4522241 4487821
15608 4487821 4457793 4483632 4388777 4438463 4577229 4559909 4420620 4439469 4531990 4381433 4405460
15597 4405460 4404962 4493187 4495982 4496284 4411371 4434081 4464838 4458627 4498124 4479883 4478092 4472953 4457479
15584 4457479 4409394 4469862 4513772 4460853 4475790 4440877 4441145 4457271 4374722 4461674 4447709 4484052
15572 4484052 4370670 4326631 4419537 4503607 4447901 4419513 4367827 4433328 4407721 4418880 4488748
15561 4488748 4501203 4383457 4310007 4330038 4407023 4359683 4399658 4452125 4538453 4540517 4543231
15550 4543231 4484277 4417362 4474980 4505551 4470224 4406948 4337406 4425730 4467096 4455699 4474341
15539 4474341 4511355 4504063 4544122 4494576 4463704 4612964 4609686 4563767 4419035 4446572 4490321
15528 4490321 4522985 4573604 4512842 4383848 4358127 4464854 4469011 4374604 4542748 4571675 4527060
15517 4527060 4489749 4539868 4603424 4554736 4550447 4553801 4407796 4516117 4468685 4482682 4461105
15506 4461105 4578691 4617122 4559653 4552996 4590733 4635337 4495705 4445299 4489456 4598313 4590291
15495 4590291 4510875 4471983 4512678 4559087 4643481 4597798 4636979 4594288 4674636 4676796 4621690
15484 4621690 4525116 4450330 4554705 4482937 4469229 4392638 4383200 4436634 4416387 4447312 4499247
15473 4499247 4444155 4432051 4447257 4470958 4471714 4508002 4558209 4481566 4433525 4474308 4550653 4581292
15461 4581292 4480848 4519737 4629884 4552431 4639799 4639909 4514940 4522455 4529948 4460484 4462854 4499463
15449 4499463 4544363 4574691 4535692 4588635 4606797 4625391 4543395 4542788 4549234 4540364 4485498 4600055
15437 4600055 4602260 4570665 4534645 4505169 4567516 4494157 4469950 4512961 4547217 4435942 4379665
15426 4379665 4500801 4510534 4484540 4545574 4619286 4595470 4536479 4545230 4586405 4556003 4584601
15415 4584601 4677355 4698295 4644488 4579031 4525073 4532600 4566128 4523741 4608995 4619224 4659542
15404 4659542 4618290 4629064 4592370 4494674 4412026 4441322 4485626 4582517 4610081 4570465 4557664
15393 4557664 4573947 4543139 4486216 4569398 4638656 4657075 4611125 4618911 4564393 4563476 4549528 4529075
15381 4529075 4556452 4648273 4704352 4609179 4618042 4549993 4590395 4485099 4573913 4584946 4582588
15370 4582588 4572967 4545111 4488555 4513486 4582401 4546171 4605765 4554833 4534384 4659899 4699410
15359 4699410 4641566 4523986 4412814 4597104 4704754 4597002 4573288 4546622 4599158 4680497
15349 4680497 4691191 4638206 4707881 4665441 4594074 4597387 4506795 4517900 4498992 4578391 4492489
15338 4492489 4539778 4497234 4596948 4563870 4536367 4622857 4620573 4564177 4653022 4625385 4535039
15327 4535039 4580299 4598954 4666072 4686787 4716646 4710301 4613470 4469571 4520068 4563526 4614952
15316 4614952 4593784 4620863 4643741 4648676 4494323 4539019 4624080 4691999 4543196 4597452 4619684
15305 4619684 4571441 4596792 4524216 4591031 4670295 4718786 4677400 4671082 4554129 4549907 4718534
15294 4718534 4726002 4534760 4508270 4560186 4607914 4548215 4595795 4634515 4649598 4685362 4717141
15283 4717141 4638150 4644089 4572005 4458313 4555076 4613429 4548542 4535012 4568693 4594385 4584807
15272 4584807 4634791 4611225 4631778 4581165 4542722 4611735 4579955 4572389 4625717 4727149 4784420
15261 4784420 4779065 4692002 4618293 4701572 4766801 4736231 4673315 4712118 4747075 4674920 4698785
15250 4698785 4731076 4776813 4750093 4744718 4672327 4625679 4655197 4640331 4577213 4530910 4697890
15239 4697890 4738317 4617074 4632584 4702666 4695581 4663611 4622474 4604617 4626356 4648604 4666492
15228 4666492 4609232 4509104 4750978 4812708 4782399 4762612 4716111 4657110 4607318 4661299 4632591
15217 4632591 4648912 4716056 4687978 4673147 4637794 4564641 4548760 4627785 4694932 4728623 4749651
15206 4749651 4611552 4584453 4657413 4634260 4632114 4594730 4504135 4571342 4642884 4657128 4702453
15195 4702453 4673771 4635912 4701163 4718060 4756681 4690162 4579573 4556958 4647523 4644505 4594893
15184 4594893 4641988 4711969 4690056 4598487 4690062 4770674 4748326 4732443 4650251 4596880 4688749
15173 4688749 4705882 4732918 4741848 4752760 4774910 4685902 4589939 4568871 4624874 4685023 4751995
15162 4751995 4612474 4619834 4732201 4684638 4615143 4794050 4812099 4701885 4703669 4689299 4704432
$$ [...]
##END NTUPLES=NMR SPECTRUM
##END=
