##TITLE=1H_EC-3306-Hex-x
 CDCl3
 8 sc, 
 22.12.2023
##JCAMPDX= 6.0         $$ Bruker NMR JCAMP-DX V2.0
##DATA TYPE= NMR SPECTRUM
##DATA CLASS= NTUPLES
##ORIGIN= UXNMR, Bruker Analytische Messtechnik GmbH
##OWNER= root
$$ XWIN-NMR		Version 3.5
$$ Fri Dec 22 14:04:50 2023 Russian Standard Time (UT+4h)  she@DPX200
##.OBSERVE FREQUENCY= 200.1313
##.OBSERVE NUCLEUS= ^1H
##.ACQUISITION MODE= SIMULTANEOUS
##.ACQUISITION SCHEME= undefined
##.AVERAGES= 8
##.DIGITISER RES= 18
##SPECTROMETER/DATA SYSTEM= spect
##.PULSE SEQUENCE= zg30
##.SOLVENT NAME= CDCl3
##.SHIFT REFERENCE= (INTERNAL, CDCl3, 0, 15.3987)
##AUDIT TRAIL= $$ (NUMBER, WHEN, WHO, WHERE, WHAT)
$$ ##TITLE= Audit trail, XWIN-NMR		Version 3.5
$$ ##JCAMPDX= 5.01
$$ ##ORIGIN= Bruker BioSpin GmbH
$$ ##OWNER= she
$$ F:/spectra/data/she/nmr/H-F/1/pdata/1/auditp.txt
$$ ##AUDIT TRAIL=  $$ (NUMBER, WHEN, WHO, WHERE, WHAT)
(   1,<2023-12-22 14:03:20.53 +0400>,<she>,<DPX200>,
      <created by zg, POWCHK disabled, PULCHK disabled
       configuration hash MD5:
       00 E9 B6 7A A2 85 ED C7 34 08 36 98 17 FE 4E 26
       data hash MD5: 16K
       57 2D 81 0E C5 93 E2 C5 FB B8 0F BA 43 BC E3 3B>)
(   2,<2023-12-22 14:03:23.17 +0400>,<she>,<DPX200>,
      <Start of raw data processing
       efp BC_mod = 2 LB = 0.24 FT_mod = 6 PKNL = 1 PHC0 = -24589.95 PHC1 = 8.85273 SI = 16K 
       data hash MD5: 16K
       BC 61 06 81 DB 69 43 81 B7 AD 1F 99 A5 F2 89 95>)
(   3,<2023-12-22 14:03:45.76 +0400>,<she>,<DPX200>,
      <pk PHC0 = -2.82141 PHC1 = 0.5999998 
       data hash MD5: 16K
       5B 24 1E 78 C0 81 EA 21 C1 48 23 90 0A C1 E5 53>)
(   4,<2023-12-22 14:03:49.90 +0400>,<she>,<DPX200>,
      <abs ABSG = 5 
       data hash MD5: 16K
       87 CF C7 15 7F 70 7F 88 93 18 1A 13 10 9D 65 76>)
$$ ##END=
$$ 
$$ hash MD5
$$ 7C 2E 7A 0B 50 CB EE B4 65 38 5A DA 30 F1 36 C8
##$RELAX= 
##$RELAX= 
##$RELAX= 
##$RELAX= 
##$RELAX= 
##$RELAX= 
$$ Bruker specific parameters
$$ --------------------------
##$DU= <F:/spectra>
##$EXPNO= 1
##$NAME= <H-F>
##$PROCNO= 1
##$TYPE= <nmr>
##$USER= <she>
##$AMP= (0..31)
100 100 100 100 100 100 100 100 100 100 100 100 100 100 100 100 100 100 
100 100 100 100 100 100 100 100 100 100 100 100 100 100 
##$AQSEQ= 0
##$AQ_mod= 1
##$AUNM= <au_zg>
##$AUTOPOS= <>
##$BF1= 200.13
##$BF2= 200.13
##$BF3= 200.13
##$BF4= 200.13
##$BF5= 200.13
##$BF6= 200.13
##$BF7= 200.13
##$BF8= 200.13
##$BYTORDA= 1
##$CFDGTYP= 0
##$CFRGTYP= 5
##$CHEMSTR= <none>
##$CNST= (0..31)
1 1 145 1 1 1 1 1 1 1 1 1 1 1 1 1 1 1 1 1 1 1 1 1 1 1 1 1 1 1 1 1 
##$CPDPRG= <>
##$CPDPRG1= <>
##$CPDPRG2= <>
##$CPDPRG3= <>
##$CPDPRG4= <mlev>
##$CPDPRG5= <mlev>
##$CPDPRG6= <mlev>
##$CPDPRG7= <mlev>
##$CPDPRG8= <mlev>
##$CPDPRGB= <>
##$CPDPRGT= <>
##$D= (0..31)
0 1.2 0 0 0 0 0 0 0 0.06 0 0.03 0 0 0 0 0.0002 0 0 0 0 0 0 0 0 0 0 0 0 
0 0 0 
##$DATE= 1703239400
##$DBL= (0..7)
120 120 120 120 120 120 120 120 
##$DBP= (0..7)
150 150 150 150 150 150 150 150 
##$DBP07= 0
##$DBPNAM0= <>
##$DBPNAM1= <>
##$DBPNAM2= <>
##$DBPNAM3= <>
##$DBPNAM4= <>
$$ [...]
##$SUBNAM3= <"">
##$SUBNAM4= <"">
##$SUBNAM5= <"">
##$SUBNAM6= <"">
##$SUBNAM7= <"">
##$SUBNAM8= <"">
##$SUBNAM9= <"">
##$SW= 18.0517328524113
##$SWIBOX= (0..15)
0 0 2 0 0 0 0 0 0 0 0 0 0 0 0 0 
##$SW_h= 3612.71676300578
##$TD= 16384
##$TD0= 1
##$TE= 0
##$TE2= 300
##$TE3= 300
##$TEG= 300
##$TL= (0..7)
0 120 120 120 120 120 120 120 
##$TP= (0..7)
150 150 150 150 150 150 150 150 
##$TP07= 0
##$TPNAME0= <>
##$TPNAME1= <>
##$TPNAME2= <>
##$TPNAME3= <>
##$TPNAME4= <>
##$TPNAME5= <>
##$TPNAME6= <>
##$TPNAME7= <>
##$TPOAL= (0..7)
0.5 0.5 0.5 0.5 0.5 0.5 0.5 0.5 
##$TPOFFS= (0..7)
0 0 0 0 0 0 0 0 
##$TUNHIN= 0
##$TUNHOUT= 0
##$TUNXOUT= 0
##$USERA1= <user>
##$USERA2= <user>
##$USERA3= <user>
##$USERA4= <user>
##$USERA5= <user>
##$V9= 5
##$VALIST= <valist>
##$VCLIST= <CCCCCCCCCCCCCCC>
##$VD= 0
##$VDLIST= <DDDDDDDDDDDDDDD>
##$VPLIST= <PPPPPPPPPPPPPPP>
##$VTLIST= <TTTTTTTTTTTTTTT>
##$WBST= 1024
##$WBSW= 4
##$XGAIN= (0..3)
0 0 0 0 
##$XL= 0
##$YL= 0
##$YMAX_a= 333643
##$YMIN_a= -454562
##$ZGOPTNS= <>
##$ZL1= 120
##$ZL2= 120
##$ZL3= 120
##$ZL4= 120
##$ABSF1= 15.3855
##$ABSF2= -2.666348
##$ABSG= 5
##$ABSL= 3
##$ALPHA= 0
##$AQORDER= 0
##$ASSFAC= 0
##$ASSFACI= 0
##$ASSFACX= 0
##$ASSWID= 0
##$AUNMP= <proc_1d>
##$AZFE= 0.1
##$AZFW= 0.1
##$BCFW= 0
##$BC_mod= 2
##$BYTORDP= 0
##$COROFFS= 0
##$CY= -3
##$DATMOD= 1
##$DC= 0
##$DFILT= <>
##$DTYPP= 0
##$F1P= 0
##$F2P= 0
##$FCOR= 1
##$FTSIZE= 16384
##$FT_mod= 6
##$GAMMA= 0
##$GB= 0
##$INTBC= 1
##$INTSCL= 3.70164e-10
##$ISEN= 128
##$LB= 0.24
##$LEV0= 0
##$LPBIN= 0
##$MAXI= 10000
##$MC2= 0
##$MEAN= 0
##$ME_mod= 0
##$MI= 1.114404
##$NCOEF= 0
##$NC_proc= -7
##$NLEV= 6
##$NOISF1= 3.799351
##$NOISF2= 2.8
##$NSP= 0
##$NTH_PI= 0
##$NZP= 0
##$OFFSET= 15.39872
##$PC= 1
##$PHC0= -24592.77
##$PHC1= 9.452729
##$PH_mod= 1
##$PKNL= yes
##$PPARMOD= 0
##$PSCAL= 0
##$PSIGN= 0
##$REVERSE= no
##$SF= 200.130024613194
##$SI= 16384
##$SIGF1= 3
##$SIGF2= 2
##$SINO= 5.538805
##$SIOLD= 16384
##$SREGLST= <1H.CDCl3>
##$SSB= 0
##$STSI= 16384
##$STSR= 0
##$SW_p= 3612.71676300578
##$SYMM= 0
##$S_DEV= 0
##$TDeff= 16384
##$TDoff= 0
##$TI= <>
##$TILT= no
##$TM1= 0
##$TM2= 0
##$TOPLEV= 0
##$USERP1= <user>
##$USERP2= <user>
##$USERP3= <user>
##$USERP4= <user>
##$USERP5= <user>
##$WDW= 1
##$XDIM= 16384
##$YMAX_p= 361013040
##$YMIN_p= -723806
$$ End of Bruker specific parameters
$$ ---------------------------------
##NTUPLES= NMR SPECTRUM
##VAR_NAME=  FREQUENCY,     SPECTRUM/REAL,   SPECTRUM/IMAG
##SYMBOL=    X,             R,               I
##VAR_TYPE=  INDEPENDENT,   DEPENDENT,       DEPENDENT
##VAR_FORM=  AFFN,          ASDF,            ASDF
##VAR_DIM=   16384,         16384,           16384
##UNITS=     HZ,            ARBITRARY UNITS, ARBITRARY UNITS
##FACTOR=    0.220516191357247, 1,           1
##FIRST=     3081.7461701036, 0,             0
##LAST=      -530.970592902184, 0,           0
##MIN=       -530.970592902184, -723806,     0
##MAX=       3081.7461701036, 361013040,     0
$$ Real data points
##PAGE= N=1
##DATA TABLE= (X++(R..R)), XYDATA
$$ [...]
14540 87508 -88575 -211028 -106254 -34134 -8883 273448 177509 -37468 -40442 -61559 9054
14529 9054 -2983 -119856 44965 -125349 -136810 12396 24586 -44941 89630 94235 -175828
14518 -175828 -190919 81847 29236 46040 55785 -95138 34941 -42569 860 41690 104443
14507 104443 76199 5124 -60524 -104119 -128041 105863 211624 -109773 -163017 -69975 -7772
14496 -7772 -18887 167351 152489 -114029 -98031 50289 -13168 40427 -37933 12913 312300
14485 312300 170222 -27276 -115876 50901 240765 262156 156720 230440 25550 56119
14475 56119 66927 5918 -53498 146878 249877 205844 190229 128144 163190 110043 337237
14464 337237 4156 93951 298441 130950 -100657 -91144 -213409 -281904 -105931 76589
14454 76589 117308 106593 71133 58001 223715 133162 235178 202555 193754 106171 70934
14443 70934 144687 46305 89171 163597 75070 137947 37915 89195 67861 87062 217837
14432 217837 180760 135620 -151414 -315248 -257661 -201905 -181801 -54313 -84152 -265548 -195074
14421 -195074 8459 -80233 -47375 -36853 -37645 -52611 -153461 -51233 -176809 -19316 63133
14410 63133 -9666 -14514 50949 -78453 15196 5955 2550 6738 113219 93892 33506 96337
14398 96337 63464 115981 142844 89294 197238 -13603 -182135 -132550 -83749 -45628 -14017
14387 -14017 82042 35943 -64958 -123773 -85178 -17209 336250 174532 160351 61898 -66711
14376 -66711 84117 231469 90368 -51552 -142372 -194703 -159941 -40002 -141661 -119526
14366 -119526 -164403 26325 -30231 -54428 -129138 -72842 -4660 -96161 -15591 -26792 118415
14355 118415 181337 248891 233820 240225 383766 298083 116199 47566 123555 134144 15206
14344 15206 100391 90999 -5448 24139 85112 284480 288413 -1933 -36308 86430 111283
14333 111283 193050 25527 -50725 24141 13920 -1141 -13603 -47378 -88709 -49047 -52293
14322 -52293 -113080 -212110 -95659 7733 -27157 -84530 -35756 53579 1826 2368 -115658
14311 -115658 -305946 -274643 8008 113608 95291 5098 -208486 -73907 164616 104914
14301 104914 172136 324232 265242 130601 230077 314480 215333 267172 86583 -69170 25555
14290 25555 109367 -35010 -48926 -26539 -241517 -209574 -129697 -12970 -107164 -145138 -57181
14279 -57181 -117600 -19014 32195 -128340 -2572 110218 21620 229199 161143 264473 244421
14268 244421 310264 120685 142204 174917 23731 45640 164233 312120 241045 -8463
14258 -8463 157975 128048 163218 -22746 99151 -11302 -118152 -28879 57235 -47184 -50946
14247 -50946 9713 -3793 -26592 35156 304595 195956 -50244 3504 52789 80338 -9944
14236 -9944 -4818 253271 114284 117643 160405 -145925 -132073 84093 -121812 80710 164167
14225 164167 -1439 6214 164835 113259 1960 -20193 96160 95033 187567 -13109 -107866
14214 -107866 83836 62094 39796 81334 114166 149688 47778 61071 6120 69734 211629
14203 211629 159741 -3633 4034 13524 -103831 -288081 -96628 -46645 -149696 -176827 -250085
14192 -250085 -122524 -12560 -94530 -31019 44356 -99395 -177618 -50040 12606 43371 65977
14181 65977 237953 331167 156832 34451 109530 -61911 45535 112044 366542 240345
14171 240345 165348 360503 303782 371397 99759 20495 47218 -30990 72557 189673 211036
14160 211036 -105778 72282 103235 -75627 33589 49044 -161252 40749 -202946 -235193
14150 -235193 65978 -16985 55571 -7171 33337 175395 165474 41475 157392 -1706 -5532
14139 -5532 -117143 -68368 -119747 58431 -65132 168721 163903 25539 50383 55040 114983
14128 114983 108452 150271 231774 450932 338930 60187 -257774 -8153 116116 141307
14118 141307 40341 -33616 25550 -121322 -169660 -270995 -313872 -70270 -34655 -89797 63309
14107 63309 32025 179244 59724 130887 93072 80517 133960 270650 323213 124666 174291
14096 174291 63620 140661 83375 275100 404831 387268 225692 165558 330522 139565
14086 139565 18566 199647 202246 115126 -35898 -83862 656 -39465 77454 74850 -18829
14075 -18829 -20308 174092 32987 -48554 6084 296776 120210 -108672 -147438 -17249 -26549
14064 -26549 -160866 -340642 -76772 205521 35437 65623 74303 -142948 -23954 143631
14054 143631 -43174 -19443 -47885 -63269 -34015 -105182 -88519 -72017 -3510 78247 109990
14043 109990 208675 224164 235497 99432 140950 67891 65918 93982 57923 36384 146684
14032 146684 -20022 -117042 41112 124230 198272 268129 327419 116007 11320 62312 180468
14021 180468 50206 138979 209195 167875 18402 -87874 -146305 -107953 -22598 -4032 69256
14010 69256 35175 169761 179703 -11269 -392062 -220524 -127679 -60948 -105788 -138492 110275
13999 110275 148071 42561 19404 64259 29854 -10662 116211 66393 -43308 -52680 8039
13988 8039 32722 10059 49688 -58501 22084 133528 24948 128655 152862 -196354 -152083
13977 -152083 -58487 -19366 28271 200586 176635 -72833 32147 -73764 -33004 -94084 -17792
13966 -17792 -59222 -91874 -45875 -122139 -85878 85940 69123 117618 251880 168844 247505
13955 247505 88888 -18523 92695 11313 -12086 206838 202034 131952 156616 77084 401104
13944 401104 330212 177452 -72427 -158508 -25605 -169685 -244381 -162148 -38773 -39401 13149
13933 13149 59720 -50176 -158855 -98536 -28200 27048 40057 145643 87433 183892 174244
13922 174244 9604 138467 139600 -45568 -299816 -297111 -154793 -13651 -76296 108907
13912 108907 5023 -182995 -127385 -80842 -105136 -155959 5935 -161295 -82573 -67010 107561
13901 107561 232155 270178 10253 -163395 -213197 -261000 -181834 -70095 -73986 15889 93754
13890 93754 226088 278961 108121 52368 224220 193675 -141696 42681 104865 1265
13880 1265 -24839 -59689 -70275 -168573 -8083 13013 30238 136204 121207 -125535 -10459
13869 -10459 5522 -156314 -333759 -121629 36254 -79311 66720 164948 342407 148614
13859 148614 -72821 -15748 142968 125277 -92450 -62579 33264 -67083 -181796 -65785
13849 -65785 -130842 -109884 -56377 -2216 7594 -93829 -92714 88758 151747 65065 -60093
13838 -60093 51378 103559 40616 49660 -145766 -42991 -32397 -7035 -30030 26166 144486
13827 144486 118441 108370 -88820 97222 394632 383250 402940 184619 198301 203776 148659
13816 148659 179794 -26867 131326 41504 -149443 19170 36711 171043 112301 -61757
13806 -61757 -213586 -140295 -197879 -278452 -138318 -59945 -287420 -179779 -101398 -192402 -200742
13795 -200742 -38631 -186736 -128639 -46525 -206533 53689 48797 -32656 -152790 -53131 13256
13784 13256 -48181 167723 211449 87557 141575 90821 31629 54898 168655 300551 249171
13773 249171 232738 209021 124409 209128 117396 -190272 -58589 -84045 103186 236177 -78397
13762 -78397 9652 23924 -87041 -143459 -186096 -205478 -157590 -270200 -35965 -69269 -349318
13751 -349318 -211293 -1083 135952 -46949 -16553 143505 54455 82090 102340 -85026
13741 -85026 -92545 50806 -31089 -222306 -129097 -27726 107131 72896 26918 183749 256513
13730 256513 215272 -19558 -142032 -72724 -89074 -131873 -69934 -34804 2987 -53163 8860
13719 8860 76438 93980 119981 -10979 -52160 -47847 9153 -6394 45663 31889 109986 194631
13707 194631 320835 205339 201219 192200 96119 14587 110960 189134 153752 -110481 -146802
13696 -146802 -216281 -243410 -25441 110684 155140 181474 109648 47662 -10873 5977 8658
13685 8658 -204281 2855 57381 -77279 110686 189105 159929 189092 -186092 -211519 126274
13674 126274 108869 49261 143251 -91286 58707 83509 -146406 -135610 98047 268726
13664 268726 309531 119032 121202 3879 -29095 77331 55794 196491 139992 -33125 80005
13653 80005 -31422 3326 4224 86581 -83108 -139507 -71908 -30094 158161 163474 -101887
13642 -101887 -58934 -181241 -134380 -143099 -99147 153834 -75261 11500 79642 256971 110562
13631 110562 -9268 86261 -69287 197676 165353 131806 140949 95635 121478 26527 23438
13620 23438 -14113 201401 265421 39219 30596 50689 128342 -31419 74541 45363 28605
13609 28605 181941 42943 26402 97683 171792 176083 162106 50729 225503 207679 376355
13598 376355 147341 66036 33315 43655 -68630 -109535 -76497 47351 9744 46065 161767
13587 161767 130122 56001 -38660 -73076 -59354 29134 -648 116205 232508 126485 54795
13576 54795 129059 117793 30726 40621 228152 266701 20037 85100 186619 195857 257803
13565 257803 146231 -25623 -243952 -229806 53089 123718 44532 195783 -42160 -27194
13555 -27194 85544 79384 143824 -56983 -77874 121687 235277 106356 -72128 -281712
13545 -281712 -93710 14798 49386 193608 324609 196432 4276 10586 72173 49195
13535 49195 15665 9750 5825 23030 2008 -141065 -14165 -44677 -172601 63914 -26828
13524 -26828 -2489 -24918 -167576 56971 49804 -244770 -209466 -214193 -453895 -236981 -219738
13513 -219738 -124604 -99322 -73723 -20601 247992 417466 252372 82718 66029 218504
13503 218504 209167 117253 35679 -4623 12537 -107909 -139998 1057 -129599 -182446 -204437
13492 -204437 -151480 -208843 26346 61929 -139382 -113600 -108750 -11221 54387 -883 150731
13481 150731 -100119 -68972 79662 -7945 -76194 -47323 -20153 -15870 116052 113302 -22858
13470 -22858 10875 -12094 -843 -163971 -143993 -99564 65503 93843 58755 193379 -52328
13459 -52328 -56882 226557 180217 16570 -34500 -14477 -60292 88587 -34141 -44820 -277931
13448 -277931 -257758 -31550 -258559 -138611 72520 69109 77414 164243 235615 128755 277068
13437 277068 164619 -88833 -129406 -91959 -74064 182235 65909 21093 114700 141531 222160
13426 222160 -111956 -97133 -52567 85440 101592 19846 -4046 -70512 -4134 21277 -169995
13415 -169995 -163816 -21679 -117296 -27039 -37870 -153286 -201330 -85043 39858 64059 158997
13404 158997 -50110 139532 175196 54242 -144069 -220569 -142029 82402 -77854 43857
13394 43857 118980 57926 -86324 83956 -92607 -252788 -444353 -380240 -333257 -174229
13384 -174229 -10731 -52106 -14182 -8922 -41336 -139781 -217086 -64332 67050 -35129 -61114
13373 -61114 -33267 133230 11609 183146 230953 92605 11075 -80284 -10762 -70215 -256077
13362 -256077 -129715 25299 39114 -3864 80985 158278 143061 114685 38991 -28095 -150869
13351 -150869 -199787 -65047 -62777 -159549 28158 -52778 -117513 -112128 -345920 -195029 -73601
13340 -73601 110608 48829 110961 84920 -27003 24183 633 16490 76354 -16846 -87220
13329 -87220 57334 -19965 -256568 -215465 -222662 -240567 -209586 -16419 164594 146882 66541
13318 66541 9839 -92853 -191124 37231 184356 255195 206861 20338 158980 -22535
13308 -22535 -100434 -258597 148428 195137 -73907 132369 313055 235079 210170 218378 245497
13297 245497 68911 -135061 -44731 4616 111694 63349 145776 -33602 -15212 -36424 -49786
13286 -49786 -33793 153522 188737 11408 44795 162047 120441 -375 142702 110621 -102763
13275 -102763 111199 146259 -60027 -2918 8956 -123004 -181025 -273969 -251619 -77760 63654
13264 63654 -56127 -80421 44026 54583 -1745 -38319 -31901 -231302 -364740 -213760 -90844
13253 -90844 -205679 -142590 -247368 -146966 -271534 -159234 133865 -202844 -53793 118193
13243 118193 71933 -156003 -232751 -118276 -49324 -66433 32 -222196 -214771 2634 -53290
13232 -53290 -55562 296448 98992 -54467 59701 29803 -86844 -148650 -84818 -162213 13360
13221 13360 -34177 -127429 -197585 -101922 -214545 -268281 -94332 180445 89065 -23808 -151567
13210 -151567 -29150 -142807 -195795 -131133 -194059 -185734 -287788 -97239 -235995 -308646 -103196
13199 -103196 -4551 -133757 -85646 -52082 93092 216329 -43173 -163389 18414 136886
13189 136886 6005 -162142 -139021 -178001 -167529 -226330 -215504 -234218 -330757 22525 40906
13178 40906 -151111 -128699 -316017 -214170 -45774 89447 74981 -90255 -115542 -140656
13168 -140656 -116374 177690 -2926 -185876 7109 -37267 -72100 -142855 -95643 586 -39631
13157 -39631 62930 162763 -4405 -119405 -148508 -85566 125882 108644 -250639 -88112
13147 -88112 8914 14573 19219 83448 -47867 -30976 187402 238900 324469 78576 121408
13136 121408 106548 110067 -93628 -87272 4629 -59759 -212411 -349819 -207010 -165801 -47481
13125 -47481 -136457 -244261 54690 229470 -47707 -137646 -49388 89793 -65434 -125379
13115 -125379 38540 -85271 -123429 -76178 -183936 -113977 -111124 61183 40316 48551 90900
13104 90900 -97949 -108119 -50151 81562 -7192 -174811 -43187 -83662 68582 49954 192275
13093 192275 165312 164515 207205 72017 142799 238245 186283 -96565 -138375 -166917 178392
13082 178392 111087 5793 137737 110208 73329 -70874 -98196 -62502 -80218 -61919 -112367
13071 -112367 -700 44381 145050 204748 206232 152760 63951 25940 75413 -93970 -143455
13060 -143455 -130812 -12195 -36017 -231272 -193356 -17625 61858 42901 -78650 -70477 -114596
13049 -114596 108715 85961 -973 209366 155686 37127 -118384 -20651 -76355 -151534 -143634
13038 -143634 -180780 -271780 -109952 26547 18792 173075 175829 -64104 -33978 -134291 -19526
13027 -19526 173156 67446 -27449 -26924 61649 83714 42656 -105934 -165152 20963 -23939
13016 -23939 119016 -26328 -101949 28071 -72731 37429 49626 -113479 140723 312900
13006 312900 -65494 -20019 45266 104220 6467 -195243 -133079 -150586 -188821 -28219 -180533
12995 -180533 -182314 27058 112970 -144012 -267938 -98981 -25109 -45653 -58493 -162481 -55410
12984 -55410 -102952 -200256 -77176 -36292 40429 -82196 -18418 -14360 -64638 -47323 50627
12973 50627 -49442 -197638 -194929 -171657 -174757 -94925 -125477 -32913 114780 -21455 -62970
12962 -62970 15718 -88312 -278666 -80852 98540 -66088 -108019 -45675 -82763 -43566 155063
12951 155063 187258 96756 97865 200418 91284 106633 168582 237680 104753 -86616 -13871
12940 -13871 -130945 -283703 -95323 72835 127391 126730 -117634 -30000 149411 -48455 95835
12929 95835 212273 -36484 -86969 -119586 -51065 69270 -12220 -35341 -100562 -120699 -23294
12918 -23294 -98737 -74230 -85609 -39101 -114605 -204990 1322 -5067 -106972 -115101 105759
12907 105759 44912 -85812 40248 -71553 -162951 -193165 -30670 21579 -129845 -115249
12897 -115249 -37176 44656 68173 -20389 -7586 -69873 2760 26463 -23555 -47284 30151
12886 30151 11498 -111548 -82038 57784 -160801 -279157 -141363 -130701 -169266 -110095 -32731
12875 -32731 -40624 3838 90489 4895 -96618 28828 -51243 -178117 -99587 -82899 -255060
12864 -255060 -210294 -276840 -11810 -583 -41132 -44587 150919 241598 256724 108207 -35469
12853 -35469 -71444 -144943 -123658 -156553 -90970 -53154 -115181 -22971 -34722 -49207 107957
12842 107957 -101966 -220127 -206028 -74337 -158933 58105 229806 110596 93486 7883
12832 7883 -273595 -70872 -128711 -18743 -76998 -385842 -188550 -136854 59070 -3855 -101130
12821 -101130 -114697 -8199 44345 -63746 -90233 -195178 39954 -18478 -53064 22128 -3812
12810 -3812 11511 -72001 -231604 -110863 -13135 115643 66456 15658 13213 -87625 -137492
12799 -137492 -211269 -246518 -384881 -84651 -42905 49039 19953 67787 126958 135995 -16216
12788 -16216 -82900 262462 52325 -127981 -174192 -251342 -122274 -64876 -52367 -8678 -40149
12777 -40149 -38491 -282248 -27621 58519 -167309 -133499 -292955 -124824 -63404 -13878 155777
12766 155777 106445 161245 154566 -32655 12550 169549 42672 -140115 -188477 -198049 -305193
12755 -305193 -347402 -21510 -34063 -234186 -230764 -297837 -102133 68516 55023 -226408 -156874
12744 -156874 -129040 40432 133862 44403 -20471 -29038 161584 -51221 75477 44501 55562
12733 55562 55125 23265 34237 -4285 58821 16006 177607 341433 -56220 144759 243988
12722 243988 62670 124132 83030 1157 -142548 -74922 -136049 -232492 -228973 -73118 -5657
12711 -5657 -157812 -318641 -141249 -133650 -288246 -57132 125940 200239 -101515 -126711 108400
12700 108400 -138525 -162599 -120795 2826 54945 -93788 -131089 -165344 -40058 51220 -10370
12689 -10370 -287421 -160236 -179966 -48420 143113 238576 80721 2341 -151069 -191261
12679 -191261 -255134 -144961 -46788 -101239 -206368 -274291 -203609 -145111 48401 -82275 -140996
12668 -140996 -150269 -235664 -216119 -39284 -134096 -177170 8409 6288 -56866 -20665 -1474
12657 -1474 -3728 -22501 -81986 -293038 -185775 -153767 -152888 53185 101580 -22819 12397 -114792
12645 -114792 -35041 33924 235117 29698 -23347 80590 112760 -7347 -174255 -272059
12635 -272059 -267710 -253904 -341695 -344783 -234521 -152020 -139372 -38411 -216474 -186352 -168034
12624 -168034 -180266 -124218 -69002 -173133 -221366 -245434 -122242 -40760 -288768 -132708 42219
12613 42219 20652 -257182 -280649 -257158 -87397 1053 89523 107145 159520 174339 75275
12602 75275 32405 -142059 -168525 -32772 86501 -40060 -8147 -92411 -70962 128927 258508
12591 258508 134870 -60197 -189973 -200518 150008 180937 -10982 -104195 -57082 -121788
12581 -121788 -201068 -138208 -113646 -2928 39132 48413 -296464 -303490 -107210 -147674 13862
12570 13862 201688 131403 -55844 141894 250687 38547 -121024 -202394 -285101 -336420
12560 -336420 -291334 -207644 -221268 -208168 -149637 -45953 13610 67314 -42671 2301 88341
12549 88341 -115266 -62266 47062 142450 32473 -64990 -146225 -147970 -181338 -224905 -58162
12538 -58162 271548 138976 128818 -103599 -240457 -179727 -91323 37580 -79415 -70475 185088
12527 185088 120945 -149966 -90598 -229377 -197845 5968 -189522 -156681 5843 -20945
12517 -20945 -32525 38928 25732 -108135 -73378 79017 183790 36955 95199 261780 -52951
12506 -52951 -226505 -106511 -83993 -155921 -121484 -52837 -83047 -173696 20133 99039 27135
12495 27135 -62292 -36525 -112788 -261095 -352293 -240252 -116421 -134744 -136877 -131701 -96500
12484 -96500 -159843 -158855 -161091 -86163 -101308 -50971 -178001 -217438 -271165 -361199 -246538 50563
12472 50563 26009 -171201 -148780 -257291 -188851 -207579 -177707 -246102 -310956 -80574 20347
12461 20347 42913 -172993 -128337 -89918 -35297 84992 72173 -21016 -147343 18755 6862
12450 6862 -44130 -113264 30097 33068 61738 196852 244021 -36275 -51664 86759 5733
12439 5733 29576 156392 268223 97066 109353 169833 213812 -36346 -160762 -37494 94312
12428 94312 -4536 234482 107039 78381 -47771 30703 79550 -5953 162527 155618 140171
12417 140171 959 -110217 -198845 -139253 -128818 -53410 -122233 -144649 -153751 -244866 -73161
12406 -73161 31867 123303 203272 128667 24779 158691 83965 -194166 -265554 -77588 28060
12395 28060 -33955 -66514 -47607 -64515 54454 -165924 -77461 -10354 -10447 22954 -4739 -132132
12383 -132132 -175434 -116825 -29707 -71373 47199 58727 -112374 52475 61245 -50331 -70019
12372 -70019 -34065 -155552 -172746 -102084 -206888 -136478 -117094 -121153 -173942 -99281 -83453
12361 -83453 -114941 -49559 -200917 59221 143634 149133 216060 156587 71477 91920 -27072
12350 -27072 -76046 -65581 -82178 -46814 -218445 -451785 -486323 -301457 -282735 -339110 -86529
12339 -86529 -172997 -117577 -290313 -202085 -11212 153049 104201 50818 -103230 -103176 -191078
12328 -191078 73653 104823 67745 1077 55012 -81280 -160705 -172717 -221618 -216306 -177838
12317 -177838 -251417 -156150 41770 21083 66192 -214558 -154283 103070 -138527 -172978 -18215
12306 -18215 134326 -70884 -33842 -11945 -287521 -194740 -290568 -24027 -50595 -143912 -194294
12295 -194294 -31067 222084 109039 41868 31885 -184761 -196111 -18963 57503 -117418
12285 -117418 17211 42198 -67324 -121335 26757 48976 2080 62875 6275 -109842 -94241
12274 -94241 -37084 35353 -131374 -92067 148169 -23614 71893 79944 -36228 -45095 232587
12263 232587 307297 108590 32168 -170687 -121829 188215 150637 -16364 217455 -2847
12253 -2847 -148640 -83449 -13431 -70435 -68636 124861 56248 -73431 -153952 -145780 -10433
12242 -10433 -16822 -41017 -199966 -213672 -105507 -99160 25201 176056 104253 169545 73451
12231 73451 62724 8530 25555 -46026 24783 -80356 81481 56576 -65738 62059 -106838
12220 -106838 -57773 -41367 26599 157317 80835 -117429 -232835 -118899 -75085 3901 136483
12209 136483 44454 -6631 26966 -121932 -16673 -117790 -133064 39460 -91295 8724
12199 8724 95539 43805 20762 80037 2167 -196815 -236054 -45346 -210274 -51275 -81531
12188 -81531 -90603 -215456 -170178 3500 3753 6698 48668 -145494 49670 -33225 -167307
12177 -167307 -98490 -18258 -91932 -90910 -78566 -99612 -36376 -2033 182182 26136 173413
12166 173413 103295 227874 153471 40209 -44887 -187135 -107862 -79824 4571 85668 209394
12155 209394 39691 91910 211088 213888 84373 -32392 342254 339666 -26613 -36941 31553
12144 31553 144099 302309 99649 58791 99873 164895 225883 281511 162771 44437 19589
12133 19589 81728 -55344 -186897 -95757 -237593 -139468 -87701 49998 -43141 -355126 -159445
12122 -159445 71054 145077 139383 -109988 -81606 -232863 -244908 -209674 -89417 101774 59129
12111 59129 -18127 18529 125230 -27582 -106928 133237 68400 42613 146906 69961 -52431
12100 -52431 -206400 -104927 -139006 -195028 -32179 72689 81503 -57833 -2916 -113191 -216039
12089 -216039 -157384 -133301 -177212 -426120 -237607 1732 149492 73608 168930 105298 -204120
12078 -204120 -122957 -174439 -45037 -51407 -89168 -121052 -51778 -40881 -119292 -112055 19502
12067 19502 81579 246840 118649 -2896 -3072 3384 -21888 31510 165993 -14681 -101578
12056 -101578 -210278 67907 -82112 -174402 189544 221070 17374 35681 9768 -140463
12046 -140463 -241422 -195952 -194602 -243227 -106544 -78985 78638 319416 128473 -56252
12036 -56252 -42533 -36905 -152084 -46402 -62484 -158146 -198024 -49847 -43311 -144607 -182638
12025 -182638 -175992 -285474 -267958 -93239 16545 -105722 -251170 -281931 -43000 -112413
12015 -112413 -258245 -48369 -2810 37520 104353 4317 -24309 -50987 -130986 -45138 232340
12004 232340 96509 -72271 -15545 -78571 -116644 -149845 -8929 -99321 -125148 79285 130900
11993 130900 -7219 -17497 175529 153541 64706 21684 -42978 26502 34320 -95133 12748
11982 12748 5572 -269181 -199929 -173182 -316105 -298197 -350913 -208573 -271897 -369264 -175867
11971 -175867 -153825 -186506 -137655 -55040 -248980 -444066 -169858 100083 28824 -53191 -198888
11960 -198888 -379790 -575477 -349813 -316039 -329918 -79079 -175424 -166716 -303470 -174928
11950 -174928 -75887 -128386 -82891 -35165 -62128 -116143 -83369 -293445 -69376 -150781 -363388
11939 -363388 -344571 -256175 -173206 -60598 -191860 -157940 -104962 -73009 -112872 -198281 14119
11928 14119 74691 46559 -20917 -224076 -188754 -97878 111287 154443 -64527 -51227 81283
11917 81283 -8302 -143939 -299744 18787 -85349 -155315 -274238 -306405 -183222 24363
11907 24363 53075 -52 -73398 -106891 -193127 -63093 122735 251687 175129 -232456 24114
11896 24114 46916 172759 310917 276673 -45988 -143267 -142670 20008 73771 -81362 371
11885 371 1756 22583 175287 256552 4058 -146850 51706 -107155 -130452 104539 -10992
11874 -10992 -281974 -64486 -22781 -214315 -204000 143093 24363 -80153 -230957 -207444
11864 -207444 -51934 30876 6797 -120576 -67790 67494 -24475 -97686 -257214 -136787
11854 -136787 -90656 14683 1294 123103 7371 -6942 118367 -6303 191513 127956
11844 127956 183198 -48162 -123653 -163103 -28277 -102619 -228998 -244621 -237155 -237644 -161031
11833 -161031 -129956 -66387 -116506 -38009 38957 85548 -112333 -200219 -29306 -218592 -158469
11822 -158469 -13201 62319 -33832 -135282 -62150 108214 120734 -123794 -160051 -74481 -105224
11811 -105224 5971 -94606 60470 160090 14648 -193119 -139157 -102531 -70914 121769
11801 121769 8973 -39181 57528 -1177 -56025 -58842 -154038 110178 152519 16099 -92919
11790 -92919 -110574 -6693 -40894 -199576 6662 20292 95277 -41486 -192564 -199125 -181953
11779 -181953 69028 -11912 71934 276068 282117 119627 -105338 20057 89596 191175
11769 191175 4478 -4079 -36279 3590 83265 -17308 22210 -21376 45793 57078 33737
11758 33737 -19371 -60609 -258671 -201302 -153865 -55816 122544 64311 -82251 -161604 -307622
11747 -307622 -34735 92931 57935 -21685 138168 49661 57322 169304 -5394 -43044 -129556
11736 -129556 -54012 -71324 5635 14660 -98774 24486 205227 188410 214164 102066 94686
11725 94686 223491 2055 -110670 -74220 17065 178877 -18367 79410 251164 182890
11715 182890 190561 100743 -4254 29426 219725 278532 167676 125474 85517 126886 71590
11704 71590 154635 417218 285372 161383 209046 169859 68737 78231 -7588 147687 229834
11693 229834 268152 386703 582967 556481 484946 358642 244058 347841 432043 520689
11683 520689 625939 775461 806386 752411 776083 1127798 1151056 1373242 1444409 1282144
11673 1282144 1486814 1467347 1367663 1191153 1089837 849838 879732 914201 594521 517659
11663 517659 472762 549063 294219 248035 434871 383211 476341 427993 354619 372028 382787
11652 382787 347630 374875 417478 431944 570745 359644 331500 10401 -75265 94220 398945
11641 398945 365129 324432 375053 355226 269144 42938 119374 245452 307639 441932 520380
11630 520380 383152 124259 15363 33886 105020 133038 40616 5408 -12509 19696 -41926
11619 -41926 -12251 183055 411852 218252 192475 327729 252908 155155 34202 240196
11609 240196 200083 137960 542272 676577 547985 446153 462526 515023 579740 897564
11599 897564 1279119 1228782 1317903 1511060 1165768 865759 931634 824098 731180 567196
11589 567196 340653 249982 465039 385814 355319 335317 235750 255772 335039 470245 472059
11578 472059 159933 175289 277564 313901 338157 502802 409654 444305 490957 485904 427085
11567 427085 330662 409220 386300 306046 216094 373475 461622 399318 376545 375358 339973
11556 339973 147392 151345 103159 332284 546515 516997 525918 434751 670716 836769 605718
11545 605718 550576 681445 591134 773636 816891 806307 789542 915128 1067573 886782
11535 886782 982142 1110168 1192130 1523945 1528425 1665981 1767763 1594030 1495235 1480639 1446518
11524 1446518 1410274 1378435 1507460 1544873 1668218 1700721 1644812 1616471 1790635 2086294
11514 2086294 2155548 2350723 2758686 3204000 3803116 4727023 5652962 6672204 7832451
11505 7832451 8378156 8132051 7178853 5990653 4897667 4071323 3258087 2783871 2396406
11496 2396406 2155497 1926354 1796438 1455426 1338502 1232074 1124400 972116 1053421 1121347
11486 1121347 984805 960152 808822 782928 715253 793279 858344 828545 769949 749110 609434
11475 609434 536532 425543 507098 538950 536390 679391 615805 424406 472016 458352 368623
11464 368623 571215 561935 488080 494423 419317 559977 457067 288089 116932 44431 245647
11453 245647 300750 269909 149466 162631 209462 155160 176005 284299 431632 165951 341807
11442 341807 432313 200973 64129 193555 285230 383300 448473 429304 262921 193292 191130
11431 191130 343171 450360 428449 344193 480093 575663 656282 580141 458176 241522
11421 241522 92663 213874 190889 49420 40091 42166 19905 26247 -19497 -185993 -272452
11410 -272452 -140343 -80294 -74361 -80271 -71399 -8870 28419 -65469 -156593 -73718 -132363 -337463
11398 -337463 -115604 -107990 -108956 -169935 -156495 8402 73663 81273 196334 105970 142200 95299
11386 95299 104093 109785 216394 163696 119677 265139 172917 -5483 237939 165134 166693
11375 166693 233879 87194 45164 113422 133976 10817 6038 10030 -114379 -46172 163720
11364 163720 188564 -101031 -139657 -16131 2351 31230 -173286 -173446 -71824 35441 80680
11353 80680 151427 115053 46974 219546 77723 71177 -12627 -191488 -23087 139764 109796
11342 109796 -80961 -66142 -355355 -192630 -24992 83084 155114 252743 152315 132206
11332 132206 214 -106596 6415 30018 -12506 101906 -91777 -69965 108505 8189
11322 8189 -178322 -27694 -6940 -14436 118990 -88425 8493 49022 -86874 -78801 -181091
11311 -181091 -281110 -36710 110784 -125428 -58420 -54374 -26937 -71055 -46362 82117 -218533
11300 -218533 -175172 -158041 -65595 -35373 94348 -8558 97556 263646 133595 77232
11290 77232 -17761 -101213 13026 -244759 -237365 -19995 -6664 -214259 -328095 -70555 67799
11279 67799 116986 186418 68545 24694 -91994 -23658 -34578 -17319 -131262 -275235 -168297
11268 -168297 -33915 -155152 -59585 189209 -79117 -223529 -132096 -23624 -22853 -131504
11258 -131504 -270550 -46850 -9826 -105068 -106544 -194869 -48888 -61946 -54712 -110268 -50492
11247 -50492 9992 11148 -40949 83413 74231 -67430 -25585 -79115 -40424 -37828 62847 25475
11235 25475 -14713 -66064 -258829 -101998 -122557 -80401 -71575 -202712 36762 -76688 -50843
11224 -50843 32759 309471 160829 27299 -206268 -2390 286528 173176 40713 115257
11214 115257 -25646 -75412 -121768 -33288 -216634 -201586 -14017 -197724 -246988 -307223 -264826
11203 -264826 -195620 -188943 -104352 15387 69729 210813 206599 119291 232037 79930 -277870
11192 -277870 -257996 -166516 -349498 -291657 -91545 -267634 -196676 -150223 -120257 -153419 36884
11181 36884 157614 196262 175974 267867 203861 183529 15911 -94947 27886 28292 4459
11170 4459 -78561 33151 37201 161266 18473 -87421 -154508 -134621 38981 -42771 -123241
11159 -123241 -352683 -359871 -112859 96840 -135060 -110611 -211992 -64695 -41972 -225126
11149 -225126 170009 239161 -18270 -184151 -167917 -14766 63271 82591 156929 250298 71527
11138 71527 -128395 -77985 34893 47548 46495 49715 -21190 -131376 -167880 -123497 -19088
11127 -19088 83855 284972 260850 -25543 92188 100844 -524 -19238 -118513 38826 53443
11116 53443 2521 8277 -191092 -34278 234988 233392 -55186 -74951 -10761 154693 128802
11105 128802 -115476 34544 95220 272614 313943 424194 183532 166315 -8872 -53885
11095 -53885 -52152 -51969 -2853 30926 211294 48519 -7007 38938 44125 -191564 60628 -61173
11083 -61173 156139 151283 104166 37802 -11224 60629 -188080 -242561 -84921 22220 -28801
11072 -28801 -45655 -69806 6787 147810 88586 90939 -21080 -132281 -248057 -58660 103953
11061 103953 46663 114382 82571 15372 -118706 -37930 -43796 275676 176366 60730 -13986
11050 -13986 -52377 -15965 -53821 33772 117163 -6677 -151050 -57907 147209 60779 10293
11039 10293 -67945 -266509 -132711 -83643 -124001 -124910 -23774 -182123 -68346 -10925 -35021
11028 -35021 -98641 -77295 -130956 -125343 117069 3549 -130246 -23185 -52911 -72306 -15498
11017 -15498 148874 69334 36627 48936 -48009 -65983 -60292 -54791 -15692 204369 80929
11006 80929 -243080 -270095 -34726 5185 11380 195560 253715 136165 22617 5362 -11949
10995 -11949 33307 61332 29279 -48301 -196981 -86844 -18516 -122632 31749 -11068 57073
10984 57073 152411 107307 101328 -25117 -128431 -41516 84178 62226 126903 83208 -84622
10973 -84622 -26951 39128 -7043 64979 59787 33057 -91655 -205996 -208822 -132207 -96136 -29059
10961 -29059 -80591 -117867 -212535 -187553 -125357 -2882 -115930 -7872 51435 102007 251580
10950 251580 102145 120193 344454 373513 174140 133733 160249 134940 90296 70061 128653
10939 128653 88220 161539 -90504 -220544 19732 270561 177568 282945 446235 368859
10929 368859 250959 -22884 126130 261932 238089 191222 70255 -113191 -2958 -22043
10919 -22043 33490 250122 88241 131033 384620 359343 495302 550769 455119 259555 440397
10908 440397 352724 217564 174545 262728 244911 411484 364343 156267 189412 283416 355494
10897 355494 410137 693870 811223 894519 950678 1042896 910502 1114388 1400098 1441908
10887 1441908 1551436 1612479 1878723 1969892 2077661 2098752 2223431 2234540 2202655 2125836
10877 2125836 1818212 1881571 1384830 1255229 1347731 1156742 860049 772798 841591 590946
10867 590946 453032 498482 356783 597655 371274 365320 453054 534997 651480 566270 537183
10856 537183 525881 364792 294851 323141 147064 58057 103502 262411 252568 254657 325987
10845 325987 140806 172552 121729 107075 167019 166807 17605 -165381 -72982 -25243 105310
10834 105310 -1273 113573 252211 252187 18717 -281758 -210548 17522 -129263 68161
10824 68161 9935 5098 129408 26665 21316 182018 -32522 94651 118751 214036 209441
10813 209441 112442 211487 171221 133967 -60022 -189048 -101669 -259131 -173447 -44749 -13174
10802 -13174 -191285 56672 151967 18613 -70357 3942 -67842 -12756 287059 143313 -123634
10791 -123634 -99088 167763 69298 113651 -57955 -58511 -40120 120747 167674 241161 251266
10780 251266 215816 263606 144391 49278 11619 -56075 203233 128382 132008 98142 141769
10769 141769 82210 -21336 38695 86670 146636 354285 442142 162084 36901 -6605 -66176
10758 -66176 -56985 -130558 -267557 20286 180987 11358 -223513 -150213 73479 193340
10748 193340 -2181 -68304 -73644 -110311 85269 -7200 59678 -98033 -260731 -144011 -8461
10737 -8461 -122539 -188443 -119457 121665 287634 155122 -45244 86979 71666 105447 84868
10726 84868 102176 -3652 -87274 33266 -100466 39056 -87527 -118171 186100 -4827
10716 -4827 -82170 -6372 -42104 24132 -85730 -105912 -107392 81645 39155 19768 -79834 83933
10704 83933 318757 141627 57620 31456 123297 53899 166355 173843 8296 -177120 -145971
10693 -145971 -65229 -10999 159692 40303 7115 140871 -22171 90352 180351 145881
10683 145881 1590 54191 177489 171020 272803 337445 263101 310176 361183 263082 121590
10672 121590 149155 155221 23533 54020 -44880 256255 129582 115432 314325 132807 80708
10661 80708 270849 561278 625645 618342 606187 255749 367129 565799 571608 693192 665557
10650 665557 790694 962250 832025 840674 990219 842177 896172 1117972 1180908 1334470
10640 1334470 1527580 1355954 990221 811958 604594 346733 289087 326774 328075 346609
10630 346609 245129 408204 279401 149054 167182 164762 156673 236886 315870 191830 157977
10619 157977 296222 387848 469831 487920 446326 303901 105264 100896 203297 249237 128998
10608 128998 197081 112342 143982 330439 281614 259332 128359 26070 113011 235455 166325
10597 166325 126392 -114222 27025 184274 182835 51537 -18835 -191340 -171830 -257042 -188402
10586 -188402 -83312 9702 -18997 -27849 51840 58008 277856 39355 -189311 -132368 -57023
10575 -57023 -106961 87735 173668 156657 318843 381097 276447 73139 134121 44637 -58728
10564 -58728 267791 112763 45028 40935 210590 333811 293730 -66087 73293 87084 189149
10553 189149 279541 411664 370041 352623 274217 90206 -70899 -87933 304297 159227
10543 159227 46482 -17345 -29875 89372 197544 174840 115882 1428 160542 -59712
10533 -59712 17286 159401 -17967 -132181 134988 370171 263980 523481 397096 282236
10523 282236 68710 -109509 -69420 -33539 29236 43318 21340 18275 38389 214974 172088
10512 172088 224891 65335 163768 187411 212443 203371 294535 262890 124214 148590 249442
10501 249442 293394 392679 80243 -81411 -153774 57000 210413 48444 49236 223507 210666
10490 210666 132406 140665 -60752 78489 -21513 -123369 3581 189073 -154822 -60292
10480 -60292 42482 259497 263470 92038 -41763 44868 199952 138764 78795 -238418 1809
10469 1809 10690 -81711 -189801 -164531 4928 107324 315350 160145 161158 118449 156377
10458 156377 150701 387071 249652 46057 20677 92741 -80792 -141102 -51649 234872 283372
10447 283372 104249 88571 189294 24221 60890 91740 50578 134700 150087 44567 175034
10436 175034 242958 183952 166599 265399 328207 164335 99695 51864 246217 186534 19775
10425 19775 -113694 -114820 84181 49226 40071 239358 58259 72429 209529 88972 33673
10414 33673 -24663 134219 257770 251488 203068 71327 -19700 51802 -35771 54559 -62324
10403 -62324 -126347 -120955 -97120 165606 94724 171054 66404 -167165 -68329 16489 44182
10392 44182 148629 112244 164214 122328 -86100 51318 257577 158050 -29750 24227 241434
10381 241434 151114 8500 -69917 -22058 89651 67347 317965 386507 288493 318510 208715
10370 208715 -14322 30978 188700 -17987 17114 69131 185634 112898 -80990 -130966
10360 -130966 19310 209029 329110 124155 88284 -44358 38288 319861 197003 -104403
10350 -104403 -49536 -188094 -93400 -40242 -41240 -133299 -100738 16555 110559 156291 47035
10339 47035 103557 -180283 -128605 176406 218745 205818 213652 378707 236155 244155 276953
10328 276953 179127 57445 3964 99409 224094 166587 42130 365394 217165 287435
10318 287435 297647 -36473 -110549 134088 120033 73873 157344 380697 419156 338557 314864
10307 314864 124655 192522 408392 422671 312205 310066 379033 227137 167955 257415 220660
10296 220660 104942 185138 364171 370412 231447 137987 307676 169547 294624 484595
10286 484595 251167 217336 161365 70083 201637 273895 415520 270373 297224 553246
10276 553246 418443 353058 497612 543902 276605 181889 334195 358731 365162 429632 210149
10265 210149 581497 650102 526915 262172 260455 611418 635052 451186 451640 339919 386707
10254 386707 304434 337251 459775 166529 195845 407463 561670 487006 506829 665928
10244 665928 589288 529763 504416 439167 450425 434048 571893 584731 689539 613883 649105
10233 649105 841234 778513 854499 882456 873735 870873 659051 627289 509850 588703 674184
10222 674184 563342 405147 439318 600056 675395 756377 862824 899638 730890 888294
10212 888294 891737 750377 620714 652698 843211 728188 846414 809114 766076 753768 754859
10201 754859 714042 734893 544615 553547 663843 643961 689650 1094555 1053585 928401 927624
10190 927624 628610 723037 905000 1134651 938780 867184 954495 852179 867493 983787
10180 983787 1087636 947178 979905 962993 919478 1123426 1314410 1510344 1453661 1474596
10170 1474596 1553733 1554476 1555606 1692373 1569550 1614627 1692926 1794235 1812369 1742361 1727121
10159 1727121 1708525 1800088 1633940 1697573 1872775 1998460 2039638 2023532 2398079 2612465
10149 2612465 2689812 2618187 2896692 3413846 3776446 4242543 4719138 4817548 5080735 4887317
10139 4887317 4962927 4920867 5138917 5387989 5455302 5347030 5249782 5015285 4594395 4426824
10129 4426824 3885515 3739434 3670533 3424489 3100470 2783198 2580384 2664236 2550001 2354336
10119 2354336 2002763 1655122 1585047 1574650 1535567 1751261 1900112 1661324 1524786 1552274
10109 1552274 1418398 1451673 1476305 1357400 1162048 1205975 1190422 1395576 1361269 1374984
10099 1374984 1269909 1431479 1440113 1509900 1568941 1523749 1510398 1423907 1493987 1525998 1613317
10088 1613317 1602051 1593351 1618109 1667256 1475678 1456765 1336146 1185161 1183570 1113605 1164479
10077 1164479 1136703 1003051 754782 961717 1166148 1404245 1272680 1224913 1395690 1316655
10067 1316655 1151839 1245098 1327844 1272258 1145454 1224686 1256712 1415818 1516578 1589426
10057 1589426 1743302 1606887 1821365 1811573 1800551 1717834 1718146 1761292 1645739 1354603 1343061
10046 1343061 1334374 1498237 1293193 1183630 1238626 1348382 1056796 880364 950742 898639
10036 898639 1107109 1235626 1293468 1219703 1142552 1147267 1273909 1419164 1318535 1059378
10026 1059378 1034017 898080 958234 1108784 1329230 1350868 1147612 1025848 1260698 1242147
10016 1242147 1355052 1267003 1030748 1391774 1558018 1526417 1483983 1395968 1339283 1618910
10006 1618910 1707029 1867912 1992191 2151741 2334230 2377936 2401539 2487322 2291723 2099115
9996 2099115 1900095 1806189 1616042 1666157 1574456 1578800 1533837 1413132 1588819 1501409 1337736
9985 1337736 1529188 1530361 1475460 1448839 1589546 1494874 1333644 1350071 1391019 1366248 1564437
9974 1564437 1579537 1345383 1267841 1296787 1400946 1401381 1564874 1602527 1707491 1714283 1880219
9963 1880219 1651546 1644523 1727619 1769232 1692164 1680750 1615721 1424247 1351446 1645397 1687713
9952 1687713 1635309 1706511 1491280 1480595 1661100 1709781 1916767 1819801 1727256 1772173 1685693
9941 1685693 1957570 2155084 2162119 2241339 2050414 2196610 2437860 2531672 2523944 2557451 2677815
9930 2677815 2564007 2494022 2410112 2301290 2432018 2662430 2505777 2715632 2624982 2647816
9920 2647816 2605010 2899203 2950702 2902210 3136393 3050294 2840447 2677307 2738507 2728793 2915012
9909 2915012 2867366 2626189 2456550 2445560 2644448 2721109 2887564 2987916 3128734 3134939
9899 3134939 3309550 3350018 2997522 3253902 3579653 3579577 3556151 3552502 3491267 3573583 3618382
9888 3618382 3602181 3532941 3607454 3752674 3772599 3724133 3686256 3671264 3613301 3775747 3705051
9877 3705051 3573576 3569154 3564509 3609315 3590495 3717772 3591434 3843080 3915445 3875575 3906362
9866 3906362 3998134 4005591 4031985 4087349 4222001 4220421 4100066 4178777 4315169 4450385 4565021
9855 4565021 4368410 4437807 4535368 4633223 4777331 4970588 5092037 5162603 4991418 5169147
9845 5169147 5468437 5499622 5586224 5655575 5572747 5679694 5995067 6099013 6076872 6333167
9835 6333167 6499975 6574618 6658301 6817412 6987430 7122816 7114649 7168991 7418373 7521870
9825 7521870 7633204 7641878 7861687 8118779 8649768 8636117 8805793 9159185 9359523 9518768
9815 9518768 9795462 10106343 10308469 10571035 11080178 11397855 11501506 11574359 11816287 12117833
9805 12117833 12701969 12754634 13049150 13103957 13271061 13317302 13674729 13964220 14097292 14662883
9795 14662883 14865888 15142431 15425260 15828668 16254555 16536458 17020997 17679298 18186793
9786 18186793 18635281 19351519 20077130 20724518 21423292 22014107 22943995 23561065 24125787
9777 24125787 24848757 25633380 26266211 26877071 27571465 27988585 28760887 29687379 30605159
9768 30605159 31578973 32739220 34037924 35092964 36162775 37192737 38108419 38975327 40033971
9759 40033971 40907638 41909121 42871748 43850149 45226027 46548897 48252253 50629516 53138650
9750 53138650 56136080 59649934 63293191 67156981 71266270 75725085 80644932 86016255
9742 86016255 91965341 99019101 107584056 118160209 129480228 139423573 147216262 154160060
9734 154160060 160566484 165406061 166655040 163313159 157108127 150607186 142666179 132229637
9726 132229637 121155381 111057465 102649385 96069394 91549190 88321697 86499994 85453744
9718 85453744 85513898 86620957 88444321 91015009 94497822 98190235 101647532 104727617
9710 104727617 107752185 110910688 114266855 117736350 122017118 127657796 135301823 144124692
9702 144124692 152540509 158788173 164120936 169887087 174502693 173882400 167043098 157409289
9694 157409289 147870270 137228200 124600658 111519860 99248845 88673734 80249876
9687 80249876 73789515 68993427 65463451 62470791 60597802 59421713 58955027 58626774
9679 58626774 58352824 57940485 57270137 56329037 54965983 53149311 50965842 48209860 45509280
9670 45509280 42644695 39768905 36624730 33537989 31065601 29008834 27466961 26120621
9662 26120621 24836304 23797031 22796866 22196140 21510395 21285819 21028774 20734295 20807592
9653 20807592 20607040 20242232 20088798 19969112 19706196 19121952 18461911 18013876 17372369
9644 17372369 16466305 15905959 15410476 14874359 14146926 13865312 13670396 13462411 13428613 13125751
9634 13125751 13006867 12771766 12489107 12220007 12263884 12032100 11962732 11869383 11879481 11927605
9624 11927605 12019046 12221381 12326125 12445723 12970723 13119949 13411151 13806694 14024834 14102216
9614 14102216 14009594 13998951 14174642 14129489 14136582 13939306 13816106 13726693 13632160 13627317 13203687
9603 13203687 12854886 12595285 12459029 12362969 12414561 12393925 12342193 12314583 12133089 11904849
9593 11904849 11809796 11900750 11778367 11700180 11823621 11937151 12081318 12182567 12492754 12352614
9583 12352614 12420017 12713608 12947539 13001928 12910257 13139699 13274331 13233194 13343004 13276968
9573 13276968 13229703 13207695 13224400 13024865 13058645 13156839 13085588 13172465 12925056 12537549 12362515
9562 12362515 12109278 11840307 11683741 11470600 11320313 11030241 10532631 10085437 9502220
9553 9502220 8888080 8574814 8538444 8482296 8338899 8102459 7828978 7615793 7266719 7063595
9543 7063595 7161110 7311929 7057124 7016608 7242100 7051747 7141444 7024374 6739681 6468277
9533 6468277 6500041 6497556 6393103 6251957 6181212 5845057 5499435 5639413 5582388 5511852 5302146
9522 5302146 5190055 5251264 5097442 5071005 5031529 5032303 5018644 4728660 4658820 4608826 4643305
9511 4643305 4508983 4417245 4450230 4551727 4687187 4693036 4702155 4655682 4569936 4645325 4654984
9500 4654984 4623877 4606249 4621219 4581556 4633034 4666891 4710334 4396349 4505767 4526262 4367097
9489 4367097 4469948 4481143 4354844 4408273 4445923 4401883 4180136 4233188 4230230 3994916 4083466
9478 4083466 4318188 4436771 4361451 4241563 4140469 3902001 3964063 4191258 4096303 4019741
9468 4019741 4170190 4125092 3971722 3815787 3889644 3950705 3853908 3992290 4024323 4145867
9458 4145867 4065231 3906753 3977100 4053615 4109814 4048343 4020966 4153551 4075194 4219511 4257436
9447 4257436 4468474 4396817 4237514 4240062 4523437 4664790 4516369 4512847 4496750 4417817 4184964
9436 4184964 4045054 4306987 4280844 4248847 4210121 4244082 4117055 4055397 3879231 3931177 3786433
9425 3786433 3767937 4085599 4127799 4270718 4250497 4576160 4634904 4520574 4620582 4366028
9415 4366028 4290941 4295294 4392530 4544501 4511313 4511207 4799205 4909888 4804478 5160354 5247657
9404 5247657 5510513 5753937 5910698 6397276 6689750 7136215 7347000 7307546 7293836 7113121
9394 7113121 6730196 6550499 6677682 6808012 7051524 7087728 7125108 6952487 6900132 6734344
9384 6734344 6380175 6002278 5601556 5470732 5656925 5642895 5732142 5825100 5957923 5832273
9374 5832273 5926623 5963766 6109603 6033614 5911410 6047703 6119417 6139739 5986136 6064414 5958855
9363 5958855 6197400 6532457 6577942 6751967 7217809 7376358 7551204 7444978 7343366 7094647
9353 7094647 6812121 6861362 7002212 7243339 7420078 7458876 7662888 7791942 7510168 7214167
9343 7214167 7158086 6893660 6590982 6728570 6631954 6508833 6381826 6179458 6099338 6225274
9333 6225274 6174301 6028351 6214379 6352670 6229525 6088352 5721190 5802432 5843178 5947948
9323 5947948 5786273 5707122 5879786 5983353 6046641 6067116 6110016 6048450 6131533 5994956 6229168
9312 6229168 6369720 6038638 6100703 6283855 6495144 6416887 6533270 6693512 6588565 6449088
9302 6449088 6511631 6585592 6445844 6512892 6627656 6925234 7003559 6991868 7038475 6962643 6996649
9291 6996649 7077903 7203775 7063413 7042202 7271232 7171828 7226829 7184460 7366111 7569039
9281 7569039 7666312 7877838 7930446 8088920 8309348 8328666 8408306 8339456 8460875 8595610
9271 8595610 8653630 8806221 8980828 9074377 9319547 9361660 9274600 9342460 9502965 9677606
9261 9677606 9703016 9602937 9621631 9793060 9919473 9760938 10046121 10310453 10327817 10386602
9251 10386602 10613554 10768655 11114981 11408295 11558432 11630833 12029093 12132594 12351997 12462815
9241 12462815 12497484 12960808 13104183 13089507 13390484 13980811 14176584 14419631 14594458 14792583
9231 14792583 15160813 15522138 15786382 16368182 16667739 16984997 17240150 17308659 17667854 18009091
9221 18009091 18314624 18721632 19169471 19699080 20136846 20539334 20967318 21413612 21836728
9212 21836728 22046463 22587865 23162754 23679817 24272543 24816238 25354327 26155509 26883829
9203 26883829 27383338 28196264 28751385 29206713 29736521 30583390 31295403 31930060 32763308
9194 32763308 33604838 34206091 34886969 35792119 36741980 37739967 38793902 40201784 41783787
9185 41783787 43447328 45303103 47387124 49937600 52882523 56270025 59637310 62270662
9177 62270662 63369212 64104424 65145919 66603516 67545357 67334179 66297760 65072053 64603497
9168 64603497 64938816 65665279 66966341 68545799 70232155 72144919 73910416 75688899
9160 75688899 77807339 80328862 82955241 85424205 87935612 90705044 93984952 97479194
9152 97479194 101266849 104770196 107756953 110792551 114981140 120666646 127960889 137077855
9144 137077855 148171785 161214420 174826227 184784763 188951693 190169468 191692218 194318654
9136 194318654 195197445 190913978 181796074 171572863 162549147 156062944 152012464 149915752
9128 149915752 150066150 151705487 155055701 160139364 166268911 174589265 185792263 200617600
9120 200617600 219219273 241038713 263548165 285160212 306601869 327514547 343008275
9113 343008275 348567165 348180130 348959913 354324370 361013040 358664318 344173120 323312212
9105 323312212 300197646 274451446 246828787 220003644 196441030 177313705 162369732
9098 162369732 151160215 143156986 137533804 133398504 129148252 124626030 120211559 116356609
9090 116356609 113696475 111433571 108587389 105171583 102123127 100359836 99626043 100420283
9082 100420283 102489927 104334525 105223985 104708146 103632486 101504067 97948918 93534392
9074 93534392 89509567 86065283 83276957 81111142 79254385 77356867 75801261 74930937
9066 74930937 74579240 74663528 74775975 74482426 73265013 71711145 70740397 70426992 70271855
9057 70271855 69289602 67362641 65301927 63628350 62160296 60863698 60224378 59896175 59542754
9048 59542754 59282319 59256206 58796444 58389717 58185831 58298594 58439541 59027183 60313785
9039 60313785 62344205 64534192 66961115 69119760 70865892 72635375 74454482 75858696
9031 75858696 76529089 76642854 75625094 73981643 71859528 69156801 65955333 62620915
9023 62620915 59704579 57577147 56077114 55332310 54830696 54971570 55336322 55915021 56716664
9014 56716664 57556220 58243842 58512123 58155270 57859658 57419074 56722800 56572532 56430738
9005 56430738 56499374 57268581 58052847 59533497 61369398 63222173 65095114 66685089 68165160
8996 68165160 69795224 71096888 72271951 73315136 74427875 75863106 77198743 78383091
8988 78383091 79787236 81205053 82880448 85337145 88954094 94107149 100934862 109526811
8980 109526811 118406721 124230368 124727061 121916772 118118923 115391901 114883098 116840092
8972 116840092 120831922 126350221 131574929 133276485 129850517 123694953 117072159 111660646
8964 111660646 108193115 106160458 104614865 103400309 102511222 102199173 103006538 104896709
8956 104896709 108669550 114023709 120627523 128297036 135099478 138059548 137024785 135332144
8948 135332144 135314119 138469268 145305297 154808962 163709368 168503672 167983562 162753921
8940 162753921 155900174 150278983 147547645 147423259 149564594 152899937 155029807 153616176
8932 153616176 149788776 145725783 143658889 145197798 150806246 160494041 170271659 169300275
8924 169300275 156970565 141667162 127953710 118483962 114049640 113473788 114864725 116022345
8916 116022345 113519372 108117126 102123297 96528912 92608822 91080075 91575368 93504581
8908 93504581 96166277 97584451 95419726 90806159 84995800 79376614 74438211 69988675
8900 69988675 66411810 63544651 61501130 59920524 58380297 56391907 53932540 51704303
8892 51704303 49359070 47551820 46223671 45205545 44220339 43399770 42792733 42380694 42011584
8883 42011584 41656651 41364079 40998622 40792079 40672863 40558902 40849946 40820641 40684204 40742336
8873 40742336 40745553 40804073 41050297 41182367 40869866 40898397 40826172 40688894 40611683 40617256 40567609
8862 40567609 40921881 41220185 41691478 42039537 42810761 43772643 44663724 45775071 47148555
8853 47148555 48843180 50605406 52485014 54613366 57091183 60311731 64393368 69686588
8845 69686588 75622044 81336613 85808072 87640309 86631421 83671603 80100930 77333511
8837 77333511 76413598 76957635 79601009 83970095 89123691 93293274 95106846 93735192
8829 93735192 89479693 83816944 77834461 73064357 69342931 66995925 65767154 65164011
8821 65164011 65433128 66699956 69150319 72114229 75553146 78167987 79342495 78596523
8813 78596523 76426565 73594813 70953515 69016166 68025806 67577714 68252954 69518803 71612835
8804 71612835 74888479 79641795 85772216 93126916 101199105 108618981 114116962 116365901
8796 116365901 114773998 109933135 104448816 99622706 96387169 94999265 95676426 97048814
8788 97048814 97821983 96534099 92965704 87440107 81464716 76736715 73484050 72153940
8780 72153940 72719483 74897574 78771864 82993020 85723326 85757758 83323279 78348575 72106278
8771 72106278 66102633 60732021 56458069 52997447 50465580 48838403 47975908 47752562
8763 47752562 48111575 49192124 51159221 54160321 58227931 62958476 67438848 70072706
8755 70072706 69823269 66714165 61389444 55119480 49232426 43916444 39567850 36220764
8747 36220764 33357089 30974584 29002044 27086805 25537213 24360979 23597887 22647762
8739 22647762 21979137 21521330 21133397 20775254 20037686 19648673 19316722 18843749 18574538
8730 18574538 18273481 17921350 17660964 17500852 17107950 16731362 16538751 16248912 16033478
8721 16033478 15599988 15533343 15575900 15455195 14997305 14739679 14668346 14449233 14182628 14047409
8711 14047409 14005718 14220343 14277309 14062224 13838831 13690801 13181003 12583681 12364783 11989517
8701 11989517 11576287 11578240 11473149 11431143 11513674 11663024 11811409 11964875 11952853 12059690
8691 12059690 12380105 12511828 12526802 12649201 12637938 12588210 12369839 12183687 12010051 12117178
8681 12117178 11936571 11606815 11372523 11244780 11287911 11031469 11116297 10917867 10877762 10883583
8671 10883583 10840664 10671127 10636826 10861286 11180022 11185762 11123049 11233903 11345718 11331951
8661 11331951 11634504 11676292 11887537 11918967 12032630 12021693 12291872 12641901 12952358 13051659
8651 13051659 13027572 13538948 13941415 14118921 14382236 14799769 15247275 15860728 16118512 16499896
8641 16499896 16754855 17132036 17419374 17772313 18185391 18738512 19459492 20412004 21553965
8632 21553965 22536283 24074402 26108183 28275066 31121677 34859497 38874354 42666895
8624 42666895 44859699 44860438 43041915 40708198 38606578 36921675 36259259 36574124 37888211
8615 37888211 40113900 42690659 44227794 44122440 42471650 39703506 36616403 33733116
8607 33733116 31487822 29940256 28794920 27741577 27081086 26507989 26167604 25991559 25835940
8598 25835940 25819409 25952867 26775692 27284672 28016613 29048581 30379350 32017714 33755309
8589 33755309 36233807 39530386 43531758 48613309 53822182 58672529 62228015 63482937
8581 63482937 62397070 59346613 55588683 52336001 50582446 49809682 50853023 52871146
8573 52871146 55309276 57002482 57068938 55242298 51615250 46590545 41647011 36954968
8565 36954968 32944730 30072720 27604147 25799466 24445321 23038156 22151446 21187838
8557 21187838 20325801 19912751 19526820 19543930 19531071 19465882 19698043 19983231 20355703 20975855
8547 20975855 21742949 23166707 24833802 27364434 29738253 31352707 31557837 30594578 28696131
8538 28696131 26493658 24635540 23530060 23190704 23513929 24352936 25483462 26602457 26959438
8529 26959438 25755510 23563685 21121410 18626093 16416319 14903501 13650421 12442573
8521 12442573 11401031 10479900 10215994 9742963 9150790 8665493 8501811 8354191 7756885
8512 7756885 7550706 7153356 6955226 7009902 6893588 6826813 6691302 6629937 6762214 6570161
8502 6570161 6399912 6376927 6354700 6436660 6435417 6285730 5979073 5737020 5434204 5493386 5507036
8491 5507036 5718252 5949188 5885537 6032708 5992138 6040467 6306499 6433013 6666963 6910053
8481 6910053 7138010 7285893 7458449 7667943 7864611 7794697 7614234 7304297 6770319 6502087
8471 6502087 6185530 5895205 5568441 5371736 5148749 5025985 4845574 4716345 4554484 4469668
8461 4469668 4391805 4161936 4232434 4020574 4058053 4011733 3957101 4205243 4077286 4021724 4470347
8450 4470347 4557551 4664291 5026623 5047208 5110544 5309409 5604876 5792207 5893463 6005330
8440 6005330 5989385 5853265 5747143 5541049 5336143 5091959 4754673 4361163 3997490 3926329
8430 3926329 3824971 3632607 3330081 3201692 2889254 2819415 2770186 2851331 2792075 2490468
8420 2490468 2601636 2633955 2538074 2477201 2370962 2376222 2239033 2112050 2030413 2076527 2106354
8409 2106354 2139990 2192708 2131764 1992405 2026060 2205188 2200128 2268952 2295053 2321131 2339201
8398 2339201 2129692 1956587 1929442 1976383 1873584 1836809 1889105 1860197 1899533 1867396 1612419
8387 1612419 1381882 1549436 1595810 1514631 1688705 1478312 1250743 1391285 1455955 1360826
8377 1360826 1222964 1248179 1092365 1163209 1118306 1090948 1248687 1256209 1205664 1329148 1572104
8366 1572104 1480622 1409787 1433722 1390512 1389527 1437404 1459935 1439712 1443693 1355753 1197307 952590
8354 952590 923953 959096 793466 904475 926615 960143 812163 689037 981840 905135 877108
8343 877108 843947 826953 867482 847389 1127531 1033607 838045 821024 1013892 957710 811626
8332 811626 880479 801751 835580 850973 816129 624730 701760 635871 568553 515754 430283
8321 430283 431270 498736 556792 469877 425852 447247 495016 492738 488302 451487 518475 665343
8309 665343 693262 704580 683249 541399 428584 576858 702277 748853 759662 486304 294559
8298 294559 403966 430226 317110 384218 370569 398318 380845 323635 368639 221127 251110
8287 251110 214715 234780 235878 210109 23404 76104 391867 489469 325770 262209 135371
8276 135371 246772 261681 160537 356861 313054 418424 474868 341216 128172 359368
8266 359368 557850 375632 387382 350139 463310 621763 661748 536493 556868 782928
8256 782928 862056 972559 854552 612331 743677 757289 819537 1240202 1029790 1033288 1106857
8245 1106857 929841 710108 593832 534059 581151 325082 209598 489621 546881 380287
8235 380287 419805 456150 470706 470927 512652 539329 525907 590466 694628 716599 507176 479792
8223 479792 536182 608141 578891 705914 576171 790922 869286 734103 680172 835265 754568
8212 754568 601440 730558 830531 840224 673888 611155 585248 646540 795040 678788 670769
8201 670769 547263 307598 588318 612471 778678 496803 824076 1069198 1245265 139175
8191 139175 -723806 -68009 -66519 116344 -44703 -60363 53923 187546 -24645 6869
8181 6869 187870 235998 297791 349055 385941 235900 288388 453505 375404 439361 428453
8170 428453 295967 376939 355104 192564 94408 120095 -16582 30062 148488 116894 343788
8159 343788 436442 361716 233745 176255 226298 127833 -34679 -180885 31331 85447 211313
8148 211313 182155 58244 297209 255473 80350 133936 223791 246426 100668 23470 151297
8137 151297 -36130 36763 13818 83676 129478 74310 249774 193589 112664 114781 197357
8126 197357 4142 42024 -15046 123890 66268 -9225 91993 -25307 -30821 118383 118524
8115 118524 -31549 -100054 17746 -258927 -207965 -17009 -35148 105843 68445 -87307
8105 -87307 -247101 -43078 -16305 -127946 -98466 36035 44929 215177 235807 91170 3982
8094 3982 90588 143674 107744 125676 116364 -18090 -262004 -267498 44606 35936 -123895 35384
8082 35384 146837 182287 197839 23229 107204 130917 163125 251355 -14825 -147737 -190560
8071 -190560 -146837 27751 17900 -32833 7739 278363 127431 171164 216638 -55774 -25344
8060 -25344 -76301 31630 -54395 -236734 -199968 -96060 134574 161526 55129 141913 208131
8049 208131 44950 -68662 -41468 -115915 44785 59398 73905 522860 403252 233556
8039 233556 390963 405274 165003 53506 -72573 -189064 -5338 106993 76321 113666
8029 113666 -27504 -20803 170116 164718 72657 3698 -17040 69407 24612 86293 46955 33765
8017 33765 118746 55631 -49210 -16325 15612 -33120 27596 158420 334567 233610 262717
8006 262717 179955 203413 230937 97464 237336 160512 -19438 120806 163373 207690 271269
7995 271269 276706 307184 254502 451300 433188 261844 220358 110042 93574 172691 119750
7984 119750 135153 258586 100866 173131 108650 -147296 -105394 11555 270854 379750
7974 379750 223877 196707 338150 175374 161145 480361 490486 275388 65713 229803
7964 229803 210932 217100 197525 84088 65470 154493 170106 289836 294062 353987 452452 363843
7952 363843 448826 474944 247007 409064 224423 166802 267886 528615 521332 440396 570253
7941 570253 277257 226512 276452 212631 272666 335812 407790 483575 585461 612197 516634
7930 516634 384229 372017 476992 691196 516682 287886 328256 431318 676940 503798
7920 503798 109443 -352 215312 275485 245407 270417 274644 216804 253844 389910 351304
7909 351304 332530 499060 471713 416574 267059 390513 440748 306949 235912 298727 180821
7898 180821 86362 89541 217250 111177 251522 332328 283516 262977 92041 115510 219548
7887 219548 201193 -9598 44320 39537 83072 130012 51680 44400 42882 59709 -67983 -185903
7875 -185903 -149569 -173515 -282762 -75022 -31476 23987 5532 105282 93842 97964 -90584
7864 -90584 -84522 -62456 -46414 -3839 -87022 248848 253160 143335 129975 -91876 -21704 138836
7852 138836 2240 70171 142658 124316 -51670 153195 178288 4953 59054 114065 175492
7841 175492 215240 31260 -21582 78063 152201 172010 82609 119429 205519 494503 250100
7830 250100 231816 470080 280190 124700 -35375 259021 297433 370544 312201 314425 355373
7819 355373 330404 348952 193740 -21540 -140624 -2697 114060 410429 633748 515762
7809 515762 493537 650856 461540 237722 76992 -32750 55979 -252023 468860 1062466
7799 1062466 505550 526097 363994 292648 292698 259021 146773 270711 116532 -71201 257213
7788 257213 287300 50917 62213 -4076 -170578 -199378 -369913 -44660 3266 -137406 -226977
7777 -226977 -326864 -50340 -153067 -237713 -31418 124919 -99124 -51868 -91244 -130603 82573
7766 82573 137396 341283 299009 258718 388863 291368 43870 -66044 273508 174180 -128905
7755 -128905 74598 -91749 -7479 94521 140251 129393 223527 -56705 -32443 5433 -133537
7744 -133537 -66229 1886 -40398 -182918 -44792 14393 -213234 -185793 -22027 71441 176050
7733 176050 215442 -40745 -316076 -480433 -187883 116613 65679 87103 -42427 -140855
7723 -140855 -15733 -110139 -354696 -133124 -16572 -235921 -187603 -138005 -161952 -221531 -317740
7712 -317740 -325740 -337502 -241488 -84966 3387 -222165 -91230 15700 46023 131618 86172
7701 86172 -18103 -104423 -233074 -209838 -33200 168139 37892 10219 -123571 -103356 16487
7690 16487 -33450 -15777 -114728 -143790 25694 -82306 -260134 -124829 -155048 -180774 -220602
7679 -220602 -231079 -110492 58960 61602 23495 -106038 -25385 44082 -160542 -40332 38337
7668 38337 -37472 -51048 -150119 -123097 13475 31032 -175964 -156782 -79312 -100937 -85102
7657 -85102 -64434 -255562 -417232 -256239 -140848 -4217 -78715 -84454 -24282 -25641 -78100
7646 -78100 -179796 -36213 4430 46744 54867 -176274 -253235 -65533 -91799 -55896 208049
7635 208049 84774 -27485 -617 56882 105121 -38868 -24714 157018 224344 -56409 -271836
7624 -271836 -132588 -47538 51642 126661 185697 17405 -291310 -311181 -74030 16063 -220207
7613 -220207 -298840 -230140 -178536 -32694 -84038 -157293 -58436 106937 -76378 -94502 -193949
7602 -193949 -222389 -107345 -132388 -131354 -90405 -87488 59594 -141131 -267539 -299871 -180419
7591 -180419 -72250 -158017 -92274 20999 -99790 -224769 -169142 79736 144184 -116302
7581 -116302 -247669 -193177 -267672 -391287 -420918 -354016 -193977 -360511 -398765 -257750 -229583
7570 -229583 -117854 -56513 -308901 -130261 -119196 -63693 -173943 -148676 -213648 23547 33728
7559 33728 -92043 36675 -123600 -233778 -142388 -81876 -25827 -3923 -115921 -58463 74809
7548 74809 17245 -22416 -20581 19767 -84844 30010 -138657 -333782 -161042 78388 10916
7537 10916 -123268 -2255 78033 -15346 55494 -28271 48293 -25829 -61693 88454 176864
7526 176864 80414 115617 227196 50552 15255 61009 127654 35315 20030 37274 221591
7515 221591 262034 209583 332652 442752 189722 162798 264326 438390 525394 518213 410837
7504 410837 468301 376012 403771 464553 563344 413522 390371 694105 710136 651172 784243
7493 784243 655339 547765 703291 982580 1143538 1085708 1199700 1311861 1341551 1159580
7483 1159580 936765 760764 873362 993694 780816 738969 736006 486221 276041 348916
7473 348916 270660 122543 58571 418616 397308 115047 192370 230903 56843 -13058 -18414
7462 -18414 -60104 -15851 115660 156835 148181 94859 -6520 3743 -193198 -138647 -80578
7451 -80578 -242564 -133815 -142103 -391270 -390926 -190587 -118465 52877 158209 -41578 -76687
7440 -76687 2802 -22909 -151245 -80797 -17128 -160060 175475 56772 -85686 160846 -66847
7429 -66847 -75209 -31082 -85742 -159430 -149642 25807 132539 191796 244402 64550 -98527
7418 -98527 1811 66188 -15186 -24778 252401 138451 -71349 -18684 -29694 -188275 -309159
7407 -309159 19774 -79179 -100352 -152583 -185721 -246768 -193406 -90635 -130610 -233910 -235903
7396 -235903 60842 11385 -329806 -202507 -164111 -230220 -191485 -84161 -3782 9953 34251
7385 34251 145424 100985 59590 32830 -73179 -262365 -134782 -149990 -94140 10632 -116948
7374 -116948 2812 -121332 -41990 -160291 48265 218531 208976 150539 41486 -92776
7364 -92776 -163791 -13864 -154514 -211864 -283076 -151185 -59295 -85092 -44774 -124911 -77740
7353 -77740 48462 15421 74256 -154342 -82950 -65432 -279021 -126498 -169778 -63831 -145019
7342 -145019 -96290 4545 -40331 -86923 -240444 -285083 -152823 -363294 -434937 -206188 -133053
7331 -133053 -4809 42985 135935 -38623 -101987 21354 -99093 -151817 -45442 -72336 -343929
7320 -343929 -133803 -123951 23307 -67945 31390 -83027 -351138 -529604 -374741 -231860
7310 -231860 -279631 -265246 -196394 15890 -102862 -132847 -286832 -152128 -9952 -135484
7300 -135484 -57742 -120899 234568 16676 -197544 -228194 -102120 -113213 -122799 -13933 -49575
7289 -49575 113149 27895 130001 -984 86468 -147125 -130341 -277896 -256700 -61947 -47307
7278 -47307 11643 64163 -159822 -266246 -213625 -67404 -164416 -189009 70777 361117 -5343
7267 -5343 -58933 -152466 -71621 92507 51448 -25724 -130285 -52538 -4164 10175 90847 251222
7255 251222 243235 247461 122557 14875 -87054 -96869 -92791 65230 -58926 128594 192389
7244 192389 -63951 -313063 -233298 -288630 -356038 -228844 -7798 292420 307694 185335
7234 185335 3817 -119161 203423 144152 78249 -28444 -130874 -37992 -129031 -96766 -107300
7223 -107300 -63862 -19053 -135995 -305899 -24187 38489 -67233 -128239 -106254 241396 115030
7212 115030 37030 -68117 -190624 -102103 -207777 -79730 -12058 -154368 -236027 -99476
7202 -99476 -143274 -45108 -31965 61802 310457 123068 -9373 52401 157867 29576 6223
7191 6223 -137902 -105765 -159856 -266514 -225080 -213637 -189134 -268787 -236601 23093 -97602
7180 -97602 -161818 -129450 -258015 -138934 64525 40056 -44045 -69306 -121903 -229681 -100588
7169 -100588 -61573 -295001 -188024 -89482 -21983 -235761 -303130 -272651 -227394 -161094 18674
7158 18674 -240789 -169663 -27985 -10150 -185545 -222057 -161939 -265854 -25815 24863 -54047
7147 -54047 -58648 -62075 -126052 -69671 40256 6687 20908 113964 101613 159753 315737 150151
7135 150151 118890 156437 61672 -145954 -205024 -80862 -220114 -134509 -26712 -65247 -29132
7124 -29132 -28213 -42394 -25515 -39166 53908 73872 -154240 27812 149094 -22450 25617
7113 25617 25543 127727 -43271 19036 74398 2493 -3242 78141 96434 7036 -129652 18607
7101 18607 29662 30564 773 -144424 -233875 -94770 57835 131635 93581 96013 82808 -58543
7089 -58543 -92930 -103743 -59982 -61888 11653 -55611 5947 126395 178852 326417 136561
7078 136561 74026 66918 127665 -42067 -253182 22928 134490 29213 -4080 36658 46118
7067 46118 -24955 77079 47103 -9387 114635 58809 27143 -35603 27078 147424 204966
7056 204966 108304 29710 -36462 -106299 -59771 85 -146598 14769 -39124 -50275 95333
7045 95333 217128 47134 -165210 -127614 -156875 -222071 -128905 -113768 -192974 -22005 104907
7034 104907 68695 109858 -69065 119359 147812 -44780 -132669 64317 111849 225577 148718
7023 148718 -41320 1530 -72810 134495 64829 106223 36477 102729 -75319 -73375 11203
7012 11203 50016 23787 -59370 -70849 -161987 -111898 -167215 -301390 -184947 -91071 242866
7001 242866 235093 42560 96778 98173 -5299 -145040 -232010 -161914 -39510 -152610 -43020
6990 -43020 218492 218751 153230 124991 199520 311839 221052 147570 232171 41278 -151913
6979 -151913 -40594 11963 -202203 -208912 -89891 111221 -71001 -225262 -135945 26614
6969 26614 6369 41373 72020 -174520 53860 -94264 -42707 -33473 -113162 -63386 -89120
6958 -89120 -80202 16401 332395 473618 96745 -8925 -130701 -145764 -161579 -19648 -146228
6947 -146228 -159510 23923 21065 52341 1781 144201 231263 191758 19830 28542 97204
6936 97204 137334 78195 -1086 102705 -31842 -151926 -323721 -80736 63355 63022 -87186
6925 -87186 -29811 97231 62601 179803 131756 -5212 -40410 245644 172296 72378 56781
6914 56781 -4995 259542 195533 -50308 67509 106038 184670 116741 190121 173773 385161
6903 385161 354318 355122 362127 174742 112501 179278 305280 239366 122269 157009 270033
6892 270033 298367 104740 52850 272550 412547 285683 222528 379093 489342 253790
6882 253790 224364 200307 257496 347907 284911 391545 502445 520689 474132 445815 252924
6871 252924 279974 382815 514863 458670 388658 303447 413704 474490 232170 408423 256018
6860 256018 248079 400226 355981 248295 262702 390795 381667 423397 453458 402272 390917
6849 390917 377588 307575 251071 307955 433009 668365 795583 559999 221826 151076 455547
6838 455547 654137 728482 697004 720837 807798 849205 782749 753430 748991 648775 666216
6827 666216 676671 702088 785366 602013 405838 411263 687458 717196 700042 836546 690071
6816 690071 1004067 921842 953405 1148322 1118188 1273900 1324635 1472977 1559743 1491115 1509180
6805 1509180 1466478 1346722 1270430 1196554 1005199 922088 945736 832109 767057 610230 539323
6794 539323 540234 646114 658447 823597 836926 846764 704054 678105 821779 723335 747829
6783 747829 910124 745294 893530 1079629 1191977 845999 689835 668339 579204 700399
6773 700399 805361 878670 852800 783702 632880 717538 649936 619538 477942 489340 628585
6762 628585 586088 552153 592850 588773 654223 744095 697444 535428 562603 520001 465782 585211
6750 585211 582998 612756 560186 593304 528320 455735 663939 657351 495754 581509 804056
6739 804056 755584 688485 847306 818187 671702 456513 552983 594814 597328 554645 512790
6728 512790 526644 689883 630547 516286 571673 634057 859371 922091 1004532 928036 867495
6717 867495 774970 690776 737811 917498 674391 878128 1052471 1107792 1234010 1114524
6707 1114524 946259 903298 1089069 924318 1071641 1014530 994788 1083075 955913 1089399
6697 1089399 1125199 1042772 1158266 1184421 1110403 1166753 1035854 1218603 1344061 1472690
6687 1472690 1534928 1447454 1497142 1392236 1259571 1429457 1269857 1307927 1257120 952181
6677 952181 866040 977016 892397 878990 933205 873707 925939 1048950 1118091 1214312 1072566
6666 1072566 1053162 1097376 1255785 1177891 1117379 1441449 1208504 1114643 1068067 1321785 1359647
6655 1359647 1247093 1335677 1274384 1276550 1139987 1107866 1359872 1046901 1014587 1227921 1201202
6644 1201202 1272042 1180341 1306438 1166052 1096458 1049694 1010865 1106947 1075030 1057324 1143189
6633 1143189 1036741 887222 983297 966605 1199286 1210423 1144853 1335251 1353178 1187804
6623 1187804 1056121 1044130 1231316 1305807 1438116 1356454 1118524 1094007 985230 1128418
6613 1128418 1131076 1086383 1396822 1370530 1460326 1438667 1478895 1488165 1425390 1355583 1566278
6602 1566278 1699440 1597644 1413179 1566425 1414227 1183707 1395137 1540436 1586804 1379996
6592 1379996 1470263 1592173 1436414 1348789 1616708 1582427 1658634 1798608 1786663 1943435
6582 1943435 2083472 1997504 1804285 1867405 1835845 1917087 1821026 1822778 1994305 2193740 2083755
6571 2083755 1972125 2174167 2019827 2106156 2145077 1996220 1860677 1963922 2293251 2431936
6561 2431936 2437870 2357370 2319809 2476191 2500138 2470099 2238077 2287395 2472200 2357156 2301248
6550 2301248 2394107 2395330 2268122 2199976 2318735 2517029 2632520 2753445 2675501 2696264 2855349
6539 2855349 2867694 3028155 2809667 2807556 2881772 2848391 2947836 3133750 3064407 3133670 3085420
6528 3085420 3002597 3049561 3135258 3230673 3236064 3219002 3315561 3438068 3452889 3538847 3710718
6517 3710718 3562245 3575395 3533846 3648680 3856392 3969831 4101446 4213151 4427936 4212925
6507 4212925 4264458 4451469 4644533 4569398 4648231 4792561 4903054 5146503 5219727 5228103 5660332
6496 5660332 5826522 6042049 6138051 6168634 6129812 6381516 6392307 6433118 6704642 6692540 6907169
6485 6907169 7244486 7173046 7331156 7566840 7772109 7892419 8371160 8827545 9259971 9707790
6475 9707790 9977472 10285710 10868739 11634133 12367936 13042799 13566861 14052483 13903201 13772229
6465 13772229 13474177 13349534 13209408 12966307 12882683 12832103 12854503 13209344 13610567 13834955
6455 13834955 14160227 14298373 14597047 15173412 15633357 15982283 16542484 17386537 18303919
6446 18303919 19483368 20600934 21853017 23188136 24197209 24806703 24875329 24554488 24106885
6437 24106885 23564558 23019781 22601383 22581426 22557505 22705324 22966403 23100582 23182304 23706630
6427 23706630 24246065 25024366 25928091 26573521 27250603 28207818 29258164 30296992 31476473
6418 31476473 32856132 34423966 36074001 37900852 39565425 41172356 43103354 44725408
6410 44725408 46739304 49578511 52635414 56678662 61836186 67806994 74228707 80417970
6402 80417970 85498996 87933203 87032754 83723137 78908514 73655229 69096109 65305239
6394 65305239 62370948 60266145 59243321 58775683 58718036 59351961 60698316 62371989 64950868
6385 64950868 68123388 72067071 76557068 82201645 89439879 98505333 109804535 122923154
6377 122923154 137074402 150009271 159274545 161022183 154378440 141587391 126288620
6370 126288620 111548304 98717223 88510448 80750251 74838857 70334263 66770553 64121634
6362 64121634 62221949 61229505 60654760 60536514 61005174 62141543 63414252 65891954 69177463
6353 69177463 73555222 78764776 84954050 91004974 95327151 96891040 94545179 88780887
6345 88780887 81076120 73099065 65906692 59929484 54876740 50966197 47769791 45212055
6337 45212055 42994162 41186164 39716219 38368253 36937858 35233776 33800180 32793970
6329 32793970 31920409 31028317 30243672 29321054 28443464 27699512 26910247 26201368 25756195
6320 25756195 25027319 24545890 24433638 24565989 25106767 25255953 25504255 25780639 25690173 25117715
6310 25117715 24363452 23780667 23453487 22997916 22543348 22167851 22113893 22324356 22398994 22723276
6300 22723276 22929284 22737280 22121546 21042645 20070230 19158091 18305210 17637952 17287208
6291 17287208 17148841 16842153 16719482 16828386 16732844 16486370 16176083 15641347 15018673 14675879
6281 14675879 14426305 14090157 13917871 14073873 14024768 14144044 14299979 14146951 14085397 13733545
6271 13733545 13264337 12836797 12354425 11846054 11280465 10903734 10517770 10284234 10457220
6262 10457220 10494661 10311761 10237710 10046513 9898072 9892300 9554693 9196786 9004734 8870287
6252 8870287 8893823 8722892 8714000 8641739 8690737 8781776 8694966 8579153 8779923 9344089 9623497
6241 9623497 9705148 9807462 9807373 9872368 9580989 9472320 9441462 9127161 8699821 8607543 8298904
6230 8298904 8150111 8235096 7954208 7904367 7908522 7860011 7856054 7980615 8195371 8401847 8612642
6219 8612642 9277425 9653498 10111714 10906981 11437149 12045189 12341772 12031243 11428946 10680014
6209 10680014 9991883 9244346 8693559 8176344 8083572 7609828 7585804 7315411 7027576 7040554
6199 7040554 6834704 6557927 6540062 6714833 6800229 6985524 7225331 7559060 7858754 8111359
6189 8111359 8296539 8356516 8176794 8253337 7956674 7767814 7271684 6811058 6507870 6221605
6179 6221605 5797783 5693801 5559855 5344774 5171685 5121493 5242573 5038980 5045538 4965603
6169 4965603 4637691 4471094 4610045 4663251 4739830 4796633 4818527 4734303 4832615 4923180 4900857
6158 4900857 4884388 4723367 4947071 4983023 4831181 4980257 4954930 4898640 5061455 5048148
6148 5048148 5214665 5145131 5066606 5026899 4965319 5085916 5168864 5232307 5137917 4960280 5099025
6137 5099025 5409333 5500827 5584843 5582887 5844440 5713066 5515373 5673434 5787121 5717708
6127 5717708 5750878 5750340 5603004 5651278 5715606 5856913 5933096 5893834 5983377 6043897 6362795
6116 6362795 6196414 6195169 6488105 6470421 6476060 6527825 6692223 6942941 7058862 7180898 7453967
6105 7453967 7766614 7979847 8380835 8667491 8835206 8930182 9290217 9244654 9412684 9349844
6095 9349844 9126608 8889740 8714842 8756322 8605455 8617367 8517031 8885496 8676987 8699696
6085 8699696 9057671 9399392 9488791 9653689 9754642 10154257 10353530 10592495 11112585 11714592
6075 11714592 12195845 12562883 13252349 13846761 14123639 14156681 14146992 13868408 13435827 12870538
6065 12870538 12561164 12366720 12204225 12362010 12359049 12247099 12164153 12226246 12602488 12760491
6055 12760491 12571817 12548410 12893096 13232935 13472516 13531282 13947481 14639581 14977602 15383276
6045 15383276 15808610 16419117 16546695 16748532 16803492 16729264 16550562 16609264 16850092 17044056
6035 17044056 17361187 17701959 17974938 18246800 18250433 18473586 18635077 19098670 19335303 19428049
6025 19428049 19871848 20443878 21066584 21429169 22057569 22617967 23469916 24031822 24745293
6016 24745293 25276967 26195180 27292086 28283425 29309683 30593986 31980452 33601514 35339480
6007 35339480 37234009 39477938 41871284 44571696 48044032 51978636 56718537 62218862
5999 62218862 68058661 74066189 79511048 82899617 83938746 82461590 79172505 75242391
5991 75242391 71020584 67426931 64530641 62221020 60774495 59884262 59827574 60417102 61530828
5982 61530828 63250995 65805739 68847084 72524267 76832260 81805512 88071740 95737343
5974 95737343 105147717 116412539 129137557 141985427 152740425 158964744 157973990 150068198
5966 150068198 137500300 123389959 110334729 99219320 89760179 82356141 76899460
5959 76899460 72391322 68940510 66449595 65070424 64404678 64524519 65227549 66256670 67426075
5950 67426075 69066816 71387439 74591410 78912816 83877311 89218461 94127679 96983923
5942 96983923 96630507 92841280 86499432 78890551 71043464 63782921 57577465 51971970
5934 51971970 47466792 43850539 41051546 38398336 36043883 34297556 32993088 31805055
5926 31805055 30658193 29638023 28564416 27214672 26016201 24814047 23956348 23256422
5918 23256422 22571283 21814506 21161444 20861083 20473963 20255453 19981375 19663073 19412326
5909 19412326 19098728 19290206 19411451 19517058 19795775 20258330 20401336 20606357 20787295
5900 20787295 20444505 20131488 19606011 19013360 18436477 17972433 17923990 17853435 17749045 17599917
5890 17599917 17457084 17213868 17358225 17627355 17724774 17877285 18192049 18459966 18898125 19335652
5880 19335652 20108023 21043163 22040056 23273552 24344579 25393260 25470376 24848145 24198390
5871 24198390 23517385 22967958 22555551 22231667 21809550 21561860 21679466 21494291 21560884 21193130
5861 21193130 21058482 21104230 21455694 21440535 21677801 21909276 22290836 22742198 23326970 23960236
5851 23960236 24571091 25383853 26011012 26587197 27011159 27218287 27125780 27301524 27323309 27557339
5841 27557339 27659515 27911085 28264571 28577528 29141988 29524755 30170032 30684139 31345775
5832 31345775 32280193 33410892 34588720 35862165 37109704 38756042 40467604 42253515
5824 42253515 44582635 46992015 49854513 53175627 57043565 61942558 67992951 75045307
5816 75045307 82973039 91163509 98397597 102696606 102917779 99169696 92859507 85965144
5808 85965144 79421969 74394665 70449346 67233207 65289950 64281826 64178435 64560632
5800 64560632 65457385 66812352 68862780 71537393 74753354 78865673 84280157 91335904
5792 91335904 100375903 111737165 125624660 141483337 157291055 168465631 170526873
5785 170526873 163127022 149425236 133663617 118329532 105216148 94690563 86433255
5778 86433255 79635566 74524101 70317935 67309653 65136674 63429354 62106802 61276405
5770 61276405 61329431 61921910 62960276 64776658 67354729 70866807 75260169 80285442 85682773
5761 85682773 90496585 93180269 92549797 88308435 81606983 74597719 67740902 61849774
5753 61849774 57220464 53531790 50134802 47284567 44741584 42633230 40465246 38941017
5745 38941017 38080515 37357611 36632628 35823132 35254076 34778223 34027769 33455437 32911973
5736 32911973 32253167 31549728 31046038 30869503 30904127 30847969 30983954 31048559 31295090 31108327
5726 31108327 30876888 30494508 29638099 29124057 28828029 28093389 27791582 27973874 28156023
5717 28156023 28602341 29100128 29631313 29856641 29568253 29046465 28334324 27629852 26903604
5708 26903604 26329262 25890309 26165042 26565531 26987071 27611178 28248592 28306805 27609588 27117008
5698 27117008 26374935 25393678 24836929 24525950 24082053 23875226 24043585 24076682 24110300 24031414
5688 24031414 23924742 23676068 23265670 22696348 22195311 21762806 21319280 21103369 20938589
5679 20938589 20922910 21156355 21350706 21548733 21634724 21583628 21258540 20695884 20330972 19946266
5669 19946266 20069465 20120045 20064385 20203319 20615829 21071708 21617032 21723030 21780637 21815831
5659 21815831 22019296 21716502 21393192 21010703 20798275 20604419 20781708 20830071 21064800 21229468
5649 21229468 21434042 21474002 21351596 21385132 21449961 21446061 21352928 21540356 21873514 22410173
5639 22410173 22939372 23553301 24517031 25234423 25618421 25621413 25221061 24661087 23944413 23459093
5629 23459093 23378918 23379069 23571121 23697642 24152305 24767951 25268771 25591202 25277625 24830343
5619 24830343 24562051 24180000 23854402 23858160 23709554 23997481 24206029 24755786 25149643 25554760
5609 25554760 25739596 25826393 25791474 25598262 25460593 25501905 25862930 26049247 26517051 26921310
5599 26921310 27407168 28140813 28758545 29441449 29739605 29867604 30219729 30379686 30258269
5590 30258269 30296978 30247714 30368062 30741228 30920792 31073099 31646069 32199423 32889264 33792521
5580 33792521 34927425 36188933 37206711 38422458 39565601 40319642 40916324 41599864 42052727
5571 42052727 42584575 42768006 43071179 43365179 44104420 45220053 46293586 47507017 49015016
5562 49015016 50599259 52615951 55346822 58362330 61681603 64784011 68322292 71956512
5554 71956512 75833988 79893181 84518484 89760136 95979898 103895693 113343159 124211092
5546 124211092 135439422 145242848 151844340 153523223 148509275 138374513 126741227 115922315
5538 115922315 107417843 101262922 96992263 94600244 93510482 93357871 94155620 95438662
5530 95438662 97399838 99978235 103269750 106931951 111706758 117664355 125237994 135061695
5522 135061695 147101067 161195384 175495576 186738592 190400687 185544820 174061901
5515 174061901 159373588 144784669 131738363 120438665 111220633 104123487 98334143
5508 98334143 93555533 89666479 86658605 84273983 83046943 82830881 82964036 83598905 84805992
5499 84805992 86500032 88903791 91778998 95787323 100293082 104895115 108978813 111813335
5491 111813335 112111304 109589169 104531210 98249380 91876545 85984736 80943618 77149284
5483 77149284 74100521 71648255 70032509 68874296 68271633 67912065 67761239 68027240 68602048
5474 68602048 69342321 70522893 71987774 73904608 76438082 79080968 81113651 82626204
5466 82626204 83935219 85404007 86784100 88723796 90811474 93108801 94820075 95940840
5458 95940840 97032314 98327201 100289476 103259668 106764093 110917749 115485263 119766560
5450 119766560 123466390 125396358 125060263 124364356 123588323 123844166 125360483 127684796 130188299
5441 130188299 132333865 134642715 137946514 142684075 148236855 154127588 159728187 163446045
5433 163446045 164632059 164315428 164480611 166558692 170907302 177199193 182944143 186845981
5425 186845981 188037081 185677943 179571861 170702005 159820499 148446741 137954491 129212986
5417 129212986 122467850 117040308 112898276 110386409 109075049 108550327 109087988 110595102
5409 110595102 113194888 117128484 122412029 129493261 137860845 147549935 157840719 167387080
5401 167387080 174755033 178823376 179612124 176714074 170750532 163484044 156546738 151532810
5393 151532810 148840108 147784208 146995677 144487790 139603522 133474684 127960381 123950582
5385 123950582 121892294 121360241 121399417 121438303 121263386 121542505 122916648 125694401 130033228
5376 130033228 134236770 136357945 134930679 130077669 122414215 113932031 105644488 98406497
5368 98406497 92757500 88438722 85419180 83022918 80393937 77612879 74526106 71508929
5360 71508929 68736688 66165040 64094620 61987575 59512404 56191030 52738098 49145986
5352 49145986 45751177 42543538 39980657 37744639 35778720 34230712 32739927 31437830
5344 31437830 30339935 29021674 27634245 26608236 25767841 24885311 23943398 23146703 22484424
5335 22484424 21898567 21336218 20760548 20165465 19799126 19267327 18842587 18278349 17683356
5326 17683356 17364286 17011301 16727713 16242484 15966362 15824504 15397270 14723757 14270050
5317 14270050 14085687 13463124 13148027 12982711 12724934 12501162 11959314 11820830 11579912
5308 11579912 11525287 11500385 11182104 11212541 11084570 11070858 11219912 11246182 11009827 10900234
5298 10900234 10777939 10655937 10432798 10137609 10011613 9602815 9461841 9298968 9147863
5289 9147863 8844694 9066247 8912320 8675919 8705500 8336828 8347208 8312620 8231809 8257560
5279 8257560 8099618 7915969 7923120 8043556 7895656 7942709 7875663 7820506 7667860 7458137
5269 7458137 7271245 7136275 7253653 7091151 7105634 6897845 6773327 6715339 6629596 6444563
5259 6444563 6494491 6390322 6313594 6178830 6089581 6145586 6014777 6228299 6095551 6143237
5249 6143237 6066208 5855056 5739753 5890165 5677226 5566577 5512710 5520872 5445580 5281299
5239 5281299 5122695 4874120 4903897 5022471 4971376 4747733 4752222 4766238 4819645 4837101 4738768
5228 4738768 4681182 4487480 4504876 4466488 4253541 4065168 4174828 4253245 4273521 4396208
5218 4396208 4157122 4085913 3987046 4343114 4495138 4293066 4074727 4206228 4244387 4108222
5208 4108222 4019472 3966584 3947250 3798963 3855528 3979290 4029133 4059162 3945384 3912631 3925926
5197 3925926 4220394 4302353 4282524 4239194 4013488 3720846 3768916 3806793 3793527 3670252 3527035
5186 3527035 3806457 3752164 3705488 3676732 3761159 3923111 3662130 3421692 3527346 3459150
5176 3459150 3534449 3661964 3658755 3835129 3491560 3534239 3700636 3787370 3801356 3885212 3759239
5165 3759239 3524426 3621371 3586261 3616368 3577088 3607226 3617106 3371452 3295096 3424174 3407915
5154 3407915 3379707 3468951 3474528 3462287 3337947 3375901 3493052 3389787 3394025 3742254 3715406
5143 3715406 3571694 3669237 3750885 3752082 3937598 3777257 3638048 3765579 3649724 3633167
5133 3633167 3541251 3646845 3542236 3553753 3628398 3577843 3632247 3601707 3691994 3571187 3656711
5122 3656711 3685526 3511193 3881019 4093996 4140690 4130580 3948854 3783952 3699224 3711168
5112 3711168 3814939 3841347 3753385 3736414 3665014 3747771 3818287 3660395 3642583 3666760 3922940
5101 3922940 3883290 3918924 3773778 3901982 3909942 3869334 3953961 4033037 4213416 4159485 4300327
5090 4300327 4385632 4483837 4560338 4485083 4536673 4412843 4414096 4638627 4486638 4477563 4579485
5079 4579485 4514533 4460382 4593686 4565740 4407417 4499036 4639971 4937764 4946488 5065793 5032594
5068 5032594 5150072 5202296 5167267 5227894 5307837 5373384 5263525 5518248 5433670 5355481 5441060
5057 5441060 5460011 5511325 5652829 5693005 5688529 5799176 5673719 5524310 5624995 5762732
5047 5762732 5944212 5898507 5936729 6146550 6090395 5961466 6026113 6208864 6116805 6184687 6439190
5036 6439190 6356030 6409708 6512227 6463247 6415452 6210923 6367614 6200234 6152426 6190978 5933968
5025 5933968 5800135 5822221 5885807 5781754 5784137 5852177 5696272 5732192 5927054 5861754 5869938
5014 5869938 6011059 6030343 6210396 6012878 5878495 5992910 5883787 5880643 5887925 5940245 5679841
5003 5679841 5530989 5635632 5765362 5763835 5822126 5993373 6029364 6088641 5875450 5850575 5996885
4992 5996885 5955616 5981734 6179660 6079570 5787169 5870517 5971597 5884226 5786994 5689485 5857180
4981 5857180 5923788 5793118 5617591 5531708 5677762 5681690 5534535 5625524 5743070 5730484 6056226
4970 6056226 6124920 6264192 6233230 6108005 6208948 6489723 6484523 6422011 6304064 6283392 6211048
4959 6211048 6264039 6414264 6269287 6247326 6156979 6107317 6319857 6260575 6234561 6255597 6299365
4948 6299365 6163190 5871867 5776714 6081199 6190929 6403798 6476530 6358500 6386693 6480731
4938 6480731 6314423 6467899 6617110 6622091 6748033 6782057 6642870 6622251 6683882 6705508 6815177
4927 6815177 6937981 7146648 7308377 7630069 7661078 7853835 8229299 8629152 9103021 9382930
4917 9382930 9424504 9194567 8634294 8006190 7946762 7882718 7848441 7738971 7607014 7597340 7729947
4906 7729947 7647624 7642438 7742662 7790494 7893917 7927042 8155572 8316781 8284962 8279850 8359754
4895 8359754 8391432 8362158 8633308 8817411 8708821 8880176 9017749 9188565 9269498 9603619
4885 9603619 9836768 10129312 10479063 10603817 10501827 10698145 10873352 11083570 11384501 11474312
4875 11474312 11606967 11899031 12080882 12356655 12302126 12656983 13011517 13283461 13412474 13613778
4865 13613778 13947568 14112018 14390262 14800923 15186350 15693829 16042968 16469943 16723143
4856 16723143 17030744 17539717 17949074 18378806 18818065 19388933 19773519 20022466 20416924
4847 20416924 21063028 21525886 21889221 22488767 22978586 23681834 24243757 24757819 25181224
4838 25181224 25817040 26526679 27343205 28196784 29075641 29705005 30409176 31345121 31998207
4829 31998207 32959906 34068730 35116371 36045086 37191097 38374637 39352061 40602645 42263514
4820 42263514 43693953 45012784 46472985 48137299 49790774 51840100 53991914 56208120
4812 56208120 58651172 61269795 63936528 66901141 70034966 73105267 76086071 79271618
4804 79271618 82378241 85306566 88498993 91711808 94789408 97093603 99129204 100998561
4796 100998561 102231861 103242533 103899051 104798969 106012664 107244122 108800131 110917450
4788 110917450 113224339 116011711 119313735 123243329 127774987 133058077 138808896 144934215
4780 144934215 151471169 158405762 165450083 172461268 179300260 185652259 191046639 195008943
4772 195008943 197607676 198249803 197497666 195775818 193172596 190390448 187259013 184349641
4764 184349641 181660804 179105055 176954699 175561126 174737765 174468601 174483071 175074762 176413025
4755 176413025 178075070 180122612 182534485 185220209 187706000 190180055 191965306 192660675
4747 192660675 192224406 190224343 186418044 181022367 174405825 166641443 158421361 150318807
4739 150318807 142622646 134914193 127766893 121042223 114828761 109612756 105060119 100880817
4731 100880817 97588994 94935402 92737084 91054594 89793252 88966184 87977173 87262806
4723 87262806 86455752 85798796 84668875 83219839 81517954 79530330 76955074 74145530
4715 74145530 71429477 68114929 65149962 62412645 59593383 56799416 53832352 51069873
4707 51069873 48215976 45826014 43666945 41431158 39394384 37256254 35340462 33772856
4699 33772856 32440967 31154388 29815098 28909853 27960697 27258970 26735803 25753812 24779062
4690 24779062 23940328 23015316 22304193 21682054 21093868 20486916 20118126 19621546 19055738
4681 19055738 18557080 18047446 17613459 17086144 16621628 16129587 15839199 15508900 15411610 14827931
4671 14827931 14700820 14459910 14202975 14048658 13877687 13783579 13676657 13521082 13215160 13276305
4661 13276305 13313358 13208595 13079049 12786162 12936118 12949879 12848747 12630501 12653433 12609924
4651 12609924 12454161 12274847 12072439 12105529 11881086 11632268 11576788 11544145 11438696 11620051
4641 11620051 11604932 11586359 11749308 11567005 11472576 11888121 11850521 11988776 11678576 11461842
4631 11461842 11518397 11399545 11081036 10945104 10476496 10277346 10272383 10119422 9965513 9517341
4621 9517341 9397958 9133802 8975849 8736880 8799269 8583248 8593810 8860009 8790519 8966343
4611 8966343 8793479 8648344 8555165 8585685 8508158 8228847 7997493 8050627 7865345 7722614
4601 7722614 7546495 7353890 7289548 7166197 6981534 6834212 6876598 6770229 6627228 6398885
4591 6398885 6216795 6238999 6345269 6331796 6372416 6389261 6256373 6290535 6350595 6514345 6325488
4580 6325488 6279434 6562575 6704109 6996164 7363301 7130263 7033985 6906387 6661174 6469257
4570 6469257 6294451 6252789 6275801 6134701 6022556 5822066 5655866 5591627 5561071 5659735
4560 5659735 5623553 5635973 5608519 5575882 5467301 5564663 5630136 5469009 5464219 5617411 5600416
4549 5600416 5577090 5882963 6276841 6183915 5964119 5788220 5739027 5880173 5989140 5897214
4539 5897214 5887387 6040014 5910409 5792371 5704406 5568459 5583592 5594768 5581017 5772127 5791990
4528 5791990 5620971 5777313 5869906 5797938 5707967 5690220 5521577 5554464 5593152 5446750 5475932
4517 5475932 5480908 5411942 5471763 5376581 5615742 5843643 5789971 5722738 5879016 5794547 5745954
4506 5745954 5681651 5633748 5347988 5227986 5315481 5319235 5042516 5010604 5160303 4853490 4925239
4495 4925239 5105018 5209342 5433817 5243645 5334441 5308807 5181356 5322023 5345469 5441756
4485 5441756 5444167 5475971 5497804 5384250 5353056 5183005 5157912 5261161 5247338 5442752 5602064
4474 5602064 5608546 5635011 5593577 5513448 5330687 5273852 5115631 5250533 5186322 5045746 5261769
4463 5261769 5189424 5074973 5458994 5553154 5443728 5418107 5544370 5733035 5807359 5718073
4453 5718073 5703540 5972496 6049394 6490046 6849821 7097502 7468669 7918817 8876801 10148412
4443 10148412 11344411 12518282 12669346 11611650 10181766 8837922 7884238 7112348 6521760
4434 6521760 6045799 5568827 5419948 5360907 5501264 5342571 5202813 5036054 4948562 4798028
4424 4798028 4769028 4906341 4830817 4685045 4667550 4847138 4692186 4639415 4415558 4455391
4414 4455391 4615430 4630904 4622279 4461715 4651021 4728866 4956552 4926763 4965812 4814658 4886506
4403 4886506 4874215 4504170 4544164 4746713 4593304 4604616 4622068 4803253 4737809 4676332 4532614
4392 4532614 4704409 4744335 4781406 4588715 4694121 4994930 4958435 5062552 5148169 5084544
4382 5084544 5230409 5499116 5468964 5504342 5735821 5877393 5781828 5807694 5984205 6107574
4372 6107574 6199301 6175972 6336705 6363945 6357488 6677701 6655057 6626515 6472846 6457304 6415381
4361 6415381 6543494 6347178 6212523 6290058 6307955 6541321 6467788 6699240 6909292 6814780
4351 6814780 6907426 7205319 7439825 7567399 7686107 7911862 8309527 8733303 9402550 10185710
4341 10185710 10952266 11803997 12389158 12731698 13002246 13028589 12865055 12507051 11547303 10418597
4331 10418597 9435202 8582078 7970340 7498826 6995584 6650781 6515452 6234299 6236558 6240656
4321 6240656 6460041 6278487 6226152 6161048 6030449 5898943 5762844 5798339 5843249 5691602
4311 5691602 5913811 5858664 5880635 5806612 5792610 5589554 5597260 5447433 5441330 5277305 5206500
4300 5206500 5067884 4907205 4980521 5127428 5271827 5154447 5284872 5400115 5298920 4974170
4290 4974170 5102898 5030596 5078396 5063321 4963162 4988284 5153757 5270785 5160780 5102358
4280 5102358 4942411 5015625 5110583 5092747 5048986 5186950 5103474 4871605 4901660 5024268 5278026
4269 5278026 5084934 4984223 5346213 5467609 5320998 5371524 5407425 5539248 5588810 5575280
4259 5575280 5597588 5524437 5630436 5886410 5732369 5604047 5651232 5615538 5815000 5919600
4249 5919600 5931029 6135126 5954330 5936921 6052561 5925056 6057215 6198315 6126909 6095620
4239 6095620 6086438 6106110 6192014 6296356 6186941 6172475 6378376 6529873 6359937 6267708 6351775
4228 6351775 6642656 6685000 6816332 6976649 7133208 7099162 7170429 7214633 7067706 7101974
4218 7101974 7143266 7358737 7431503 7506844 7500698 7428196 7438636 7698829 7703191 7667601 8074217
4207 8074217 8326173 8405716 8431162 8461291 8599597 8538484 8643404 8700943 8943200 8962726 8910302
4196 8910302 9164085 9357675 9256427 9494535 9698924 9849252 9894660 10238873 10492368 10513499
4186 10513499 10907840 11071954 11132289 11113932 11350074 11577423 11886413 12011554 12246712 12494660
4176 12494660 12989268 13127947 13426197 13564620 13771376 13993497 14166848 14527026 14814012
4167 14814012 15180943 15634202 15956504 16317711 16585797 16816704 17278698 17874974 18495710
4158 18495710 19143065 19770266 20154760 20632397 21137868 21493458 21727587 22356038 22871179
4149 22871179 23574176 24296417 24945289 25792700 26674172 27656905 28226790 29147160 30282884
4140 30282884 31642352 32618216 33461720 34613600 35408163 36189832 37134585 37598618 38265686
4131 38265686 39191805 39873708 40650334 41564549 42626946 43817115 44894308 46106453 47263239
4122 47263239 48436238 49375281 50304624 51107285 52298717 53490994 54591729 55791539 56896256
4113 56896256 58085368 59417532 60775306 62334267 64164371 65880444 67702159 69380139
4105 69380139 70930000 72396509 74051873 75695754 77721081 79813016 82006680 84340474
4097 84340474 86706054 88754504 90846163 92546216 94153583 95418442 96940633 98411120
4089 98411120 99711203 101054990 102359408 103493401 104968012 106720898 108437479 110221963
4081 110221963 112501483 114916124 117807850 121046314 124630216 128433573 132108539 136204795
4073 136204795 140371215 144871935 149417791 153533147 157289634 160635958 163428850 165403972
$$ [...]
##END NTUPLES=NMR SPECTRUM
##END=
