##TITLE=1H_EC-3306(13)
 CDCl3
 8 sc, 
 19.12.2023
##JCAMPDX= 6.0         $$ Bruker NMR JCAMP-DX V2.0
##DATA TYPE= NMR SPECTRUM
##DATA CLASS= NTUPLES
##ORIGIN= UXNMR, Bruker Analytische Messtechnik GmbH
##OWNER= root
$$ XWIN-NMR		Version 3.5
$$ Tue Dec 19 13:47:39 2023 Russian Standard Time (UT+4h)  she@DPX200
##.OBSERVE FREQUENCY= 200.1313
##.OBSERVE NUCLEUS= ^1H
##.ACQUISITION MODE= SIMULTANEOUS
##.ACQUISITION SCHEME= undefined
##.AVERAGES= 8
##.DIGITISER RES= 18
##SPECTROMETER/DATA SYSTEM= spect
##.PULSE SEQUENCE= zg30
##.SOLVENT NAME= CDCl3
##.SHIFT REFERENCE= (INTERNAL, CDCl3, 0, 15.3172)
##AUDIT TRAIL= $$ (NUMBER, WHEN, WHO, WHERE, WHAT)
$$ ##TITLE= Audit trail, XWIN-NMR		Version 3.5
$$ ##JCAMPDX= 5.01
$$ ##ORIGIN= Bruker BioSpin GmbH
$$ ##OWNER= she
$$ F:/spectra/data/she/nmr/H-F/1/pdata/1/auditp.txt
$$ ##AUDIT TRAIL=  $$ (NUMBER, WHEN, WHO, WHERE, WHAT)
(   1,<2023-12-19 13:46:00.96 +0400>,<she>,<DPX200>,
      <created by zg, POWCHK disabled, PULCHK disabled
       configuration hash MD5:
       00 E9 B6 7A A2 85 ED C7 34 08 36 98 17 FE 4E 26
       data hash MD5: 16K
       B0 24 C0 43 B7 EA 67 AF 05 B5 2E 87 29 A5 8B 8A>)
(   2,<2023-12-19 13:46:03.59 +0400>,<she>,<DPX200>,
      <Start of raw data processing
       efp BC_mod = 2 LB = 0.24 FT_mod = 6 PKNL = 1 PHC0 = -24595.2 PHC1 = 16.65272 SI = 16K 
       data hash MD5: 16K
       A3 DC 91 5F AE 30 D5 1E 05 EA 10 A9 23 CF 9C 38>)
(   3,<2023-12-19 13:46:37.15 +0400>,<she>,<DPX200>,
      <pk PHC0 = 5.405978 PHC1 = -6.600002 
       data hash MD5: 16K
       E3 2B 17 91 DE 26 D7 F9 C9 94 F4 38 24 9C 50 07>)
(   4,<2023-12-19 13:46:40.75 +0400>,<she>,<DPX200>,
      <abs ABSG = 5 
       data hash MD5: 16K
       52 84 48 78 A1 04 50 CF B0 85 D4 BF 93 2F 43 A3>)
$$ ##END=
$$ 
$$ hash MD5
$$ B7 58 C6 6C 91 DF D6 7D 6E 73 EB C1 89 85 4A CC
##$RELAX= 
##$RELAX= 
##$RELAX= 
##$RELAX= 
##$RELAX= 
##$RELAX= 
$$ Bruker specific parameters
$$ --------------------------
##$DU= <F:/spectra>
##$EXPNO= 1
##$NAME= <H-F>
##$PROCNO= 1
##$TYPE= <nmr>
##$USER= <she>
##$AMP= (0..31)
100 100 100 100 100 100 100 100 100 100 100 100 100 100 100 100 100 100 
100 100 100 100 100 100 100 100 100 100 100 100 100 100 
##$AQSEQ= 0
##$AQ_mod= 1
##$AUNM= <au_zg>
##$AUTOPOS= <>
##$BF1= 200.13
##$BF2= 200.13
##$BF3= 200.13
##$BF4= 200.13
##$BF5= 200.13
##$BF6= 200.13
##$BF7= 200.13
##$BF8= 200.13
##$BYTORDA= 1
##$CFDGTYP= 0
##$CFRGTYP= 5
##$CHEMSTR= <none>
##$CNST= (0..31)
1 1 145 1 1 1 1 1 1 1 1 1 1 1 1 1 1 1 1 1 1 1 1 1 1 1 1 1 1 1 1 1 
##$CPDPRG= <>
##$CPDPRG1= <>
##$CPDPRG2= <>
##$CPDPRG3= <>
##$CPDPRG4= <mlev>
##$CPDPRG5= <mlev>
##$CPDPRG6= <mlev>
##$CPDPRG7= <mlev>
##$CPDPRG8= <mlev>
##$CPDPRGB= <>
##$CPDPRGT= <>
##$D= (0..31)
0 1.2 0 0 0 0 0 0 0 0.06 0 0.03 0 0 0 0 0.0002 0 0 0 0 0 0 0 0 0 0 0 0 
0 0 0 
##$DATE= 1702979160
##$DBL= (0..7)
120 120 120 120 120 120 120 120 
##$DBP= (0..7)
150 150 150 150 150 150 150 150 
##$DBP07= 0
##$DBPNAM0= <>
##$DBPNAM1= <>
##$DBPNAM2= <>
##$DBPNAM3= <>
##$DBPNAM4= <>
$$ [...]
##$SUBNAM3= <"">
##$SUBNAM4= <"">
##$SUBNAM5= <"">
##$SUBNAM6= <"">
##$SUBNAM7= <"">
##$SUBNAM8= <"">
##$SUBNAM9= <"">
##$SW= 18.0517328524113
##$SWIBOX= (0..15)
0 0 2 0 0 0 0 0 0 0 0 0 0 0 0 0 
##$SW_h= 3612.71676300578
##$TD= 16384
##$TD0= 1
##$TE= 0
##$TE2= 300
##$TE3= 300
##$TEG= 300
##$TL= (0..7)
0 120 120 120 120 120 120 120 
##$TP= (0..7)
150 150 150 150 150 150 150 150 
##$TP07= 0
##$TPNAME0= <>
##$TPNAME1= <>
##$TPNAME2= <>
##$TPNAME3= <>
##$TPNAME4= <>
##$TPNAME5= <>
##$TPNAME6= <>
##$TPNAME7= <>
##$TPOAL= (0..7)
0.5 0.5 0.5 0.5 0.5 0.5 0.5 0.5 
##$TPOFFS= (0..7)
0 0 0 0 0 0 0 0 
##$TUNHIN= 0
##$TUNHOUT= 0
##$TUNXOUT= 0
##$USERA1= <user>
##$USERA2= <user>
##$USERA3= <user>
##$USERA4= <user>
##$USERA5= <user>
##$V9= 5
##$VALIST= <valist>
##$VCLIST= <CCCCCCCCCCCCCCC>
##$VD= 0
##$VDLIST= <DDDDDDDDDDDDDDD>
##$VPLIST= <PPPPPPPPPPPPPPP>
##$VTLIST= <TTTTTTTTTTTTTTT>
##$WBST= 1024
##$WBSW= 4
##$XGAIN= (0..3)
0 0 0 0 
##$XL= 0
##$YL= 0
##$YMAX_a= 768902
##$YMIN_a= -808916
##$ZGOPTNS= <>
##$ZL1= 120
##$ZL2= 120
##$ZL3= 120
##$ZL4= 120
##$ABSF1= 15.33261
##$ABSF2= -2.719237
##$ABSG= 5
##$ABSL= 3
##$ALPHA= 0
##$AQORDER= 0
##$ASSFAC= 0
##$ASSFACI= 0
##$ASSFACX= 0
##$ASSWID= 0
##$AUNMP= <proc_1d>
##$AZFE= 0.1
##$AZFW= 0.1
##$BCFW= 0
##$BC_mod= 2
##$BYTORDP= 0
##$COROFFS= 0
##$CY= -3
##$DATMOD= 1
##$DC= 0
##$DFILT= <>
##$DTYPP= 0
##$F1P= 0
##$F2P= 0
##$FCOR= 1
##$FTSIZE= 16384
##$FT_mod= 6
##$GAMMA= 0
##$GB= 0
##$INTBC= 1
##$INTSCL= 3.70164e-10
##$ISEN= 128
##$LB= 0.24
##$LEV0= 0
##$LPBIN= 0
##$MAXI= 10000
##$MC2= 0
##$MEAN= 0
##$ME_mod= 0
##$MI= 1.114404
##$NCOEF= 0
##$NC_proc= -6
##$NLEV= 6
##$NOISF1= 3.799351
##$NOISF2= 2.8
##$NSP= 0
##$NTH_PI= 0
##$NZP= 0
##$OFFSET= 15.31719
##$PC= 1
##$PHC0= -24589.79
##$PHC1= 10.05272
##$PH_mod= 1
##$PKNL= yes
##$PPARMOD= 0
##$PSCAL= 0
##$PSIGN= 0
##$REVERSE= no
##$SF= 200.130040930135
##$SI= 16384
##$SIGF1= 3
##$SIGF2= 2
##$SINO= 5.538805
##$SIOLD= 16384
##$SREGLST= <1H.CDCl3>
##$SSB= 0
##$STSI= 16384
##$STSR= 0
##$SW_p= 3612.71676300578
##$SYMM= 0
##$S_DEV= 0
##$TDeff= 16384
##$TDoff= 0
##$TI= <>
##$TILT= no
##$TM1= 0
##$TM2= 0
##$TOPLEV= 0
##$USERP1= <user>
##$USERP2= <user>
##$USERP3= <user>
##$USERP4= <user>
##$USERP5= <user>
##$WDW= 1
##$XDIM= 16384
##$YMAX_p= 329400058
##$YMIN_p= -1080052
$$ End of Bruker specific parameters
$$ ---------------------------------
##NTUPLES= NMR SPECTRUM
##VAR_NAME=  FREQUENCY,     SPECTRUM/REAL,   SPECTRUM/IMAG
##SYMBOL=    X,             R,               I
##VAR_TYPE=  INDEPENDENT,   DEPENDENT,       DEPENDENT
##VAR_FORM=  AFFN,          ASDF,            ASDF
##VAR_DIM=   16384,         16384,           16384
##UNITS=     HZ,            ARBITRARY UNITS, ARBITRARY UNITS
##FACTOR=    0.220516191357247, 1,           1
##FIRST=     3065.42989571442, 0,            0
##LAST=      -547.286867291364, 0,           0
##MIN=       -547.286867291364, -1080052,    0
##MAX=       3065.42989571442, 329400058,    0
$$ Real data points
##PAGE= N=1
##DATA TABLE= (X++(R..R)), XYDATA
$$ [...]
12212d3954o9446J0060p032k0276Q9397M8576n7772n1598N5846K5687n8619j3439
12200i2570m5717k093M1082j4233K9495R5098K0564o7010N4077n9039M1190K574
12188C418j0614M1686j6990L7900m4953q852N4199n3004n2351K9306j20417M7437
12176i3235l5399R1975l5870l350L9099j1161R8640j59141j6363J9113L5232M113
12164f6347l6451N6780n1622l238N6804k9774R9012N0628l4736m5204M0740j61587
12152a24995M4276M7052O230J655M6526p5633R335J44219n6561m2596j9149l2723
12140e2364l2239n9815K7377N7066J2822N1185J1270j1463l3154n5313J2631q5757
12128a57754o5895J6206o0288K2713J13448K5931J2010P4346J2148M7332n8903
$$ plain form
12212 -43954 -113400 -103340 -110372 -130648 -41251 7325 -50447 -102045 -46199 -20512 -79131 -92570
12200 -92570 -138287 -140380 -99298 -113531 -84036 11062 31626 -35384 18693 -40346 844 3418
12188 3418 -7196 34490 17500 55400 10447 1595 55794 2790 -49561 -20255 -140672 -93235
12176 -93235 -128634 -36659 -72529 -75879 -36780 -47941 50699 -108442 -124805 -105692 -70460 -66347
12164 -66347 -102798 -46018 -97640 -100878 -44074 -73848 25164 75792 41056 -4148 36592 -124995
12152 -124995 -80719 -33667 -27437 -25782 20744 -54889 -45554 98665 42104 -492 -19641 -52364
12140 -52364 -84603 -144418 -117041 -59975 -47153 4032 15302 3839 -29315 -84628 -71997 -157754
12128 -157754 -223649 -207443 -267731 -245018 -131570 -105639 -93629 -19283 -7135 40197 -18706
12117a8706m7448k0281M7254L8998q8628l2355O8985N092j3641J7101l0127L2047
12105d1709n7571J119O4152k0459k0963j9173J3745O6900M5844N738l8678j3774
12093a4829P5249L9380j23726r3497N2383Q1742o3924k1186K0517k5567l1504
12082a04962J2172P9038P400l8981l9096L3168K867Q0120j6101j7668K9795o5458
12070c7706l3876K6592K1039o0411J14662m2825o1608K8610m5888L4840m0517
12059i7088O5552j7257o097r6091n5800N9243M2429M8501K7628M906q2770J5450
12047i1394P1152l3982J1750r5613J21028Q4186l4682o7618J5047p9512K041L9570
12035e8027p028k1132m3224O9359k3610M6166Q3303q2158j6805J8510n7651M21
$$ plain form
12117 -18706 -66154 -86435 -39181 -183 -88811 -121166 -52181 -47089 -60730 -43629 -73756 -41709
12105 -41709 -99280 -98161 -34009 -54468 -75431 -94604 -80859 -13959 31885 37623 -1055 -14829
12093 -14829 60420 99800 -23926 -117423 -65040 16702 -47222 -68408 -47891 -73458 -104962
12082 -104962 -92790 -13752 -6352 -45333 -84429 -51261 -48394 31726 15625 -2043 27752 -37706
12070 -37706 -71582 -44990 -23951 -84362 30300 -12525 -74133 -45523 -91411 -56571 -97088
12059 -97088 -31536 -48793 -54890 -150981 -206781 -147538 -105109 -56608 -28980 -24074 -106844 -91394
12047 -91394 -20242 -54224 -42474 -138087 -17059 67127 32445 -35173 -20126 -99638 -97597 -58027
12035 -58027 -65055 -86187 -129411 -60052 -83662 -37496 45807 -36351 -53156 -34646 -92297 -91876
12023i1876J2202N7806n2765l0010J05785J5762K0434j18161M6982O656r511p871
12011d4567n0117o7790L2324L9222r2021J19640j2162J1516N3039K8617L0594
12000D8295j2173q0560q6227O7008j5012Q1818L8326j33736k4228o1379j855M205
11988a75518J5076Q547k54l2060K4287Q906j7274J2336O7477L1155P4876j09697
11976i2143n959N8661N6928l2213r42q5484O0000l5482j00812N6878O7336O271
11964d6961P4577j34813m7444J4616M2620n0126R1672R8195n4272K157M5539l6766
11952a006J8500j3485k3309o872O6649k0332p5418m3759r8384J37200L7207n4368
11940g7377l6191n2640J7695N0838o0224O5892q029R1556m6581O6521M2479q2697
$$ plain form
12023 -91876 -79674 -21868 -74633 -104643 1142 16904 37338 -80823 -33841 -27185 -36696 -44567
12011 -44567 -94684 -162474 -130150 -90928 -182949 -63309 -75471 -63955 -10916 17701 48295
12000 48295 36122 -44438 -130665 -63657 -78669 3149 41475 -92261 -116489 -177868 -179723 -175518
11988 -175518 -160442 -151895 -152149 -184209 -159922 -151016 -168290 -155954 -88477 -57322 17554 -92143
11976 -92143 -98102 -39441 17487 -14726 -15668 -101152 -41152 -76634 -177446 -120568 -53232 -46961
11964 -46961 27616 -107197 -154641 -140025 -97405 -147531 -55859 42336 -11936 -9779 35760 -1006
11952 -1006 17494 4009 -19300 -26172 40477 20145 -55273 -99032 -197416 -60216 -23009 -77377
11940 -77377 -113568 -166208 -148513 -97675 -157899 -92007 -100036 -8480 -55061 11460 53939 -28758
11928b8758O5452l7656q6075N373k8179J0206L281M228k5534R4550m6510R0456
11916B0834L4387q1625m2834o1915O2293L6025r3896l5313l9513N1494R2010n2081
11904a10134l3864K0864P5624m103N3058K0609j28857M159n7604J04195l3452
11893h9505J7048j7O5679o106l1585j2793M120q7732N903Q8987p8553k6067m0762
11880a91383J08391L2246j61356M7050O5083N7043J1617J6979P3570m5464j25353
11869a11577l6250P7423m1333o1678J5459M3840j3179N11P7427M3550o6027m0087
11857a11921j5092M3303K2097J4172p8804p489l0169L7965k4759Q3701J2545j8701
11845g3152o4346p4347P6980O7514l0209m3453r238m4106L4652J48549j41662
$$ plain form
11928 -28758 36694 -962 -87037 -81664 -109843 -99637 -96356 -92128 -117662 -23112 -69622 20834
11916 20834 55221 -26404 -69238 -131153 -68860 -32835 -126731 -162044 -201557 -150063 -58053 -110134
11904 -110134 -143998 -123134 -47510 -51613 1445 22054 -106803 -102644 -160248 -56053 -89505
11893 -89505 -72457 -72474 -6795 -12901 -44486 -57279 -53159 -140891 -134988 -46001 -124554 -150621 -191383
11880 -191383 -82992 -50746 -212102 -165052 -99969 -42926 -31309 -14330 59240 13776 -111577
11869 -111577 -147827 -70404 -111737 -173415 -157956 -114116 -127295 -126784 -49357 -5807 -71834 -111921
11857 -111921 -127013 -83710 -61613 -47441 -126245 -133734 -163903 -125938 -150697 -66996 -54451 -73152
11845 -73152 -137498 -211845 -134865 -67351 -97560 -141013 -150251 -194357 -159705 -11156 -152818
11834a52818R9173L6123j8622p0091o655L9492K5569k9321n2690m1148m2348N0912
11822a62424L5753L1821o4326O8687q080l6041o4227J15264L7l3328O0088o1116
11810a17892o2222L9621Q4584K9319k5922p7289M9832k8452k7345o1194J00128
11799i6832N2931k4665m5278Q511J3789l2558L9627j2194J12344j3364P1705k7046
11787D6970j06508m0822L3913K5432p1977L184P1443p5991p1392J03010K9092
11776e3646n9339k070o2225N3516O7458j3765N7460K1140q0284O2751N3198j33235
11764h9041n6375O7448Q3811L3457L2923q7373m2241J29138r1049K2386K127J0396
11752A5607m6705o0460o3924Q9251K211q7284R2858r7158L2587M5855r4460J3535
$$ plain form
11834 -152818 -53645 -17522 -36144 -106235 -112890 -73398 -47829 -77150 -129840 -170988 -213336 -162424
11822 -162424 -126671 -94850 -159176 -90489 -98569 -134610 -198837 -83573 -83536 -116864 -56776 -117892
11810 -117892 -180114 -140493 -55909 -26590 -52512 -129801 -79969 -108421 -135766 -196960 -96832
11799 -96832 -43901 -68566 -113844 -105333 -91544 -124102 -84475 -96669 15675 2311 74016 46970
11787 46970 -59538 -100360 -66447 -41015 -112992 -109808 -38365 -114356 -185748 -82738 -53646
11776 -53646 -112985 -115055 -177280 -123764 -56306 -70071 -12611 8529 -71755 -9004 44194 -89041
11764 -89041 -145416 -77968 5843 39300 72223 -15150 -57391 71747 -19302 3084 5211 15607
11752 15607 -31098 -91558 -155482 -66231 -64020 -151304 -58446 -155604 -123017 -77162 -171622 -158087
11740a58087L6031J4650M2682n9284L8592j1949m6930N674m5789M9028o203k6356
11728a67941L0060L9204o1276o3828l5602J20891J10883p6473l8670n9058l1479
11717b33289O8546K0942K3217P5068L0052o1807n3830O032j09249P2880j8536
11706a79974O3610k8243j2446k5313L6495o9390o7724J05481N4551k511q6394
11695b11858M1097M9674L3045J25411K5583o7041l7370j09211J6084L1044Q2668
11684b0874o9717Q793j18319L0239M6575n4603J30060j0943K6471j9684J01773
11673D9771q5659j44596J06515l4995j5688j6971p666O9895p619l0206L1906Q660
11661g6653O6233L3536K3935j7667n969o7841j33677k4414L0576P2776q4803M5542
$$ plain form
11740 -158087 -122056 -107406 -64724 -124008 -85416 -97365 -144295 -138621 -184410 -135382 -141585 -167941
11728 -167941 -137881 -98677 -159953 -223781 -259383 -138492 -27609 -104082 -142752 -201810 -233289
11717 -233289 -164743 -143801 -120584 -45516 -15464 -77271 -131101 -125069 -234318 -161438 -179974
11706 -179974 -116364 -144607 -157053 -182366 -145871 -215261 -282985 -177504 -122953 -125464 -211858
11695 -211858 -170761 -121087 -88042 37369 62952 -4089 -41459 -150670 -134586 -103542 -20874
11684 -20874 -90591 -81798 -200117 -169878 -123303 -177906 -47846 -58789 -32318 -52002 49771
11673 49771 -35888 -180484 -73969 -108964 -124652 -141623 -149289 -79394 -87013 -117219 -85313 -76653
11661 -76653 -10420 23116 47051 29384 23415 -44426 -178103 -202517 -171941 -99165 -183968 -138426
11649a38426j05423J05504k6194j02714J07537P0223Q786o3666L2334L7898O7172
11638f969j71329K8390N1603k8974j1682o7663J13361Q5278p198p9939j2547J14383
11626F714o4151K9196o6125j16826O1876K9052l4128L8626N8029j4243n9633l9397
11614a71010P7944q9190P0409L8188j2103K0963r2252q0050R1621j283j5430O7749
11602i4444k040Q0882j7335J5860r3364K0798O6209o4518N2385j1353q9491J2042
11590a24369j4216j46333l6839J50228M6088R519J4742l1591N352k7910P0162
11579h5167J4615l1331J03403j6356p2712K8105Q6958j35846L2573p3936k2878
11568a72572M6282J4949J7487p8924M1614k7342k246o420O945m9448M4808P7755
$$ plain form
11649 -138426 -243849 -138345 -164539 -267253 -159716 -89493 -80707 -144373 -112039 -74141 -6969
11638 -6969 -178298 -149908 -98305 -127279 -138961 -206624 -93263 -7985 -15183 -95122 -107669 6714
11626 6714 -57437 -28241 -94366 -211192 -149316 -120264 -154392 -115766 -57737 -71980 -131613 -171010
11614 -171010 -93066 -182256 -111847 -73659 -85762 -64799 -157051 -237101 -145480 -146763 -162193 -94444
11602 -94444 -96484 -15602 -32937 -17077 -110441 -89643 -23434 -87952 -35567 -46920 -136411 -124369
11590 -124369 -138585 -284918 -321757 -171529 -125441 -115922 -101180 -132771 -127419 -155329 -85167
11579 -85167 -70552 -101883 1520 -14836 -87548 -59443 27515 -108331 -75758 -149694 -172572
11568 -172572 -126290 -111341 -93854 -172778 -131164 -158506 -160752 -167172 -160227 -209675 -164867 -87112
11556h7112j9392K5904o6038J6793L0116O0600m0694M810j068n5233j4479l2327
11544a78120O1209J7568l1509k1320J00716j2069N4356J15424n5500o6798l8938
11533e4981r3262L3554K1020k6950N7654O0804o6493J2342m9297k481J7584n7786
11521a48292R924M1888k6015m7598J215q341N5511L8153o6736p832n5252j8065
11509b31440J22902M5910j45973l8198N3352P5498l9937p7790O6643P6451m217
11498i6799O220N2739l5665j7211k218L9091n2606j13540M0176p8067P7952k643
11486a82571J1151N9506o9685M4890l0744p2595R4420L7987K4682P12l0600j28078
11474b40925m3671J62861K8667k6649k8721M1659R428K8851K5892l0435n2322
$$ plain form
11556 -87112 -106504 -80600 -146638 -129845 -99729 -39129 -79823 -75013 -76081 -131314 -145793 -178120
11544 -178120 -116911 -99343 -130852 -152172 -51456 -63525 -9169 106255 50755 -16043 -54981
11533 -54981 -148243 -114689 -93669 -120619 -62965 -2161 -68654 -56312 -105609 -108090 -90506 -148292
11521 -148292 -138368 -96480 -122495 -170093 -168878 -177219 -121708 -83555 -150291 -158123 -213375 -231440
11509 -231440 -108538 -62628 -208601 -246799 -193447 -117949 -157886 -235676 -169033 -92582 -96799
11498 -96799 -90579 -37840 -73505 -90716 -92934 -53843 -106449 -219989 -179813 -257880 -179928 -182571
11486 -182571 -171420 -111914 -181599 -136709 -167453 -240048 -145628 -107641 -82959 -82247 -112847 -240925
11474 -240925 -284596 -121735 -93068 -119717 -148438 -106779 -97351 -68500 -42608 -73043 -125365
11463a25365o4151n4850o5116M7226J14407k3634J24794J3309l8463o8248N9214
11452h0877K0433m5847k7267l0328J07362K2561j49269P8648q8671j4436N0910
11441a56781k7059j4142J0500l6083O4391J2393k143N6068l8711n0595k9520O8958
11429a42724o4590q641N2237M6839M2156N0942j02059n9178p6079Q0622M8817
11418a31658K4533O2040M6282l0642j00034q018n2336k439J11154J00149j03645
11407h4614p7290Q3239l595k7724L5734k8488j3476l399q8926Q565O6141O891
11395a26942L7702j9227r912l9958m1900P0291n4522M9817p1126l1247M5694n7336
11383b48666N6245m2996k363Q8689K886q3148L6558P39Q3967k8592n9630j354
$$ plain form
11463 -125365 -189516 -244366 -309482 -262256 -147849 -171483 -46689 -33380 -71843 -140091 -80877
11452 -80877 -60444 -106291 -133558 -163886 -56524 -33963 -183232 -104584 -193255 -207691 -156781
11441 -156781 -183840 -197982 -187482 -223565 -159174 -146781 -148924 -92856 -131567 -182162 -211682 -142724
11429 -142724 -207314 -215955 -163718 -116879 -74723 -23781 -125840 -185018 -261097 -180475 -131658
11418 -131658 -107125 -45085 1197 -29445 -129479 -137497 -189833 -192272 -81118 19031 -84614
11407 -84614 -161904 -78665 -82260 -109984 -74250 -102738 -116214 -119613 -208539 -199974 -133833 -126942
11395 -126942 -89240 -108467 -118379 -158337 -200237 -129946 -184468 -134651 -205777 -237024 -191330 -248666
11383 -248666 -192421 -235417 -237780 -149091 -146205 -229353 -192795 -192056 -108089 -136681 -196311 -197665
11371a97665J03865J9785j33577J03930j5112o0715K4043p1859J2234M6223P6452
11360i2396r4535q4791J05891L7295P900L7699K2661J348p0757O2547J749j44809
11348b10198J51638p6342o2025K3160L9619M2254q3979l7577K4638k6065J3654
11337b01223K3985K0427l1244j2006K4857K2852o5818J3186O1410J3011p2260
11326b02823n9753R5939M1709k2650O598j2560o5753R7691n3119o2276P8862j67752
11314c25887K8101J47438K9141j37734n4283M6818J06355P362q2022l7194M2330
11303b29575m2856M8208O4892p5080l7991L2298Q1300j9905L1839l31K7959L9221
11291h0021m2909k5150M2311K3616j5744p5666L3324k0999K5235l4310m3972k0946
$$ plain form
11371 -197665 -93800 -74015 -207592 -103662 -118774 -179489 -155446 -227305 -215071 -168848 -92396
11360 -92396 -186931 -271722 -165831 -128536 -120636 -82937 -60276 -58928 -129685 -67138 -65389 -210198
11348 -210198 -58560 -134902 -196927 -173767 -134148 -91894 -175873 -213450 -188812 -214877 -201223
11337 -201223 -177238 -156811 -188055 -200061 -175204 -152352 -218170 -204984 -143574 -130563 -202823
11326 -202823 -262576 -166637 -124928 -147578 -140980 -153540 -219293 -121602 -174721 -236997 -158135 -325887
11314 -325887 -297786 -150348 -121207 -258941 -313224 -266406 -160051 -152689 -234711 -271905 -229575
11303 -229575 -272431 -224223 -159331 -234411 -272402 -240104 -158804 -178709 -146870 -147201 -119242 -80021
11291 -80021 -122930 -148080 -105769 -82153 -97897 -173563 -140239 -161238 -136003 -170313 -214285 -235231
11279b35231O2150k7416M2616R850j2312j8410O1962j9891j19891Q892O8499K1462
11267a57720Q091k9054j0757p712j4330K9011L968P2983l906M131j243R074L6428
11254f1036l3708l1578K6352p5849j8543j09935R2194N6097L215P867L6423k3040
11242a31541l5384P5332m9029l4681P66p4428o409O8477R4875j3636j33594m9255
11230b88507O2821J21017N9011k1538K8653J7167j09986j03419M6167k0123r6964
11219c05701P8357l220L4517o9921j6366o2071N4165J01328J6002o1533l9074
11208b73517J05344N5130q2907l6418O525K403K2741l5398R3422r7621Q1047P7018
11196h2231l5072p3111m4620l8498r4904J21586o6077q061p7110O4194J12181
$$ plain form
11279 -235231 -173081 -200497 -157881 -148031 -160343 -178753 -116791 -136682 -256573 -247681 -179182 -157720
11267 -157720 -149629 -178683 -189440 -197152 -211482 -182471 -178503 -105520 -109426 -105295 -106538 -97464 -61036
11254 -61036 -94744 -126322 -99970 -175819 -194362 -304297 -212103 -156006 -152791 -144924 -108501 -131541
11242 -131541 -166925 -91593 -140622 -175303 -174537 -248965 -255374 -186897 -92022 -105658 -239252 -288507
11230 -288507 -225686 -104669 -45658 -67196 -38543 -21376 -131362 -234781 -188614 -208737 -305701
11219 -305701 -227344 -230564 -196047 -265968 -282334 -344405 -290240 -188912 -172910 -234443 -273517
11208 -273517 -168173 -113043 -195950 -232368 -225843 -223440 -200699 -236097 -142675 -240296 -159249 -82231
11196 -82231 -117303 -190414 -235034 -273532 -368436 -246850 -312927 -320988 -398098 -333904 -221723
11185b21723P0959j0793N3495K761L6930o0568m9918J37939r392q7992L6946Q7473
11173a3883o4884n8234r7262n6540j7889K5969N8262N181n508L0072K9180L6855
11161a28681o8730L2307N6875l8536k9062P1772k5651j20676k4079Q9073n0938
11150b36326K146J7933L9226M3291k371m7074j1854M0158q5855j2844K6409K9796
11138a97365N415m7039M9948k5570J3762Q6821K6777o6992Q4643r1668j56959
11127c18227M1894O1472R340O1385J15436n5136l18j402n7616m5772m427j4144
11115b07515O6844M0869p6196q949j2834o3403P2049N4070j7978j04191K4313
11104b32921O8677J4842m4380n2780R9553l3873o614K5426Q6533m1318J3177k1083
$$ plain form
11185 -221723 -150764 -161557 -108062 -105301 -68371 -128939 -178857 -40918 -50310 -138302 -101356 -13883
11173 -13883 -78767 -137001 -234263 -290803 -308692 -282723 -224461 -219280 -224788 -194716 -165536 -128681
11161 -128681 -197411 -165104 -108229 -146765 -175827 -104055 -129706 -250382 -274461 -185388 -236326
11150 -236326 -234180 -216247 -177021 -133730 -136101 -183175 -195029 -154871 -240726 -253570 -227161 -197365
11138 -197365 -191950 -238989 -189041 -214611 -200849 -114028 -87251 -154243 -69600 -161268 -318227
11127 -318227 -276333 -214861 -205521 -144136 -28700 -83836 -84154 -85556 -143172 -188944 -193371 -207515
11115 -207515 -140671 -99802 -175998 -184947 -197781 -261184 -189135 -135065 -153043 -257234 -232921
11104 -232921 -164244 -149402 -193782 -246562 -147009 -180882 -187496 -162070 -75537 -116855 -103678 -124761
11092a24761l4412M5127l3177M9146L1062j25438j9678O7960K411n9622M7144
11081a54238M5648J1809j05967L1196q107N5358N8843j568k143o5196m9686L3605
11069a50446K2486m6957M5220L6614O042m2755N1482J01595P1616j64467n8637
11058a28207J14199J3765n3556q3660K1048N4107j19649l9369M717R3787j4457
11047a37275J1760N8723R76n2873N1524o4758O4091k7054p8325k835N9351O3889
11035e2806M313k4352M6752k1877j4858P1174j13829j20739J16936m5069p8378
11024b32733N1744N7027j11727m4437O9601n2256J42832O5248n9245P357L95m9274
11012a55468L338K0085J7974j6676L1838q7626Q9369m0614j75025R4224M3320
$$ plain form
11092 -124761 -159173 -114046 -147223 -98077 -67015 -192453 -212131 -144171 -141760 -201382 -154238
11081 -154238 -108590 -96781 -202748 -171552 -179659 -124301 -65458 -67026 -69169 -134365 -184051 -150446
11069 -150446 -127960 -174917 -129697 -93083 -87041 -129796 -78314 23281 94897 -69570 -128207
11058 -128207 -14008 -243 -53799 -137459 -116411 -62304 -181953 -221322 -216605 -122818 -137275
11047 -137275 -125515 -66792 -65816 -118689 -67165 -131923 -67832 -94886 -173211 -176046 -116695 -52806
11035 -52806 -48493 -72845 -26093 -47970 -62828 8346 -105483 -226222 -109286 -154355 -232733
11024 -232733 -180989 -123962 -235689 -280126 -210525 -262781 -119949 -54701 -113946 -106589 -106194 -155468
11012 -155468 -152130 -132045 -114071 -130747 -98909 -186535 -97166 -137780 -312805 -218581 -175261
11001a75261K8608K4484M3340N594O7149N2045p9266j13198R5960j1065j8874
10990h0484M1812j3851r9893r2834N6739N3876L7682L066J8753p5474r642Q7295
10978g2955K4944m4801j5769k531K7697J3133j0652K918m9346r971Q083n564M0036
10965i4778o7549K8193j21332J8618Q3772j2666J5624O9865N068K8268J26608
10954G9691o9231j25487Q4948J5420k5297J06289l0013m5863L3144r2757k5621
10943i4777J6751k6554j1899M097n8725n8859l8847R9875J3885N5411K7655k2903
10931i4890o6168L1752Q0461n7982j7689j7077o910j172n6146N1601J4710m1346
10919a80856M9689j2526K6150r252q195j56667L9582R179N4081J2642J7013j9886
$$ plain form
11001 -175261 -146653 -122169 -78829 -73235 -6086 45959 -33307 -146505 -50545 -61610 -80484
10990 -80484 -38672 -52523 -152416 -245250 -188511 -134635 -96953 -93887 -75134 -150608 -160250 -72955
10978 -72955 -48011 -92812 -108581 -111112 -83415 -70282 -80934 -78016 -127362 -137333 -129250 -134814 -94778
10965 -94778 -162327 -134134 -255466 -236848 -153076 -165742 -150118 -80253 -75185 -46917 79691
10954 79691 10460 -115027 -30079 -14659 -39956 66333 36320 -9543 23601 -69156 -94777
10943 -94777 -78026 -104580 -116479 -112382 -171107 -229966 -268813 -168938 -155053 -99642 -71987 -94890
10931 -94890 -161058 -129306 -48845 -106827 -124516 -141593 -148503 -149675 -205821 -154220 -139510 -180856
10919 -180856 -131167 -143693 -117543 -126795 -134990 -291657 -252075 -242896 -188815 -176173 -159160 -179046
10907a79046o571j2668l8267k172L1069N9145o5972P1682K4031k1427q4644O6799
10895a58041L3966j8737o4897p8383L4684J68312l2289m9554J1350o9906j14832
10884c38327L6456J37355o8632k846N4362J6708o7085j550L9528N018K43L8175
10872a50595k3953k4535j09509L4487l5787P662J12342M9085j7906k1005n9294
10861b39008Q8298R8049j76361L3448l4725m1894J27867J0859K1409M119j54866
10850b62805P0832R0091q7824k2896m6394K3194K1508j45N933J8217N3334K4575
10838a12380m0232n5490j0704J4550J56416j37418L0380J43064m3530n3430k3994
10827a32768p209K1457K4816q8186P5751r985k6360L7015L7886p1317n3709K3338
$$ plain form
10907 -179046 -185617 -198285 -236552 -238724 -207655 -148510 -214482 -142800 -118769 -140196 -224840 -158041
10895 -158041 -124075 -142812 -207709 -286092 -251408 -83096 -115385 -164939 -153589 -223495 -338327
10884 -338327 -301871 -164516 -233148 -235994 -181632 -164924 -232009 -233559 -194031 -189013 -188770 -150595
10872 -150595 -174548 -199083 -308592 -274105 -309892 -302230 -189888 -140803 -158709 -179714 -239008
10861 -239008 -150710 -52661 -229022 -195574 -230299 -272193 -144326 -133467 -112058 -107939 -262805
10850 -262805 -191973 -101882 -189706 -212602 -258996 -235802 -214294 -214439 -208506 -190289 -136955 -112380
10838 -112380 -152612 -208102 -218806 -204256 -47840 -185258 -154878 -11814 -55344 -108774 -132768
10827 -132768 -139977 -118520 -93704 -181890 -106139 -116124 -142484 -105469 -67583 -138900 -192609 -169271
10815a69271J01046l2697p674j23200l4747O8448N7778n604p1279l1946J2583
10804b36563P820K8644K5081m9769J933M4435M650j11699N480O8104J7831k5873
10792b19926k9759M38J42310L5448m1989L7167j12707J968k8330j27355m495M3553
10780c03677J9121P1770l5542n3740M7319P411Q8778N7751r1989j62478o6612
10769d21888J7581J52572j25441J32500K8620j78607k2143P889L7772R1172J69898
10758a10075n1685l3225N463m2226M0416m1910j23684o758L5364L0360n1840L7270
10746c12530M6308O7009K0915O95L4194j4870n224R624n8466q4859R2055l9832
10734b44981j0235P0274L3062N5591L1627k7570o2474l525N0189p6314n8680P3789
$$ plain form
10815 -169271 -68225 -100922 -108596 -231796 -266543 -198095 -140317 -145921 -217200 -249146 -236563
10804 -236563 -228743 -200099 -175018 -224787 -222854 -178419 -173769 -285468 -279988 -211884 -194053 -219926
10792 -219926 -249685 -249247 -106937 -71489 -113478 -76311 -189018 -187050 -215380 -342735 -347230 -303677
10780 -303677 -284556 -212786 -248328 -302068 -254749 -247338 -158560 -100809 -192798 -355276 -421888
10769 -421888 -404307 -251735 -377176 -244676 -216056 -394663 -416806 -408917 -371145 -279973 -110075
10758 -110075 -161760 -194985 -189522 -231748 -191332 -233242 -356926 -363684 -328320 -297960 -349800 -312530
10746 -312530 -266222 -199213 -178298 -177603 -143409 -158279 -163503 -153879 -212345 -297204 -205149 -244981
10734 -244981 -255216 -184942 -151880 -96289 -64662 -92232 -154706 -158231 -108042 -184356 -243036 -169247
10722a69247l8215Q637k0007K3701j818k5283J44041q439r0834l527m0366J6368
10710b04989K401L5089J03653p5326l2702k3101k064K4599O7080J2222l7197j04828
10698b35163O728N3312J9165L3500O1915m3206o6160J6785k1904q3905j2982J21807
10686a50108j135M2282j33181K502K0727J1499m0487O1836Q724r9344l6033R7386
10674b15332L5180o3022o850k1163J6086L702J52531k6558j80083k0599J70727
10663a55381j8835n3668l9657J01861M9909O1938r9615P350J6538K7630m9686
10652a51616j19195K4962M9173L5358N383L6505j22756J12637K6585l7333r9783
10641b40080M792N1187P8383K7220q7114l5270K4489K079j1755J16943k5907j29180
$$ plain form
10722 -169247 -207462 -198825 -218832 -195131 -196949 -222232 -78191 -86630 -177464 -180991 -221357 -204989
10710 -204989 -202588 -167499 -63846 -139172 -171874 -194975 -197039 -172440 -105360 -93138 -130335 -235163
10698 -235163 -228435 -175123 -155958 -122458 -60543 -103749 -169909 -153124 -175028 -258933 -271915 -150108
10686 -150108 -151243 -108961 -242142 -239640 -218913 -207414 -247901 -186065 -177341 -276685 -312718 -215332
10674 -215332 -180152 -243174 -250024 -271187 -255101 -251399 -98868 -125426 -305509 -326108 -155381
10663 -155381 -174216 -227884 -267541 -165680 -115771 -53833 -153448 -146098 -129560 -101930 -151616
10652 -151616 -270811 -245849 -196676 -161318 -155935 -119430 -242186 -129549 -102964 -140297 -240080
10641 -240080 -235288 -184101 -105718 -78498 -165612 -200882 -176393 -174314 -186069 -69126 -95033 -224213
10629b24213j801n7903j0478Q4766j3376J71874p3508j51529m878Q8164J2635
10618a80247J5609K2400p2433J7027m504j8002j8749m3760O2049L4470N37J13753
10606g1850O8896r0644j55382J08293J5363L9290J1724j29394Q0918j3342j12783
10595b48911K8593l398L3049m8490Q3470j41995K2996M9545K0843J18058j00959
10584a87199Q5696M5002o6385l9054J4378L1132q5535K2126N5725k143N8608l3152
10572a00801N8382l0664k6486J645K3090M4280p9800R9864l5113o3606o6171n2604
10560b27984K328j8048J20051J50274L5280j06033j32981K9964q3897J4613l0317
10549b46750R0400O9309m7894L4487o6926j00920Q4419j5053L2291Q2654R997
$$ plain form
10629 -224213 -226014 -283917 -294395 -209629 -223005 -51131 -124639 -276168 -281046 -192882 -180247
10618 -180247 -164638 -142238 -214671 -197644 -202148 -220150 -238899 -282659 -220610 -186140 -185603 -71850
10606 -71850 -2954 -93598 -248980 -140687 -125324 -86034 -74310 -203704 -122786 -136128 -248911
10595 -248911 -220318 -223716 -190667 -239157 -155687 -297682 -274686 -225141 -204298 -86240 -187199
10584 -187199 -101503 -56501 -122886 -161940 -147562 -116430 -201965 -179839 -124114 -126257 -67649 -100801
10572 -100801 -42419 -73083 -99569 -97924 -74834 -30554 -110354 -10490 -45603 -109209 -175380 -227984
10560 -227984 -225656 -243704 -123653 26621 61901 -44132 -177113 -147149 -231046 -216433 -246750
10549 -246750 -156350 -87041 -134935 -100448 -167374 -268294 -183875 -198928 -166637 -83983 -73986
10538g3986k2168o078l3096O1299N9723j46508K736Q3006l3336p2201N9619K4493
10526i6497L1081n0584k5608J321O9100k1779j2321j08455R4471J43573n9617
10515c5315o3928N9916K7233j63081j0493K7807p2680O648L885J43060K4414P7564
10503B5030j47369m91m3182M7387R6712Q0146l0555j18202M5987k1870n7089l8208
10491a61704L0493M6414o4615l9788N9795L4158k9848p1211n7831m7589N709O2313
10479b33704k066J30316o0978n2213O4556m0464l5136Q4590L022N9495l2355n5161
10467a70098R6220o7189o5155r213L4915O2141O6984j7128q2208P3551K8025j00712
10455a49867P8234J1892k3512N3855k0871p1268Q7233l8887R5167l7264m5881
$$ plain form
10538 -73986 -96154 -102232 -135328 -74029 -14306 -160814 -158078 -75072 -108408 -180609 -120990 -96497
10526 -96497 -65416 -116000 -141608 -140287 -71187 -92966 -105287 -213742 -119271 24302 -35315
10515 -35315 -99243 -39327 -12094 -175175 -185668 -157861 -230541 -223893 -220008 -76948 -52534 25030
10503 25030 -122339 -122830 -166012 -118625 -21913 58233 27678 -90524 -44537 -66407 -123496 -161704
10491 -161704 -131211 -84797 -149412 -189200 -129405 -95247 -125095 -196306 -254137 -301726 -296017 -233704
10479 -233704 -235770 -105454 -166432 -218645 -154089 -194553 -229689 -145099 -142077 -82582 -114937 -170098
10467 -170098 -73878 -141067 -206222 -215435 -180520 -118379 -51395 -68523 -150731 -77180 -49155 -149867
10455 -149867 -71633 -59741 -83253 -29398 -50269 -121537 -34304 -73191 21976 -15288 -61169
10444f1169o3414J4807P8215M0933L9759J1994j3716J06669p6795r0907j4022
10433b7646m0175O4545o184j03568J27540p1474m2159j71544L88J07418Q8941
10422g3918O5985k5906k7117o4581O0498L3065L9654l7611m0186j6061m3040l4122
10410a63340P0260l3175l8722Q0444K3201J2640p6468N8970o1697K7474K8111
10399g2302l9616J90708K34j265r9272j78280O1677Q6089Q846K4920K6O9671r8796
10386d7360j3877M2316m3171J11609K3555p4872j2425j20277o7811L7392M9408
10375a15513L7239m5220P9692J01338l4600n5910k5839J02851k2254L3754Q86
10364E6424L4210J2531j05922o3990J19919J02619o634j17124M3314k5330P2841
$$ plain form
10444 -61169 -124583 -109776 -31561 9372 49131 61125 47409 154078 77283 -13624 -27646
10433 -27646 -67821 -3276 -9460 -113028 14512 -56962 -99121 -270665 -270277 -162859 -73918
10422 -73918 -7933 -33839 -60956 -125537 -65039 -31974 7680 -29931 -70117 -86178 -129218 -163340
10410 -163340 -93080 -126255 -164977 -84533 -61332 -48692 -125160 -66190 -127887 -100413 -72302
10399 -72302 -111918 78790 79024 77759 -21513 -199793 -138116 -52027 -43181 -18261 -18235 51436 -47360
10386 -47360 -61237 -18921 -62092 49517 73072 -1800 -14225 -134502 -202313 -164921 -115513
10375 -115513 -78274 -123494 -43802 57536 22936 -32974 -58813 44038 21784 55538 56424
10364 56424 90634 103165 -2757 -66747 53172 155791 149157 32033 75347 50017 122858
10353A22858K2135j356L8693J7242j36168O7765O7768K5135J10975r7433m371
10342B33243N040M3808M2849n8860m5722P7405n6209J61898N1599j65172j2208
10331B77671J62449p4059L7290k6068j6624O8968k5332k5073o9728J07289L7571
10320D54354M6032R4647K7939O3660M7075O516r8349n6502N9708O0642N0460m026
10308G52156j0692R4223M363J1727J26648j2993N5759M8990M7044R6462J04677
10297A318364J22559J07297Q5310k063M0633J52938J47990K07720M0193M9895
10287B270836J22372N6120M1226N6821J50025l6705K4771M3552M7274J49259J86890
10276C112441K50144K48184K13504L97412L43797N12565N07482M43497N73894
$$ plain form
10353 122858 144993 143637 182330 199572 63404 131169 198937 224072 335047 237614 233243
10342 233243 238283 282091 324940 266080 220358 297763 241554 403452 455051 289879 277671
10331 277671 440120 366061 403351 377283 360659 429627 404295 379222 309494 416783 454354
10320 454354 500386 595033 622972 686632 733707 740223 641874 585372 645080 705722 756182 752156
10308 752156 741464 835687 840050 851777 978425 965432 1021191 1070181 1117225 1213687 1318364
10297 1318364 1440923 1548220 1633530 1631467 1672100 1825038 1973028 2180748 2220941 2270836
10287 2270836 2393208 2449328 2490554 2547375 2697400 2660695 2685466 2729018 2776292 2925551 3112441
10276 3112441 3362585 3610769 3824273 4221685 4565482 5078047 5585529 6029026 6602920
10267F602920M63991L71572J08406J06360j72256k29477l62457n79686m40699
10258E868674n86125n11988l94908m25424l18221l29156l14829j62759j58891
10249B666373k31255k12836j81781q6649j85587j28657n206p4202P3396k6814
10239A606782q2026p5229k1602n83q2019J5308j6951j23231o0055l6239j23510
10228A000645K5814m2835k0357L2130j09403j53466J7048L8058n8978r0711j256
10217F36689o7981j06511M5420p5966R7595O6393r3619k5117O5008N5185o8702
10206E28394j4804P223j7648n4564K6287q3133K9355k1796O1344K3426k9189M7398
10194E02293K8002l032P7253j7261k6072j49866K5869K8138o5763J26489k1P7045
$$ plain form
10267 6602920 7066911 7438483 7546889 7653249 7480993 7251516 6889059 6309373 5868674
10258 5868674 5282549 4770561 4375653 3950229 3632008 3302852 2988023 2825264 2666373
10249 2666373 2435118 2222282 2040501 1953852 1768265 1639608 1634402 1560200 1633596 1606782
10239 1606782 1524756 1449527 1427925 1427342 1345323 1360631 1343680 1220449 1160394 1124155 1000645
10228 1000645 1026459 983624 963267 995397 885994 732528 749576 787634 728656 637945 636689
10217 636689 568708 462197 507617 431651 529246 595639 502020 476903 541911 597096 528394
10206 528394 513590 520813 503165 448601 474888 391755 421110 399314 460658 484084 454895 502293
10194 502293 530295 527263 604516 587255 561183 411317 437186 465324 399561 526050 526029 603074
10182F03074m1939p0448m3880J4536J0264l520O7264P1693j10971N008r0142K7088
10170D38027j6301J2445j0666r4883O6083P7151k9804O9340L7750J7127O2897
10159F29166R1860j5574Q3937j8194r6307L3722p2219k2388J13137K9256m8611
10148G07785O9980M1727L478J37710M7158M8617O4606o9932m3353J14442J25614
10137A247832n68m6262q596k9695p4260l2062l0569j12118q0819P790K103J7860
10125H60636L3649q7357K1732n2549j16815L7290Q567k9532N603L8535P431j6366
10113G10824L792M3013J43012J6038M2362J26532P2785Q3983l0499O5856o2045
10102A215653l7916J6976j1741K1669j47779p6558K3660o0930K2864j27028m1794
$$ plain form
10182 603074 561135 490687 446807 461343 471607 468087 535351 607044 496073 501081 410939 438027
10170 438027 421726 434171 423505 328622 394705 471856 442052 511392 549142 566269 629166
10159 629166 721026 705452 789389 771195 674888 708610 636391 614003 727140 756396 707785
10148 707785 777765 819492 822970 960680 1007838 1056455 1121061 1051129 1007776 1122218 1247832
10137 1247832 1247264 1201002 1192406 1162711 1088451 1056389 1025820 913702 832883 840673 842776 860636
10125 860636 894285 806928 828660 776111 659296 696586 705153 675621 681224 719759 727190 710824
10113 710824 714616 757629 900641 916679 959041 1085573 1158358 1242341 1211842 1277698 1215653
10102 1215653 1177737 1194713 1182972 1204641 1056862 980304 1003964 943034 965898 838870 797076
10091G97076J6801L0621r4192j04745l0065j07442q584O6917n2421K1706j05283
10080D30389l3705k6905M6713O7400j22m1820M9092L7839o8165J6497R2744j717
10068E68240O9890m3356n9509M2376K3800p7384j03387l5012o579O3124L0790
10057D72993J6369p0603L9335J23592K4357l3215n2739k1252L5014q309J17429
10046F42971J21545J6001j25257p5691P9448M6380j00093L264R7989P2387l9475
10035G39469k5437J9227l444m2941K4438N4320J6239J4952p8792M2786P5559m4209
10023G92167J01176p3554Q2003N3968o2159k5702j08531R065M7489J45771K1922
10012I83615L610k014l9557R7553j186k043M2073k1184K8227r0125L4108Q9695
$$ plain form
10091 797076 813877 844498 750306 645561 615496 508054 499470 566387 513966 535672 430389
10080 430389 396684 369779 416492 483892 483770 441950 491042 528881 460716 477213 569957 568240
10068 568240 638130 594774 535265 577641 601441 524057 420670 385658 379079 442203 472993
10057 472993 489362 418759 458094 581686 606043 572828 520089 498837 533851 525542 642971
10046 642971 764516 780517 655260 579569 659017 705397 605304 608568 706557 778944 739469
10035 739469 714032 733259 729815 686874 711312 765632 781871 796823 718031 760817 836376 792167
10023 792167 893343 819789 901792 955760 893601 867899 759368 768433 815922 961693 983615
10012 983615 987225 985211 945654 1043207 1042021 1039978 1082051 1060867 1089094 998969 1033077 1122772
10000A122772j53252M7541N4916L9958O4605r0513l0426J2950M6213Q152J0139
9989A133055m6571j9939M5783K5387K2107Q6811M9388m7038R7095J0262p3767
9978A282573N5402J08186J09377K6018L9590J6475l1936L5409k4950p6241m4661
9967A495242M7630Q6067l1241J3011N7763j7886j5859j3590O0925o0659L4068
9956A655471J20581K7018k5315l6871P7780R3513O7556P09k9699P3916J365l0267
9944A995757P7552n2279J02374O9537J4749m9930J2844Q6014J32605q5172L8203
9933B342254J28857k9476J55382Q5689J34261n1516O5918J6196N9114O664o1149
9922B852194J1081l346N3444R5504k3300O1511J01555m1092R8426J01627M3310
$$ plain form
10000 1122772 969520 1017061 1071977 1111935 1176540 1086027 1055601 1068551 1114764 1122916 1133055
9989 1133055 1086484 1066545 1112328 1137715 1159822 1246633 1296021 1248983 1346078 1356340 1282573
9978 1282573 1337975 1446161 1555538 1581556 1621146 1637621 1605685 1641094 1616144 1539903 1495242
9967 1495242 1542872 1628939 1597698 1610709 1668472 1650586 1634727 1621137 1682062 1621403 1655471
9956 1655471 1776052 1803070 1777755 1740884 1818664 1912177 1979733 1980442 1950743 2024659 2026024 1995757
9944 1995757 2073309 2021030 2123404 2192941 2207690 2157760 2170604 2256618 2389223 2304051 2342254
9933 2342254 2471111 2441635 2597017 2682706 2816967 2765451 2831369 2847565 2906679 2913343 2852194
9922 2852194 2863275 2859929 2913373 3008877 2985577 3047088 3148643 3107551 3205977 3307604 3350914
9911C350914L886K6129J9517J2961J07850N3249J83631J10517N5219N3888M8060
9900D025821M785Q2158Q8058l098J12331k1866l145J47737R5366R3771K02770
9889D824688J61515J47801Q6139J00898K1397O6605J84029J18712R1253J04733
9879E907770R5580J75396J47529J60556J34995J53076J99891J62250Q1315J04037
9869G322395K40174K21520J93289J03415J38862J16038J32321J00006J74407L66060
9859I108487K11650K65255L25389J67639J70288J77267K17880L47162L58508K89639
9849A1639164L28433K59826L39607L93831M58161M37494M48609M52229L57081
9840A5114435M97443M51266M62497L57191M01648L66804M06578L43622N73308
$$ plain form
9911 3350914 3354800 3380929 3400446 3413407 3521257 3574506 3758137 3868654 3923873 3977761 4025821
9900 4025821 4030606 4112764 4200822 4197724 4310055 4288189 4285044 4432781 4528147 4621918 4824688
9889 4824688 4986203 5134004 5220143 5321041 5342438 5409043 5593072 5711784 5803037 5907770
9879 5907770 6003350 6178746 6326275 6486831 6621826 6774902 6974793 7137043 7218358 7322395
9869 7322395 7562569 7784089 7977378 8080793 8219655 8335693 8468014 8568020 8742427 9108487
9859 9108487 9320137 9585392 9910781 10078420 10248708 10425975 10643855 10991017 11349525 11639164
9849 11639164 11967597 12227423 12567030 12960861 13419022 13856516 14305125 14757354 15114435
9840 15114435 15611878 16063144 16525641 16882832 17284480 17651284 18057862 18401484 18974792
9831A8974792M39249M34209O74931N73918O74822Q09574R14770R96364J149894
9822B5642523J224856J292932J454397J526292J726040J863304K010737J741542
9814C8482623J469908J197111Q53634P29028O29213P42457J243962J415392J601256
9805D8364584J667965J303380R05513N16380M86628N76300J128095J332517J797365
9796E8078727K257824K612435L132254L873573M339648M930123N881820O955736
9788I2062140Q500972R758408J0918155J1530501J1179175R773787Q077402O629222
9780A68429762M934248J769089j968969n117575o790161q129611j0021693j1753245
9772A31351845j1859162j0535559q698824o777687n465806m112035l330338k628659
$$ plain form
9831 18974792 19414041 19848250 20523181 21097099 21771921 22581495 23496265 24492629 25642523
9822 25642523 26867379 28160311 29614708 31141000 32867040 34730344 36741081 38482623
9814 38482623 39952531 41149642 42003276 42732304 43361517 44103974 45347936 46763328 48364584
9805 48364584 50032549 51335929 52241442 52757822 53244450 53820750 54948845 56281362 58078727
9796 58078727 60336551 62948986 66081240 69954813 74294461 79224584 85106404 92062140
9788 92062140 100563112 110321520 121239675 132770176 143949351 153723138 161800540 168429762
9780 168429762 173364010 175133099 173164130 168046555 161256394 153126783 143105090 131351845
9772 131351845 119492683 108957124 100258300 93480613 88014807 83902772 80572434 77943775
9764G7943775j751929j293962p57871L8652N89000J256116J969031K615475L092433
9755H3700720M049020N193273O934794Q621498R954786J1015056J0952827R412134
9747A49834108P618364O161987M319397Q38961l856784p641569r527293j0705814
9739A37041357j1883665j3316664j3329139j1609685r697480p783866o281035
9732F3139823n465422m669832m230799l807995l307518k951223k641782k343066
9724C3722186k111497j921647j666930j406303j436704j306524j069807j058206
9716B1744568q40206p60415p64893p10816o40949n57967l98300n16531k97719
9707A6256772l85662k86629l24492l25298l14135l73139k64575k34450k79503
$$ plain form
9764 77943775 76191846 74897884 74140013 74178665 74767665 76023781 77992812 80608287 83700720
9755 83700720 87749740 92943013 99877807 108499305 118454091 129469147 140421974 149834108
9747 149834108 157452472 163614459 167933856 168772817 164916033 157274464 147747171 137041357
9739 137041357 125157692 111841028 98511889 86902204 77204724 69420858 63139823
9732 63139823 57674401 53004569 48773770 44965775 41658257 38707034 36065252 33722186
9724 33722186 31610689 29689042 28022112 26615809 25179105 23872581 22802774 21744568
9716 21744568 20904362 20143947 19379054 18668238 18027289 17469322 17071022 16554491 16256772
9707 16256772 15871110 15584481 15259989 14934691 14620556 14247417 13982842 13748392 13468889
9698A3468889j12409j02057P4370J84599Q4981K17011K40636L2817j32444o3488
9688A3892905k64855l84635l28525n50314n44818n46699p06740n90971p04691
9679I270657m41274k42986k35697k20353k55384j20992j05643R706j55280j46542
9669G356212j1762j10585p6051J1061R8932k0574O6463K1229J53363L61897M20612
9658H270797L90861M59230L65107K67116K09808N6968o8100k56402k99377m33713
9648H962295m27886m56602m82438n81983m45802k67155j73334j32885k05026j32043
9638E657141J0895j1302O355j11773O2955l2952K877J02143M140N045K7731m7189
9626E676066J39993J84270j5767Q4899J24966J82856K30177K38217J96711L32673
$$ plain form
9698 13468889 13356480 13254423 13328793 13513392 13598373 13815384 14056020 14088837 13956393 13892905
9688 13892905 13628050 13243415 12914890 12364576 11819758 11273059 10566319 9975348 9270657
9679 9270657 8829383 8586397 8350700 8130347 7874963 7753971 7648328 7658034 7502754 7356212
9669 7356212 7344450 7233865 7157814 7168875 7267807 7247233 7313696 7334925 7488288 7850185 8270797
9658 8270797 8661658 9120888 9485995 9753111 9962919 10019887 9951787 9695385 9396008 8962295
9648 8962295 8534409 8077807 7595369 7013386 6567584 6300429 6127095 5994210 5789184 5657141
9638 5657141 5668036 5656734 5663089 5551316 5614271 5581319 5584196 5686339 5690479 5695524 5723255 5676066
9626 5676066 5816059 6000329 5984562 6069461 6194427 6377283 6607460 6845677 7042388 7375061
9616G375061M12253L99094L93517L87618M08164K67347K12273J50830J1993o1437
9606I956713j66689n3677k66223k12233k58276m97040m50933m66809n24988m74153
9596F585692l95680l89100l05443k54869k37293j27362k23207j23663r9827L3508
9586D462756l8544l9105j55234j00981o2570n6460Q7769k08204o5678m2685j6323
9575C764741q6358j16075m2169j58680j36714k8432o9640n6314m9885r8310m5597
9564B876567M3416q5829n7602o8937J23633j5489k3624n5247P0628j1903l3289
9553B762324r2732o5498l8910L2289Q4055j1974N4793L4315N3842J4575J46974
9542B974053O3949K1508j4325l5010k5337k267l8255l4781K2015O2560o8834l8655
$$ plain form
9616 7375061 7787314 8186408 8579925 8967543 9375707 9643054 9855327 10006157 10018150 9956713
9606 9956713 9790024 9736347 9470124 9257891 8999615 8502575 8051642 7584833 7059845 6585692
9596 6585692 6190012 5800912 5495469 5240600 5003307 4875945 4652738 4529075 4429248 4462756
9586 4462756 4424212 4385107 4229873 4128892 4066322 4009862 4097631 3889427 3823749 3781064 3764741
9575 3764741 3678383 3562308 3520139 3361459 3224745 3196313 3126673 3070359 3020474 2922164 2876567
9564 2876567 2919983 2834154 2776552 2707615 2831248 2815759 2792135 2736888 2807516 2795613 2762324
9553 2762324 2669592 2604094 2565184 2597473 2681528 2669554 2724347 2758662 2812504 2827079 2974053
9542 2974053 3038002 3059510 3045185 3010175 2984838 2982571 2944316 2909535 2931550 2994110 2925276 2886621
9530B886621N3238p615J29849P3790J6268J12679J83425O6929J8347P5570m8454
9519C560647n6664r8411N7548n4075r044R6802J4623k8549M1417M1736K6040J6057
9507C608127J1718L0169J15600k9876r2302L7293L86M8778J29578o2751R3835
9496C890555l911J21698Q9632O4744R3721K26970J00677Q3462J64579J39766K09389
9485E181282K51889Q4041K67326L89697J89364L01702L21103L09195K60188J52868
9475G708655J50690q2830k00669k72010m54586k95898l46126k24271j48670j08079
9465E726206n4032p7418o2368P6195O385J27287K25638J09731R1381J38140K08460
9454F515605K68368L17884M62934M74905N82968M41962L47920L79466M41125M11887
$$ plain form
9530 2886621 2939859 2932244 3062093 3135883 3152151 3264830 3448255 3515184 3533531 3609101 3560647
9519 3560647 3503983 3405572 3463120 3409045 3400001 3496803 3511426 3482877 3524294 3566030 3592070 3608127
9507 3608127 3619845 3650014 3765614 3735738 3643436 3680729 3681115 3729893 3859471 3796720 3890555
9496 3890555 3886644 4008342 4097974 4162718 4256439 4483409 4584086 4667548 4832127 4971893 5181282
9485 5181282 5433171 5517212 5784538 6174235 6363599 6665301 6986404 7295599 7555787 7708655
9475 7708655 7859345 7776515 7575846 7303836 6849250 6553352 6207226 5982955 5834285 5726206
9465 5726206 5672174 5594756 5532388 5608583 5614968 5742255 5967893 6077624 6169005 6307145 6515605
9454 6515605 6783973 7101857 7564791 8039696 8622664 9064626 9412546 9792012 10233137 10645024
9444A0645024J80514J25812R3339J46178L14630O6038n0304j69833l41089m92573
9434A0517736p20669o86534p66491o49265n03446l08772k53977j15109p4721p3191
9424F365561L0480r7427k4699k388K6855l4863J180O1348J1768J8053J19788K08252
9412F683908J90052K24044L33670M49586L83276J08726J92555n1280k75056k23307
9402H016174j59289R6164K73236M05188M53339J964k10300k42862m02927n30334
9392G700353l41291m23259m16181k41070j89488q7708o5091r3038m374j19789
9382E719064r1039j61958j77761o8172r6273o2427p9325k00574K6776K3903r105
9371D823109L0495K9382K0376r0072L1750O2531l2523L4113m638P4133P1780j4245
$$ plain form
9444 10645024 10825538 10951350 11044689 11190867 11505497 11571535 11521231 11351398 11010309 10517736
9434 10517736 9797067 9110533 8344042 7694777 7191331 6882559 6628582 6513473 6438752 6365561
9424 6365561 6396041 6298614 6273915 6271527 6298382 6263519 6264699 6326047 6337815 6355868 6475656 6683908
9412 6683908 6873960 7098004 7431674 7881260 8264536 8373262 8565817 8514537 8239481 8016174
9402 8016174 7856885 7953049 8226285 8631473 9084812 9086776 8876476 8633614 8230687 7700353
9392 7700353 7359062 6935803 6519622 6278552 6089064 6001356 5936265 5843227 5838853 5719064
9382 5719064 5628025 5466067 5288306 5220134 5123861 5061434 4982109 4781535 4808311 4832214 4823109
9371 4823109 4853604 4882986 4903362 4813290 4845040 4907571 4875048 4909161 4904523 4978656 5050436 5036191
9359E036191O6854K6731J5181N2266J00049m2345k263L6632O4317j33427J16201
9348E336387O3574j16091j6451J46887O4649j3828R9269R5482J09007O1374M5622
9337E875881Q7989L8477L9221R7808K0045R8026J37773M9110Q6377R8941J12990
9326F742638J15805J12719R3502R9429P7674J90545j274J03403l6259J23304J09208
9315G730694R897j8698J48616L3582j10658J30975J67708K03789O6552J86208
9305H548665J99042J46614J57887J04341L8969J28011K45531K10349J95642K44005
9295A0219056K16023J70441Q7552K62797K48333K37345K13251J35430K85890K72553
9285A2348671K42200J93045J83819J82686J14528L2422K5506P9671P4548O6363
$$ plain form
9359 5036191 5103045 5129776 5144957 5197223 5297272 5254927 5252664 5289296 5353613 5220186 5336387
9348 5336387 5399961 5283870 5267419 5414306 5478955 5465127 5564396 5659878 5768885 5830259 5875881
9337 5875881 5963870 6002347 6041568 6139376 6159421 6257447 6395220 6444330 6530707 6629648 6742638
9326 6742638 6858443 6971162 7064664 7164093 7241767 7432312 7431038 7534441 7498182 7621486 7730694
9315 7730694 7740591 7721893 7870509 7904091 7793433 7924408 8092116 8295905 8362457 8548665
9305 8548665 8747707 8894321 9052208 9156549 9195518 9323529 9569060 9779409 9975051 10219056
9295 10219056 10435079 10605520 10693072 10955869 11204202 11441547 11654798 11790228 12076118 12348671
9285 12348671 12590871 12783916 12967735 13150421 13264949 13297371 13322877 13402548 13477096 13543459
9275A3543459K47714J98144K31723K34985O3657K76841M31845K21393J97893K58284
9265A5905938K94751K77180N14134M41127L60954M07743M19534M56722L64750
9256A9442833M92859N94000M68536N44024O08874O23351O99072P53030Q14579
9247B5041158P63466P26447N47346N77338O27205O29978P48059P23220P37036
9238C1121253P69025Q80593J081369J120543J445350J585482K041291K552491
9230D2597397K885316L350469L866186L380813K393529J554036Q09779Q76803
9222F1714328J074664O58863m24472j518606j677838j262080m69332J96785Q09818
9213E9102130J604285K032642K388048K721818K558371J984677J853091K076133
$$ plain form
9275 13543459 13791173 13989317 14221040 14456025 14519682 14796523 15228368 15449761 15647654 15905938
9265 15905938 16200689 16477869 16992003 17433130 17794084 18201827 18621361 19078083 19442833
9256 19442833 19935692 20529692 20998228 21542252 22151126 22774477 23473549 24226579 25041158
9247 25041158 25804624 26531071 27078417 27655755 28282960 28912938 29660997 30384217 31121253
9238 31121253 31890278 32770871 33852240 34972783 36418133 38003615 40044906 42597397
9230 42597397 45482713 48833182 52699368 56080181 58473710 60027746 60837525 61714328
9222 61714328 62788992 63447855 63023383 61504777 59826939 58564859 58095527 58292312 59102130
9213 59102130 60706415 62739057 65127105 67848923 70407294 72391971 74245062 76321195
9205G6321195K489305K708381K565812K462512K853305L723855M983380N651779
9197A03759524N576565N927206O242767P203444Q681838R665949R758953Q398500
9189A65214746N384742K543848J235615K393480M410440L688478l51632n608311
9181A78911406r041778q514932p103369o520625o294327n273909l581651j645851
9173A30934964n7454R22421J821267K686381L904971N479426O949877Q592882
9165A61234735J0689963J3627423J7092636K0565303K1792466J9657301J6037567
9158B80697394J3889252J4128263J2956160P728989o5132p918243j3245334j3875231
9150B94296118j0207501n472669m470673o971807r476399j1556613j5346881j9698446
$$ plain form
9205 76321195 78810500 81518881 84084693 86547205 89400510 93124365 98107745 103759524
9197 103759524 109336089 115263295 121506062 128709506 137391344 147057293 156816246 165214746
9189 165214746 170599488 173143336 174378951 176772431 181182871 184871349 184519717 178911406
9181 178911406 169869628 161354696 154251327 147730702 141436375 136162466 132580815 130934964
9173 130934964 130877510 131799931 133621198 136307579 140212550 145691976 152641853 161234735
9165 161234735 171924698 185552121 202644757 223210060 245002526 264659827 280697394
9158 280697394 294586646 308714909 321671069 329400058 329334926 321416683 308171349 294296118
9150 294296118 284088617 278615948 274145275 267173468 257697069 246140456 230793575 211095129
9142B11095129k1850595k0692532j7716288j4297743j1088614q721116p116776
9135A09611465n973343n290711m838813m230404l411914k586000j887247j444115
9127G9948918j088752o43878J26466R54567K161387L214737M421528N292605M874599
9118I9262177L284515J879007P19175j027107k656770l603828l563178l121884
9110I1172107l065506l344688l721344m019030m614204n160933n229345m746395
9102E7270662m159691l368585k767547k196244j724445j612469j288952j088691
9094C9064038r29692o93358m30005l19424l23462o1521o2964j27943r4404M8661
9084C6069926Q3826L06362M87924M79983O27315P71348P09356N65653O71995O63180
$$ plain form
9142 211095129 189244534 168552002 150835714 136537971 125449357 116728241 109611465
9135 109611465 103638122 98347411 93508598 89278194 85866280 83280280 81393033 79948918
9127 79948918 78860166 78216288 78342754 79297321 81458708 84673445 89094973 94387578 99262177
9118 99262177 102546692 104425699 105144874 104117767 101460997 97857169 94293991 91172107
9110 91172107 88106601 84761913 81040569 77021539 72407335 67246402 62017057 57270662
9102 57270662 53110971 49742386 46974839 44778595 43054150 41441681 40152729 39064038
9094 39064038 38134346 37440988 37010983 36691559 36368097 36306576 36243612 36115669 36021265 36069926
9084 36069926 36153752 36460114 36948038 37428021 38055336 38826684 39536040 40101693 40773688 41436868
9074D1436868N86916N50668L54657J67512K46112M0456J0504J57956r4289j15295
9064D3342065j64439k82968m05438l20795m27676l50071l54046r6154J87961J59669
9054D1288108M21923N81858P32694R47808J141877J181256J402798J665796J790145
9045E1154263J999795K059369K186012K521412K810313L265923L666933L959645
9037G3623665M453361N096160N883803P345907Q356511Q120670N617216K177609
9029A20674902r92441k349476j521076K38343K063099K315457M52932k441132
9021A18440608n299881o893427o517502n031807l154938j705560o03620j2438
9013H9221435L20297O40950R16023J453809K149272L128270M510655O128664P961718
$$ plain form
9074 41436868 42023784 42574452 42929109 43096621 43342733 43383189 43393693 43551649 43457360 43342065
9064 43342065 43177626 42894658 42489220 42168425 41740749 41390678 41036632 40940478 41128439 41288108
9054 41288108 41710031 42291889 43024583 43972391 45114268 46295524 47698322 49364118 51154263
9045 51154263 53154058 55213427 57399439 59920851 62731164 65997087 69664020 73623665
9037 73623665 78077026 83173186 89056989 96402896 104759407 112880077 118497293 120674902
9029 120674902 119682461 117332985 115811909 116050252 118113351 120428808 120881740 118440608
9021 118440608 113140727 106247300 99729798 94697991 91543053 89837493 89233873 89221435
9013 89221435 89541732 90182682 91098705 92552514 94701786 97830056 102340711 108469375 116431093
9004A16431093R381554R492888P479169M577411J956921J520040L421414N447955
8996A59708445N472612L267542q63816m371227o003796n694869l708955k254841
8988A45551095k654679m442613o530216q014410p904827o537360m665054k919551
8980A01882385j787256r79704o57090o75696p63201n96218Q2347R48776K306198
8971I9760541L444449M727357N366159N197089L063216M98773k145124k791968
8963A17120492j829166J49374J759849K301620O88689j635794m199562n973878
8955A08381624o136997m830515l413686j780741q78455k37707j7797j64844r22155
8946H9998727j476872j655332j364799j038398o17862o8018N96277R07742J221245
$$ plain form
9004 116431093 125812647 135305535 142784704 147362115 149319036 150839076 154260490 159708445
8996 159708445 165181057 168448599 167584783 163213556 157209760 151514891 147805936 145551095
8988 145551095 142896416 138453803 131923587 123909177 116004350 109466990 104801936 101882385
8980 101882385 100095129 99115425 98458335 97782639 97019438 96423220 96505567 97454343 99760541
8971 99760541 103204990 107932347 113298506 118495595 121558811 122057584 119912460 117120492
8963 117120492 115291326 115440700 117200549 119502169 120190858 118555064 114355502 108381624
8955 108381624 102244627 97414112 94000426 92219685 91341230 91103523 91085726 90920882 89998727
8946 89998727 88521855 86866523 85501724 84463326 83845464 83777446 84373723 85281465 86502710
8937H6502710J316470J903399K515149L403100M421778O283148Q633686J2901624
8929A27881064J7683396K4552458L2271796L3744238J1860000k5007820l4404178
8922A88580954k8806904k0730487j4307257r917061p390079n625759m326523l447196
8914I4029688k648235j176910M10050J526419K096309J770760P83200r32360k459726
8905I3399195l155559l283466k773870j464449K98038J741103K545361K222550
8897H9528903J214516l42130k266056l523004m294864m535130m180547l370292
8889F8231396k485919j769602j687771j581186j665556j475962j116334r42411
8881E5506655o47267j26133R2825M72080M43347L89802K32757L04628L77635R08657
$$ plain form
8937 86502710 87819180 89722579 92237728 95640828 100062606 106345754 114979440 127881064
8929 127881064 145564460 170116918 202388714 236132952 247992952 222985132 188580954
8922 188580954 159774050 139043563 124736306 114819245 107429166 101803407 97476884 94029688
8914 94029688 91381453 90204543 90614593 92141012 94237321 96008081 96791281 95858921 93399195
8905 93399195 90243636 86960170 84186300 82721851 83019889 84760992 87306353 89528903
8897 89528903 90743419 90401289 88135233 84612229 80317365 75782235 71601688 68231396
8889 68231396 65745477 63975875 62288104 60706918 59041362 57565400 56449066 55506655
8881 55506655 54859388 54733255 54826080 55298160 55741507 56131309 56364066 56668694 57046329 57954986
8871E7954986J602520K599747L513937M392282N063722M676263L714599K300827
8863H5818883N32265n38460r09519k59724J329075L437416N323279O168755M921153
8854A05823123K364384j057240m624213p096926p950457p795628o862687n685804
8846F7114552m202670l161959k116550j215082m15922M35192J192788K282992
8838E9913341L207939L710735L279147J456562p24984k914871m447116m883006
8830E8597747m255886l665296k591821j856573j186418n56823J06784P00048J181568
8821D6473330K181331L017565M081029N343933O041555N422374L281682L00974
8813G6143773k998938n578788o685416o153184m921252l759825k553960j583988
$$ plain form
8871 57954986 59557506 62157253 65671190 70063472 75127194 79803457 83518056 85818883
8863 85818883 86351148 85812688 84903169 84643445 85972520 89409936 94733215 100901970 105823123
8854 105823123 108187507 107130267 102506054 95409128 87458671 79663043 72800356 67114552
8846 67114552 62911882 59749923 57633373 56418291 56002369 56437561 57630349 59913341
8838 59913341 63121280 66832015 70111162 71567724 70842740 67927869 63480753 58597747
8830 58597747 54341861 50676565 48084744 46228171 45041753 44484930 44591714 45291762 46473330
8821 46473330 48654661 51672226 55753255 61097188 67138743 72561117 75842799 76143773
8813 76143773 73144835 67566047 60880631 54727447 49806195 46046370 43492410 41908422
8805D1908422p26272p3037O66514J467735K134841L025981L975217M992749N309590
8796F2681740M646986K348411p87046l813630o104088o764692o261365n173962
8788D0772354l946401l011007k352223j727410j262092r08637n91065n33006o37686
8779B5802827o01212o35504o86133p12747n51514m23529k22288k9319P2194m4845
8769B1967930Q113J59168J20077J59556L17725L31735O18783O76558O49295L45798
8759B5354738L29407K58164K48015L12676O06671P35963P76798P90178O99843
8750C0112453O37763M65469J14999l4768l41682m53909m61161l37120l14306k64443
8740B9123295l93663m49221n50409q30820q02739r67483r60903o61239p47201
$$ plain form
8805 41908422 41182150 41109113 41775627 43243362 45378203 48404184 52379401 57372150 62681740
8796 62681740 67328726 69677137 68890091 65076461 58972373 52207681 45946316 40772354
8788 40772354 36825953 33814946 31462723 29735313 28473221 27564584 26973519 26440513 25802827
8779 25802827 25201615 24566111 23879978 23167231 22615717 22192188 21969900 21940581 22012775 21967930
8769 21967930 21976043 22135211 22255288 22414844 22732569 23064304 23683087 24359645 25008940 25354738
8759 25354738 25684145 25942309 26190324 26503000 27109671 27845634 28622432 29412610 30112453
8750 30112453 30750216 31215685 31330684 31295916 30954234 30500325 30039164 29702044 29387738 29123295
8740 29123295 28729632 28280411 27730002 26899182 26096443 25128960 24168057 23506818 22759617
8731B2759617n61159l37784k98901k48659q8743k5748J21895L05608L83978N27417
8721B2537521O60556O63096N74794N34533L16321J70013m7042j7667j01531o0353
8711B5230241n028R099m9552j35063k34419m26123o80649o41665p29016o21854
8701B1715971k95386l72096k26238j6877J04795K45927L33968N84279N93147P39900
8691B3407390J081790J558603J817818K354331K939159L435984L148658K052772
8683D1796505P99033o79989j739120k335539j820254r18861o3385Q88947J734372
8674C7661709J839741J212660J92857j054985k165256k721075k947125k634034
8666B9384492j975387j453483j207513q13518m41362m39755k34717k05033m8603
$$ plain form
8731 22759617 22198458 21860674 21561773 21313114 21224371 21198623 21320518 21626126 22010104 22537521
8721 22537521 23198077 23861173 24435967 24970500 25286821 25456834 25409792 25392125 25290594 25230241
8711 25230241 25225213 25234312 25184760 25049697 24815278 24389155 23708506 23066841 22337825 21715971
8701 21715971 21420585 21048489 20822251 20805374 20910169 21156096 21490064 22074343 22667490 23407390
8691 23407390 24489180 26047783 27865601 30219932 33159091 36595075 39743733 41796505
8683 41796505 42595538 41915549 40176429 37840890 36020636 35101775 35038390 35927337 37661709
8674 37661709 39501450 40714110 40906967 39851982 37686726 34965651 32018526 29384492
8666 29384492 27409105 25955622 24748109 23934591 23493229 23053474 22818757 22613724 22565121
8657B2565121J40534K73646M11698P99644P84073R78168J398951J734744K241348
8648C1327927K779832L549673M279305M641530M445403L689063K060675J07173
8640E6880581j607181k642176k812235k302425r71477N98712J591719J911464
8632E0646982J586240O57509j100325k759272l974663m560866m500624m049891
8624C1945090l289672k538670k016673j586368j181996j052157p36628n99479
8616A8943447m06288k57444j64662M0402L23941K03703L31210M74539N71312Q06174
8606B0866334J229497J525623J804239J917449J601593O81425l47204j120937
8598B8158019j679178j622401j098110o81462q2818M78282R05794Q11499J31718
$$ plain form
8657 22565121 22705655 22979301 23390999 24190643 24974716 25952884 27351835 29086579 31327927
8648 31327927 34107759 37657432 41936737 46578267 51023670 54712733 56773408 56880581
8640 56880581 55273400 52631224 49818989 47516564 46545087 47143799 48735518 50646982
8632 50646982 52233222 52890731 51790406 49031134 45056471 40495605 35994981 31945090
8624 31945090 28655418 26116748 24100075 22513707 21331711 20279554 19542926 18943447
8616 18943447 18537159 18279715 18115053 18155455 18479396 18683099 19014309 19488848 20060160 20866334
8606 20866334 22095831 23621454 25425693 27343142 28944735 29626160 29278956 28158019
8598 28158019 26478841 24856440 23758330 23076868 22994050 23472332 24378126 25189625 25321343
8589B5321343p89874j583231k022829k273928k268737j783340j438537j068408
8581A2092459o04401o19660m23234m90607m67075k49871m4346j05343K4409J20230
8571I232561J93893J49200R8940o5788j52604k39209k37697l51955k15768k59722
8561H151851o9895j08106L1895p5199j32511m9860k58522l19491l42597k46264
8551F581301l13799k88805l01539k13604j25327j52161q1938k7774j05910j42753
8541D827691Q876j81560j10363p894p9862k112n0236n5506j4439L283N8323J46983
8529D543184J25555N7879o6416k7000l3305n5152k03302r3290q4282q7597k1874
8518D054400n69Q2923J55041k4834j06001j83632r8455m0296j14527j38749j46925
$$ plain form
8589 25321343 24531469 22948238 20925409 18651481 16382744 14599404 13160867 12092459
8581 12092459 11488058 10868398 10445164 9954557 9487482 9237611 9193265 9087922 9112331 9232561
8571 9232561 9426454 9575654 9674594 9608806 9456202 9216993 8979296 8627341 8411573 8151851
8561 8151851 8081956 7973850 8005745 7930546 7798035 7748175 7489653 7170162 6827565 6581301
8551 6581301 6267502 5978697 5677158 5463554 5338227 5186066 5104128 5076354 4970444 4827691
8541 4827691 4836567 4655007 4544644 4536750 4456888 4454776 4404540 4349034 4334595 4337878 4396201 4543184
8529 4543184 4668739 4726618 4660202 4633202 4599897 4544745 4341443 4248153 4163871 4076274 4054400
8518 4054400 4053831 4136754 4291795 4266961 4160960 3977328 3878873 3838577 3724050 3585301 3438376
8507C438376j85009j93390j35939k7591j5552K0349k0711K3465j63097j63420
8497B577481j3325j95162n1542o6767q7193p226P549R9318q0733k0558R5993J07687
8485B365522r0884P152n5340J9893p1128p0870M9450j55273r8291o4609M3459
8474A879081L5277M5079J61817K9398l2770k533k5346Q543j52900q6065j64359
8463A695222j21973k8555j05509J5702l6729m8341O1866r6897m3401J0908M2105
8452A344398J0138N8775J98609J99097J18709q1216j13463k35149j42148n9218
8442A298532j42641N964j01712n5411q9861r6863j0220l4543r1205R1502K1519
8431G95061m5301Q058P181m9588K4917n3758n0067m2073q8686m3805L8819p407
$$ plain form
8507 3438376 3253367 3059977 2924038 2896447 2880895 2901244 2880533 2903998 2740901 2577481
8497 2577481 2564156 2368994 2317452 2250685 2163492 2156266 2163815 2263133 2182400 2161842 2257835 2365522
8485 2365522 2274638 2281790 2226450 2246343 2175215 2104345 2153795 1998522 1900231 1835622 1879081
8474 1879081 1914358 1959437 2121254 2150652 2117882 2115349 2090003 2098546 1945646 1859581 1695222
8463 1695222 1573249 1544694 1439185 1454887 1418158 1369817 1431683 1334786 1291385 1302293 1344398
8452 1344398 1354536 1413311 1611920 1811017 1929726 1848510 1735047 1499898 1357750 1298532
8442 1298532 1155891 1161855 1060143 1004732 914871 818008 807788 773245 682040 773542 795061
8431 795061 749760 757818 764999 715411 740328 686570 636503 594430 505744 461939 500758 493351
8419D93351q5921p4908o9577J8703M9360p2711l0843N6271l0587m3371M188N1713
8407B65668p9397l3935k238J8590R6025M5214n7470o468P715P438m5248m1785
8395A74109j9885O9068N4994L9950R4122r3031q953j7666O809J17938Q9322k0750
8383D86027l8633n7236J7611l0725k5279P6329L3264j03859r2008J71693J8691
8372D55875o6450P579j1289O6350O4049O0847o180n9727J48478j6136K4053M7089
8360G14538n5746j14356O6707K2029K8748r6177j6778L6629o5053J04492L0915
8349F55948L4388J50966Q6792l33R693L4136J2119J08421J937j33695j22975r2187
8337G45210o7107m136O8846k993o9772j9026j606l6290J48583l1354k353K06665
$$ plain form
8419 493351 407430 332522 262945 281648 331008 258297 227454 283725 253138 209767 213955 265668
8407 265668 186271 152336 150098 168688 264713 309927 252457 245989 253704 261142 215894 174109
8395 174109 154224 223292 278286 318236 412358 319327 310374 292708 299517 417455 506777 486027
8383 486027 447394 390158 407769 377044 351765 428094 461358 357499 265491 437184 455875
8372 455875 389425 397004 385715 452065 516114 576961 570781 511054 659532 643396 667449 714538
8360 714538 658792 544436 611143 633172 661920 565743 548965 585594 520541 625033 655948
8349 655948 690336 841302 928094 927761 937454 971590 983709 1092130 1094067 960372 837397 745210
8337 745210 678103 673967 742813 739820 670048 651022 649416 613126 761709 730355 728002 934667
8325I34667J795l0143J01232N5734o8034k2736m1051j30423p9791m7570o5027
8314F08653n7800r0572j2348L7720j28192J801J045O3170q620o8469K5836j2167
8302C60057J7633P8523q2316N9360O2281j5603N7373J1719J20672j9014r9450
8291E51235J01972j48j4150M0123J3030Q1655k9150o9752R4995J37219p9692l1611
8279G95726J01218p370O2997K463j01297q0339j46174j16498R0656N8738p1312
8268E88808N6047j02420M6359J8137k1557L7600o6190m8335j0375o070M5737J1646
8256E49387l4031l0404J92814O8385l9676R3612q3281o3351j1419K1596J36643
8245H00275N2504n636R7973l7322P5035M1899o9915J11778k5492p6837k4663o8879
$$ plain form
8325 934667 936462 906319 1007551 1063285 995251 972515 931464 801041 721250 673680 608653
8314 608653 550853 460281 447933 485653 357461 359262 360307 423477 414857 346388 372224 360057
8302 360057 377690 456213 373897 433257 495538 479935 537308 549027 669699 650685 551235
8291 551235 653207 653059 638909 679032 692062 773717 744567 674815 769810 907029 827337 795726
8279 795726 896944 889574 952571 955034 853737 773398 627224 510726 601382 660120 588808
8268 588808 644855 542435 588794 606931 585374 622974 556784 508449 498074 492004 537741 549387
8256 549387 515356 484952 677766 746151 706475 800087 716806 653455 642036 663632 800275
8245 800275 852779 847143 945116 907794 982829 1024728 954813 1066591 1041099 964262 939599 870720
8233H70720j33046n4953m0869n2439q4361r4277K9975q0842p7901M2111L4887
8222C59005l4052j69045j45804J05703n7285n7050O423j7795k6980N3812K6204
8211D3136m7128K1325J4542M6592Q112j0235j31741o3170k7891J5782R9557J8806
8199a2313j052n2447m272k8215K6153l0565M7328o21408j45024J32506J41762
8188e47547J49709o2377k1345p5666L6834o8933J00585n5429K8113p3173K002
8177e87227P0409m2039L2675k3990L1344J34765J4468n2968n1869n9268j343l6796
8165e71839j75611J9533Q0620k5349J3310N4083p4552J7007k6166k8065J8556
8154f98473L8283J07756K3317j48968J8468J0908O7936N5584m1421k0982n3503
$$ plain form
8233 870720 737674 682721 641852 589413 505052 410775 440750 359908 282007 324118 359005
8222 359005 324953 155908 10104 115807 58522 1472 7895 -9900 -36880 16932 43136
8211 43136 -3992 17333 31875 78467 86579 76344 -55397 -118567 -146458 -130676 -31119 -12313
8199 -12313 -13365 -65812 -70084 -98299 -72146 -102711 -55383 -676791 -821815 -689309 -547547
8188 -547547 -397838 -460215 -481560 -557226 -520392 -589325 -488740 -544169 -516056 -589229 -587227
8177 -587227 -516818 -558857 -526182 -550172 -518828 -384063 -369595 -422563 -474432 -533700 -535043 -571839
8165 -571839 -747450 -727917 -647297 -672646 -659336 -605253 -679805 -662798 -688964 -717029 -698473
8154 -698473 -660190 -552434 -529117 -678085 -659617 -648709 -580773 -525189 -566610 -587592 -641095
8143f41095n4173q8938J20815o6960q5172J10949q2938P3164L4153K1269m7743
8132g06669r030j8489K4046m6543p5290M9383M3108J29823r8550O0320J3557l3265
8120f67599N384m9307k7459N1986r8524j099N6822J6699P0376M8010o6295K6858
8108f34148J2850o4764J1746q3099m171J71604J6469j6802m654l4687J2336k5662
8096f42982J0609p7783L7320o3953m1299r311M2599P3435j4412j9149r7433O734
8084g95625K510J01772O9188o1918M1711J45722o3160N711k9006q7995J83255
8073d87835P612l001j32953M5724j06475N8970q04M643m4752r086J10235o0205
8061f17927J06289j4851l2859K7022M2417m5473j189J06668n1328l5886O9831
$$ plain form
8143 -641095 -695268 -784206 -663391 -730351 -815523 -704574 -787512 -714348 -680195 -658926 -706669
8132 -706669 -715699 -734188 -710142 -756685 -831975 -782592 -739484 -609661 -708211 -647891 -634334 -667599
8120 -667599 -662215 -711522 -738981 -686995 -785519 -786618 -729796 -713097 -642721 -594711 -661006 -634148
8108 -634148 -621298 -686062 -674316 -757415 -761586 -589982 -573513 -590315 -594969 -629656 -617320 -642982
8096 -642982 -632373 -710156 -672836 -736789 -778088 -787399 -744800 -671365 -685777 -704926 -802359 -795625
8084 -795625 -793115 -691343 -622155 -684073 -642362 -496640 -559800 -554089 -583095 -671090 -487835
8073 -487835 -480223 -483224 -616177 -570453 -676928 -617958 -618762 -614119 -658871 -667957 -557722 -617927
8061 -617927 -511638 -526489 -559348 -532326 -489909 -535382 -536571 -429903 -481231 -517117 -447286
8050d47286K6697l8175o83N5764m8820P6508O1200l5040M0426l5079J54235K6906
8038a63347j70914R3716n0312O5221J01510L4620r925J78651n522Q0273M4077
8027A98048L0977J49434P7977J01874N9135L973k3150j5270M9576J5810J0150
8016F58534J00611J9926J69134m0092o133J09231L0380l4940m0438j49176n9258
8005G57779l7547r6253J23345p2960n1918o7254R4462R0519l8626j04635J1780
7994F08692n8983l2859p5579p7520k4468N4851n2704R6129J4233M4980P7725O6556
7982F41053Q6571M4781J70706P0036q6214q646n6449k0337R0725J14637M8586
7971A095449o6749J38637J50998J27340N8530j31893p1005L6927k34990m6260
$$ plain form
8050 -447286 -420589 -458764 -459447 -403683 -452503 -375995 -314795 -349835 -309409 -344488 -190253 -163347
8038 -163347 -334261 -240545 -290857 -225636 -124126 -89506 -99431 79220 73698 153971 198048
8027 198048 229025 378459 456436 558310 617445 621418 598268 582998 632574 648384 658534
8016 658534 759145 779071 948205 908113 901980 1011211 1041591 1006651 966213 817037 757779
8005 757779 720232 623979 747324 674364 622446 555192 649654 740173 701547 596912 608692
7994 608692 549709 516850 441271 363751 339283 394134 341430 437559 451792 496772 574497 641053
7982 641053 727624 772405 943111 1013147 926933 918287 861838 841501 932226 1046863 1095449
7971 1095449 1028700 1167337 1318335 1445675 1504205 1372312 1301307 1338234 1103244 1056984
7961A056984p6433m0025j27245M7334m4319L1273O5933j7104p9958j55774K7417
7950F88083p1208j14376j37576m9378m5955N171J444k9600M9853l8215N8228n4450
7938B62021O248l5078n0649J9699J2842m389O3626j9640n9971J4092N0510K3869
7926B83180m7650n8934j5138O824O8739o6802l0096m7837k1432K5367L1382j16072
7914A1531m4336O7654J1597J00230m8450m7510O5363p46j7292l7403K6395J21072
7902B08105K8929j33947l4556K2646k6890P4969o6120j24563R759N5098O7178
7891H0608n7529j6312l7353p2146J8681p0399l6764K1914L2438m7135J01838J139
7879h1020j3612L2588o3146p5389l803m8352N2858q665O2410l3706l4558j4949
$$ plain form
7961 1056984 980551 940526 813281 860615 816296 847569 913502 896398 816440 660666 688083
7950 688083 616875 502499 364923 315545 269590 274761 276205 246605 296458 258243 316471 262021
7938 262021 268269 233191 182542 202241 215083 210694 274320 254680 194709 208801 259311 283180
7926 283180 235530 176596 161458 168282 237021 170219 140123 92286 70854 96221 127603 11531
7914 11531 -32805 34849 46446 146676 98226 50716 116079 115333 98041 60638 87033 208105
7902 208105 237034 103087 68531 91177 64287 139256 73136 -51427 -41668 13430 80608
7891 80608 23079 6767 -30586 -102732 -84051 -154450 -191214 -169300 -136862 -183997 -82159 -81020
7879 -81020 -94632 -62044 -125190 -200579 -204382 -252734 -199876 -208541 -146131 -179837 -214395 -229344
7867b29344j0856J36300K8416k0670j40573o6944Q6285J28937k4028O8130R0472
7856D6125k1897k3646m2362o6378p5093N900j02865j25915L5707R436N079P2901
7844b83008o4515M2608J2963L3827j24947L7003q997j05428j8979J7831n5796
7833e17438N9201O6106J3695K4852r4891j10031L4443L0723o3902Q749K8583K2789
7821d97121m2477q1659J81030M1860j12183L6735K6617k782O0668N2991j47010
7810d83331j09102O8306j9193q6989q495j865p676o6451q1932j166N8886O8419
7798f70589K0015M1530P6173n2489L8252L2387J5803n1536p889N2552O552j30096
7786f29335O0389J3630J5695q9480r3294m0436r938K6251m582m9526k8540n1972
$$ plain form
7867 -229344 -240200 -103900 -75484 -96154 -236727 -303671 -217386 -88449 -112477 -44347 46125
7856 46125 24228 582 -41780 -108158 -183251 -177351 -280216 -406131 -370424 -360988 -355909 -283008
7844 -283008 -347523 -304915 -291952 -258125 -383072 -346069 -355066 -460494 -479473 -461642 -517438
7833 -517438 -458237 -392131 -378436 -353584 -448475 -558506 -524063 -493340 -557242 -548493 -519910 -497121
7821 -497121 -539598 -621257 -440227 -398367 -510550 -473815 -447198 -449980 -389312 -336321 -483331
7810 -483331 -592433 -524127 -543320 -630309 -638804 -640669 -648345 -714796 -796728 -797894 -739008 -670589
7798 -670589 -650574 -609044 -532871 -585360 -547108 -514721 -498918 -550454 -558343 -505791 -499239 -629335
7786 -629335 -568946 -555316 -539621 -629101 -722395 -762831 -772769 -746518 -751100 -800626 -829166 -881138
7774h81138j7045K0469J04732L7548N995j6003J2537N6448q9060M9012J21071
7763e95434q8071r6642o280N9817m3634j834J9533K9837O4965p3093k467K1217
7751g12086l2983m1528J90216K0306k0957m9959j9337J06534p7080R699j1354
7740f38529J6637l536j00948J71423O0259m8676l7099M1808m6715N3465o130r2591
7728f30632L6205L0749Q2492l7408j8112N0562n3185O8273J33313j9518l8142
7717c95403q8162L9693K1013j9376L015M0915k5132P2518P6311N308j4242l3383
7705c16925K5932k5728l5383J02856L2939K4557m7938r3917N544O066M9090q8820
7693c61727j15292N1173K1992J1950K5402j2947r539j5981m0430J346M0951p8516
$$ plain form
7774 -881138 -898183 -877714 -772982 -735434 -729439 -745442 -732905 -676457 -765517 -716505 -595434
7763 -595434 -683505 -780147 -786427 -726610 -770244 -772078 -752545 -722708 -657743 -730836 -733303 -712086
7751 -712086 -745069 -786597 -596381 -576075 -597032 -646991 -666328 -559794 -636874 -627175 -638529
7740 -638529 -621892 -625428 -726376 -554953 -494694 -543370 -580469 -538661 -585376 -531911 -538041 -630632
7728 -630632 -594427 -563678 -481186 -518594 -536706 -486144 -539329 -471056 -337743 -357261 -395403
7717 -395403 -483565 -443872 -422859 -442235 -439220 -398305 -423437 -350919 -274608 -269300 -283542 -316925
7705 -316925 -290993 -316721 -352104 -249248 -216309 -191752 -239690 -333607 -328063 -321997 -272907 -361727
7693 -361727 -477019 -425846 -403854 -391904 -366502 -379449 -388988 -404969 -445399 -444053 -403102 -481618
7681d81618r8746p0588P6146L1470n762O0913P9607r8091n788j01518q0182J15449
7669e78708j8895n2888R25L2267o072K7561j5826j04270L1487p117P326o4849
7657g49059j6934J02420J101q6539L1568J5032l4357J1483J47818j03117q9245
7646g69829P2850k1689N4824j867m2058k8823N4668n0176k833N8400M5282j01531
7634g32782j824K3829q2989K2951R9559n5505j224o192l6459L0306Q790j27389
7622h58929N0599J38669R328k1390m5753o4378M924o534Q961m2633M5550m968
7610g86554O106N6084j1251m2567J1144n6142J30946m0202j22514L997J1703P0765
7598g68485M6328O791n2635k0253K2734J15355L2114O6906q7724k9890n246o3102
$$ plain form
7681 -481618 -580364 -650952 -574806 -543336 -549098 -488185 -408578 -506669 -512457 -613975 -694157 -578708
7669 -578708 -597603 -650491 -649566 -617299 -623371 -595810 -611636 -715906 -684419 -691536 -684210 -749059
7657 -749059 -765993 -663573 -662472 -749011 -717443 -702411 -736768 -725285 -577467 -680584 -769829
7646 -769829 -696979 -718668 -663844 -665711 -707769 -736592 -681924 -732100 -734933 -676533 -631251 -732782
7634 -732782 -734606 -710777 -793766 -770815 -671256 -726761 -727985 -734177 -770636 -740330 -731540 -858929
7622 -858929 -808330 -669661 -660333 -681723 -727476 -791854 -786930 -793464 -784503 -827136 -781586 -786554
7610 -786554 -780448 -724364 -735615 -778182 -767038 -823180 -692234 -732436 -854950 -850953 -839250 -768485
7598 -768485 -722157 -715366 -768001 -788254 -765520 -650165 -618051 -551145 -638869 -668759 -674005 -737107
7586g37107l9379J64284q4215q376p9395K385K3369N7488o9184Q7296L3957o4022
7574g12899m5598M9727J10810q8546n9106O8727J1003o790J1610k543k2912j2550
7562f99067l4342Q143n6875o778R5012j5901k756O5044m3669o6856J30817k723
7550f29951k1871k5789P4117k2371j664k6157Q4069o687l4045L4525K8867q5373
7538f32330L6628l5131K8413Q1746n6661N1996m899j3156n6935j9118R5188P4263
7526d49996k6261l3998J4230N542M7298P2903J1160l7411P5761q4558M8446P055
7514c49829O2101n2139N385j3607r1955n1828M0481M7934J27830Q4549l7267m4057
7502b72402O7000O7170l4825J101m2720R6449N3478J6855j12873q0981O6603n001
$$ plain form
7586 -737107 -776486 -612202 -696417 -704793 -784188 -781803 -758434 -700946 -770130 -682834 -648877 -712899
7574 -712899 -758497 -708770 -597960 -686506 -745612 -676885 -665882 -672672 -661062 -663605 -686517 -699067
7562 -699067 -733409 -725266 -782141 -788919 -693907 -709808 -712564 -647520 -691189 -758045 -627228 -629951
7550 -629951 -651822 -677611 -603494 -625865 -627529 -653686 -569617 -576304 -610349 -575824 -546957 -632330
7538 -632330 -595702 -630833 -602420 -520674 -577335 -525339 -530238 -543394 -600329 -619447 -524259 -449996
7526 -449996 -476257 -510255 -496025 -490483 -443185 -370282 -359122 -396533 -320772 -405330 -356884 -349829
7514 -349829 -287728 -339867 -334482 -348089 -440044 -491872 -451391 -403457 -275627 -191078 -228345 -272402
7502 -272402 -205402 -138232 -173057 -171956 -214676 -118227 -64749 -47894 -160767 -241748 -175145 -180146
7490a80146P4868m6503j7591R6964R908j26796K202R222l0723Q2609p26l907L4287
7477i6332N8007M8669L1756Q152N05n8321M9139M9371K0195n6331k392n2177K4058
7464B4299q2590Q1661J5955j3482n8654j9692J17871j6026j48844J3812k5952
7453a11642n3247p7652J26945N3479M6288n3787l8709m456L222L6727j4529j05911
7441a93272j8404J3883l3308J18271k8300q6089l8007o1148l1274K7069j86499
7430e17078Q6833J32647o1359J0945r615j27474O9982J7016m0389n1081P3481
7419d16092P8379n4481J7145q6565j47519K168K6217r4254O2265K5110l5853p3304
7407f96784n8230N6488m903o242n8369M2344j30745n9289P310M3880O1399m0970
$$ plain form
7490 -180146 -105278 -151781 -169372 -72408 -62500 -189296 -187094 -177872 -208595 -125986 -126712 -130619 -96332
7477 -96332 -38325 10344 42100 50252 50757 -7564 41575 90946 111141 54810 52418 241 24299
7464 24299 -58291 23370 39325 25843 -32811 -52503 65368 49342 -99502 -85690 -111642
7453 -111642 -164889 -242541 -115596 -62117 -15829 -69616 -108325 -112781 -109559 -72832 -87361 -193272
7441 -193272 -211676 -197793 -231101 -112830 -141130 -227219 -265226 -326374 -357648 -330579 -517078
7430 -517078 -430245 -297598 -358957 -348012 -357627 -485101 -415119 -398103 -438492 -489573 -416092
7419 -416092 -337713 -392194 -375049 -461614 -609133 -606965 -580748 -675002 -612737 -587627 -623480 -696784
7407 -696784 -755014 -698526 -703429 -709671 -768040 -725696 -856441 -915730 -908420 -864540 -803141 -844111
7395h44111j5465Q9309o6908l3263N8920K7025p1420r5845Q6530r303P9296j3535
7383h08770q169n3546J01609L1032q6610N7499Q059k1340l2745N4155Q275j5077
7371g65628j68245O6223P5545q0119j5882k9695J7063j1754k4397N5307Q0283
7360h01299k0249o482n6361O9853M797o1885p22k9991Q0147N959o1642o8415R5421
7347h50869p214n1213O8469O3962q8214m7131O7220K4622k459o8809j3826K3390
7335h82072p057m1348J2349p2231L2063K2803K675q741k3564J07508l022o7413
7323i28050R9334L1998p4444n4133k8753l7427l4213J09496N9805J2637l9685
7312h83435k0414o3863N2133L3304o8544o8467L6643j814P0220K8392L1687j8640
$$ plain form
7395 -844111 -859576 -770267 -837175 -870438 -811518 -784493 -855913 -951758 -865228 -874531 -795235 -808770
7383 -808770 -816939 -870485 -768876 -737844 -824454 -766955 -758896 -780236 -812981 -758826 -750551 -765628
7371 -765628 -933873 -867650 -792105 -872224 -888106 -917801 -900738 -912492 -936889 -881582 -801299
7360 -801299 -821548 -828030 -884391 -814538 -809741 -871626 -872348 -902339 -822192 -816233 -877875 -946290 -850869
7347 -850869 -858083 -909296 -840827 -776865 -865079 -912210 -844990 -820368 -822827 -891636 -905462 -882072
7335 -882072 -889129 -930477 -918128 -990359 -958296 -935493 -932818 -941559 -965123 -857615 -860637 -928050
7323 -928050 -828716 -796718 -871162 -925295 -954048 -991475 -1025688 -916192 -856387 -843750 -883435
7312 -883435 -903849 -967712 -915579 -882275 -950819 -1019286 -982643 -984457 -914237 -885845 -854158 -872798
7300h72798m5192J0871N5208Q2157Q466j08249m5520K2532o0321k5664o5033L1847
7288a011696R0700J04952k4935l9880o367J5391J7864k7300p2531L289p1460M6634
7276i75339J40621J9354n0697l7805o7045J3258N0823P3599k1814k2756J9770
7265h58031N9446o3699p6354J10955R4693j54961p6719l5890J57408n0411j53732
7254a047295R5087J6348n8062q6130J35739Q7850j5393J4479m075n9936O1886
7243h59502J7759j1202J6103N152K5673M4871L233m1021r152K8678o4254N129
7231h38533m9691K8703r743j3020M3790o4260L4395l0484K8076l9565k8700o4163
7219a003195Q8458K9307q2216L1110M4453p155J5176k8383K2825M7515j769m1480
$$ plain form
7300 -872798 -917990 -907119 -851911 -769754 -761288 -869537 -915057 -892525 -952846 -978510 -1043543 -1011696
7288 -1011696 -920996 -816044 -840979 -880859 -887226 -871835 -853971 -881271 -953802 -950513 -1021973 -975339
7276 -975339 -834718 -815364 -866061 -903866 -970911 -957653 -906830 -833231 -855045 -877801 -858031
7265 -858031 -798585 -862284 -938638 -827683 -732990 -887951 -964670 -1000560 -843152 -893563 -1047295
7254 -1047295 -952208 -935860 -993922 -1080052 -944313 -856463 -871856 -857377 -861452 -921388 -859502
7243 -859502 -841743 -852945 -836842 -831690 -806017 -761146 -757913 -798934 -808086 -779408 -843662 -838533
7231 -838533 -888224 -859521 -869264 -882284 -838494 -902754 -868359 -898843 -870767 -910332 -939032 -1003195
7219 -1003195 -914737 -885430 -967646 -936536 -892083 -899238 -884062 -912445 -889620 -842105 -843874 -885354
7207h85354J08569J7154n2444L7574l3260K6721o2193j09266p944M041R4184Q4804
7195g77414l5483p3868q7826K4451j3965J19009k7624n561M0364J7201q2583m7619
7183i50918N0045L3827N511j3896k1242P3715j2344J7708M1744N390n8628l8440
7171h67528r4785Q4199J2879j301O1214P1457l6315n7602k0053j2606K3732Q8080
7159g48629N8482o8335n4947r5125P4978M0705n2160j6783J10323n5777j62217
7148i69485J3455O5816K153L9291M3093J4422J07839n8136K29l496j06443L3844
7136h17418q780l6276J6331O953L3572l8664l5991R7656j46475J2610K7453M1450
7124h47579K6442o3882m6811P741p410J8206k6189J27112Q3190r0494j0892P9570
$$ plain form
7207 -885354 -776785 -759631 -812075 -774501 -807761 -781040 -843233 -952499 -960443 -956402 -862218 -777414
7195 -777414 -812897 -886765 -974591 -950140 -964105 -845096 -872720 -878281 -837917 -820716 -903299 -950918
7183 -950918 -900873 -867046 -861535 -875431 -896673 -822958 -835302 -817594 -775850 -770460 -829088 -867528
7171 -867528 -962313 -878114 -865235 -866536 -805322 -733865 -770180 -827782 -847835 -860441 -836709 -748629
7159 -748629 -690147 -758482 -813429 -908554 -833576 -792871 -845031 -861814 -751491 -807268 -969485
7148 -969485 -956030 -890214 -888061 -848770 -805677 -791255 -683416 -741552 -741323 -744819 -851262 -817418
7136 -817418 -826198 -862474 -846143 -839190 -805618 -844282 -880273 -782617 -929092 -916482 -889029 -847579
7124 -847579 -821137 -885019 -931830 -924089 -931499 -913293 -939482 -812370 -729180 -819674 -830566 -750996
7112g50996n8930l9222l6998n8650N6841j3931P8652K2987m2823N302J106L5466
7100h01196k2492q050N2982r5887J2068K3975R0308L0908r4415j41685k0982P3441
7088i01025m6622L8476l360N2621L2783j6331q0817m7301J4435L4531P4573M4401
7076h03636k8448n0414N6861L2629j1352n9002j1461n3011j1723j2390m5183O1246
7064i35884P9768N0899j4089M6334J5345L6645o996k3478r960l0349q6761M8924
7052h29602l7775m119M4080l1985O4963N1661j23590K8810J5287K9855k3745k0798
7040h36958J5079m8191N1136O3926m2983O0334O2350l7204R1855p4544q6728J22729
7028f59199l352q6597l9949n7622K8851R18Q5203O3106K5617J3760r1886L3087
$$ plain form
7112 -750996 -809926 -849148 -886146 -944796 -887955 -901886 -823234 -800247 -843070 -837768 -836662 -801196
7100 -801196 -823688 -831738 -778756 -874643 -862575 -838600 -748292 -717384 -811799 -953484 -974466 -901025
7088 -901025 -947647 -909171 -912531 -859910 -827127 -843458 -924275 -971576 -957141 -922610 -848037 -803636
7076 -803636 -832084 -882498 -825637 -793008 -804360 -863362 -874823 -927834 -939557 -951947 -997130 -935884
7064 -935884 -856116 -805217 -819306 -772972 -757627 -720982 -727978 -751456 -761416 -791765 -878526 -829602
7052 -829602 -867377 -871496 -827416 -859401 -794438 -742777 -866367 -837557 -822270 -792415 -816160 -836958
7040 -836958 -821879 -870070 -818934 -755008 -797991 -737657 -675307 -712511 -620656 -695200 -781928 -659199
7028 -659199 -662551 -749148 -789097 -846719 -817868 -816950 -731747 -668641 -643024 -629264 -721150 -688063
7016f88063O6920q0296K775j21004J03799o0043M9983L8287r3611m4182o2966
7005h88401p9543J20193N4159l862R4688o676r5534j1662J66400m783j15061o4290
6993h34372Q5795m831o5129k313o1831N8547M3511J8764L6263Q4805Q414j19989
6981g52366l2752P1027o2202P931L4488J8067L2899l1393m1901j3807O5211J80081
6969e24717n1641q0722K9754q7662o7408m6820N5355m0087K7636j0138j9933K3483
6957g92900l3168p938Q4183M4204o3201m851Q0279k8785M2857j5777m8077M1289
6945g01885j4646j0611K6896l5157j9547M0958L4735k320k1323l7898j5136j8492
6933g74426l1133K9308N3822K100O8740j0143q3643j4257n754M7746K0193p2721
$$ plain form
7016 -688063 -621143 -701439 -698664 -819668 -715869 -775912 -725929 -687642 -781253 -825435 -888401
7005 -888401 -967944 -847751 -793592 -797454 -702766 -709442 -804976 -816638 -650238 -655021 -770082 -834372
6993 -834372 -748577 -753408 -818537 -820850 -882681 -824134 -780623 -761859 -725596 -640791 -632377 -752366
6981 -752366 -785118 -714091 -776293 -768362 -733874 -715807 -682908 -714301 -756202 -770009 -704798 -524717
6969 -524717 -576358 -657080 -627326 -714988 -782396 -829216 -773861 -813948 -786312 -796450 -816383 -792900
6957 -792900 -826068 -834006 -749823 -705619 -768820 -773671 -693392 -722177 -679320 -695097 -743174 -701885
6945 -701885 -716531 -727142 -700246 -735403 -754950 -713992 -679257 -681577 -702900 -740798 -755934 -774426
6933 -774426 -805559 -776251 -722429 -720329 -651589 -661732 -745375 -759632 -765386 -717640 -697447 -770168
6921g70168m0532L4543M8224J14285J0695r3823Q4882j7521m853q037j0299j1917
6909f64521o896L5304o0875l0494Q1187m8834j33915J8643Q8098Q2993o9950M1725
6897f67535K1117J7931k8079N2549L9090n3820J8571p8975l5951K7441M5962N1374
6885e90325m4624r6546j4039j3616R2621P2868n6398k9452p356n0249J08446R596
6873f19074j2087N425K823L463M3445n7897n1280K9834J0937Q460L0640j358J09393
6860d97276o0283m2938K0745J5678j28602L8004K384j31729k3082R7939M4048
6849f65112k4234M8574l1119R1949m8545n776R1105M8618n8884o7865O1326R5999
6837d63964q3781L3642k4065p2566M0733L1750n1018K8808J00932J7264m3747
$$ plain form
6921 -770168 -810700 -776157 -727933 -613648 -602953 -696776 -611894 -629415 -634268 -642305 -652604 -664521
6909 -664521 -671417 -636113 -696988 -727482 -646295 -695129 -829044 -810401 -722303 -639310 -709260 -667535
6897 -667535 -646418 -628487 -656566 -604017 -564927 -618747 -600176 -679151 -715102 -687661 -641699 -590325
6885 -590325 -634949 -731495 -745534 -759150 -666529 -593661 -650059 -679511 -686867 -737116 -628670 -619074
6873 -619074 -631161 -625736 -622913 -619450 -576005 -633902 -685182 -655348 -644411 -635951 -605311 -606669 -497276
6860 -497276 -557559 -600497 -579752 -564074 -692676 -654672 -652288 -784017 -807099 -709160 -665112
6849 -665112 -689346 -640772 -671891 -579942 -628487 -634263 -543158 -494540 -553424 -621289 -559963 -463964
6837 -463964 -547745 -514103 -538168 -610734 -570001 -538251 -589269 -560461 -459529 -442265 -486012
6826d86012j21699L2155Q6497k1820l580M2568j01479j42892K52094p2120m4222
6815e80510R3606J9771j22782R1327J12602J966q8057J19348M3444n8372O8437
6804b99220j15153p7209L2957q4694O1702p8315p011O9421R2099O6355K1828q1626
6792c98866o3019J4902J0157J7229n7232J43262M8778n8944j31252L3868r7642
6781e38759O8038J07258m8371J08177J01168k17035q458Q6639N3842N64j09936
6770c96873J0026M6914r835O9100N5774n221m0978o1447l9215K3102K2618l3042
6758c59077K2203Q6507R175m0933m7293j7948N0684L5796l1267O4170L0442j4477
6746b12018K3843k3621J1706n2605O0504r0392O2364P2787P3280M4435J21050
$$ plain form
6826 -486012 -607711 -575556 -489059 -510879 -514459 -471891 -573370 -716262 -464168 -536288 -580510
6815 -580510 -486904 -467133 -589915 -498588 -385986 -384020 -472077 -352729 -309285 -367657 -299220
6804 -299220 -414373 -491582 -458625 -543319 -481617 -559932 -566943 -497522 -405423 -339068 -317240 -398866
6792 -398866 -461885 -446983 -436826 -419597 -476829 -333567 -284789 -343733 -474985 -441117 -538759
6781 -538759 -470721 -363463 -411834 -303657 -202489 -419524 -427982 -341343 -287501 -286937 -396873
6770 -396873 -386847 -339933 -349768 -280668 -224894 -230115 -271093 -332540 -371755 -348653 -326035 -359077
6758 -359077 -336874 -250367 -241192 -282125 -329418 -347366 -296682 -260886 -292153 -227983 -197541 -212018
6746 -212018 -188175 -211796 -200090 -252695 -192191 -282583 -220219 -147432 -74152 -29717 91333
6735I1333M3768j29860K2594L3360L1709o5472k2406L0475Q2892n6738N4211l1787
6723H4079J701P0807J6934r5429o9059n475Q0390o401k8543K7754k4503Q1042
6711A33297j6699m5751J12299P3511k4678J13215K9213o208m802K2335p6761K8253
6699C37224J69482M8040Q8222j11413q7563l5222L7778j78894L7578p6127l573
6688B25532o689l1114J5207Q3080J2032j12895L3255Q260J5342o0663P5520M1048
6676B97915l4310M3961O5854O8245k3832o2027P889l473r687M776j9903L1525
6664C66933j54234p1277J35801K8031K6077k4512j82817m3188J24625k780j7262
6653A85397j756J06713L1628l2672r7390j0351R9115O5518p7845p786J2410K2589
$$ plain form
6735 91333 135101 5241 27835 61195 92904 27432 5026 35501 118393 61655 115866 84079
6723 84079 85780 156587 173521 78092 9033 3558 83948 77547 49004 76758 52255 133297
6711 133297 116598 70847 183146 256657 231979 345194 374407 368199 363397 385732 308971 337224
6699 337224 506706 554746 642968 531555 443992 408770 446548 267654 305232 229105 225532
6688 225532 218843 187729 202936 286016 298048 185153 218408 226668 242010 181347 256867 297915
6676 297915 263605 307566 373420 441665 417833 355806 363695 360222 350535 355311 335408 366933
6664 366933 212699 141422 277223 305254 331331 306819 124002 80814 205439 202659 185397
6653 185397 183641 290354 321982 289310 191920 181569 280684 346202 268357 260571 272981 295570
6641B95570L7363J0724m1901L3963m2030N9454m3375N9231M5912J6191j5147J5723
6629D31678M8899q817K7400L4432n0509j1689l0026j601l7761L8175K0029p8851
6617C81359p228J53105k5317Q497j803P1617n5405n2059J77667p2551n637K2862
6605E95107K9488K9456N9204j41P479J14317m5011O6275N9434r1272J0423M4724
6593H79483Q8882L0741n605M5920N157p5830L9768o7006N3275o667J16118M2992
6581A147228m2332O3085j1659n981P7892r148l5082K6905M2975J03245J2816m6466
6569A323478J16899R6720O5230N0604P6023M8785j07251k3058O2741J6568o441
6558A720298J6781K9256Q9171P9389N480l718M1644J33316M3695O9841m0275L3035
$$ plain form
6641 295570 332933 343657 301756 335719 293689 353143 309768 368999 414911 431102 415955 431678
6629 431678 480577 471760 499160 533592 483083 471394 441368 439767 402006 440181 460210 381359
6617 381359 374131 527236 501919 510416 508613 580230 524825 472766 650433 577882 572245 595107
6605 595107 624595 654051 713255 713114 720593 834910 789899 856174 915608 824336 834759 879483
6593 879483 968365 999106 993501 1039421 1044578 968748 1008516 941510 994785 988118 1104236 1147228
6581 1147228 1104896 1167981 1156322 1150341 1228233 1219085 1184003 1210908 1253883 1357128 1369944 1323478
6569 1323478 1440377 1537097 1602327 1652931 1728954 1777739 1670488 1647430 1710171 1726739 1720298
6558 1720298 1737079 1766335 1855506 1934895 1940375 1936657 1978301 2111617 2155312 2225153 2184878 2217913
6546B217913R4660K8632J08750N7322P9519J32838j9943M6483J02248O9946q340
6535B910028K7987j3269J25581L6518k7030P5971R2853R7823J09777K48529N5227
6524C739995K3971R6635N4557j9118J05447J40658J41470J23344J13968J67275
6514D688202K36835K8415P2727J05796N5652J18200K51401K09634J09775J39021
6504F015658K19530J38050J74495K59677J28718J78364O3808K41748L88875K92534
6494H101457K87748K50395M24894M21784M81546N78258M57780O44946P34343Q26545
6484A3209696R68506J174567J000832N07462K11354j62618n13069n27259m50199
6475A5419272l77838k15624j28455n9767J22719J93803K24248L48516N18343O66745
$$ plain form
6546 2217913 2312573 2341205 2449955 2507277 2586796 2719634 2699691 2746174 2848422 2918368 2910028
6535 2910028 2938015 2924746 3050327 3086845 3059815 3135786 3228639 3326462 3436239 3684768 3739995
6524 3739995 3763966 3860601 3915158 3896040 4001487 4142145 4283615 4406959 4520927 4688202
6514 4688202 4925037 4953452 5026179 5131975 5187627 5305827 5557228 5766862 5876637 6015658
6504 6015658 6235188 6373238 6547733 6807410 6936128 7114492 7178300 7420048 7808923 8101457
6494 8101457 8389205 8639600 9064494 9486278 9967824 10546082 11003862 11648808 12383151 13209696
6484 13209696 14178202 15352769 16353601 16861063 17072417 16909799 16396730 15869471 15419272
6475 15419272 15041434 14825810 14697355 14637588 14760307 14954110 15178358 15526874 16045217 16711962
6465A6711962M99307P10463J013912R28816J236473J392038J657948J911031K079662
6456B8141612K092349J906016J088379N449j122161j574831j478025j280776q21569
6447B6956443n21297k31877k30457R4897K56208L64858L90153N94418P05994Q41410
6437B9220750J039622J064240J157007J520186J752188J901666K333166K496000
6429D2484825K514896K604654K446501K121790K182293K631358L183179L992617
6421F4162113M919168N711906O020907N687744M079007J442357j421035l697935
6413H6904232m727818m821884m160766l601649k715183j788651j016398k52757
6405F3819126K51978Q86747J420828K291190K915434L625217M342302N371383
$$ plain form
6465 16711962 17211269 17921732 18935644 19864460 21100933 22492971 24150919 26061950 28141612
6456 28141612 30233961 32139977 33228356 33233805 32111644 30536813 29058788 27778012 26956443
6447 26956443 26435146 26203269 25972812 26067709 26323917 26688775 27078928 27673346 28379340 29220750
6437 29220750 30260372 31324612 32481619 34001805 35753993 37655659 39988825 42484825
6429 42484825 44999721 47604375 50050876 52172666 54354959 56986317 60169496 64162113
6421 64162113 69081281 74793187 80814094 86501838 90580845 92023202 90602167 86904232
6413 86904232 82176414 77354530 73193764 69592115 66876932 65088281 64071883 63819126
6405 63819126 64071104 64957851 66378679 68669869 71585303 75210520 79552822 84924205
6397H4924205O542342P876221R651192J1490328J3018150J3539025J1573864O622008
6389A65237335j184362r108248j3915900j5156016j3882537j1816501r415184
6382I0758587p311383n751627m440818l391637k569939j796650j187952n78273
6374F3730308N8231P57289J432862J951871K762133L678980M501997N238998N362101
6365H9474770M714551K387856q98534m244896o898801p932065p649736o891908
6357F2061237n992092m954020l951541l274579k782559k225779j848106j707687
6349C5324874j365981j092923q97336o98936o45313n49863n58417m78685m51964
6340B8585456n02093m21832n40378p72809r25126j067307j058035p78456p33677
$$ plain form
6397 84924205 91466547 99342768 108993960 120484288 133502438 147041463 158615327 165237335
6389 165237335 164052973 154944725 141028825 125872809 111990272 100173771 90758587
6382 90758587 83447204 77695577 73254759 69863122 67293183 65496533 64308581 63730308
6374 63730308 63788539 64545828 65978690 67930561 70692694 74371674 78873671 84112669 89474770
6365 89474770 94189321 96577177 95678643 91433747 84534946 76602881 68953145 62061237
6357 62061237 56069145 51115125 47163584 43889005 41106446 38880667 37032561 35324874
6349 35324874 33958893 32865970 31968634 31269698 30624385 30074522 29516105 29037420 28585456
6340 28585456 28083363 27661531 27121153 26348344 25423218 24355911 23297876 22519420 21785743
6331B1785743p19391o15959m15047l98153l01817k52501j88141j87896o8682j341
6321A8636815J64912J47974K78795L46450M01624M80970O43780Q32227N79924
6312B2513471L29523j82249p72151j178193j318151j305185j071954r60399p10321
6303A5344391m79479n33781l31921l18069n64009n04481l02645j15558k43378
6294A1951070k39545r7834K7265J71703K75646K84697L94788K13098M9887j04023
6284A2926752m58926n28738o27326o55932n66677m41845l45860k79563j66266
6275H855619k60287j87424j94891k43388k86754j34286l05787j34695j26914j35182
6265F846011q9886k9707K3377n3942l7540J672J9003M1470J13761J36349K73524
$$ plain form
6331 21785743 21066352 20450393 20035346 19637193 19335376 19082875 18894734 18706838 18638156 18636815
6321 18636815 18801727 18949701 19228496 19574946 19976570 20457540 21101320 21933547 22513471
6312 22513471 22842994 22660745 21888594 20710401 19392250 18087065 17015111 16054712 15344391
6303 15344391 14864912 14331131 13999210 13681141 13117132 12612651 12310006 12194448 11951070
6294 11951070 11711525 11613691 11640956 11812659 12088305 12373002 12767790 12980888 13030775 12926752
6284 12926752 12467826 11939088 11311762 10655830 10089153 9647308 9301448 9021885 8855619
6275 8855619 8595332 8407908 8213017 7969629 7682875 7548589 7242802 7108107 6981193 6846011
6265 6846011 6756125 6726418 6749795 6695853 6658313 6659985 6678988 6720458 6834219 6970568 7244092
6254G244092J26891J91398L37059L81021L30246N37829L58396K80328K26216j5355
6244I998121l02814l24332k51315k75481l08974k30173j93535j08983o2763p0071
6234G869680L4795J01484J32362J83654K86570M02951M01776M66478O76685P21697
6224A1278132R48700R74564R24532P64861K82938k04080o69966j103488j128620
6215A2067573j022077q74317o43874m13134l67891l35675k29853k87650n472j06416
6205G781214q3141P440J20509R7569J32903K74143L18768M29769L46510L39912
6195I765596K73250P2500l59346m73767o60340m98687m39895n04742l71059k41836
6185F561674j22878j83527j35544J1712j22361k20502p7980r9510k58779j28334
$$ plain form
6254 7244092 7370983 7562381 7899440 8280461 8610707 9148536 9506932 9787260 10013476 9998121
6244 9998121 9695307 9370975 9119660 8844179 8535205 8305032 8111497 8002514 7939751 7869680
6234 7869680 7904475 8005959 8138321 8321975 8608545 9011496 9413272 9879750 10556435 11278132
6224 11278132 12226832 13201396 14125928 14890789 15173727 14969647 14299681 13196193 12067573
6215 12067573 11045496 10171179 9527305 9114171 8746280 8410605 8180752 7893102 7887630 7781214
6205 7781214 7698073 7705513 7826022 7923591 8056494 8330637 8649405 9079174 9425684 9765596
6195 9765596 10038846 10111346 9752000 9278233 8617893 8119206 7679311 7174569 6803510 6561674
6185 6561674 6438796 6255269 6119725 6131437 6009076 5788574 5710594 5611084 5352305 5223971
$$ [...]
##END NTUPLES=NMR SPECTRUM
##END=
