##TITLE=1H_EC-3306(12-2)
 CDCl3
 8 sc, 
 25.12.2023
##JCAMPDX= 6.0         $$ Bruker NMR JCAMP-DX V2.0
##DATA TYPE= NMR SPECTRUM
##DATA CLASS= NTUPLES
##ORIGIN= UXNMR, Bruker Analytische Messtechnik GmbH
##OWNER= root
$$ XWIN-NMR		Version 3.5
$$ Mon Dec 25 14:57:22 2023 Russian Standard Time (UT+4h)  she@DPX200
##.OBSERVE FREQUENCY= 200.1313
##.OBSERVE NUCLEUS= ^1H
##.ACQUISITION MODE= SIMULTANEOUS
##.ACQUISITION SCHEME= undefined
##.AVERAGES= 8
##.DIGITISER RES= 18
##SPECTROMETER/DATA SYSTEM= spect
##.PULSE SEQUENCE= zg30
##.SOLVENT NAME= CDCl3
##.SHIFT REFERENCE= (INTERNAL, CDCl3, 0, 15.3954)
##AUDIT TRAIL= $$ (NUMBER, WHEN, WHO, WHERE, WHAT)
$$ ##TITLE= Audit trail, XWIN-NMR		Version 3.5
$$ ##JCAMPDX= 5.01
$$ ##ORIGIN= Bruker BioSpin GmbH
$$ ##OWNER= she
$$ F:/spectra/data/she/nmr/H-F/1/pdata/1/auditp.txt
$$ ##AUDIT TRAIL=  $$ (NUMBER, WHEN, WHO, WHERE, WHAT)
(   1,<2023-12-25 14:56:13.12 +0400>,<she>,<DPX200>,
      <created by zg, POWCHK disabled, PULCHK disabled
       configuration hash MD5:
       00 E9 B6 7A A2 85 ED C7 34 08 36 98 17 FE 4E 26
       data hash MD5: 16K
       57 4C A1 E1 A6 C6 3A 39 79 60 BB E4 A8 B3 DF F5>)
(   2,<2023-12-25 14:56:15.45 +0400>,<she>,<DPX200>,
      <Start of raw data processing
       efp BC_mod = 2 LB = 0.24 FT_mod = 6 PKNL = 1 PHC0 = -24594.35 PHC1 = 14.05273 SI = 16K 
       data hash MD5: 16K
       8D 90 0A A0 5E C1 3D C5 43 BE E3 CA 63 70 B8 B5>)
(   3,<2023-12-25 14:56:38.06 +0400>,<she>,<DPX200>,
      <pk PHC0 = 0.4027764 PHC1 = -1 
       data hash MD5: 16K
       4B 5A 3A DB D7 57 76 99 B5 B3 81 38 63 26 CD E1>)
(   4,<2023-12-25 14:56:41.68 +0400>,<she>,<DPX200>,
      <abs ABSG = 5 
       data hash MD5: 16K
       94 4D F7 33 39 39 8C 02 26 52 30 B1 B3 0D 96 AD>)
$$ ##END=
$$ 
$$ hash MD5
$$ 47 AA 13 9A 09 25 93 D5 0F 62 60 30 60 4A E1 31
##$RELAX= 
##$RELAX= 
##$RELAX= 
##$RELAX= 
##$RELAX= 
##$RELAX= 
$$ Bruker specific parameters
$$ --------------------------
##$DU= <F:/spectra>
##$EXPNO= 1
##$NAME= <H-F>
##$PROCNO= 1
##$TYPE= <nmr>
##$USER= <she>
##$AMP= (0..31)
100 100 100 100 100 100 100 100 100 100 100 100 100 100 100 100 100 100 
100 100 100 100 100 100 100 100 100 100 100 100 100 100 
##$AQSEQ= 0
##$AQ_mod= 1
##$AUNM= <au_zg>
##$AUTOPOS= <>
##$BF1= 200.13
##$BF2= 200.13
##$BF3= 200.13
##$BF4= 200.13
##$BF5= 200.13
##$BF6= 200.13
##$BF7= 200.13
##$BF8= 200.13
##$BYTORDA= 1
##$CFDGTYP= 0
##$CFRGTYP= 5
##$CHEMSTR= <none>
##$CNST= (0..31)
1 1 145 1 1 1 1 1 1 1 1 1 1 1 1 1 1 1 1 1 1 1 1 1 1 1 1 1 1 1 1 1 
##$CPDPRG= <>
##$CPDPRG1= <>
##$CPDPRG2= <>
##$CPDPRG3= <>
##$CPDPRG4= <mlev>
##$CPDPRG5= <mlev>
##$CPDPRG6= <mlev>
##$CPDPRG7= <mlev>
##$CPDPRG8= <mlev>
##$CPDPRGB= <>
##$CPDPRGT= <>
##$D= (0..31)
0 1.2 0 0 0 0 0 0 0 0.06 0 0.03 0 0 0 0 0.0002 0 0 0 0 0 0 0 0 0 0 0 0 
0 0 0 
##$DATE= 1703501772
##$DBL= (0..7)
120 120 120 120 120 120 120 120 
##$DBP= (0..7)
150 150 150 150 150 150 150 150 
##$DBP07= 0
##$DBPNAM0= <>
##$DBPNAM1= <>
##$DBPNAM2= <>
##$DBPNAM3= <>
##$DBPNAM4= <>
$$ [...]
##$SUBNAM3= <"">
##$SUBNAM4= <"">
##$SUBNAM5= <"">
##$SUBNAM6= <"">
##$SUBNAM7= <"">
##$SUBNAM8= <"">
##$SUBNAM9= <"">
##$SW= 18.0517328524113
##$SWIBOX= (0..15)
0 0 2 0 0 0 0 0 0 0 0 0 0 0 0 0 
##$SW_h= 3612.71676300578
##$TD= 16384
##$TD0= 1
##$TE= 0
##$TE2= 300
##$TE3= 300
##$TEG= 300
##$TL= (0..7)
0 120 120 120 120 120 120 120 
##$TP= (0..7)
150 150 150 150 150 150 150 150 
##$TP07= 0
##$TPNAME0= <>
##$TPNAME1= <>
##$TPNAME2= <>
##$TPNAME3= <>
##$TPNAME4= <>
##$TPNAME5= <>
##$TPNAME6= <>
##$TPNAME7= <>
##$TPOAL= (0..7)
0.5 0.5 0.5 0.5 0.5 0.5 0.5 0.5 
##$TPOFFS= (0..7)
0 0 0 0 0 0 0 0 
##$TUNHIN= 0
##$TUNHOUT= 0
##$TUNXOUT= 0
##$USERA1= <user>
##$USERA2= <user>
##$USERA3= <user>
##$USERA4= <user>
##$USERA5= <user>
##$V9= 5
##$VALIST= <valist>
##$VCLIST= <CCCCCCCCCCCCCCC>
##$VD= 0
##$VDLIST= <DDDDDDDDDDDDDDD>
##$VPLIST= <PPPPPPPPPPPPPPP>
##$VTLIST= <TTTTTTTTTTTTTTT>
##$WBST= 1024
##$WBSW= 4
##$XGAIN= (0..3)
0 0 0 0 
##$XL= 0
##$YL= 0
##$YMAX_a= 362452
##$YMIN_a= -392423
##$ZGOPTNS= <>
##$ZL1= 120
##$ZL2= 120
##$ZL3= 120
##$ZL4= 120
##$ABSF1= 15.45271
##$ABSF2= -2.599139
##$ABSG= 5
##$ABSL= 3
##$ALPHA= 0
##$AQORDER= 0
##$ASSFAC= 0
##$ASSFACI= 0
##$ASSFACX= 0
##$ASSWID= 0
##$AUNMP= <proc_1d>
##$AZFE= 0.1
##$AZFW= 0.1
##$BCFW= 0
##$BC_mod= 2
##$BYTORDP= 0
##$COROFFS= 0
##$CY= -3
##$DATMOD= 1
##$DC= 0
##$DFILT= <>
##$DTYPP= 0
##$F1P= 0
##$F2P= 0
##$FCOR= 1
##$FTSIZE= 16384
##$FT_mod= 6
##$GAMMA= 0
##$GB= 0
##$INTBC= 1
##$INTSCL= 3.70164e-10
##$ISEN= 128
##$LB= 0.24
##$LEV0= 0
##$LPBIN= 0
##$MAXI= 10000
##$MC2= 0
##$MEAN= 0
##$ME_mod= 0
##$MI= 1.114404
##$NCOEF= 0
##$NC_proc= -7
##$NLEV= 6
##$NOISF1= 3.799351
##$NOISF2= 2.8
##$NSP= 0
##$NTH_PI= 0
##$NZP= 0
##$OFFSET= 15.39541
##$PC= 1
##$PHC0= -24593.95
##$PHC1= 13.05273
##$PH_mod= 1
##$PKNL= yes
##$PPARMOD= 0
##$PSCAL= 0
##$PSIGN= 0
##$REVERSE= no
##$SF= 200.130025273945
##$SI= 16384
##$SIGF1= 3
##$SIGF2= 2
##$SINO= 5.538805
##$SIOLD= 16384
##$SREGLST= <1H.CDCl3>
##$SSB= 0
##$STSI= 16384
##$STSR= 0
##$SW_p= 3612.71676300578
##$SYMM= 0
##$S_DEV= 0
##$TDeff= 16384
##$TDoff= 0
##$TI= <>
##$TILT= no
##$TM1= 0
##$TM2= 0
##$TOPLEV= 0
##$USERP1= <user>
##$USERP2= <user>
##$USERP3= <user>
##$USERP4= <user>
##$USERP5= <user>
##$WDW= 1
##$XDIM= 16384
##$YMAX_p= 382421722
##$YMIN_p= -543176
$$ End of Bruker specific parameters
$$ ---------------------------------
##NTUPLES= NMR SPECTRUM
##VAR_NAME=  FREQUENCY,     SPECTRUM/REAL,   SPECTRUM/IMAG
##SYMBOL=    X,             R,               I
##VAR_TYPE=  INDEPENDENT,   DEPENDENT,       DEPENDENT
##VAR_FORM=  AFFN,          ASDF,            ASDF
##VAR_DIM=   16384,         16384,           16384
##UNITS=     HZ,            ARBITRARY UNITS, ARBITRARY UNITS
##FACTOR=    0.220516191357247, 1,           1
##FIRST=     3081.08370915774, 0,            0
##LAST=      -531.633053848037, 0,           0
##MIN=       -531.633053848037, -543176,     0
##MAX=       3081.08370915774, 382421722,    0
$$ Real data points
##PAGE= N=1
##DATA TABLE= (X++(R..R)), XYDATA
$$ [...]
14524 35985 -174195 -44815 -7759 28523 13996 -320752 -165308 121378 43061 63269 -51198
14513 -51198 -141678 -106792 -269895 -230325 -61804 -10872 -15279 36770 223350 -48310 -26242
14502 -26242 41841 196332 73683 115303 -133719 -304073 -328651 -166576 -103426 -217590
14492 -217590 -131363 17334 -21222 -41464 110100 -26236 -66072 107037 -40687 -106441
14482 -106441 -10284 -17713 -40390 -30425 35003 14771 30806 170299 112150 204694 9053
14471 9053 36235 -12368 -18036 72129 -157873 -172484 -29088 61336 113824 84497 -31137
14460 -31137 -96793 -97385 74715 210349 138780 -146440 -1873 -14370 124372 129418 220160
14449 220160 220863 110867 54140 350243 420148 353898 428398 71570 -77728 -101697 -196089
14438 -196089 -137985 -64625 37347 46681 190040 78135 -70700 -37811 46421 180958 4687
14427 4687 2862 -794 -5669 32183 -281229 -245150 34326 28127 145653 272684 212987 189364
14415 189364 154829 164587 153111 128193 118245 50176 56740 125003 804 11333 -69249 76206
14403 76206 238173 254884 149335 21302 28762 88150 179186 82430 96825 166546 79284
14392 79284 49436 146213 72141 -5498 44256 191846 50122 67497 -116051 -144952 -61456
14381 -61456 -138624 -228989 -145460 -111687 -380060 -315583 -407112 -201552 94372 -3054 -104661
14370 -104661 -71069 101769 86071 38658 -195494 -55550 119120 168086 216715 296989 169663
14359 169663 -117300 -4562 -53145 -76108 -44898 66293 80524 -68441 -68094 -2356 110151
14348 110151 176617 66502 168955 -1767 -85165 -163917 -39146 -31789 16160 6412 -8649
14337 -8649 33949 -90423 -21189 -97941 -185168 -207250 -116630 179241 109126 100039 221681
14326 221681 -9294 132650 123118 89262 110759 -9809 263104 162037 -10089 -235216
14316 -235216 -359329 -276102 -6131 55422 -87503 124108 190504 13634 -63531 -105228
14306 -105228 -50157 34705 -110484 -129694 -98594 -186421 46829 104767 -101624 -43053 83444
14295 83444 249087 104867 99396 150412 83935 -39474 115941 185677 -57328 -182609 -77574
14284 -77574 -120596 -30690 -27297 -151792 56325 186610 51793 47398 -147676 4281 -7700
14273 -7700 -43102 156906 230032 143681 49964 -55114 39733 103127 188450 6800 -133063
14262 -133063 -122866 -53918 7457 -48916 92346 -13433 -153846 -18303 147320 198760
14252 198760 60045 -31571 -62439 5063 87024 64016 -33909 47567 -79391 -111583 39856
14241 39856 -130751 35628 258113 325418 -11698 4985 119827 245388 -53805 -187644
14231 -187644 -23953 67614 2362 -2474 205264 306161 -53079 -175259 18851 49500
14221 49500 178646 62594 51236 201146 128285 -20663 -38304 89885 -5621 -174546
14211 -174546 -193717 -277055 -102968 -89713 -36210 -100702 -330817 -156733 -69931 -278817 -145421
14200 -145421 -77107 -5534 51387 44323 65814 12804 -72299 29098 -126093 10732 72923
14189 72923 88658 84989 96742 161888 179534 119701 77452 294750 236390 340462 67971
14178 67971 -36925 -23150 41148 -57332 -94212 133620 303978 238512 82699 163561 -20629
14167 -20629 -28364 29821 9489 202143 201023 237689 210126 119726 114083 72084 -247363 -19357
14155 -19357 -93778 -198742 -142773 46131 -31335 -37134 76715 -166132 -234336 -41445 19212
14144 19212 132124 -18948 -76188 108179 193195 121606 -7228 80489 23465 -82493 -48472
14133 -48472 -191076 -231881 -201546 -97904 -175893 -160896 75347 186897 233870 27161 -19285
14122 -19285 -13038 -52482 -254662 10042 99625 11392 106369 -72259 12324 135467 -47142
14111 -47142 17932 -89180 83718 -11021 -89115 -51337 -182984 -152032 -26274 51852 203559
14100 203559 82684 -119111 -22400 -92883 71034 318747 127827 86711 172871 -28861
14090 -28861 40886 132670 107080 206154 238174 23702 -42186 136511 75472 90125 -108331
14079 -108331 -82481 10883 -111978 -257216 -96575 -81430 -20874 44194 -200246 -175405 171967
14068 171967 343839 85991 5986 96921 -116717 -108096 -112328 -61503 26631 20611 60925
14057 60925 110035 87998 -86620 -78400 -3248 18058 26127 49551 -184531 -248384 10823
14046 10823 -124151 -36813 58498 256947 201146 104889 278457 178643 70482 169314 62218
14035 62218 -107756 -103651 76414 192821 152521 201349 44502 -3949 -100732 -15342 52748
14024 52748 73458 -23983 -99017 -39829 -12792 -14885 -285688 -61264 133680 22463 110249
14013 110249 180448 62157 -31983 -199486 -217024 -80872 -90796 83468 103012 225502 67390
14002 67390 196913 124770 63443 211640 361059 226388 -3576 -22304 -6757 -192168
13992 -192168 -50969 -78347 -47934 -107826 24002 -16013 -224495 -83286 -17135 71016 145496
13981 145496 166515 186111 176182 31996 72180 129649 204716 138379 184871 236552 -18325
13970 -18325 2213 -30777 -100723 -243965 -52603 -10424 -12502 -46714 -207937 -159782 -114665
13959 -114665 -86853 -67198 117044 129791 67611 99802 14262 -190834 -175056 -392703 -275061
13948 -275061 -181926 -167975 92609 157478 26892 44466 2133 -77162 -187777 44718 16020
13937 16020 -64 -118171 -216551 -280553 -66029 -191704 -177397 -17125 4196 -180560 -202108
13926 -202108 -85089 34791 79643 -57134 -29395 46051 280219 105163 -20391 -79294
13916 -79294 -62745 -90771 10170 -83025 -232850 -19856 34829 -45857 -32927 94432 329336
13905 329336 43020 -133355 -192105 -43279 -82714 -39636 165199 134333 95518 233975
13895 233975 112894 -91701 -80140 114631 41719 -61408 2516 -79618 -105844 -28668 68987
13884 68987 -128306 -146744 -160634 -104225 -149263 -11145 38181 -90847 -292877 -108487 -155474
13873 -155474 -134337 -116902 -201084 -148126 -246510 -339127 -370288 -242606 -44153 -29878 27237
13862 27237 -69544 -102440 -206036 -158670 -94681 -94296 113105 -109830 -159773 -26836 -4468
13851 -4468 168331 219243 28855 -23791 5770 134283 59769 68427 -54334 21275 60476
13840 60476 -66840 56097 114995 -47149 11877 71331 2109 -245044 -171073 173115 217187
13829 217187 322207 267874 89500 -67107 -89055 -124206 -71513 78456 90222 -21 15158
13818 15158 148903 248205 319137 112385 106976 -55010 -62005 -189729 904 -4245 -97138
13807 -97138 59334 198634 157281 -53439 39952 238802 358580 263366 -78219 -22569
13797 -22569 120216 61198 -85297 -309657 -91133 37749 77274 33593 133042 -7768
13787 -7768 -64486 -22923 208691 22683 -234309 57703 195605 128679 269352 7378
13777 7378 -197648 -105896 -110896 -197689 -262844 -10713 -19088 -45460 128078 154979 -15888
13766 -15888 -378933 -276843 -93011 -243393 -89057 -211917 -135695 -30446 -66566 -128697
13756 -128697 -166380 55742 -220152 -183153 -230589 -204795 -208946 -266157 -116480 -18385 115450
13745 115450 84326 312134 256074 55791 21864 113818 181426 -1435 -114359 -176624 -33660
13734 -33660 22685 -165198 -36826 64736 115996 -80562 -182218 22753 90850 72982
13724 72982 -74041 -66827 -174556 -116799 -1524 -113140 75774 124212 -83262 -25221 29410
13713 29410 -68283 -285602 -291131 -292389 -210026 -151766 10397 13624 -87056 -63854 -47398 7457
13701 7457 -53849 -36857 -11104 -207254 -122655 20936 -199268 42571 47086 1743 83950
13690 83950 -134807 -228788 60862 145813 102734 -68467 3193 -199682 -168677 -14764 165166
13679 165166 177190 91207 -69932 -97894 55233 8549 -29323 -78712 232963 217307 83925
13668 83925 81000 -47843 -96481 67869 131529 226985 155872 103235 258661 262010 10457
13657 10457 -178707 19810 152552 178190 138138 -12540 -163410 -203329 -68032 -61478 88441
13646 88441 63121 74547 -28458 -76189 -183657 -249065 -220961 -74417 -46483 -8640 38877
13635 38877 111764 152251 -98860 32102 -32634 38498 99464 -29864 -74782 -161757 19933
13624 19933 96651 22250 107737 188965 163639 171820 141099 -34067 -40549 5688 18429 17831
13612 17831 -126358 -25177 203741 40642 150389 161250 -134115 -57969 -8105 -116235
13602 -116235 -121610 -58842 64671 43630 194471 184606 -3886 -69993 -47715 -101477 -126216
13591 -126216 -223917 -288050 -23445 -205896 15369 107449 -69306 -163131 -183734 -113541 -162840
13580 -162840 -23211 147094 93377 -100821 -157777 -262087 -309445 -181109 54017 55822
13570 55822 92035 104152 148949 162518 141355 103259 -132290 -210693 -127764 -146096 -176348
13559 -176348 -196078 -75715 18922 -57621 -78184 -92299 -162265 -182723 -79113 -63945 63691
13548 63691 213729 92681 30165 28228 210997 161522 18927 64097 -120684 -41044 -34290
13537 -34290 -144194 -154451 -131913 -314756 -326045 -336081 -114651 100579 91584 121745 141908
13526 141908 -5781 5415 32579 -6239 -292136 -384847 -106773 -134652 -180450 -176910 -150742
13515 -150742 -223409 -156722 58543 169433 28891 -128278 -232568 -63396 -35086 -121651
13505 -121651 -143383 -58016 202249 181872 83607 65549 -30857 3568 -88090 82491 113936
13494 113936 -45493 -94583 90776 32490 -49017 -163263 -11050 38103 -94905 170953
13484 170953 203187 -78996 -227406 -130079 -130351 -145563 -210365 -74734 -116636 -188036 -186968
13473 -186968 -169744 -101927 -193225 -169292 41750 -65066 -9483 -8495 60763 46890 111375
13462 111375 39478 -9082 146476 185150 -61278 -118154 -33370 -75201 54646 56501 83908
13451 83908 23797 -75558 -183001 -37796 -15125 95759 48281 -49337 121612 145046 -152044
13440 -152044 -118578 -64565 23258 196161 126508 18985 -61786 -29585 -6931 -51768 -14287
13429 -14287 135995 99013 174598 192507 21075 -8565 21605 68502 -38526 11166 16843
13418 16843 50455 -38659 -142997 -38392 -221220 -246142 -209960 -187404 -45540 8568 27276
13407 27276 -219541 -280067 -237413 -149695 69505 10852 -53284 -225393 -176615 -174730 -84661
13396 -84661 152099 -124839 -291522 -35057 -158884 -164551 -92763 26980 116799 -66622
13386 -66622 78080 262284 135571 128649 -44430 -135828 -129875 -157691 2630 227515 -6765
13375 -6765 -68998 8808 30208 -79332 -91864 54348 -25771 -97220 -108721 -51667 -103159
13364 -103159 72740 -35296 144058 265812 68416 43521 50958 -142737 98876 95464
13354 95464 -30530 -117957 -56288 -162633 -281709 -181169 -338050 -279944 -270135 -219469 -26307
13343 -26307 115636 -50185 -143313 -107072 -18149 -45470 5341 -7664 115023 222795 106460
13332 106460 68543 -76942 -130928 -129591 48133 279399 191263 20727 -195195 -97220 -121712
13321 -121712 -167315 -151637 -112452 60191 73660 -156400 -307466 57958 100827 217094
13311 217094 149969 -60860 -23359 -75784 -2170 -121931 20001 49350 35983 101978 73008
13300 73008 6949 36385 -50825 -157622 -81197 -140308 -80003 -67548 -82058 91716 34847
13289 34847 -74267 -169477 -179855 -62770 22109 83658 89176 -4812 -13788 -7890 -16427 -116854
13277 -116854 -203140 -317818 -349487 -134099 159177 401560 85974 -262978 -86229 -64927
13267 -64927 -160686 -66644 237269 228987 245030 158934 60904 68157 14999 106014 82827 14142
13255 14142 -180053 -129409 -145366 29542 -118501 -110945 -137814 -89357 -322771 -174564 -72386
13244 -72386 -58 74914 -6964 -107900 -201047 -238553 -384561 -441253 -254142 -292723 -311409
13233 -311409 -187859 -104405 33997 103333 -187882 -294651 -108074 -185295 91725 253406
13223 253406 133105 109949 315314 289848 56507 -148849 -200525 -151396 21516 -185009
13213 -185009 -147926 -201844 36257 79325 -22189 145080 155135 121890 139642 -91873 16553
13202 16553 295274 111786 -180541 -10400 22461 52594 -110178 -126932 27732 -150141
13192 -150141 -26055 25023 -19386 -60026 -66947 -54284 210644 82927 -79883 -23278 73211
13181 73211 -106666 -68533 -226234 -264090 -179978 -36445 -13524 -34777 -72751 -93290 155469
13170 155469 1905 -221005 -299294 -123249 -144135 48724 -98054 -22791 22495 111865
13160 111865 113011 6422 90665 122584 85505 183465 153184 -81814 -54344 -165146 -110273
13149 -110273 -63766 -21413 43289 94909 -27575 -139231 -145005 -86580 -67435 -69147 -35988
13138 -35988 -50145 -100877 -147696 40816 106761 86738 -68224 -75837 -234485 -222188 -41071
13127 -41071 -22336 -28535 47248 -38573 47573 187439 -102854 -156241 -123239 -105864 -191006
13116 -191006 -315193 -439304 -172503 -48787 -72548 -216 -52616 -16598 -115291 -223783
13106 -223783 -65858 -8791 9350 23154 -63613 37336 80516 15374 148287 -147560 -82666
13095 -82666 -132435 -117820 -102735 42201 116872 93513 -30210 -123878 -117882 15318 -87885
13084 -87885 -63721 -126391 -325621 -268450 -260660 -99492 -213391 -365631 -326605 -204638 7160
13073 7160 277085 83940 24079 -7501 -100743 39651 169006 53690 19458 -97825 -31228
13062 -31228 75220 91134 4198 47371 -21895 -127078 -40233 -119850 -112890 -140823 -96753
13051 -96753 -133944 -259634 -174589 -67357 -104897 -106990 -182862 -373134 -290517 -198066 -16377
13040 -16377 -38260 -219364 -174480 -43418 -131826 -24662 -105934 -72818 -43544 -97371 -821
13029 -821 144864 83714 -221830 -116704 102346 -43933 -152371 -228370 -43946 172884
13019 172884 217638 212232 129144 -39520 -137017 1973 -116542 -160569 38840 -138097 -251473
13008 -251473 -380956 -220593 -69156 -152757 -190395 -89255 131054 -124285 -159461 42331
12998 42331 -25514 -58635 -97639 -212850 -241569 -257197 -161894 -30965 46315 -93664 14471
12987 14471 23049 -135513 -117471 -46115 49027 -32787 -71288 -73758 -45446 -12086 -109016 199222
12975 199222 115958 28635 -132713 -174225 -273336 -46768 94384 34344 151286 139588 -119561
12964 -119561 -235107 -95016 -30618 46707 28258 59552 33258 -9740 -29569 144262 152341
12953 152341 -75731 -150795 -275865 -366613 -224491 -166731 -210445 -72394 77060 -42455
12943 -42455 -24857 -38647 -79207 40678 139321 68423 50405 -113979 -204788 -235758 -349820
12932 -349820 -241187 -13398 -144421 -299563 -171463 -159005 -81474 29829 -148766 -340527
12922 -340527 -167515 25300 157717 302339 30562 -50594 -41562 -194 76622 92739 -35047
12911 -35047 -136058 199534 281169 122332 176902 216242 -47057 -211524 -153764 -90912 -75395
12900 -75395 87822 76122 61619 -23980 -64261 24683 27895 -89440 29359 -50504 31059
12889 31059 -27587 -103013 82720 -38591 139109 79592 -74037 41463 95690 190483 115186
12878 115186 -59587 -78644 19637 -104703 -31145 -61011 57925 -12096 -45602 92744 -55429
12867 -55429 154653 203379 226257 302578 249212 -40936 10576 -102597 -154430 75945 220106
12856 220106 -42552 -118438 14217 42603 -4983 74822 -28451 58457 -179607 -332955
12846 -332955 -416837 -171803 -17075 101292 79277 24969 -26206 14493 -65175 -161622 -40320
12835 -40320 -84975 -227746 -253260 -203655 -136389 -49096 -174244 -97177 -340165 -281705 -146863
12824 -146863 -55887 -234024 -185673 -21686 35531 -166380 -288909 -180649 -105407 -103638 -49410
12813 -49410 -8810 -184951 -141312 43588 -11374 64089 32135 -41015 31951 -78106 -54773
12802 -54773 121741 -20797 3041 125670 -22462 -35868 -15910 50671 92814 129289 327032
12791 327032 119380 -76139 -139872 -234483 -62059 18403 -36429 -144608 -338907 -325823
12781 -325823 -199912 -98814 -67087 -81006 -33900 -108626 -112900 -86537 14613 135356 72270
12770 72270 -40976 -76712 38100 -59972 113995 -181756 -124437 -172611 -256110 -186215 -347083
12759 -347083 -243075 -286644 -185398 -174531 -172611 3517 -146292 -97543 -35577 -87521 -155410
12748 -155410 -301875 -148963 24252 -18451 -151427 -303903 -247595 -86590 -67514 -125462
12738 -125462 -75261 -89033 -315767 -182264 -62531 74376 109089 59041 -36915 -144903
12728 -144903 -125305 -65276 -273457 -331546 -179149 -188650 -226096 -45574 64741 55926 -133442
12717 -133442 -192412 29428 194090 123387 174015 403756 -24470 -173681 -81429 -165504
12707 -165504 -58406 -15500 -246712 -197193 -195590 -358920 -75263 14635 -144976 -123401 -142613
12696 -142613 -66628 -18053 -33952 -159759 -349113 -228259 -236425 -439144 -360731 -87105 -258562
12685 -258562 -356803 -99644 -81086 -359778 -237790 -232397 -107694 -75992 -204692 -127912 151503
12674 151503 117808 -93153 14028 220286 -22443 -119707 -132866 -45511 -3767 -64564 -80978
12663 -80978 -131137 -237516 -147359 -22081 -128061 -181716 -222926 -256849 -78330 -75570 -40030
12652 -40030 23226 -85597 -202599 -183571 -230526 -258336 4991 66001 -30065 -153915 -135935
12641 -135935 -193622 -54138 21864 -119459 -133718 -180427 -132949 24633 -85214 -225737
12631 -225737 -99383 -97990 -103185 -162266 -125330 -44645 93656 52561 -179484 -267946 -332718
12620 -332718 -240652 -140307 -2626 -36662 9452 -62211 -49062 -329187 -351997 -342679 -73913
12609 -73913 13553 -19429 -105869 -144727 -54978 -227332 -179592 -78940 164666 30158 -166231
12598 -166231 -320247 -211968 11176 -104789 -132332 -211728 -47542 -269842 -294350 -184687
12588 -184687 -46069 -41177 4217 26799 13018 -91660 -145696 -175676 -201532 -220367 -328713
12577 -328713 -483195 -220769 -75910 -213659 -208699 -56650 135823 168341 111908 29498
12567 29498 -31540 -123394 -234477 -230719 -127583 -346309 -333861 -270052 -218464 -244564 -208542
12556 -208542 -243318 -246474 -316079 -357482 -194416 26667 125295 240404 11178 27737 93169
12545 93169 -101489 -140606 -203945 -250801 6027 21546 9536 -13829 -43509 -2244 -4496
12534 -4496 -208093 -144687 -14086 228133 142707 -96586 -151658 -228226 -205860 -115878 -29829
12523 -29829 -166660 -69237 -120692 -121797 108849 61569 -57631 -105919 -148616 52073 -136577
12512 -136577 -47947 85723 -195336 -16855 164691 232560 -52158 58537 221536 -54744
12502 -54744 13510 -2887 -101337 59536 72887 -35300 -241936 -320563 -209935 -172551 -42057
12491 -42057 -146372 -118154 19624 -3991 -26142 -30260 -60164 20059 106417 18417 -55756
12480 -55756 -79969 55919 145167 -69019 -14507 -173494 -170144 -139582 -193203 -178978 -124848
12469 -124848 -28388 -12810 47884 -4786 -2263 -112287 -193510 -188673 44471 -58930 -245819
12458 -245819 -203172 -229791 -96937 -132516 -125312 17306 62514 -2876 67372 81884 77559
12447 77559 80417 48276 34790 -149692 -247303 -122842 -118489 -25551 37145 -83656 -30388
12436 -30388 -309900 -305273 -38553 -256378 -170152 6934 -165613 -16357 255356 311525
12426 311525 -14644 -78304 -184972 -44014 84787 77098 42875 -57688 -109091 -94728 95960
12415 95960 28811 6839 -19384 -67757 -89861 -174398 -131608 -201076 -231841 27321 -25776
12404 -25776 -103967 130044 22349 -173804 -186848 -244135 -78682 -108030 -133563 -106095 -14542
12393 -14542 2956 -48418 -32556 166949 -8103 -176109 -35307 -165294 -93975 -111910 -127703
12382 -127703 -937 -228904 -202924 -197280 -155101 -138963 -124293 -211465 -242246 -256672 -46958
12371 -46958 -73417 -230112 56470 147081 -93002 24701 -119713 -219188 -156281 -311547
12361 -311547 -276283 -428347 -290850 -185167 -195106 7902 -98343 -211069 160173 206046
12351 206046 188330 176284 266787 177879 -32357 -53442 -124616 -216879 -40181 10391 51646
12340 51646 -20293 -73467 -269366 -205563 -240067 -291117 -7125 614 -45806 -136756 -11588
12329 -11588 -97292 -219422 -169160 -118823 76009 69405 -65069 107364 122916 61145 110543
12318 110543 -111043 -231803 -189931 -105537 -178315 -249846 -70858 -131486 -168562 -205028 -106019
12307 -106019 79079 176775 218029 170525 190533 135569 -169483 -229250 -65945 10191 2501
12296 2501 46642 21421 -166807 -56871 -16075 -95504 -90797 -49000 27774 -163292 -93389
12285 -93389 51018 -161766 -141615 10157 21129 -170773 -166220 -213325 -338058 -297367 -241449
12274 -241449 -154433 -181588 -189938 -176181 -119931 -185621 -347586 -155353 -136143 40384 133113
12263 133113 63643 169529 64651 -49287 -47797 -101591 130017 13398 -89410 -241301
12253 -241301 -66658 -38565 -137199 23912 12747 -137281 -113844 232660 98162 -63536
12243 -63536 -543176 -248147 -25667 40373 -13633 -5470 -47398 -251986 -15028 60693 148114
12232 148114 -106647 -161446 -178155 -65987 237735 166883 46322 -293035 -353411 -203463
12222 -203463 -10750 -79210 -51821 110275 -89528 -115819 -21559 -177895 -281250 -226019
12212 -226019 -232877 -256418 -8912 57857 103320 178772 -109443 -1771 87667 74099 75943
12201 75943 26579 16582 -34664 70743 54890 -79013 -6703 56508 54091 -93253 -97544 -232700
12189 -232700 10516 113925 -46018 173591 77432 24383 217479 204336 117686 133761
12179 133761 138890 7307 176527 29538 -200668 -279940 -297874 -2544 -44340 -118587 26946
12168 26946 -27163 -81076 59119 -175803 -306712 -302423 -166893 -91549 186312 134804 -67902
12157 -67902 -186663 -237754 -387066 -99464 121591 1191 105927 62416 -22615 -29146 -97749
12146 -97749 -12038 110811 -8178 -170587 -176702 -293728 -35825 117813 -78859 -4010
12136 -4010 48120 81277 -8569 -66344 -51126 16670 87207 225976 275829 255983 131560
12125 131560 22566 -178422 -201086 152655 149060 -109446 69379 56407 106914 54093 17342
12114 17342 -177307 -230451 -246176 -222790 5040 166581 50004 42654 34792 121972 -23302
12103 -23302 -144580 41366 67435 -84735 -2195 -24042 -249408 -20121 46056 98644 -647
12092 -647 -34029 33439 267157 305234 115434 139799 136002 29283 -185334 -268415 144244
12081 144244 189728 -95286 -27208 -9478 -200750 -230712 -77016 -31290 24100 76260 -30120
12070 -30120 -72928 85605 -64930 -179233 -187842 -127631 -52329 -23028 -177078 -18005 45087
12059 45087 68780 155637 63017 -112082 -246138 -168292 -78832 -21752 -156713 -216938 -1206
12048 -1206 63401 54954 94472 -192230 -133434 -169319 -246948 -151199 119353 94626 1275 -25734
12036 -25734 -69959 -79045 -157932 54719 -130277 -207165 -37662 -187985 -208758 -140394 73905
12025 73905 -187292 -238311 -264603 -15939 -59943 -272902 -228233 -162619 5653 -152539 -250075
12014 -250075 -223671 -172481 -1785 -108259 -152559 110315 90025 -160669 -57723 -7807
12004 -7807 57940 -6362 -157955 -127930 -72579 187606 -83198 -94657 -16136 80024 44684
11993 44684 -122923 -118141 -66813 20826 3875 77474 120945 -27066 -8268 255733 133452
11982 133452 89990 24443 -58771 -39413 -95472 74301 -52168 -419695 -247139 -113051
11972 -113051 -195456 -270319 -149139 -35671 -157323 33042 141517 -104867 -147050 -144338
11962 -144338 -31607 87500 219931 34120 -9936 73637 72633 182982 137554 72819 -150220
11951 -150220 10335 47225 131509 -107536 -425718 -242626 -23064 -169146 -10266 77485
11941 77485 -68824 -275022 -354956 -295764 -203484 -11835 130415 -4603 -2351 -49405 -68729
11930 -68729 -225164 -200850 12116 -72888 141296 40467 -206025 -4524 87845 -60405
11920 -60405 -84358 -154487 -230285 -31261 -196847 -79169 116576 174148 83716 32528 -191374
11909 -191374 -110676 58852 22907 57411 -25790 114631 5203 106259 171959 28069
11899 28069 28883 110751 319976 202844 102567 -23822 -5049 21003 17521 -104037 -51209
11888 -51209 65067 -127768 -154642 -189013 -72314 -171779 -182544 -136568 111687 -101670 27983
11877 27983 2574 -55939 -35810 -114475 -22488 -10771 -130818 -98938 77319 -24072 14549
11866 14549 92679 -80769 -146217 66733 68434 119274 92802 -61300 -47694 26819 23801
11855 23801 -298017 -346345 -307243 -135118 -123284 -113919 -16388 3481 -154587 -123209 -178879
11844 -178879 -81150 21278 105414 -13719 -92367 -34943 156696 -11811 -96335 -82899 -57602
11833 -57602 147198 -76942 -40523 248031 75549 27874 -24515 -82161 -96221 -181715 -135181
11822 -135181 -311893 -22987 122197 107764 149417 194472 93606 200198 77363 -18191
11812 -18191 -156109 -26308 118252 -43427 -87501 -101714 -164006 -119401 25984 -11951 -227133
11801 -227133 -175610 -147581 -212050 -57457 10185 -1679 -230598 -204136 -114500 -308279 -221470
11790 -221470 -307101 -76401 64358 8667 71175 -26000 -184751 -87720 -23973 -66794 -216349
11779 -216349 -204086 -177036 -41081 17977 -218820 -188771 -121958 -83227 81670 -100163 -232888
11768 -232888 -361527 -360802 -89878 -28695 -77304 -282117 -255512 7765 -36243 -11588 -64450
11757 -64450 -27355 31192 -117381 -139366 -272860 -105960 94873 148921 318079 287972 113412
11746 113412 -150976 -171929 34605 -46475 -275910 -317938 -87575 52263 108920 33670
11736 33670 218851 217538 154125 207739 233438 92026 38717 114487 51895 -164247 -100381
11725 -100381 -125065 37977 47320 36395 -15887 -9668 125202 239733 188492 411560 355216
11714 355216 135951 166219 188897 227441 127203 289887 106835 -33256 16409 77937
11704 77937 76481 126330 118557 325094 132441 -8026 46455 -60611 260491 480763 346414
11693 346414 303640 225723 155721 30330 276483 214353 72688 236024 229745 159689 231358
11682 231358 130300 342193 469952 471804 396114 64600 91353 222710 248113 314262 339973
11671 339973 346967 325304 368179 491337 542113 630661 398225 356136 412006 243691 451970
11660 451970 387927 372435 427751 397109 331880 178541 345151 384981 72466 123853 110190
11649 110190 159411 226601 353375 548004 373681 369946 207503 341460 490670 340150
11639 340150 340199 519370 306471 255428 119636 404611 339383 226169 114594 135270 192616
11628 192616 305186 211694 209528 437412 467183 436492 244263 387949 478144 364042 308722
11617 308722 225820 42767 50925 186651 406644 344925 333796 518985 744347 640498
11607 640498 662357 592820 503266 710676 631169 516398 695436 1055768 1198603 1311668
11597 1311668 1711783 2186225 2294341 2091590 1755565 1363410 1123862 761377 555928
11588 555928 711591 502294 244108 202925 383570 368744 371951 223382 135437 336118
11578 336118 396437 294917 350909 432192 269834 80888 151733 138765 78640 42953 12105
11567 12105 5262 105229 59599 22401 265220 339525 470283 306193 113575 117874 204568
11556 204568 301946 387215 330745 348286 400216 606799 453550 211341 359900 275750 52856
11545 52856 159895 242800 134865 162255 248305 518626 706713 589134 673968 570141
11535 570141 578333 605847 672344 851601 1006715 915549 880630 652581 783526 767945 715696
11524 715696 637831 463769 534233 521406 519055 574252 712420 697974 740805 898783 906963
11513 906963 927056 1016150 1247460 1442584 1790171 2218806 2667159 2856624 2730815 2477761
11503 2477761 2124757 1924454 1684912 1259918 1138285 1015337 741329 683070 703820 612268
11493 612268 532562 442865 418846 323952 496053 672927 480387 382508 403551 336693 394449
11482 394449 420064 386430 367430 438732 319044 119250 217468 150216 147383 -100954 40506
11471 40506 -30606 -134540 7686 90067 -12692 -38873 -102671 42232 161983 -8918
11461 -8918 -150098 -103943 -92925 -48014 -37860 -105788 -141737 -151866 -164415 6023 -26629
11450 -26629 -165327 -135688 31923 4147 108935 191260 305666 235390 88470 207261
11440 207261 134450 -119385 96666 -3109 77525 56307 -41129 -21932 76831 135816 140640
11429 140640 267319 6332 190795 461220 293777 310404 332045 271805 130062 125365
11419 125365 65617 60610 245774 305475 119628 33791 1853 26356 150219 37664 97103
11408 97103 -76376 -61204 -20489 25483 -22733 -87417 -206681 -142000 -47912 -9812 24646
11397 24646 144407 -74667 -233017 -219632 -141041 -252547 -197414 -168701 -292351 -21498
11387 -21498 34864 36153 -68370 -31808 151495 7928 66639 28215 41865 -5548 -194723
11376 -194723 -272431 -110451 43187 151045 63695 -123807 18594 -263385 -90984 142979
11366 142979 -110570 -79222 -188191 8392 49071 -33258 12813 52109 19028 -172987 -82587
11355 -82587 -13349 -41102 75777 -25115 -17829 124323 54186 313588 -43290 -161371 -123763
11344 -123763 -70095 -7411 -55801 54849 -121212 -113764 4621 172086 299499 21950
11334 21950 -198398 -173270 -242769 -108605 56690 17658 31601 156156 83526 317787 365063
11323 365063 16600 -31874 100765 85525 182294 124207 79767 -48349 -249913 -166945 -106929
11312 -106929 -203955 -872 -81265 -232085 -129471 72737 91523 -22237 50231 133585
11302 133585 -23848 -13211 -80671 -81826 -58209 -31473 82986 -47940 -27753 105221 167542
11291 167542 25179 -24809 -72671 -52629 98637 -93212 62327 107932 60568 13485 -14026
11280 -14026 -49081 7616 70077 11037 -120588 6564 185807 295534 315512 178237 181933
11269 181933 -75267 -62525 -24387 -88535 -169225 -48281 -74655 141754 132497 124777 137883
11258 137883 220508 68445 184676 115407 -4911 113198 63269 126460 162148 -26755
11248 -26755 139702 -28469 11090 54786 -57223 -228770 -221246 8304 -39592 -121423 -179460
11237 -179460 -22970 191092 222817 111613 -69854 -47000 32566 101263 208227 143878
11227 143878 193739 49646 68063 37918 203518 191102 9217 104419 -13838 -6845 -195119
11216 -195119 -81643 -36058 92589 150440 91943 51867 67850 2663 57425 110873 77706
11205 77706 31660 80132 130184 49474 654 130313 416032 206712 219713 363756 246130
11194 246130 167746 84997 -93958 54312 -64355 167369 199185 213300 148655 234293 234521
11183 234521 285472 207458 176640 293681 424957 491406 572845 502281 473897 489636 436669
11172 436669 460062 557432 566363 496295 485372 390507 340145 407652 372270 468922 315863
11161 315863 342100 380368 328733 283346 226786 298524 214525 240346 275312 305452 405430
11150 405430 275483 107665 292134 331025 239980 189399 219205 176215 383614 254071
11140 254071 166936 413577 329384 236045 326296 210591 331497 259655 315281 248329 118703
11129 118703 80928 50425 43330 150244 115189 180863 237525 242451 251603 184061 238137 254130
11117 254130 264389 259579 322821 397616 254459 339577 360187 272864 365716 475349 502783
11106 502783 631902 734157 737449 1005822 1107333 1440180 1633982 1859087 1834766 1549370
11096 1549370 1072121 913739 753079 807425 768564 528437 343696 85714 178918 298709
11086 298709 256653 279658 303217 311661 317629 282953 262275 127040 272053 454630 311817
11075 311817 192087 218451 172578 66243 198615 94178 96333 185790 268457 381110 171379
11064 171379 -8231 232228 146817 352299 452952 219663 223599 -23604 -2878 326519
11054 326519 321418 207751 176971 55584 105937 132667 252765 345151 281675 79106 3955
11043 3955 -204843 -39128 -23081 90910 15939 68267 -68165 -85072 17724 158916 131155
11032 131155 14022 -146015 -130057 -41715 127768 186380 69325 183878 77366 3656
11022 3656 92065 12910 130001 41614 -229626 -109812 -33019 -185347 -50870 224765 205208
11011 205208 392815 273598 127535 -3707 118603 63322 2138 -23260 -52275 114103
11001 114103 -81215 -6649 -12346 -104115 -19092 45388 -44867 52609 84791 89105 130678 134339
10989 134339 11736 -105813 -14034 121022 108593 141508 132103 -17778 -77471 20247 43108
10978 43108 -70139 -20628 3119 158615 -40711 27469 89446 147851 -133719 149639 266635
10967 266635 192339 113499 255813 61621 68025 94318 121253 264354 130710 214942 218063
10956 218063 122186 142297 73127 -99418 -111725 148407 313990 69174 -61391 -22672
10946 -22672 173488 264792 72005 -136929 -120186 15810 165146 95356 -13402 74503
10936 74503 54260 -91670 23515 8062 109415 200485 226637 218752 311993 124077 83947
10925 83947 312549 365472 333960 103814 89799 98006 -16336 126997 309992 387180 250376
10914 250376 163749 384492 299552 397565 456293 360611 253431 364384 393027 278145 525204
10903 525204 578103 642443 401649 366460 333602 371889 480211 641817 554463 822916 936204
10892 936204 952713 1058439 997810 926330 1068384 1372621 1300249 1239240 1414876 1574112
10882 1574112 1602138 1497743 1536118 1268489 1117379 1087483 868551 886743 1102014 903037
10872 903037 728747 652713 595779 602074 514156 477722 466678 433856 204686 365272 376268
10861 376268 346411 359280 279586 322524 293955 271602 422669 363172 259376 49779 53801
10850 53801 148252 134614 398533 325229 326289 187813 193586 388869 312164 44928 -134079
10839 -134079 -97710 -15970 201321 158301 155980 78519 190708 177282 157141 153195 389142
10828 389142 362297 106207 8406 270374 331800 161201 30021 101493 100956 102709 157650
10817 157650 50418 58911 107425 219950 74302 -49595 85303 190216 161333 76090
10807 76090 126728 89793 68594 135402 150689 -94433 90744 234866 187152 -10913 142054
10796 142054 221916 212083 222493 97891 57080 80416 63353 -89313 -97092 -147956 -72545
10785 -72545 320491 327918 54927 113934 70797 129614 157993 271751 139702 223703 157182
10774 157182 -10535 6089 -56663 -49172 -160230 -128774 96811 39280 26406 65467 110498
10763 110498 -47349 -40215 55924 -20947 11891 9938 48749 110887 -14944 98372 -65557
10752 -65557 -85458 -156335 -73038 186451 312009 204593 239802 227178 258054 128362 -46681
10741 -46681 4698 136205 126046 397652 292281 197877 34932 -161330 -40506 190234
10731 190234 290434 150662 251903 129319 180859 283008 436129 206612 213410 279596
10721 279596 91861 -76871 75245 -42126 -151895 -60307 -10582 99592 235372 351462
10711 351462 302263 245043 282660 274443 443204 227185 289534 329112 364048 275072 156351
10700 156351 261549 208231 293665 428213 433372 192722 360501 524741 330168 359224
10690 359224 339077 384132 641930 309659 133268 328686 418838 409505 394915 479462 386580
10679 386580 365935 334045 438968 347848 404499 568650 529014 496553 436044 635479 664263
10668 664263 698694 785757 746034 632637 611288 556269 687393 842319 886855 623259 531642
10657 531642 729098 1033592 1022415 1068221 1209356 1272263 1567922 1618546 1791932 1893303
10647 1893303 2259048 2647494 2902561 3019545 3003422 2858538 2546701 2328521 1953492 1705148
10637 1705148 1419623 1250527 1173731 1294191 1351475 1079965 1054537 907471 941446 917397
10627 917397 722395 875980 748039 511872 711794 765292 615490 531471 383088 368486
10617 368486 411041 398363 363737 358181 285493 49297 239667 317213 311159 261216 262760 261180
10605 261180 466579 374133 149409 114290 152576 168847 302079 37696 51280 249359
10595 249359 169238 275249 87876 141985 329570 149633 176767 278023 207060 219283
10585 219283 153252 295235 282805 493778 484826 387786 482869 537177 728676 650702 422664
10574 422664 170662 120941 291168 238519 270265 86192 101210 334571 393886 427254 552902
10563 552902 410237 368017 298710 442749 435851 405354 495505 345837 451128 576958 570037
10552 570037 499859 571219 578550 582701 539732 470983 502352 511822 548083 524116 496994 409848
10540 409848 305242 340602 396837 383640 222523 -65117 139062 322705 197372 180786
10530 180786 184677 287758 240245 322440 344962 214076 284862 290872 308575 194979 16456
10519 16456 26092 261315 239310 228607 345029 360463 376804 241495 213797 262259 202035
10508 202035 324217 286816 123173 325298 347887 159345 90524 228272 244880 283259
10498 283259 410113 478870 452093 238276 175523 51911 22733 128342 283646 228561
10488 228561 69759 209080 176669 186409 189392 218844 345485 405729 406733 489791 425025
10477 425025 278812 316653 121978 192549 265602 102934 77827 250301 92965 -3499
10467 -3499 220384 256780 262958 452348 332721 272101 393162 309825 328163 266875 216767
10456 216767 203778 299257 274510 278680 128934 134151 202851 361849 465861 337690 283808
10445 283808 125129 77329 208905 371021 425875 330039 335156 95879 81926 7125 -23120
10434 -23120 -48476 81007 196490 202746 109605 -42066 71266 94512 36885 121972 208284
10423 208284 267420 396932 430997 180971 87343 265962 218722 374585 467785 225021
10413 225021 107064 200978 259889 194264 246596 290012 248909 266431 419971 261127 -14315
10402 -14315 126300 416723 310669 263924 239698 213782 193663 231051 431326 440797 397319
10391 397319 179975 -50646 -138615 -192793 -35875 207719 184338 273676 300261 261345 177605
10380 177605 149454 409783 493786 267413 284670 286913 222974 169632 -3632 -51745 4494
10369 4494 57560 21982 59876 197562 227671 354010 216730 518546 562876 370659 376363
10358 376363 326653 197865 92954 266587 306830 114302 172067 391786 345058 186850
10348 186850 341306 362010 317636 33168 86683 286175 283888 224958 226576 173496 367378
10337 367378 604025 401114 312843 467372 288602 439764 582583 450720 566576 394820
10327 394820 537978 570436 580701 253425 333237 440649 356568 241153 368827 253985
10317 253985 187472 165857 127957 243387 425520 567461 378652 240800 256929 242961
10307 242961 364041 470563 371218 430194 631179 469529 195410 363578 378331 320555
10297 320555 205018 457786 337709 421952 470322 509524 537582 472034 409590 437799 396563
10286 396563 388345 552059 213583 230766 549547 444801 392785 466148 630131 536753 445662
10275 445662 524157 476104 359008 630736 630617 407511 516647 404010 377418 390123 548643
10264 548643 395057 463664 488200 400916 237403 277190 502779 590015 640563 704618 663066
10253 663066 634673 446629 358613 382057 459475 565804 369564 325230 566765 510691 524686
10242 524686 587385 689986 748267 644089 674892 601422 633774 736836 490715 365665
10232 365665 412774 606474 668707 533931 604787 467384 643275 782212 825415 984836
10222 984836 914770 737091 958824 1021847 933527 1062068 1032756 968353 1032953 1089988 1016135
10211 1016135 1004812 1067496 1122535 1277789 1227490 1319535 1354955 1083762 1283294 1083305
10201 1083305 1230946 1414249 1393648 1537382 1272052 1001208 1104883 1052257 971781 844981
10191 844981 1074115 1079736 904817 1267430 1375190 1279239 1144409 886100 894527 918599 922124
10180 922124 957851 875805 1178311 1197018 1279243 1323877 1325844 1424174 1334722 1242387 1353006
10169 1353006 1373412 1572729 1531956 1544131 1437893 1295463 1212623 1276600 1366372 1314944 1252864
10158 1252864 1181813 1368607 1321837 1386620 1504192 1350273 1335065 1380696 1313307 1516781
10148 1516781 1786609 1874087 1882413 2048323 2240632 2310410 2123719 2223251 2451170 2304713
10138 2304713 2347200 2451273 2576242 2472368 2516629 2399714 2275832 2179453 1914223 2014993
10128 2014993 1934599 1896037 1825033 1837115 1783551 1753322 1665760 1508197 1447572 1482786 1694886
10117 1694886 1595744 1417884 1451307 1265428 1160159 1244156 1265018 1317179 1360598 1392807 1382189
10106 1382189 1345527 1227934 1083364 914957 1239145 1478431 1578085 1640337 1841470 1846682
10096 1846682 1838799 1705241 1520379 1821109 1765407 1621485 1716642 1835174 1740475 1534230
10086 1534230 1614352 1469794 1358416 1489696 1270835 1206825 1278631 1463711 1419163 1284890
10076 1284890 1234105 1331899 1318817 1310868 1397625 1409962 1622624 1533381 1347782 1584612 1671746
10065 1671746 1610885 1583407 1660654 1715362 1677305 1787341 1743254 1776066 1854364 1739702 1577248
10054 1577248 1618763 1536308 1439416 1342417 1199742 1091183 1097349 1020817 1231077 1304600 1045360
10043 1045360 1112266 1250075 1349093 1238316 1258524 1252008 1355802 1397203 1484975 1502759 1380542
10032 1380542 1237551 1092006 1201542 1293319 1364329 1252141 1153744 1190491 1283225 1234775
10022 1234775 1245496 1219699 1333707 1443033 1171139 1214153 1199973 1000390 895064 1165143
10012 1165143 1204630 1211729 1337864 1495305 1371520 1462090 1383619 1369187 1351181 1185915 1368056
10001 1368056 1640953 1670433 1553148 1715406 1556638 1387117 1278173 1274955 1249989 1430178
9991 1430178 1428930 1471173 1468695 1319123 1289336 1415193 1431506 1289291 1278344 1378983 1263904
9980 1263904 1385183 1695897 1601880 1597927 1692778 1742974 1643750 1596137 1743663 1804451 1637828
9969 1637828 1568468 1671283 1957220 2037460 1743452 1883552 1918235 1741131 1777082 1799512
9959 1799512 1691405 1831195 2122897 1910073 1833329 1965260 1924972 1978169 2203812 1926757
9949 1926757 1839586 1893104 1938899 2083970 2032038 2011367 1971979 1966432 2191118 2206376 2247760
9938 2247760 2474472 2612709 2609574 2680845 2955622 3067034 3192263 3336432 3341741 3123340
9928 3123340 3135395 3205829 3143646 3136776 3190204 3280082 3266903 3107726 3030949 3023609 3036662 2997281
9916 2997281 3031000 3097075 3221853 3055473 2965037 3009096 3025799 2879516 2726369 2949422
9906 2949422 2939245 2959268 3129031 3159591 3031556 3332076 3574499 3551480 3697811 3795914
9896 3795914 3978253 4002715 4043928 3804307 3787888 4000911 3838269 3598241 3542545 3531943
9886 3531943 3589689 3498873 3616856 3673034 3407460 3480899 3358488 3541322 3943779 3969927
9876 3969927 3952228 3831819 3776815 3882433 3968651 3838454 3729536 3887023 4100469 4102834
9866 4102834 3925067 4097773 4271835 4134311 4160014 4132545 4268533 4435594 4410882 4532679
9856 4532679 4832544 4895447 4891002 4903370 4923015 5091513 5207306 5175426 5103203 5198325 5286921
9845 5286921 5425430 5384552 5512459 5580765 5822244 5864797 5967426 6263387 6483498 6531589
9835 6531589 6595417 6753853 6764296 6949871 7262711 7355381 7472435 7723382 7912264 7829576
9825 7829576 7868792 8122487 8319464 8482997 8580333 8804784 9158359 9543252 9772561 9947131
9815 9947131 10002119 10348809 10794421 11027888 11240848 11580417 11832311 11938098 12088773 12506128
9805 12506128 12836976 13138224 13207311 13589803 13976054 14087670 14319639 14354150 14734370 15240305
9795 15240305 15375488 15952004 16133733 16586956 17236311 17798847 18006108 18272881 18873594
9786 18873594 19275157 19959033 20636297 21419089 21986023 22510604 23230567 24249139 25016365
9777 25016365 25803224 26715455 27604771 28566712 29634246 30616963 31929725 33334429 34813470
9768 34813470 36256292 37668437 39167841 40578222 41998384 43347862 44501399 45505902
9760 45505902 46643843 47859224 49025651 50058689 51413223 52933993 54855002 57573561
9752 57573561 60403387 63803683 67466538 71133994 75293548 80151264 85340851 91328617
9744 91328617 98233429 107197050 118177899 130390406 142519031 152330558 160124736 167730656
9736 167730656 173966062 176824432 175165184 169754586 163211088 155991137 146014464 134103035
9728 134103035 123037263 113527819 106139011 100265151 96496806 93930169 92427989 91926473
9720 91926473 92615931 94569803 97267488 100640677 104714382 108777283 112314527 116059192
9712 116059192 119639556 123104235 126910793 131503341 136861817 144286150 153569234 162789781
9704 162789781 169493058 174581208 180013972 185104848 186661691 181456707 171528659 160733952
9696 160733952 149842692 137366519 123052824 109236039 97192363 87389084 79767879
9689 79767879 73953128 69709716 66633004 64439210 62817109 62309569 62682938 63396457 63829792
9680 63829792 64379921 64349710 64026412 62942449 61266417 59214380 56326121 52574998 48967446
9671 48967446 45234810 41427947 37678518 34320146 31483643 29305857 27592615 25744517
9663 25744517 24434781 23574677 22553795 21907749 21390084 21013861 20766439 20276570 19847505
9654 19847505 19421485 19147125 18769872 18341642 17866414 17345002 16712823 16230525 15756276
9645 15756276 15274531 14770525 14208969 14042825 13706790 13183985 12884888 12766261 12898742
9636 12898742 12792813 12356052 12082521 12133238 12046910 12207808 12128724 12008231 12103815 12210637
9626 12210637 12086091 12008154 12199510 12598129 12935184 13071290 13263220 13343522 13510457 13826988
9616 13826988 13832149 13873477 13802482 13711985 13640924 13404018 13174280 13049281 13104084 13218588 13099814
9605 13099814 13282839 13317865 13250157 13182522 13000741 13283055 13631345 13872757 13889676 14133116
9595 14133116 14331305 14303487 14511849 14883091 14962688 14990390 15161544 15520696 15687589 15679590
9585 15679590 15819881 16071281 16117524 15968501 16094628 16090861 15893051 15666238 15492240 15411469
9575 15411469 15150844 15137576 14639887 14099178 13645106 13603557 13392901 13184739 13029115 12584688
9565 12584688 12098593 11637091 11352913 10874283 10621965 10176945 9973454 9626459 9437721
9556 9437721 9197689 8662028 8444363 8217277 7862509 7644554 7398130 7344598 7152326 6901503
9546 6901503 6719895 6670146 6780845 6971343 6649439 6584532 6492951 6311651 6216765 6285084
9536 6285084 6217506 6144078 6088045 6031526 6103660 5702853 5754061 5668544 5542183 5282272 5024987
9525 5024987 4980442 5013742 4806840 4665483 4583568 4539989 4590701 4429967 4481110 4429844 4546933
9514 4546933 4358250 4279407 4381503 4229451 4075503 4021568 3948086 4099450 4087501 3954842
9504 3954842 3934440 4135972 4176897 4232597 4428366 4172922 4186324 4447367 4438502 4243989 4352726
9493 4352726 4288398 4414727 4369606 4160489 4183004 4226358 4179762 4144736 4212753 4432043 4355136
9482 4355136 4335864 4156179 4049711 4255132 4221900 4105496 3870230 3976489 4164772 4207756
9472 4207756 4281767 4362291 4253536 4131102 4165845 4152392 4206312 4339022 4399215 4272371 4087438
9461 4087438 4112226 4201357 4215348 3973464 3887179 3841081 3667604 3709330 4144577 4290016 4312640
9450 4312640 4443018 4370812 4363301 4170534 4383935 4577588 4711213 4567741 4561864 4642636 4788851
9439 4788851 4843867 5056290 5032419 4755636 4644049 4897105 5064468 4837296 4619460 4567164
9429 4567164 4542940 4237781 4035298 4261151 4181135 3930419 3945423 4127427 4053407 4098729
9419 4098729 4432773 4358230 4495036 4548024 4649747 4696807 4713744 4853378 5069071 5051891
9409 5051891 5094295 5245566 5158122 5221080 5430672 5733043 5911017 6024159 6451733 6401659
9399 6401659 6296149 6293027 6033966 5870848 5845364 6119507 6081958 6170844 6421020 6434591 6640801
9388 6640801 6131624 5715958 5677454 5313977 5318432 5409057 5350046 5240191 5408366 5654149
9378 5654149 5721627 5523885 5506964 5711006 5649835 5826062 5807364 5501706 5579314 5679188 5823696
9367 5823696 5804626 5749068 5911098 6124572 6439656 6528727 6839009 7027744 6804557 6506521
9357 6506521 6430718 6412665 6288182 6233268 6435662 6473929 6540581 6632234 6761342 6673064 6732143
9346 6732143 6525946 6376018 6311539 6345880 6333843 6291401 6227798 6448658 6351622 6124139 6151724
9335 6151724 6148810 6039743 5883367 5806176 5687901 5825764 5723798 5788459 5830424 5828760 5761849
9324 5761849 5784186 5707554 5848218 6029607 6136187 5925597 5885267 5980799 5780716 5940904
9314 5940904 6215363 6301121 6369542 6424729 6316460 6238342 6247430 6674300 6614190 6505832 6399092
9303 6399092 6414128 6519948 6431464 6480135 6406289 6675849 6910058 6984567 6938734 6873675 6840878
9292 6840878 6822762 6889218 6773355 6799093 6972270 7162629 7339947 7391595 7418552 7339855 7354388
9281 7354388 7164535 7302720 7522584 7429964 7743373 8070336 7812901 7923356 8022207 8110515
9271 8110515 8254255 8609629 8746140 8737153 8891934 8885212 8765518 8849465 8891382 9076593 9358727
9260 9358727 9521729 9574642 9540703 9629403 9764746 9714664 9854669 10071017 10162214 10388881
9250 10388881 10744792 11075698 10798773 10848593 11155540 11354687 11645467 11823025 11958307 12041593
9240 12041593 12469741 12820206 12835009 13060337 13420991 13759099 14076411 14437808 14649532 14813163
9230 14813163 15184809 15240485 15495242 15581942 15877831 16374222 16378126 16652041 16813227 17250101
9220 17250101 17704313 17967537 18579932 19072092 19460721 19894977 20373502 20899336 21307300
9211 21307300 21870251 22259844 23051140 23760212 24331142 25166638 25989440 26422614 26793329
9202 26793329 27311301 27960916 28616982 29147643 29718270 30190533 30610079 31263057 32015072
9193 32015072 32726897 33459921 34296131 35402082 36748304 38398707 40047199 41927429 44308657
9184 44308657 47541566 51207283 55094710 58779359 60851413 61785651 62703609 63841365
9176 63841365 65046156 65582770 64734514 62852563 61224380 60211407 59781739 60058462 60489512
9167 60489512 60937188 61966586 63057634 64285787 65581574 67079117 68853078 70931122
9159 70931122 73148657 75907436 79324412 83283618 87910630 92761390 97489273 101764720
9151 101764720 106272435 111873966 119004166 127392788 137040523 148597976 162115090 175176104
9143 175176104 183670250 186654355 187723831 189424563 192369269 193486673 188451693 178340046
9135 178340046 167938330 159634475 154388447 151380321 150138956 150398017 152459094 155952224
9127 155952224 161046149 167206762 174656567 185030978 198742172 217220477 240745106
9120 240745106 267453654 294511845 320816529 346000864 365604380 372589676 370955263
9113 370955263 370084838 374458917 382213339 382421722 369238172 348270684 325525046 301936541
9105 301936541 275114667 246552791 219956915 197424664 180139460 166416133 155772304
9098 155772304 148209542 142911049 138841593 134479080 129531176 124330213 119781899 116533387
9090 116533387 114157550 111447826 107925050 105061036 103340535 103116655 104688300 107045232
9082 107045232 109005297 109399629 108791365 107009789 104104486 99793674 94776712 90515260
9074 90515260 87000960 84439299 82481251 80776564 79285119 78199827 77761450 78079137
9066 78079137 79820566 81990587 83016179 81764895 79744265 78420461 78317372 78926202
9058 78926202 77885623 75261102 72054219 68916227 66569938 65269186 64211030 63473886
9050 63473886 63121093 62638301 61927472 60867577 59845442 58805190 57795158 56969177 56551661
9041 56551661 56626268 56864553 57717840 58929540 61021430 63552587 66525038 70015742 73656953
9032 73656953 76551475 78818108 81267503 83069546 84346754 85029719 84692159 82586688
9024 82586688 79958518 77482262 74333406 70515964 67055416 64657173 63391421 62558951
9016 62558951 61998158 61786921 61272686 60386156 59753273 58905946 58473287 58147023 57755292
9007 57755292 57487992 57384752 57557893 57853836 58812933 59940696 61414197 63474055 65754674
8998 65754674 68594725 72013938 75805050 78792925 81481866 84372064 86497874 88144380
8990 88144380 89643379 91771279 94491637 98252730 103424530 109867462 117653129 125889179
8982 125889179 131878623 133082043 129835447 125022853 120905826 119468004 120966023 125034931
8974 125034931 130909033 136293996 138967128 137475971 132536325 125422361 118771747 113937693
8966 113937693 110856574 109929164 110186619 110154909 109404791 108897831 109597931 112121355 116431196
8957 116431196 122527960 129407670 136365235 141279871 141796369 140428628 139973558 142706980
8949 142706980 149283495 158671472 168228062 173802052 173687985 168575067 160580097 153738834
8941 153738834 149844469 149803063 152172120 154445326 155169780 152522063 146921573 139567643
8933 139567643 131913317 125163729 120141236 117391856 116674205 117026382 118135128 119561176
8925 119561176 119982090 117104694 113805889 112789945 113697907 115136642 114414587 109979033
8917 109979033 103742193 98170487 94480612 92707315 93038742 95534720 98794261 100961102
8909 100961102 99767468 94820576 88974871 83455425 79265994 75955831 72210091 68683930
8901 68683930 65464850 62986679 61179390 59688799 57787918 55355278 52758703 50267194
8893 50267194 48140848 46311850 44999932 43711832 42753184 41955952 41343702 41036826 40974189
8884 40974189 40604412 40322233 40314949 40335208 40561698 40659135 40688049 41161873 41605715 41844412
8874 41844412 42307123 42460118 42918793 43438583 43943460 44152586 44049584 43949153 44081970
8865 44081970 44277731 44633422 44948979 45399674 45868203 46171086 46944006 48015651 49419700
8856 49419700 51052297 52618298 54915475 57522369 61135412 65512923 71018687 76696352
8848 76696352 82139647 86565867 88943413 88913208 86736799 83424418 80532095 78964997
8840 78964997 79081375 81477920 85313575 89847746 93903503 96415389 96051734 93047611
8832 93047611 88271698 82769059 77397532 73136812 69846220 67008529 65205023 64141428
8824 64141428 63565411 63722545 65069023 67565229 71287080 75548466 79421516 81886592
8816 81886592 82507632 81228293 78407215 75483186 73493568 72672974 72777887 73876744 76092760
8807 76092760 79419191 84244662 90009570 96022710 101711187 106245414 109208317 111097876
8799 111097876 112382371 112700485 112006266 110658013 109236384 107551378 106280669 104477453
8791 104477453 101625642 96907017 90659089 83440409 76605130 71286549 67806920 65789218
8783 65789218 65490543 66770130 69708359 74575604 79933504 84738135 86813049 85952499
8775 85952499 81861496 75227734 68135145 61627626 56187856 51997524 49103212 47014262
8767 47014262 45656182 45018715 45169008 46320213 48254259 51251327 55516269 61145126
8759 61145126 67004356 71964326 73606424 71947491 67287199 60364228 53351306 47130917
8751 47130917 42052751 38250334 35186561 32692166 30657796 28513725 27116913 25876291
8743 25876291 24838991 23844727 23181118 22570801 21948481 21534074 21058060 20516846 20011940
8734 20011940 19881274 19723081 19570745 19439599 19254440 18930629 18565434 18114678 17824445
8725 17824445 17097100 16738591 16704075 16446663 16346444 16107108 16245431 16148807 16041908 16069032
8715 16069032 16143505 16029208 16227542 16759732 17220568 17184088 17143603 17016745 16680999 16185153
8705 16185153 15693461 15270088 14827053 14569913 14378917 14312353 14225532 14287378 14582264 14798703
8695 14798703 14740377 15079562 15195806 15205387 15911580 16309275 16618106 16591365 16365372 16111870
8685 16111870 15928535 15493990 15001120 14502836 14501368 14493832 14271092 14136144 13827822 13526925
8675 13526925 13038362 12904200 12665705 12841255 12960044 12809497 12778697 12636060 12751755 12840115
8665 12840115 12918616 13058762 13051707 13320812 13630549 14082643 14376088 14456139 14729180 14882287
8655 14882287 14974631 15106258 15379404 15824402 16288135 16808290 17290560 17841971 18214549 18635632
8645 18635632 18790973 19128142 19222599 19298544 19614634 19965921 20520386 21224126 21946285 23093163
8635 23093163 24491524 26083433 28106713 30677024 34003440 37861426 41781135 45329938
8627 45329938 47135951 46971896 44892465 42104441 39397127 37965710 37730323 38592252 40525888
8618 40525888 42800002 45504222 47115042 46500575 44106779 40871136 37618749 34611193
8610 34611193 32171474 30672391 29408315 28317102 27848270 27663759 27250319 27171659 26947745
8601 26947745 26662035 26712388 26987214 27452736 28264544 29408867 30852103 32493236 35039667
8592 35039667 37888090 41477124 46056870 51123491 56726954 61712395 65262567 66195231
8584 66195231 64469014 61110054 57040979 53730661 51897590 52003168 53601356 55998355
8576 55998355 58727278 60274459 59914097 57704738 53477601 47920254 42265046 37545399
8568 37545399 33649471 30672318 28282622 26209924 24605944 23518656 22418309 21570342
8560 21570342 20857251 20172881 19698178 19613286 19619625 19819263 19984384 20456699 21058659 21635519
8550 21635519 22666659 24306267 26238716 28764045 30973337 32225455 32259364 30815132
8542 30815132 28668732 26488447 24912541 23995569 23832943 24457818 25561326 26724227 27674948
8533 27674948 27943869 26875154 24614237 21796897 18789947 16669094 15086057 13855983
8525 13855983 12785938 11998961 11133846 10480431 9763337 9461484 9284595 8808010 8507525
8516 8507525 8160420 7907142 7628488 7445061 7486986 7333094 7227151 7029795 6773889 6731308
8506 6731308 6747941 6635584 6555695 6584576 6505358 6424701 6459031 6418156 6417004 6337473 6383790
8495 6383790 6401313 6573089 6805685 6922909 7229595 7650064 8337512 8889292 9291343 9818270
8485 9818270 10329183 10987482 11532708 11947668 12196937 12312416 12189491 11839011 11200129 10462942
8475 10462942 9829873 9148656 8379071 7862880 7634032 7072858 6625447 6069556 6146796 5868219
8465 5868219 5719720 5687306 5553229 5669664 5344109 5325347 5580477 5372095 5353561 5440095
8455 5440095 5566864 5876433 6125609 6509804 6998764 7539003 7889783 8568502 9204701 9409163
8445 9409163 9622394 9766739 9591316 9564494 9127050 8733869 8127761 7805126 7241991 6495554
8435 6495554 6001351 5559577 5193908 4832388 4684388 4455319 4310384 4343115 4204214 3758603
8425 3758603 3624735 3513421 3509884 3367480 3049515 3012825 2938718 2697104 2737027 2624418
8415 2624418 2542697 2359596 2469482 2408258 2338106 2345336 2207552 1945540 2148894 2218083 2230376
8404 2230376 2061223 1833711 1788074 1627719 1789782 1820699 1609542 1668965 1735037 1619316
8394 1619316 1682075 1667532 1648480 1467282 1504856 1444255 1490222 1637094 1387304 1180002 1078482
8383 1078482 1029088 1132204 1178976 1229601 1133409 1199060 1249292 1340512 1230715 921525 751128
8372 751128 901842 1181061 1114818 980092 942978 837039 810076 880376 685846 576924
8362 576924 665293 680080 757733 657441 871127 784621 802989 847062 787417 779646 708168
8351 708168 503350 418883 401705 388314 430245 318569 602306 473406 534228 653278 606594
8340 606594 572040 638858 584970 524457 455093 409396 382294 417906 590389 474025 347792
8329 347792 194787 443034 659189 669606 631149 606610 393947 372901 438910 537597 384758
8318 384758 313296 378890 297103 482613 333755 421555 638362 639883 533185 296386 527213
8307 527213 664949 402276 591110 583594 506685 317709 286633 551908 612740 457188 626078
8296 626078 550090 601748 386213 182834 212594 421865 544698 155287 185075 332836
8286 332836 487886 259059 301940 514212 517111 347004 293197 538312 769298 385885
8276 385885 466317 502101 419576 628978 603942 756367 709463 470944 793403 918933 738240
8265 738240 695321 606793 518670 661210 817309 998433 852983 923216 1124584 1072235 1076680
8254 1076680 858385 921543 831520 852539 565955 622703 631902 687043 707880 650547 459980
8243 459980 571847 762646 707882 532086 547268 591156 647268 687561 624389 333670 478321
8232 478321 650275 608343 700430 558584 507267 565679 632093 650589 800843 585296 734755
8221 734755 800287 893062 835676 878994 1083087 821521 710429 802956 874202 820118 623479
8210 623479 586425 725983 741773 374300 442594 713806 784130 663548 600940 543970 701599
8199 701599 897677 1055684 924613 803407 533499 328874 466468 1666150 1359664 620561
8189 620561 448300 177058 476308 390863 676826 674444 751778 864653 987258 877011
8179 877011 713624 608531 820714 1063893 803331 592338 675822 534138 546828 355944
8169 355944 419006 587579 615619 746971 546701 202461 358615 457212 512503 380076
8159 380076 329407 484732 351899 132759 46869 226802 86916 223251 188341 214646
8149 214646 369597 274079 311016 144258 25011 36964 -9969 -15583 94491 197897 188669
8138 188669 179476 211781 259724 223623 188503 139301 -22665 -34656 53658 -81384 -17454
8127 -17454 215491 126966 236885 192770 -9008 -68209 -47088 -142894 -191996 -185381 -171750
8116 -171750 72348 60459 187913 129864 67635 290555 294225 25833 100873 75319 -65121
8105 -65121 -119762 -37239 -47634 -51013 -198602 -206188 -198999 -310344 -210737 -156633 -255673 -138937
8093 -138937 -168236 -274034 -321065 -85249 108826 48492 -51674 -115197 -148928 -164323 96898
8082 96898 92638 76871 -108477 -368898 -174233 19454 -111930 -224885 -252234 -213950 124952
8071 124952 115702 -244650 -95462 -241418 -267519 -209895 -283620 -297718 -322520 -271906 44957
8060 44957 5887 -116778 17176 259221 -3993 -8763 -262350 -180405 75471 -230969 -271852
8049 -271852 -282963 -286551 -146314 -85099 -42649 -157262 -140511 86946 127886 -15070 -244369
8038 -244369 -231556 -89085 -346066 -273397 -121068 -86123 129676 103087 192457 75006 -80511
8027 -80511 -133061 -355758 -156926 -187814 -189673 -104652 11998 -136302 -219690 -107095 -115185
8016 -115185 -54031 -206585 -87808 33858 -48919 -287855 -91252 -87749 81361 21846 -42298
8005 -42298 -186553 -53900 73947 -42974 -214864 -110248 -111752 -43874 124653 21454
7995 21454 -106442 -6837 -93924 -91204 164202 200825 83669 147518 236172 105831 -126605
7984 -126605 18518 -7194 3205 -45122 -110227 -63413 -135683 -263928 -238413 -88763 -158650
7973 -158650 -125551 -148512 2900 -16095 -117280 -214977 16661 -49262 -72407 134952 214521
7962 214521 83534 9062 142869 47008 37433 -128755 18814 253761 71208 -139550
7952 -139550 -150107 229546 329779 248126 206605 74541 115958 96466 353937 334977 259085
7941 259085 497575 336473 358937 320404 397578 473596 429208 441371 481509 438242 436969
7930 436969 415955 349292 185625 59101 227393 260960 -271 173024 239410 9273
7920 9273 215039 409792 351187 438876 303005 278554 143251 129039 89449 113335 143172
7909 143172 260741 363423 375292 561480 388184 450499 351139 285556 402773 324877 312234
7898 312234 437406 352022 240177 274055 495924 428878 379943 382557 236979 283205 320647
7887 320647 393354 216462 137989 79191 118078 369825 152336 -79061 10939 140555 169139
7876 169139 112098 73297 11346 49931 34226 145764 121244 57544 -22576 20414 235942
7865 235942 65601 191245 282983 149476 185442 66652 278604 185546 267713 262063 52993
7854 52993 173935 126156 282642 17060 -156278 -44494 26238 71922 36320 33593 -33856
7843 -33856 -126953 96178 202203 -10254 -38524 -3974 70139 71731 32580 21851 -63543
7832 -63543 74735 193314 95487 -88217 -60954 -21191 -100831 -108933 -113178 -91911 -149277 -97310
7820 -97310 -167118 -391615 -127548 -61048 201811 153604 197045 108394 107848 -47354 19073
7809 19073 -89262 -272062 -107713 -110022 -410075 -386343 -242218 -104675 98701 104179 -237892
7798 -237892 -453296 -197511 -299557 66730 -140872 -130875 -233584 -267449 11340 153727
7788 153727 27555 43111 -152912 -148285 -94799 15051 -3982 -73957 61233 57055 -244751
7777 -244751 -425153 -359235 -396521 -150765 -269299 -169985 -214306 -174593 -155095 -211592 -157873
7766 -157873 -109906 -242889 -411471 -298231 -149630 -127533 -95146 -183494 -183671 -237023 -154719
7755 -154719 -111771 -101468 19732 -136927 -61833 -194783 -188891 -345548 -294800 -122777 -47694
7744 -47694 -189579 -201850 -256262 -187426 3765 75631 22620 -15045 34972 -29050 -89899
7733 -89899 -247257 -225166 65248 83380 -111097 -211257 -388865 -342455 -156830 -57171 -93387
7722 -93387 -169573 -192648 -164156 -168579 -6716 63556 -108965 -285820 -298727 -322439 -342475
7711 -342475 -287784 -81002 94558 -94577 -46510 5070 -70852 61515 -15228 -11857 56127
7700 56127 -84410 -185054 19307 157102 96075 2338 -133018 -155500 -129224 -114711 -115063
7689 -115063 -281429 -308905 -180191 -161052 -153857 -64087 -149626 -120563 -244550 -191800 -186412
7678 -186412 -223990 -344933 -347885 -201041 -150357 -31131 -169012 -107613 151769 7855 -37099
7667 -37099 -112543 -132193 -314644 -400042 -145821 27338 -6818 -191186 -205490 -356388 -276858
7656 -276858 -210659 -359898 -409479 -163983 -23352 -32922 -58335 66542 -223360 -341712 -216903
7645 -216903 -216897 -461953 -441317 -203463 -183738 -328470 -338606 -259091 -178358 -102480 -172628 -127960
7633 -127960 -154977 -15720 -82510 -33270 142344 -97130 -250027 -293610 -264966 -344864 -454059
7622 -454059 -193536 -154696 -142854 -176615 -243952 -108082 -1676 -141054 -216968 -195088 -325410
7611 -325410 -449360 -443108 -478391 -231527 -71192 13270 -34035 -147897 -350843 -274678 -154178
7600 -154178 -208140 -39153 -179699 -190005 -214069 -54263 -275300 -178292 -105719 -201376 -248208
7589 -248208 -166443 -245750 -326625 -351905 -233848 -158651 -122462 -76215 -94932 -18515 -191182
7578 -191182 -3516 -110704 -195163 -271332 -321829 -292048 -242774 -252468 -172224 -83724 -126396
7567 -126396 -192710 35045 143805 -193039 -293976 -166495 -192730 -154421 -216896 -397702
7557 -397702 -278483 3962 -98389 -146979 -270966 -74243 -59657 -174597 -169110 -110734 -28349
7546 -28349 -90111 -8878 61461 106757 -12512 15022 -297208 -327473 -366818 -233636 -12929
7535 -12929 -282251 -236168 -175987 -185361 -28255 -122789 -246548 -147856 -93901 -194416 -116447
7524 -116447 -73948 71940 -65571 -58769 -54859 -84777 -29583 41394 288730 211111 136150
7513 136150 139959 184898 203303 254637 348308 155129 188703 403767 238295 29135 65762
7502 65762 66705 213842 168693 -24593 79143 94400 76039 -48613 -43607 10383 -9483 16877
7490 16877 -66744 -95797 -97225 82471 274795 -50594 -22286 162612 275623 367423 581680
7479 581680 508037 228724 172663 35856 148026 436090 513154 467088 412364 336059 257528
7468 257528 254125 274600 197578 -78063 -59650 45381 -75546 -82986 -84181 67175 38543
7457 38543 95055 -99432 40708 -4347 -207869 -65184 -188044 36044 185621 231899
7447 231899 117692 -38802 44666 67838 39916 -156175 -286316 -286530 -302372 -204380 30686
7436 30686 -75371 -162408 -209937 -183042 -67949 -73348 12635 -332284 -24492 -24510 -64940 -26920
7424 -26920 -77586 -7164 -88775 3711 -46689 -228008 -118365 -157504 -39577 -227421 -366142
7413 -366142 -298369 -234225 -137734 -163618 -14819 50592 62060 -5029 196529 72793 -97685
7402 -97685 -153694 -76977 -238684 -255485 -334717 -358220 -303613 -215614 -81147 -111894 -218623
7391 -218623 -188943 -91053 -299066 -368066 -66218 -75527 -187523 -203454 -2564 -1125 -154553
7380 -154553 -141027 -26378 -235601 -233752 63006 -205783 -259666 -250109 -4229 32004 -114889
7369 -114889 -108966 -19200 47917 -105543 -278812 -79909 -100034 24997 97634 -101261 -24380
7358 -24380 -304714 -400848 -210954 -53268 -156198 -20505 -30975 -165625 -211870 -228254 -44865
7347 -44865 34045 156671 172673 104482 143321 11198 33224 80555 76889 35874 -100371
7336 -100371 118054 62771 -51046 -117170 -161480 -241627 -122111 -119436 -287061 -230146 -352580
7325 -352580 -216037 -206929 -61802 -133263 -80712 41474 180276 20265 -51769 161064 11371
7314 11371 14552 38337 180351 43342 -154482 -267627 -245809 -151209 -53827 -41907 -181570
7303 -181570 -305474 -291839 -139763 -108539 -152472 -49218 -84166 -38275 -5989 -66720 -112554
7292 -112554 -259736 -238497 -104666 -145450 -95990 -202817 -148270 -138822 -245203 -283796 -20416
7281 -20416 255190 197587 179157 208988 122149 -92088 -70194 -46395 -68612 -90593 -30649
7270 -30649 -70914 56971 -80343 -171526 -30520 -236474 -65826 42713 -55597 37300 37597
7259 37597 -89604 -100223 -97803 -34814 100490 88157 -53966 -26491 -170557 -176681 -232998
7248 -232998 -109724 21364 -200130 -392133 -22679 193486 81453 31761 -188403 -149483
7238 -149483 -86039 -83135 -99890 141640 57969 138899 75003 -61611 -132631 -153556 -29785
7227 -29785 92410 154704 39657 194762 45466 -133012 -24989 37236 -86887 -59960
7217 -59960 133483 258036 64554 -39241 -27803 -34000 212147 316238 55806 -37453 31534
7206 31534 70012 176817 244668 149151 -21759 -93542 -47458 8245 -53374 165646 65705
7195 65705 -1848 -77296 -99070 -74016 -98682 -176627 -170167 39205 316193 135319 30922
7184 30922 151135 36451 76136 2623 83721 104838 -25529 24335 76584 -55608 37964
7173 37964 108948 118319 142802 4409 -37235 -289239 -314960 -148350 -83715 -296187 -277785
7162 -277785 -431121 -151789 305854 106957 -26778 60859 110203 -45493 15712 28630
7152 28630 -38805 -133451 -167221 -98747 33383 -213003 -335288 -171156 51817 58836 26272
7141 26272 70759 55145 3904 52118 121501 139703 130461 -44055 -103724 -48325 62964 118661
7129 118661 -3363 1471 -189453 -336893 -207469 -67515 -29351 55711 118201 167745 -16819
7118 -16819 -238126 -151797 -77994 -107255 -223340 -71499 -211781 -282033 -128851 -181437 13313
7107 13313 25843 -131620 -11033 -33557 127772 100911 -41508 -87175 13994 216787 212585
7096 212585 160527 -41367 217172 192116 158228 262652 164250 54700 129655 112792 277640
7085 277640 250187 33178 50583 21175 -35109 -60764 139276 72463 19123 -9937 2975
7074 2975 62369 251367 440724 466531 186795 34706 105981 80940 118558 154099 224486
7063 224486 255734 226187 314685 222011 106192 137739 -4192 269804 557060 431242 483633
7052 483633 803452 598002 492550 616635 388918 269948 66322 92396 241125 115022
7042 115022 213751 309857 318813 312913 292283 331637 311149 412022 188421 -22301 149659
7031 149659 21478 183104 275010 140866 197836 172605 288344 216417 160974 290253 102576
7020 102576 56813 31341 -106595 -128809 -131005 -195367 -113489 7001 4879 200765 34861
7009 34861 -124787 -84964 -78156 -108333 98764 126129 -37548 159471 46597 -164202 -239249
6998 -239249 -296771 -198322 -135852 -45077 32918 160829 111658 132155 -29660 -53868 -312266
6987 -312266 -55425 210287 178445 25147 1221 -31012 86611 -88473 -393921 -118582
6977 -118582 114203 169319 86064 193035 97733 169670 122012 28634 34264 -128224 -80964
6966 -80964 48205 179700 140004 95176 96029 11502 30695 23708 95010 211801 61358 -65913
6954 -65913 223157 138165 139064 117779 20037 120217 13153 -126998 162770 -872 50403
6943 50403 118354 90651 -75538 53294 -53285 48819 41447 77431 206907 241341 -70227
6932 -70227 -191670 -38279 -48474 94521 285824 430131 263003 232000 210226 230728 161511
6921 161511 -36814 -62804 72778 136934 236330 208446 196955 33531 124490 182818 130558
6910 130558 101780 81376 139765 183788 100914 61309 214558 249317 134493 263185 204938
6899 204938 327920 223224 310909 346286 250093 347575 340118 186951 153555 20876 236379
6888 236379 272927 105142 103833 73149 -123213 -89426 -70000 41979 145775 -102405 197928
6877 197928 166298 -41932 10891 149234 323336 387189 287383 188814 123158 -1291 -160700
6866 -160700 -13730 137796 4294 -27681 -144803 43763 371707 286415 108280 204174
6856 204174 145390 119290 273394 220004 9269 -11014 162781 131857 302088 286583 226980
6845 226980 -4911 131604 13988 77524 -56410 11615 101529 44035 278311 50359
6835 50359 35617 182037 106226 127842 101715 105395 165768 105794 72633 72366 179838 170050
6823 170050 122807 246457 238799 173659 142373 166322 63171 123999 206328 91656 154539
6812 154539 26777 15906 32009 120892 48010 189359 224053 328105 307704 155333 145459
6801 145459 71008 195807 340344 128676 321053 215477 320775 332665 272691 285108
6791 285108 68632 82359 311097 380800 310568 252058 190685 407761 484652 405397 307294
6780 307294 311258 162131 317870 215793 378446 408213 221945 299744 290317 303389 319308
6769 319308 179113 256427 315647 193515 451181 480908 398840 506532 431003 543138 565450
6758 565450 401038 472643 508243 441689 341959 388072 475381 519074 538499 346115 451151
6747 451151 333799 268902 323319 270379 302939 229426 221993 246954 344612 424750 540776
6736 540776 532400 471775 499090 435556 671311 771033 756868 811419 707387 651449 514881
6725 514881 678670 888653 927805 838424 812202 672326 580406 811432 908615 992269 684091
6714 684091 732404 897862 833230 844282 929008 1080761 900708 737097 816377 886532 882004
6703 882004 947132 888084 771372 736380 766032 786142 694787 790942 802768 772829 1063460
6692 1063460 1100474 1071149 1053472 1143516 1158686 1278738 1336686 1226401 1249159 1573845 1454763
6681 1454763 1575299 1641123 1447849 1468169 1370803 1315478 1263392 1170453 1268236 1293954 1161791
6670 1161791 1046325 1190354 1127395 1382582 1413283 1197968 1428561 1600932 1534862 1482203
6660 1482203 1575654 1653522 1709586 1866760 1868072 1708738 1884030 1725327 1707800 1652252 1842932
6649 1842932 1693364 1682637 1642512 1984852 2002459 2117558 1999061 1940346 2071614 1883257
6639 1883257 1713171 1782334 1701281 1651340 1761528 1885681 1760843 1559878 1571293 1639457
6629 1639457 1781047 1534696 1512837 1489124 1584978 1611598 1638547 1686151 1417576 1454784 1482949
6618 1482949 1487723 1501412 1423043 1416154 1396706 1388647 1353591 1441507 1296483 1143500 1293745
6607 1293745 1483852 1199231 1408530 1320263 1521182 1307775 1031293 1182163 1304112 1304511
6597 1304511 1161131 1096668 1289530 1451801 1562689 1381816 1203682 1261834 1463194 1234111
6587 1234111 1220941 1358570 1414144 1252980 1345125 1371488 1536306 1428655 1186351 1248227
6577 1248227 1263653 1313192 1551024 1549229 1533774 1781468 1819034 1735909 1676629 1706985 1616824
6566 1616824 1806524 1945556 2019782 2065128 1916573 1711376 1911453 1859807 1904963 1873544
6556 1873544 1861184 1715767 1818813 1760349 1918007 1801512 2022188 1907854 1899863 1938016
6546 1938016 1994584 2003347 2041703 2116857 2140436 2114759 2300280 2152764 2183361 2258685 2356072
6535 2356072 2302035 2351660 2519361 2448521 2593403 2476279 2433012 2442471 2343165 2446800 2785086
6524 2785086 2925233 2814228 2653232 2719852 2883882 3186395 2992707 2932380 3022946 3068778
6514 3068778 3028583 3233654 3360216 3390939 3575595 3534742 3685858 3791877 3811781 3837013
6504 3837013 3750809 3851504 3727991 3933356 4183080 4556164 4548872 4561974 4889261 4921172
6494 4921172 4866303 5204064 5465453 5464164 5441200 5613485 5881283 6200466 6273875 6214010 5966141
6483 5966141 5993994 6156488 6438328 6680554 6585604 6715428 6753743 6761737 6878615 7049463
6473 7049463 7286088 7611057 7880952 8038919 8144446 8426719 8874756 9042286 9239293 9242864
6463 9242864 9419321 9718012 9780456 10024379 10088938 10136608 10360615 10729014 11192598 11613608
6453 11613608 12105419 12524500 12499569 12945122 13345466 13431209 13897259 14183441 14174861 14499216
6443 14499216 14996249 15527538 16046181 16570236 17091535 17508324 18105043 18790443 19222501
6434 19222501 19701294 20065581 20405524 20777675 21412671 22151850 22741074 23631647 24701659
6425 24701659 25777830 26624555 27278574 27727217 28188879 28857741 29545092 30217593 31441427
6416 31441427 32531518 33817426 35391720 37277562 39277985 41906715 44728614 47814118
6408 47814118 51818142 56160004 61383211 67609461 75064058 82878299 89938372 94545487
6400 94545487 95751273 93455998 88841103 83188582 77959120 73558415 69890573 67048583
6392 67048583 65105649 63894025 63018589 62736425 63162706 64348198 66234177 68860231 72292444
6383 72292444 76912227 82781764 89916864 99004873 110275529 124042363 139518528 155785400
6375 155785400 169467508 176521762 174431582 163245358 146766447 129473034 114103091
6368 114103091 101723425 91811590 84033277 78014376 73129852 69225999 66088462 63957558
6360 63957558 62577095 61898530 61958237 62966535 64538220 66852343 70165105 74771111 80296381
6351 80296381 87086287 94408277 100689114 104830649 104969038 100397493 92688592 83843643
6343 83843643 75173334 67553155 61499645 56751454 52689943 49297424 46365695 43594597
6335 43594597 41188324 38925305 36917955 35285260 33756075 32501561 31451108 30485828
6327 30485828 29656157 29145448 28469784 27578053 27006315 26309665 25678999 25278707 25163696
6318 25163696 25140384 25089772 25485454 25998722 26667708 27528793 28078896 28188903 27964354 26911549
6308 26911549 25549067 24396182 23333635 22324052 21555487 21037189 20934872 21012129 21109367
6299 21109367 20934125 20290346 19434355 18687986 17988092 17435748 16910895 16610205 16536659 16619493
6289 16619493 16856001 17272452 17623618 17556040 17504099 17154229 16677843 16288546 15680014 14950786
6279 14950786 14475929 14011595 13827823 13640154 13318666 13175010 12993523 12547535 12196028
6270 12196028 11811122 11337783 10855950 10507805 10164228 9964293 9934868 9915327 9713305 9562339
6260 9562339 9477741 9564567 9561798 9424615 9303031 9172750 8986513 8706823 8588655 8219293
6250 8219293 7889146 7769522 7776553 7762186 7746761 7990365 7914917 7927339 8068608 8218419 8364256
6239 8364256 8389818 8559101 8547374 8403235 8204542 8119769 7846067 7845597 7753686 7673174 7481896
6228 7481896 7496392 7452308 7343324 7263694 7205646 7087880 7218505 7314750 7462518 7675340
6218 7675340 8025498 8445795 8583669 9280715 9746256 9976868 10037048 9918232 9419986 8865202
6208 8865202 8094388 7592801 7334586 7203259 7061965 6589930 6526367 6534951 6561651 6586987
6198 6586987 6314555 6184445 6217062 6378378 6302493 6292559 6363960 6636157 6823442 6981910
6188 6981910 7184221 7351393 7382022 7100168 6891651 6687559 6324770 6021452 5835973 5895663
6178 5895663 5760075 5473812 5454216 5601766 5527568 5380999 5244194 5209574 5130951 5055165
6168 5055165 5178710 5011741 4989588 5028242 4838217 4898720 5010640 5134800 5156341 5136539
6158 5136539 5387338 5257667 5307178 5279215 5272912 5314584 5271120 5491667 5442611 5539180 5741552
6147 5741552 5689434 5768342 5766171 6003356 5993365 6059413 6213483 6371180 6455106 6440799 6408472
6136 6408472 6442538 6495169 6596048 6773511 6899681 6784449 6763295 6745071 6828853 6801027 6692969
6125 6692969 6583304 6599967 6671723 6673408 6670332 6779361 6912064 6918675 7052244 7095783 7022643
6114 7022643 7096245 7118836 7180165 7372731 7548440 7554536 7801164 8124222 8214762 8296034 8585038
6103 8585038 9017148 9342939 9952276 10416733 10796018 11046924 11478395 11596690 11163936 10806862
6093 10806862 10663304 10355369 10200190 9937594 9748426 9840709 9664926 9687439 9859709 10232125
6083 10232125 10411603 10492765 10850541 11000853 11690777 12055845 12617494 13408551 14135659 15138495
6073 15138495 16224945 17159269 17994796 18166506 18015604 17561647 16655427 15942169 15085950
6064 15085950 14593965 14421613 13913867 13706179 13618380 13392610 13356426 13209676 13329549 13582295
6054 13582295 13682663 13866630 14156577 14364727 14843479 15137849 15745115 16558343 16972005
6045 16972005 17567021 18229496 18370532 18377833 18425971 18471486 18337718 18143585 18031726 18037813
6035 18037813 18205262 18374518 18540062 18750623 18986129 19129289 19496382 19575642 19888814 20221706
6025 20221706 20284488 20650181 21095054 21519639 21963609 22670313 23322377 23885557 24662788 25331180
6015 25331180 26136167 27110766 28227551 29531638 30793185 32219225 34015754 35714213
6007 35714213 37611607 39994999 42771340 45957995 49536678 53906066 59377945 65121773
5999 65121773 71817257 78955557 84979361 88939778 89736238 87878613 83859427 78814198
5991 78814198 73813613 69610705 66402322 64058501 62416282 61380846 60933345 61451034
5983 61451034 62775282 64502724 67016523 70498739 74520642 79436092 85444492 92575176
5975 92575176 101266834 111976010 124252791 138103781 152505256 164718172 171416660
5968 171416660 169978907 160302064 145350928 129001970 114343165 102176043 92175676
5961 92175676 84753149 78874031 74148803 70670974 68031793 66372047 65544618 65693922
5953 65693922 66733744 68339475 70608087 73580836 77279255 81385955 85988091 91193167
5945 91193167 96695013 101615363 104227830 103463145 98948609 91587655 82581149 73783124
5937 73783124 65740291 59137194 53519857 48656494 44784127 41597477 38931071 36488324
5929 36488324 34802642 33415719 32457607 31585014 30777549 29980339 29370903 28250069 26867613
5920 26867613 25596951 24288753 23160334 22013905 21038112 20090433 19315192 18741919 18145971
5911 18145971 17616829 17148351 16766448 16645704 16292386 16116927 15962336 15630260 15426999
5902 15426999 15342022 15398049 15360146 15088532 14774096 14553103 14153611 14150459 14170589 14221852 13960026
5891 13960026 13692810 13618159 13552768 13486252 13584570 13745419 13793832 13960550 13849132 13769780
5881 13769780 13987634 14330054 14507740 14610766 14646346 15241225 15552609 15727899 15892279 15933329
5871 15933329 16119756 16055225 16080859 16153607 16212815 16341253 16785385 16921080 16859375 16791108
5861 16791108 17249557 17604999 18013872 18190308 18209645 18439259 18722730 18836367 19032081 19612794
5851 19612794 20323696 20624969 21193918 21418335 21927324 22534043 22853799 23277771 23589001
5842 23589001 24145921 24349357 24783765 25421599 26041125 26582903 27187223 27757969 28445234
5833 28445234 29144281 29834133 30697939 31772429 32819408 34344895 35996813 37684922 39639466
5824 39639466 41892839 44271839 47347120 50588280 54457062 59210216 64922546 71694872
5816 71694872 79844226 89225424 98827977 107337300 112423103 112425726 107730211 100228916 91897580
5807 91897580 84303065 78436737 73735448 70137043 67661641 66349994 65606915 65610432 66410380
5798 66410380 67802639 69789883 72703827 76406966 81065008 87166056 95417504 105603678
5790 105603678 118372490 134204815 152544814 171487376 185161368 188245721 179481605
5783 179481605 163520899 144593909 126612193 111918449 100114228 90659914 83425019
5776 83425019 77819780 73175261 69498509 66735471 64827381 63662890 62944460 63234073
5768 63234073 63859569 64922721 66994225 69975942 73886043 78720242 84389736 90613719
5760 90613719 96175046 99102114 97953924 93162382 85695620 77333659 69359432 62865901
5752 62865901 57688459 53566644 49850846 47026552 44805600 42831511 41362445 39927719
5744 39927719 39163968 38679877 38087325 37593459 37273972 36869840 36655465 36373152 35430727
5735 35430727 34522839 33683968 32710388 31884087 30977788 30226235 29589874 29490492 29378425 28985543
5725 28985543 28631197 28326050 27851070 27349250 26948301 26836976 26987297 27033923 27519123 28059317
5715 28059317 29009133 29627526 30472570 31577359 32092198 32295160 31513417 30292606 28932762
5706 28932762 27950339 27207445 26727063 26448529 26314513 26269072 26123371 25542324 24456498
5697 24456498 23642730 22983146 22160083 21840132 21716963 21651249 21601801 21706080 21876197 22066854
5687 22066854 22375515 22843962 23082242 23254527 22917046 22411469 21793945 21193859 20792045
5678 20792045 20479773 20331672 20037483 19792316 19656779 19527443 18957016 18765358 18574678
5669 18574678 18330241 18107363 18024647 17948222 17956225 18157375 18586787 18930636 19248459 19568481
5659 19568481 19844444 19817528 19625599 19476157 19334582 19410245 19432639 19891703 20205111 20786400
5649 20786400 21369639 21768438 21720026 21390722 21048799 20576166 20181209 20127657 20065395 19962212
5639 19962212 19961308 20263436 20970833 21414985 21839290 22369336 22496618 22152056 22137771 21893638
5629 21893638 21770753 21887601 22178820 22718033 23352974 24540072 25560306 26352608 26607982
5620 26607982 26166116 25458454 24554946 23697361 22859179 22167410 21878821 21909406 21815138 21712606
5610 21712606 21809141 21824092 21853749 21826736 21908503 21946305 21887142 21871634 21893121 22135205 22567327
5599 22567327 23126824 23426172 24091589 24777048 25324725 25627601 25578589 25552341 25350774 25294417
5589 25294417 25352918 25016878 25093101 25214287 25498660 25639268 25820602 26035587 26477406 27065414
5579 27065414 27462793 27896155 28554289 28961310 29697767 30465645 31074679 31827769 32336696
5570 32336696 33139927 33763091 34586470 35356863 36058952 36648123 37688336 38464400 39452528
5561 39452528 40786222 42214066 44013142 46017556 48330509 51004119 53977517 57653167
5553 57653167 61976769 66844199 72291093 79194893 87148607 95977577 105484282 114241476
5545 114241476 120812604 123671812 122045154 116553183 108943723 100920181 93865741 88139484
5537 88139484 83771834 80515315 78505398 77254776 76596477 76994616 78257977 80361255
5529 80361255 83376933 87329243 92518147 98775269 106644248 116646361 128620928 142611235
5521 142611235 158786732 176050244 190765336 198158761 195522572 184014354 167651136
5514 167651136 150040525 133967267 120513634 109770273 101370243 94580320 88970080
5507 88970080 84506166 81400343 79047371 77603522 77226658 77264115 77701282 78886979 81039883
5498 81039883 83833010 87494876 91955091 96979313 102486564 107748177 111676807 113063731
5490 113063731 111185807 106379904 99479255 91977668 85379281 80062600 75694913 72308574
5482 72308574 69539309 67578207 65964995 64763542 64208059 64068727 64363869 64801795 65496858
5473 65496858 66695575 68672175 71167176 73688144 76659948 79675975 82257835 84171669
5465 84171669 85418340 86616202 87783576 89622144 91808187 94083424 95982435 97493561
5457 97493561 98632779 99994244 101998302 104932022 108883802 113637174 118475606 122809994
5449 122809994 126717040 129207238 129352160 128056335 127118587 127649017 129550940 132751678
5441 132751678 136505513 139914138 143272471 147396832 151944583 156984450 162146670 167193657
5433 167193657 171089664 172287244 171088587 170164795 171665491 176003392 182603255 189675238
5425 189675238 195059512 197413645 196125348 190758730 181705992 169737320 157203463 145209188
5417 145209188 135080338 127029442 120948464 116332583 113157546 111298563 110563223 110912743
5409 110912743 112248754 115144565 119499312 125293985 132944127 142685469 153997110 166022857
5401 166022857 177243861 185656076 190073023 191045419 188005371 181501391 173129986 165206209
5393 165206209 159215919 156057709 155366450 154855027 151791821 145639475 138350888 131831692
5385 131831692 127167937 124555192 123862963 123514373 122823255 121862288 120808056 120645215 122497146
5376 122497146 126106032 130013314 132162556 131688083 127688342 121306187 113678814 106599559
5368 106599559 100345090 95107653 91808984 89620409 88355294 87226551 85821681 82560063
5360 82560063 78093213 73883888 70187867 67180276 64480709 61230755 57454449 53683983
5352 53683983 49734790 46195362 43159464 40545717 38226753 36254534 34823368 33339656
5344 33339656 32052784 30571980 29299917 28273695 27246535 26296031 25424687 24617741 23761526
5335 23761526 22929052 22255352 21823058 21189368 20568557 20050083 19490166 18900191 18609860
5326 18609860 18187586 17612004 17212652 16807406 16356038 16009092 15744604 15363475 14973118
5317 14973118 14559971 14199044 13877443 13484265 13115681 12936336 12659591 12278736 12086054
5308 12086054 11683407 11327079 11339186 11349511 11241240 11139436 11023124 10999643 10934575 10875027
5298 10875027 10722313 10554652 10107808 9804770 9531259 9296973 9316237 9066908 8746776 8600093
5288 8600093 8363594 8376369 8261646 7950754 7719835 7602399 7576693 7340235 7281693 7120257
5278 7120257 6849751 6912437 6954739 7037701 6848167 6895356 6703418 6704247 6812025 6750028 6491075
5267 6491075 6408496 6249527 6092277 5942859 5797880 5824661 5831184 6015195 5783792 5673687
5257 5673687 5393028 5423677 5352148 5393589 5528612 5467800 5497643 5504308 5408076 5284830 5163763
5246 5163763 5182213 5200129 5166114 4687585 4664010 4692520 4713445 4556237 4560918 4583523 4710916
5235 4710916 4800070 4465301 4421049 4752906 4820166 4734590 4668475 4513515 4182866 4297765
5225 4297765 4366180 4499829 4692614 4510629 4400935 4492059 4496501 4324541 4208198 4321465
5215 4321465 4107968 4135962 4180484 4097299 4209650 3974052 3943829 3793672 4003506 3957198
5205 3957198 4041891 3893768 3934170 4062728 3992299 3914717 3887861 3912440 4026058 4168557 4051734
5194 4051734 4126728 4000210 4149636 4100873 3837392 3564797 3594834 3726069 3634541 3665341
5184 3665341 3715797 3639340 3398602 3202475 3487909 3572120 3506630 3550214 3446729 3409404 3531169
5173 3531169 3589772 3698109 3745085 3628508 3812126 3723539 3724435 3739913 3676549 3794491 3958286
5162 3958286 3863976 3669025 3658776 4040591 3941087 3750975 3871426 3669097 3618944 3974709
5152 3974709 3871780 3680032 3660078 3786150 3744439 3650896 3696894 3777387 3969208 4095772
5142 4095772 4094054 4227380 4050059 4313820 4307707 4448736 4506489 4560081 4671083 4322839 4198569
5131 4198569 4070975 4231089 4329406 4165390 4024447 4046990 3983323 3747879 3691417 3758169
5121 3758169 3776758 3688152 3833377 4035502 3883311 3967199 3963518 3855282 3865968 3865422 3974078
5110 3974078 3920219 3787793 3678105 3618105 3451907 3462565 3526444 3434405 3530705 3569238 3618465
5099 3618465 3533004 3497564 3357485 3639972 3631308 3420655 3530470 3511219 3622581 3622121 3499996
5088 3499996 3652846 3533691 3582159 3610754 3731247 3781478 3972405 3978178 3611171 3496997
5078 3496997 3494253 3523534 3591277 3587080 3587602 3788277 3891399 3936394 4109775 4264463 4173475
5067 4173475 4239512 4260268 4419815 4609314 4629678 4547218 4560218 4605647 4541253 4487200 4566105
5056 4566105 4670403 4423908 4344246 4423377 4290535 4294591 4299199 4372382 4450143 4588311 4514008
5045 4514008 4260257 4596874 4843868 4764459 4636368 4758512 4602760 4708880 4713045 4637570
5035 4637570 4482838 4574073 4591164 4400952 4393932 4414832 4510260 4446932 4139831 4155485 4405530
5024 4405530 4602732 4563189 4250764 4366770 4439830 4575151 4491612 4354868 4374460 4546713
5014 4546713 4586820 4505751 4600680 4517544 4445919 4558243 4669294 4562760 4763486 4784256 4565736
5003 4565736 4677805 4728433 4755876 4739609 4695364 4633699 4778819 4958434 4835989 4985392
4993 4985392 5168387 5206503 5297010 5262671 5221271 5098459 5353052 5473349 5324454 5392014
4983 5392014 5308747 5323091 5453426 5311593 5574124 5535053 5477210 5342274 5182202 5103350
4973 5103350 5355033 5326008 5476345 5465985 5330987 5618344 5692063 5502307 5680448 5767968
4963 5767968 5686033 5544804 5736566 5977744 5815957 5922495 5902873 6068565 6010988 5961913
4953 5961913 5822629 6067318 6024330 6098060 6096506 5965980 6034642 6086882 6046890 5946678 6157899
4942 6157899 6248630 6294798 6311426 6194486 6310902 6531764 6689248 6694215 6592028 6797258
4932 6797258 6903124 6798995 6995518 6983764 6926070 6961175 7017069 6946464 6797594 7050339
4922 7050339 7445554 7438764 7215825 7544747 7651440 7416126 7698683 7764185 7576685 7751416
4912 7751416 7934144 7966337 7975082 7934939 7913795 8010334 8064207 8273947 8590144 8802847 8877634
4901 8877634 8730774 8563569 8936738 9144329 9143305 9333741 9487247 9439258 9515559 9538901
4891 9538901 9770822 9749370 9677282 9991942 10166707 10401038 10656905 10869797 10848042 10891031
4881 10891031 11201240 11412829 11561605 11925978 12100044 12349821 12470272 12372683 12546671 13002527
4871 13002527 13242634 13401540 13623014 13705351 13878982 14189904 14438013 14781755 15211527 15571682
4861 15571682 15824140 15873446 16332019 16707691 17056452 17354343 17753303 17974430 18329521 19001721
4851 19001721 19299428 19731404 20131121 20497759 21272623 21950119 22373065 22855254 23103607
4842 23103607 23602530 24067179 24978300 25704066 26361222 27067044 27600665 28335209 29167396
4833 29167396 30059562 30773046 31660019 32960404 33878350 35067878 36055842 37267742 38751980
4824 38751980 40066310 41517128 42939211 44495924 46282227 48102581 49983315 51893325
4816 51893325 53993185 56382723 58697625 61214679 64148382 67070776 70137598 73488545
4808 73488545 76758382 80051955 83212254 86566370 90047237 93434467 96403866 99258852
4800 99258852 101661747 103468339 104955672 106427019 107410131 108510362 109694479 111019293
4792 111019293 112554147 114621404 117028773 119533023 122219293 125968103 130167788 135076623
4784 135076623 140686000 146816510 153236802 160106466 167255392 174457960 181581604 187845956
4776 187845956 193935077 199062595 202327100 204408507 204752326 203837874 202426689 200175851
4768 200175851 197813447 194752291 191608991 188597147 186137568 184114458 182423825 181272842
4760 181272842 180747875 180924025 181620180 182534831 184022684 186450650 189341062 191898993 194553964
4751 194553964 196906148 198726582 199873867 199995681 198326321 194838696 189553997 182411044
4743 182411044 174698829 166264059 157878605 149659940 141447484 133589216 125908776 119182835
4735 119182835 113186322 107910169 103561669 99649914 96679758 94545330 92617094 91353167
4727 91353167 90518639 89907068 89555687 89072119 88374518 87488238 86352166 85032222 83007256
4718 83007256 80621531 77763252 74879898 71804858 68421108 65426437 62580122 59472560
4710 59472560 56417355 53376037 50466069 47524923 44728227 42305411 40220844 38544964
4702 38544964 36654238 34843818 33442477 32164087 30947288 29659593 28511210 27603985
4694 27603985 26626206 25762513 25040493 24477652 23816784 23106884 22416607 21825625 21277395
4685 21277395 20812505 20259020 19783313 19326769 19192889 18698166 18300923 17945939 17421728
4676 17421728 17101395 17009152 16599529 16261182 16463541 16412764 16032482 15898891 15858544 15949904
4666 15949904 15799200 15434566 15275679 15202002 15318814 15251515 15432604 15392825 15315957 15237566
4656 15237566 14910886 14820119 14889416 14830542 14868954 14504277 14462707 14590758 14350421 14378964
4646 14378964 14438426 14503187 14563810 14657342 14751645 14951664 14799202 14826229 15001426 15315691
4636 15315691 15357904 15261812 15336211 15539971 15375512 15307631 15199104 14995486 14815326 14569751
4626 14569751 14073638 13513319 13178869 12767762 12460891 11987759 11644173 11385709 11198483
4617 11198483 10943670 10780117 10679663 10838530 10765944 10318648 10322230 10301518 10046333 9988925
4607 9988925 9957226 9772315 9568963 9422384 9387346 9275773 9034966 8787633 8563450 8553091
4597 8553091 8201036 8019272 7983074 7689652 7417155 7285294 7137111 7003280 6785995 6569818
4587 6569818 6531662 6408646 6458068 6230216 5980124 6052188 5983715 6068561 6044984 6210637 5981889
4576 5981889 5887383 5710667 5879585 5838249 5677443 5799892 5590998 5601358 5699511 5562535
4566 5562535 5369033 5428300 5474909 5582348 5515866 5486320 5513054 5499273 5390329 5686547 5560679
4555 5560679 5551641 5405055 5292689 5337827 5366133 5455954 5409683 5457605 5389646 5482005 5454877
4544 5454877 5486940 5631107 5578342 5240639 5342211 5511382 5408768 5429361 5461436 5322016
4534 5322016 5396661 5475635 5543997 5438883 5345399 5601215 5485111 5470482 5383186 5492634 5554714
4523 5554714 5352144 5205440 4923886 4884157 4880325 5034642 4940290 4872330 5006935 4973509 4805815
4512 4805815 4760078 4853256 5046859 5075129 4833080 4890600 4788792 4626598 4532944 4651009
4502 4651009 4784880 4908507 4857513 4723169 4795595 4816111 4941097 4779498 4879870 4912353
4492 4912353 5019599 5151171 5224858 5131388 5188914 5233068 5254303 5171848 5080853 5283779 5210474
4481 5210474 5289691 5372455 5244191 5255775 5363561 5507000 5406405 5448004 5479671 5587700
4471 5587700 5465087 5293760 5485910 5546230 5529987 5486770 5570397 5646158 5718167 5942752 6053546
4460 6053546 6188802 6196695 5979141 6246972 6314486 6470809 6397265 6696693 6711033 6909972
4450 6909972 7221194 7545523 8228628 8857679 9739004 10860595 11895678 12026556 11379201
4441 11379201 10498700 9405476 8728136 7949827 7435687 7395658 7273168 7037747 7059413 6886998
4431 6886998 6774173 6714759 6565661 6707068 6661233 6609640 6624242 6611885 6536185 6555687 6743947
4420 6743947 6716842 6870126 7035625 6862190 7024164 7165850 7182474 7175977 7301033 7441441
4410 7441441 7542304 7642741 7826503 7875193 7792441 7600881 7665384 8031211 8129814 8167094
4400 8167094 8600249 8766578 8847078 9038747 9252300 9392143 9612302 9617581 9734262 10016559
4390 10016559 10068758 10468128 10603004 11022245 11171898 11458860 12018594 12571019 13010956 13293849
4380 13293849 13708453 14042534 14585934 14800020 15260924 15726218 16154443 16825072 17060341
4371 17060341 17529603 18028175 18457278 18955440 19328894 19627404 20090244 20438549 20666283
4362 20666283 21259366 22060239 22610087 23277445 24092255 25274254 26510486 28051653 29934764
4353 29934764 31878130 33965963 36732597 39401282 42999504 48026204 54932611 64153031
4345 64153031 76787540 94254564 117922302 150242009 182120675 189287849 166807557
4338 166807557 137877852 109219083 87750792 73429303 62636856 54643812 48051090
4331 48051090 42697978 37945767 34319642 31571854 29338967 27391424 25718667 24471102
4323 24471102 23393347 22210945 21352999 20355776 19457652 18675665 18016253 17270393 16736301
4314 16736301 16081579 15598213 14930263 14612918 13863881 13570512 13271773 12730514 12519174
4305 12519174 12216003 11948037 11679215 11404002 11341411 11064124 10788475 10837531 10709168 10375776
4295 10375776 10015766 9815143 9847309 9814251 9540549 9443361 9127366 8969677 9034296 8846310
4285 8846310 8709194 8452870 8412621 8452288 8394554 8138587 7918357 7902288 7871739 7971140 7946501
4274 7946501 7739857 8053924 8163996 8063539 7862445 7932450 7793136 7695003 7528889 7540127
4264 7540127 7414074 7375784 7571271 7756582 7594038 7367384 7550170 7525008 7400937 7266851
4254 7266851 6945678 7167540 7306598 7447668 7496399 7489795 7290474 7112566 7379677 7541292
4244 7541292 7443658 7313067 7264031 7403812 7629095 7600430 7478540 7552689 7775212 7636625
4234 7636625 7684430 7550631 7629521 7620075 7642450 7805177 7712153 7725002 7827030 7975903 7909523
4223 7909523 8006751 8099649 7970450 8188403 8260584 8166140 8093283 8315461 8230376 8247396 8427105
4212 8427105 8612084 8609803 8587839 8570652 8571437 8622557 8673649 8722027 9040335 9222472 9071195
4201 9071195 9198989 9235961 9392364 9668219 9690446 9662959 9769605 10164981 10369171 10552914
4191 10552914 10651227 10732452 10952369 11036655 11127376 11133763 11276611 11339375 11622372 11712207 11780842
4180 11780842 12021862 12191646 12404621 12696133 12857494 13141296 13632963 13911913 14089013
4171 14089013 14183717 14388890 14943782 15227564 15506087 15858923 16198053 16503329 16881278 17060715
4161 17060715 17418854 17770468 18151159 18908100 19473907 19754705 20296400 20887685 21325838
4152 21325838 21970935 22467450 23167508 23714661 24399172 25382989 26550824 27806714 28820110
4143 28820110 29852715 30871879 31696177 32569905 33694642 34787180 35814934 36713433 37580539
4134 37580539 38325809 39074042 39642556 40171861 41159136 42322950 43644651 44918805 46153448
4125 46153448 47094619 48238828 49437527 50495010 51347170 52399759 53652551 54656245
4117 54656245 55754662 56909279 58069487 59434823 60623132 62204953 63684911 65433464
4109 65433464 67246378 69119480 70723247 72564274 74333032 75969595 77714319 79929716
4101 79929716 82079063 84586437 87397850 89789644 92115257 93872486 95715596 97476041
$$ [...]
##END NTUPLES=NMR SPECTRUM
##END=
