##TITLE=1H_EC-3306(12-1)
 CDCl3
 8 sc, 
 25.12.2023
##JCAMPDX= 6.0         $$ Bruker NMR JCAMP-DX V2.0
##DATA TYPE= NMR SPECTRUM
##DATA CLASS= NTUPLES
##ORIGIN= UXNMR, Bruker Analytische Messtechnik GmbH
##OWNER= root
$$ XWIN-NMR		Version 3.5
$$ Mon Dec 25 15:01:49 2023 Russian Standard Time (UT+4h)  she@DPX200
##.OBSERVE FREQUENCY= 200.1313
##.OBSERVE NUCLEUS= ^1H
##.ACQUISITION MODE= SIMULTANEOUS
##.ACQUISITION SCHEME= undefined
##.AVERAGES= 8
##.DIGITISER RES= 18
##SPECTROMETER/DATA SYSTEM= spect
##.PULSE SEQUENCE= zg30
##.SOLVENT NAME= CDCl3
##.SHIFT REFERENCE= (INTERNAL, CDCl3, 0, 15.4263)
##AUDIT TRAIL= $$ (NUMBER, WHEN, WHO, WHERE, WHAT)
$$ ##TITLE= Audit trail, XWIN-NMR		Version 3.5
$$ ##JCAMPDX= 5.01
$$ ##ORIGIN= Bruker BioSpin GmbH
$$ ##OWNER= she
$$ F:/spectra/data/she/nmr/H-F/1/pdata/1/auditp.txt
$$ ##AUDIT TRAIL=  $$ (NUMBER, WHEN, WHO, WHERE, WHAT)
(   1,<2023-12-25 15:00:36.92 +0400>,<she>,<DPX200>,
      <created by zg, POWCHK disabled, PULCHK disabled
       configuration hash MD5:
       00 E9 B6 7A A2 85 ED C7 34 08 36 98 17 FE 4E 26
       data hash MD5: 16K
       03 8F 65 E5 EA A9 A2 DF 89 84 6F 53 3E 1F C0 BA>)
(   2,<2023-12-25 15:00:39.51 +0400>,<she>,<DPX200>,
      <Start of raw data processing
       efp BC_mod = 2 LB = 0.24 FT_mod = 6 PKNL = 1 PHC0 = -24593.95 PHC1 = 13.05273 SI = 16K 
       data hash MD5: 16K
       93 32 8E 94 CF 0D 01 5F 45 14 A5 E0 AC 48 9D 6F>)
(   3,<2023-12-25 15:00:57.21 +0400>,<she>,<DPX200>,
      <pk PHC0 = -3.378032 PHC1 = 4.800001 
       data hash MD5: 16K
       7A 3B 45 68 07 3A 37 81 E4 CA F0 5D 2A 76 95 AF>)
(   4,<2023-12-25 15:01:00.54 +0400>,<she>,<DPX200>,
      <abs ABSG = 5 
       data hash MD5: 16K
       80 8C D4 28 7F 99 A9 E7 52 F5 3C 1A E1 C7 68 48>)
$$ ##END=
$$ 
$$ hash MD5
$$ C0 F8 AE 18 AD E9 BC E1 D3 C7 88 50 E3 A6 C1 C8
##$RELAX= 
##$RELAX= 
##$RELAX= 
##$RELAX= 
##$RELAX= 
##$RELAX= 
$$ Bruker specific parameters
$$ --------------------------
##$DU= <F:/spectra>
##$EXPNO= 1
##$NAME= <H-F>
##$PROCNO= 1
##$TYPE= <nmr>
##$USER= <she>
##$AMP= (0..31)
100 100 100 100 100 100 100 100 100 100 100 100 100 100 100 100 100 100 
100 100 100 100 100 100 100 100 100 100 100 100 100 100 
##$AQSEQ= 0
##$AQ_mod= 1
##$AUNM= <au_zg>
##$AUTOPOS= <>
##$BF1= 200.13
##$BF2= 200.13
##$BF3= 200.13
##$BF4= 200.13
##$BF5= 200.13
##$BF6= 200.13
##$BF7= 200.13
##$BF8= 200.13
##$BYTORDA= 1
##$CFDGTYP= 0
##$CFRGTYP= 5
##$CHEMSTR= <none>
##$CNST= (0..31)
1 1 145 1 1 1 1 1 1 1 1 1 1 1 1 1 1 1 1 1 1 1 1 1 1 1 1 1 1 1 1 1 
##$CPDPRG= <>
##$CPDPRG1= <>
##$CPDPRG2= <>
##$CPDPRG3= <>
##$CPDPRG4= <mlev>
##$CPDPRG5= <mlev>
##$CPDPRG6= <mlev>
##$CPDPRG7= <mlev>
##$CPDPRG8= <mlev>
##$CPDPRGB= <>
##$CPDPRGT= <>
##$D= (0..31)
0 1.2 0 0 0 0 0 0 0 0.06 0 0.03 0 0 0 0 0.0002 0 0 0 0 0 0 0 0 0 0 0 0 
0 0 0 
##$DATE= 1703502036
##$DBL= (0..7)
120 120 120 120 120 120 120 120 
##$DBP= (0..7)
150 150 150 150 150 150 150 150 
##$DBP07= 0
##$DBPNAM0= <>
##$DBPNAM1= <>
##$DBPNAM2= <>
##$DBPNAM3= <>
##$DBPNAM4= <>
$$ [...]
##$SUBNAM3= <"">
##$SUBNAM4= <"">
##$SUBNAM5= <"">
##$SUBNAM6= <"">
##$SUBNAM7= <"">
##$SUBNAM8= <"">
##$SUBNAM9= <"">
##$SW= 18.0517328524113
##$SWIBOX= (0..15)
0 0 2 0 0 0 0 0 0 0 0 0 0 0 0 0 
##$SW_h= 3612.71676300578
##$TD= 16384
##$TD0= 1
##$TE= 0
##$TE2= 300
##$TE3= 300
##$TEG= 300
##$TL= (0..7)
0 120 120 120 120 120 120 120 
##$TP= (0..7)
150 150 150 150 150 150 150 150 
##$TP07= 0
##$TPNAME0= <>
##$TPNAME1= <>
##$TPNAME2= <>
##$TPNAME3= <>
##$TPNAME4= <>
##$TPNAME5= <>
##$TPNAME6= <>
##$TPNAME7= <>
##$TPOAL= (0..7)
0.5 0.5 0.5 0.5 0.5 0.5 0.5 0.5 
##$TPOFFS= (0..7)
0 0 0 0 0 0 0 0 
##$TUNHIN= 0
##$TUNHOUT= 0
##$TUNXOUT= 0
##$USERA1= <user>
##$USERA2= <user>
##$USERA3= <user>
##$USERA4= <user>
##$USERA5= <user>
##$V9= 5
##$VALIST= <valist>
##$VCLIST= <CCCCCCCCCCCCCCC>
##$VD= 0
##$VDLIST= <DDDDDDDDDDDDDDD>
##$VPLIST= <PPPPPPPPPPPPPPP>
##$VTLIST= <TTTTTTTTTTTTTTT>
##$WBST= 1024
##$WBSW= 4
##$XGAIN= (0..3)
0 0 0 0 
##$XL= 0
##$YL= 0
##$YMAX_a= 202605
##$YMIN_a= -253028
##$ZGOPTNS= <>
##$ZL1= 120
##$ZL2= 120
##$ZL3= 120
##$ZL4= 120
##$ABSF1= 15.39541
##$ABSF2= -2.656438
##$ABSG= 5
##$ABSL= 3
##$ALPHA= 0
##$AQORDER= 0
##$ASSFAC= 0
##$ASSFACI= 0
##$ASSFACX= 0
##$ASSWID= 0
##$AUNMP= <proc_1d>
##$AZFE= 0.1
##$AZFW= 0.1
##$BCFW= 0
##$BC_mod= 2
##$BYTORDP= 0
##$COROFFS= 0
##$CY= -3
##$DATMOD= 1
##$DC= 0
##$DFILT= <>
##$DTYPP= 0
##$F1P= 0
##$F2P= 0
##$FCOR= 1
##$FTSIZE= 16384
##$FT_mod= 6
##$GAMMA= 0
##$GB= 0
##$INTBC= 1
##$INTSCL= 3.70164e-10
##$ISEN= 128
##$LB= 0.24
##$LEV0= 0
##$LPBIN= 0
##$MAXI= 10000
##$MC2= 0
##$MEAN= 0
##$ME_mod= 0
##$MI= 1.114404
##$NCOEF= 0
##$NC_proc= -8
##$NLEV= 6
##$NOISF1= 3.799351
##$NOISF2= 2.8
##$NSP= 0
##$NTH_PI= 0
##$NZP= 0
##$OFFSET= 15.42626
##$PC= 1
##$PHC0= -24597.33
##$PHC1= 17.85273
##$PH_mod= 1
##$PKNL= yes
##$PPARMOD= 0
##$PSCAL= 0
##$PSIGN= 0
##$REVERSE= no
##$SF= 200.130019098902
##$SI= 16384
##$SIGF1= 3
##$SIGF2= 2
##$SINO= 5.538805
##$SIOLD= 16384
##$SREGLST= <1H.CDCl3>
##$SSB= 0
##$STSI= 16384
##$STSR= 0
##$SW_p= 3612.71676300578
##$SYMM= 0
##$S_DEV= 0
##$TDeff= 16384
##$TDoff= 0
##$TI= <>
##$TILT= no
##$TM1= 0
##$TM2= 0
##$TOPLEV= 0
##$USERP1= <user>
##$USERP2= <user>
##$USERP3= <user>
##$USERP4= <user>
##$USERP5= <user>
##$WDW= 1
##$XDIM= 16384
##$YMAX_p= 386789439
##$YMIN_p= -1215744
$$ End of Bruker specific parameters
$$ ---------------------------------
##NTUPLES= NMR SPECTRUM
##VAR_NAME=  FREQUENCY,     SPECTRUM/REAL,   SPECTRUM/IMAG
##SYMBOL=    X,             R,               I
##VAR_TYPE=  INDEPENDENT,   DEPENDENT,       DEPENDENT
##VAR_FORM=  AFFN,          ASDF,            ASDF
##VAR_DIM=   16384,         16384,           16384
##UNITS=     HZ,            ARBITRARY UNITS, ARBITRARY UNITS
##FACTOR=    0.220516191357247, 1,           1
##FIRST=     3087.25770732528, 0,            0
##LAST=      -525.459055680499, 0,           0
##MIN=       -525.459055680499, -1215744,    0
##MAX=       3087.25770732528, 386789439,    0
$$ Real data points
##PAGE= N=1
##DATA TABLE= (X++(R..R)), XYDATA
$$ [...]
14199 179828 -191452 -252560 71276 -335766 -363390 -413759 -281016 -149493 217017 184495
14189 184495 -207839 69121 -301195 -384484 43074 96110 -262841 -358630 -400619 -454330
14179 -454330 -67510 557178 435496 -311012 -769253 -294358 -77537 -25007 -242333 543727
14169 543727 552217 137248 -212449 -66762 98448 285109 338736 101950 -137662 -329123
14159 -329123 -320489 -221208 -277002 -276714 -198509 -523410 -469880 118217 -233710 -326820 -278726
14148 -278726 -451777 -393123 -468399 -425412 -265921 -216315 -89941 -144255 -171736 11554 -247174
14137 -247174 -264977 -326919 -36937 410168 319619 -65433 -26446 -97858 -153865 -31423 -76687
14126 -76687 -449310 -471142 -151726 -263024 -542086 -115821 -519751 -220264 -125366 -112452
14116 -112452 177160 38134 487320 420746 166655 130872 -197118 -296685 -268219 -34724
14106 -34724 -162731 -139472 -132825 -57503 -134261 -303636 -140645 -159307 -260781 -284105 -479403
14095 -479403 -490961 -671110 -574730 -230109 37446 114333 -130805 -63661 419169 362684
14085 362684 -21596 -281801 -459370 -333422 -101919 -252861 -404390 -544180 -470832 -103036
14075 -103036 -489280 -52184 121859 185543 -10151 -156834 -74266 49053 57126 150129
14065 150129 120069 -161547 173485 286301 -177169 -79205 -223766 -64348 -52502 -329485
14055 -329485 -374127 -301794 -218267 -82659 -188472 -214432 87250 -324559 -410426 -413371 -704126
14044 -704126 -65373 261585 452842 77224 -106740 -83569 205081 36574 -111336 -129295
14034 -129295 -152070 52202 291146 59290 -92226 -55851 -94264 -509510 -794024 -489846
14024 -489846 -561880 -573406 -250332 -320126 -57014 356944 254584 63928 -34394 -63767
14014 -63767 -459423 -353273 45213 -187955 -319277 -38168 -94251 369852 494136 276165
14004 276165 -218367 2770 250232 290325 244183 252121 71066 102493 101479 463876 324163
13993 324163 316799 49643 -124828 174043 39593 -177748 -257675 -294122 -76311 128494
13983 128494 325110 419610 545707 170368 -144797 75114 233108 114822 -19364 365762
13973 365762 230184 308498 80254 -276413 -311410 -228356 -61710 117194 159865 169886
13963 169886 261551 253432 259614 208771 187535 235709 -54506 -311961 -98672 97380 -300080
13952 -300080 -244777 -225648 -453534 -98769 -121069 112739 122836 437513 -36879 -119010
13942 -119010 -58304 -41093 -62984 -144904 30072 100990 179814 385598 319218 -206434 -345512
13931 -345512 -713903 -473492 -564974 -221570 82122 395994 474846 325215 -142624 -73840
13921 -73840 153409 372070 84707 -177980 -80372 -154188 261480 443021 368735 -284601
13911 -284601 -272899 397034 54258 18101 -247040 -377893 -176566 -109422 -210932 -360279
13901 -360279 -372589 -42592 208499 35167 -159346 -164712 -125358 35454 133939 -102029
13891 -102029 577611 476305 49285 42354 -108405 31468 -23246 -316722 -289857 -118550
13881 -118550 109387 -92763 -75501 -115092 -99571 64844 244402 262485 -65706 312789
13871 312789 33533 64113 260536 109611 205164 7582 134118 210924 -139233 -91243
13861 -91243 219908 260823 308773 207323 123537 335783 531109 353414 243865 372164
13851 372164 -5237 -116319 -138278 198738 318685 232459 337687 20035 330377 306025
13841 306025 115863 38348 224687 18446 199007 129229 54273 295185 201263 -52008
13831 -52008 -185231 -253391 -110148 172558 216351 336861 155072 170755 201666 -260790
13821 -260790 -363298 55057 -212975 -226771 -26757 324764 414228 41647 -404003 -359449
13811 -359449 292687 -35000 141052 306940 -154603 -74075 348553 485821 284608 43276
13801 43276 22220 -312097 -555509 -564992 -330168 -92902 -216365 -314235 -404810 26256 -139150
13790 -139150 -511845 -525899 -66354 -18949 -124868 -468644 -348756 53793 189240 431442
13780 431442 191695 -225030 -12009 -141663 -398814 65146 72334 -214608 -127594 -238461
13770 -238461 -82253 27320 -101564 -81827 -98170 -25074 -158780 160089 91716 -53274
13760 -53274 48117 2692 -166959 -70430 57615 -81043 -110766 57406 27805 145804
13750 145804 350643 462112 -157954 43147 45773 -101524 53316 -573497 -784640 -770914
13740 -770914 -558853 -493993 -599578 -350643 57822 -287549 -113572 121613 -36929 -158953
13730 -158953 201213 80848 430034 492149 637598 177991 -194126 106489 217781 -22094
13720 -22094 -301396 -393945 -113109 255800 29021 164244 -67266 -72059 280878 59160
13710 59160 92301 -160135 209211 279088 -317393 -428002 -314041 -136580 -180183 -381099
13700 -381099 -543208 25621 -137654 -374131 -81183 183017 32581 303679 -35557 -235866
13690 -235866 -288283 -270045 183020 -16521 -6805 -199146 -431667 -441483 -233527 -1770 -284030
13679 -284030 -349266 -564603 -256092 -356573 -354302 -204993 -112132 -482806 -303844 -217951
13669 -217951 -264843 -626349 -284824 -362027 114645 378046 -268774 -97993 -10415 -59811
13659 -59811 -187007 277725 -156297 1342 389912 253405 82504 -16950 385363 148454
13649 148454 -344053 -424296 -294463 121642 98578 323285 155116 -113737 -211936 -149086
13639 -149086 -269225 -286264 -322262 -220576 77485 354513 193802 94882 -76002 -500215
13629 -500215 -74198 90711 143953 237032 218602 -379262 -99974 -196894 -34820 -274188
13619 -274188 -261469 -315696 -132549 -34027 -340566 -154813 -333350 -271079 -357913 388904
13609 388904 490502 484955 48891 100438 176618 -49806 104402 673099 377129 46032
13599 46032 -117128 -159161 -514171 -479602 -158254 -54702 67723 -451719 -516010 237060
13589 237060 92559 74711 611054 183288 -313998 36618 209724 292624 32973 71126
13579 71126 476685 140836 -254104 -502729 -98137 145556 -194470 -201477 179582 -216995
13569 -216995 -86919 -59528 19675 137067 -81530 -377335 -646167 -493268 -498585 -382303
13559 -382303 -419642 -172381 -342695 -100212 331486 386602 255173 496629 539625 22923
13549 22923 -239470 -58988 -209726 -433172 -243181 -137523 -380151 -276514 133325 -97430
13539 -97430 326896 16266 -469516 -164305 -284343 -105316 159494 245890 -135012 -154467
13529 -154467 230556 44863 170831 164442 118265 -81624 -241324 -240609 -185433 -14038 -74458
13518 -74458 82319 -100060 176626 458678 178492 369733 -118680 -236464 -19264 -136833
13508 -136833 -99502 -53871 -36645 305271 251190 -30569 33422 -346225 -587533 -402931
13498 -402931 -727410 -633203 -570529 -429955 -38773 305932 419989 373195 64028 109815
13488 109815 -221740 -142248 -77788 100345 126505 3484 215706 158925 -85263 273014
13478 273014 383952 36702 201 -223581 -237287 -487151 -281170 -346621 -16124 -88909
13468 -88909 -146065 -241124 -202742 -406072 -546100 -396420 105864 -24367 -121059 24824
13458 24824 33243 40736 -45951 -233482 -241729 -516297 -357840 -386776 -322553 73209 16333
13447 16333 122960 92005 142031 79436 -45273 -65919 367140 294600 126117 -49422 343214
13436 343214 530564 205840 337443 171863 -181322 218925 -215356 -106087 275179 220996
13426 220996 480233 424711 368927 453201 -146760 32484 138039 69581 -149306 -336462
13416 -336462 -409411 -365602 11981 181901 -321567 -282686 117613 199753 -187275 -512753
13406 -512753 -199513 193262 84088 -95456 80266 162202 72148 -193696 -356615 84136
13396 84136 407508 474485 133731 139310 207098 41806 -46404 -154880 -137528 20420 86590
13385 86590 -161196 162990 80724 211222 120080 -67166 -221348 -101287 -538235 -160019
13375 -160019 153 83711 206789 248826 167173 -16463 -70629 -373393 -535727 -320725
13365 -320725 -232754 -306939 -288714 -592177 -725665 -407438 161784 -48981 -446229 -251787
13355 -251787 -225676 -53598 -123763 28769 -149353 -300806 -272531 221438 128377 -75467
13345 -75467 -184192 -600316 -312366 -206409 -1589 137818 87200 -429081 -300647 -324901
13335 -324901 -620765 -255083 -354567 -209605 63874 101630 127515 -169440 -351788 -346414
13325 -346414 -273275 -132064 -16323 11459 -500438 -548233 -311965 -45526 367316 487649
13315 487649 352978 226215 283522 89188 -123911 97134 -400234 -500708 -393429 -106899
13305 -106899 258278 174489 6871 36366 30722 -114883 12702 270619 576061 244140
13295 244140 -23097 303383 371689 169862 248428 293418 508632 331555 -67066 -368359
13285 -368359 -546380 -271757 -357046 -526161 -339103 -48557 140723 -533387 -513269 -712776
13275 -712776 44061 341482 555880 549628 103620 -169546 -60 -33268 -86753 298900
13265 298900 70735 45900 -155030 -394417 -65225 348695 39043 154377 44799 47617
13255 47617 53601 -33484 -224457 -235673 -29790 -40289 178410 132749 267669 103392 145100
13244 145100 -184853 -10482 39549 57900 184633 79922 -357238 -572838 -627775 -310439
13234 -310439 -338150 -247943 189081 119888 -250223 -545666 -54882 469296 324324 39191
13224 39191 -71331 -49173 -60289 66288 -166893 -457234 -117810 -160650 64058 129430
13214 129430 112631 -84060 -147858 -431455 -182864 -260851 -350492 -283613 -105448 -416283
13204 -416283 -625924 -680188 -502960 -508630 -276033 179984 -321258 -637503 -438925 -251705
13194 -251705 -162153 5531 -294269 72794 372886 -45373 -184726 -128291 -548541 -286109
13184 -286109 -146511 -37993 641339 446544 -144168 -390501 -476739 -479003 -197415 -70043
13174 -70043 265907 71439 487343 725396 605052 498898 253306 144053 247063 318363
13164 318363 -201296 -74971 -45570 -174357 -585655 -423730 -254146 -273067 40121 -339591
13154 -339591 -331852 -561397 -307653 64305 -245390 -238856 -352252 -565886 -563335 -372016 -179245
13143 -179245 -95579 113467 77378 -152064 332968 508568 105486 -505680 -168391 336414
13133 336414 -155761 -100338 -33374 180991 244089 -43029 -159768 -298675 -85925 -334110
13123 -334110 -341830 -69518 -463472 -120854 6348 -108462 -19879 21207 -30549 245910
13113 245910 111463 -357896 -351277 -351881 -141369 -384927 -242375 241745 199406 -268788 -330313
13102 -330313 -236165 -219743 -638812 -886958 -417394 -453193 -384353 -369337 -331284 -304333 -116226
13091 -116226 -134440 -289415 -144476 72752 242930 329124 154425 -226986 -237987 -436832
13081 -436832 -437172 -142777 -251061 -66448 -111961 -668250 -614260 -228409 -5474 227822
13071 227822 157910 -18273 -164631 -77258 -33298 109463 309390 108404 124752 48142
13061 48142 -80767 270868 434160 -106235 309507 19898 -282930 -31408 -70041 -262636
13051 -262636 -567900 -388236 -818 52181 -446047 -647748 -463174 83733 -65897 -230665
13041 -230665 -12401 -404497 -121496 -273642 -375736 -123136 -54134 -39995 -207700 -418640
13031 -418640 -492278 -99048 169605 170194 -64710 323479 -91506 -179633 -395445 -330505 152875
13020 152875 -1323 23184 -26188 -169863 -488562 -523647 -277580 175295 469738 605125
13010 605125 557617 443569 -73944 176473 439085 369830 -48388 170971 354786 356412
13000 356412 -297 56600 79620 137533 247196 -337682 -380463 -430058 -226950 -245636 -426092
12989 -426092 -257087 -228578 -604263 -552401 8075 -485914 -670603 -490192 -323918 -156543
12979 -156543 105418 130415 188372 -19285 -185055 -287907 -205892 84537 -656436 -479510
12969 -479510 -47215 17807 -84773 119358 108533 -366195 -565205 -304198 -380143 -230205
12959 -230205 -621014 -275949 -113065 -197560 -179867 -482598 -756389 -789503 -473192 -349708
12949 -349708 -54620 -145029 -280985 -437483 -1080508 -620251 56467 -337298 -195759 -423229
12939 -423229 -613840 -497652 -20188 110778 -421318 -423149 -72327 -1326 -309681 -379848
12929 -379848 58992 43854 -78203 414227 185663 -413126 -145281 -112054 -165666 -104295
12919 -104295 -374848 -391939 -375041 155430 259852 242084 -65019 -201075 -240904 -263088
12909 -263088 -103174 4197 459560 198029 45853 269374 -22514 -527312 -421540 -294987
12899 -294987 -710362 -574413 -276845 73710 -221618 -450791 -452895 -440094 -141695 -178307
12889 -178307 -440763 -197509 -179745 -113616 70530 205885 -460810 -579749 -411949 -524828
12879 -524828 -130024 -72380 -546785 -631493 -367947 -560093 -468902 -509432 -665150 -291625
12869 -291625 -228104 -238895 -251501 -265845 -108442 -133737 365031 -194583 -200585 40818 170074
12858 170074 -25888 -222876 -182888 -301449 -14457 148277 -63941 -236732 -334672 -227704
12848 -227704 319516 213584 -212099 -99247 35227 -242840 -399803 229353 237393 262646
12838 262646 -36194 182261 520128 153822 -204031 -31925 19876 -196971 -355972 -280608
12828 -280608 -13141 -85805 -218301 -215631 -398508 -616606 -456181 -63406 -407643 -434918
12818 -434918 -73408 -352407 -97752 -324018 -350423 -280231 -39194 30750 -208231 381774
12808 381774 11896 -519115 -168244 -340661 -249492 -478445 -578215 -105882 -529230 -398638
12798 -398638 -500984 -585944 -244209 193895 323490 -205380 -412623 -318741 -203507 -373936
12788 -373936 -82654 322242 45043 197753 572868 -80700 -403787 -544281 -288328 -231856
12778 -231856 162923 -52867 -320629 -417926 -378473 -11236 -182602 -146068 -223848 -300327
12768 -300327 40808 306760 -9069 130479 48922 -264032 -17189 -233551 -368786 -361386
12758 -361386 -98031 -203647 -75443 52706 -303419 -555267 -210002 57453 -340012 -101928
12748 -101928 485488 289830 -232384 182433 -31771 -190772 -265286 -353573 -139473 221426
12738 221426 -91652 109302 -29740 -435469 -414844 -201398 -80291 -13170 95077 130511
12728 130511 -205594 -71113 5009 76526 702814 434824 -274430 -245256 256785 -50461
12718 -50461 13283 85881 93623 -102201 246209 31778 -448270 -402928 -288875 69199 334221
12707 334221 120518 84334 114359 -130260 165648 110734 -678436 -482289 -366819 -503899
12697 -503899 -115563 -80012 70720 84641 -297820 67361 126611 -155589 -54590 30424
12687 30424 -85962 -281189 -69168 -51951 262936 83449 -111774 70825 -305553 -572907
12677 -572907 -130847 -41656 -102484 -279587 -115188 168908 -166728 -193321 -368686 -149570
12667 -149570 -125360 -172185 -409679 -167162 -168791 -331735 -179596 -620871 -526107 -101972
12657 -101972 64302 88003 -240355 199970 144304 -315580 11209 220004 155785 130534
12647 130534 44091 -142653 -46053 -365230 -152951 -132942 -159901 -215758 -163044 89447 -254195
12636 -254195 -573270 -227188 -37551 -24292 -312363 -517481 -268615 111577 -137318 -256632
12626 -256632 79071 -633 99752 -535715 -659840 -316250 -596188 32120 -63181 -97273
12616 -97273 97757 -285816 -210635 -468568 -431666 -541605 -366085 -237524 -332117 -166992
12606 -166992 -265385 -301068 -196015 -572186 -498452 -174695 -165157 144480 -181453 -98480 189792
12595 189792 30299 262737 117276 -116910 -232920 -87787 -161929 -181677 -190276 -312060
12585 -312060 -173046 110214 106589 53366 154151 -203310 14230 -50737 -32829 318518
12575 318518 332731 69015 -208194 -634426 -541547 -78098 -98795 -460492 -214953 99465
12565 99465 -317096 -313396 215311 -108413 -70811 150123 82302 -33811 -247414 -137485
12555 -137485 -19536 215347 65549 33707 -288717 -194452 214935 -25523 -169697 -222188
12545 -222188 -241631 -391969 -484133 -499696 -862236 -734734 -432458 -475060 -363568 -61713
12535 -61713 -84885 -34068 -16764 -46511 -98060 40867 325636 401633 298206 537581 471954
12524 471954 -348009 -295912 -25884 55115 109240 -256829 -559074 -394858 -396004 -123565
12514 -123565 -171333 -486286 -62176 -121796 154181 349146 459475 117610 -382795 -243346
12504 -243346 -154853 -344808 -333434 -553617 -372032 -348456 -419247 264218 127039 11967
12494 11967 -180871 385141 431953 666447 325647 -79607 138848 -412592 119401 -125618
12484 -125618 -294037 -110993 -182679 -227374 -566084 -462646 -320993 -355029 -24394 -279807
12474 -279807 -105000 -101884 -409874 -296520 -62708 -79894 -145056 45110 16886 152255
12464 152255 -233059 -506166 -537138 -380371 -301474 -698 -147954 -11227 -128088 -439640
12454 -439640 -85653 -228118 -515991 -358173 -203309 -25118 -103646 -444683 -401173 -340848
12444 -340848 -238454 -21074 -175278 -149222 98661 -306166 -700204 -599820 -404824 -162062
12434 -162062 -288665 -578518 -534346 -44965 -229876 -751684 -402962 -226745 -79819 -54553
12424 -54553 10549 -356074 -357804 -440293 -373405 -363330 -531689 -545440 -662888 -494553 -105369
12413 -105369 280391 336044 -67161 -188131 -18503 -296400 26721 321734 133284 -141294
12403 -141294 -376086 49912 401013 55451 112287 -245936 143840 288190 -96611 -79060
12393 -79060 -355384 -251314 -348929 -497078 -622123 -584039 128563 -75002 -222713 -106641
12383 -106641 -274324 -86150 363792 726218 461931 6416 -185407 -167659 64699 -182486
12373 -182486 -399491 -203009 -253487 -153701 -147516 -52742 -265084 -322871 -390902 -143348 -53794
12362 -53794 -129958 -105331 -64592 -57758 -211834 278931 133236 164063 -544615 -566548 -4849
12351 -4849 -287418 -197919 -330664 17543 188088 -98359 104316 91042 -30132 192505
12341 192505 -296149 -124578 178077 -52318 668 139208 66910 -324647 -209444 8108
12331 8108 -356923 -333624 -475476 -490416 -146360 223414 3142 -60077 -11737 -309550 -538380
12320 -538380 -41359 29127 -415700 -740232 -319795 -629913 -878340 -369883 -110400 -11136
12310 -11136 -72684 -56581 -14370 -258433 -44989 86872 28838 212765 -28617 -344102
12300 -344102 -243441 127289 103887 270621 -49200 -20406 -166800 -406147 -444348 16031
12290 16031 456610 -234335 -404254 -265137 -265066 -56851 13680 143192 -153093 -516044 -608272
12279 -608272 -598063 -399432 -82772 300403 194846 -91264 -175734 -340010 492429 522570
12269 522570 118062 -25865 160664 354186 451401 -68108 -174795 97086 148245 15817
12259 15817 17398 88792 32898 41746 99756 -23026 -627062 -776526 -765966 -576412 -379905
12248 -379905 -212784 -134486 -406256 -565437 -389509 -337785 -393002 43364 223535 440437
12238 440437 339121 114162 203288 124767 220429 41918 -58234 -39660 -209242 -241385
12228 -241385 46237 -64624 -698862 -67059 -29924 -223461 -150864 -285526 -494708 -682580
12218 -682580 -797050 -368670 -422887 -721759 -449154 81972 -296167 -314799 145172 274792
12208 274792 -68688 -204774 -126886 -275694 93783 339504 595382 251043 117625 -239989
12198 -239989 398337 -117539 -179169 -182338 -324266 -267849 -205538 -33032 -42734 -117954 -305705
12187 -305705 249195 434221 244382 328919 169360 227512 364308 81465 115128 -243920
12177 -243920 -529147 -279863 -130888 -263004 -664554 -687471 -627600 -1559 10994 -185364
12167 -185364 -47137 -5140 -340259 -219995 38463 354924 -59442 18930 373322 284940
12157 284940 -292261 -384962 -21273 -353835 -417252 -421499 -175827 -181320 170060 591159 498184
12146 498184 275210 -131142 -228955 -120409 -234424 -498287 -255119 238427 140173 -45265
12136 -45265 -135075 -235600 -552953 -135532 -315157 -436085 -461772 47374 389639 -322197
12126 -322197 -123814 428453 261454 -30133 -219955 -411748 -258337 -52593 -89907 -589363
12116 -589363 -292790 -495230 -676937 -314148 -82129 -452284 -558298 -936826 -456539 -314464
12106 -314464 -689263 -101763 -83322 191637 510204 317733 56438 360205 188869 25280
12096 25280 18654 -358071 -126304 116503 -492319 -250968 50368 42636 167750 325513
12086 325513 -36654 -27408 -130970 192697 46113 255997 507550 141140 67281 -167534
12076 -167534 61978 -226255 -177483 43171 -421861 -668312 -407707 88575 -215718 -625432
12066 -625432 -297983 -144314 -311383 -60987 -352789 -251253 -321699 -167646 62763 138910
12056 138910 -92194 78188 57066 244162 213730 -177046 65756 151551 349673 201365
12046 201365 156030 -102031 -466680 -416560 -478082 -460275 -306929 -14740 -325210 -183552
12036 -183552 -203594 -360389 -2006 -66290 208538 284765 356088 -217576 -571932 -504340
12026 -504340 -558005 -1682 356321 104102 -217340 71429 130319 -297714 -186431 -289318
12016 -289318 -115700 226621 269425 348574 138456 32262 43092 406555 185145 -145294
12006 -145294 -130862 -11901 111479 -172290 -197933 -300156 -296730 -20323 148541 -527796
11996 -527796 -570437 -509798 -484431 -192203 -152646 -469592 -421523 -506801 -470885 -344561 -293975
11985 -293975 -258699 -78846 -55454 -252469 -375564 -333955 -297856 210077 -48423 -151910
11975 -151910 35326 -99353 196297 508661 62466 -90482 -69990 -316695 -155592 164197
11965 164197 -151541 -381253 -116797 -78863 -212816 -824752 -678400 -823736 -759043 -911106
11955 -911106 -609572 -515029 -693287 -292540 -243470 -43809 -73164 81654 -152263 184060
11945 184060 250851 177283 99051 -187127 -7488 269905 -93225 -140960 -100102 8682
11935 8682 110814 -63691 -258249 -299942 -180426 -113647 95842 55976 195607 69800
11925 69800 281697 -28426 -199136 -160661 -19177 640765 -103886 -460216 -367931 -249692
11915 -249692 8638 116963 -232276 -762548 -847958 -505481 -335213 -347134 -255815 -282415
11905 -282415 -321804 -580540 -425645 50412 165945 -157623 -476428 -317845 -40300 -116254
11895 -116254 187766 -127113 49626 297203 -9825 -165329 -239302 -68083 82033 204294
11885 204294 158710 45705 300220 79567 140919 72820 -159976 -101366 311195 -73089
11875 -73089 14500 46066 -45012 119659 -120278 100959 -346097 -529334 -469654 -61590
11865 -61590 -75648 -387475 -419685 -194718 83196 196889 299060 138693 245487 -195161
11855 -195161 231842 278465 5228 96214 -166023 551762 375158 95702 343417 400800
11845 400800 218362 262096 263618 147291 155966 355137 299116 -47386 80439 -128475 -312301
11834 -312301 345267 626313 523242 487712 59807 176725 133901 116901 349436 214369
11824 214369 -124775 -30459 259557 236512 81571 -69372 253601 97878 -291345 519142
11814 519142 331797 297811 397731 725939 603344 460686 317600 374425 56807 19403
11804 19403 -108687 -48309 -205970 -502310 -111682 595076 640309 304509 -98372 -196130
11794 -196130 229734 -45308 19572 -156224 -354026 -397380 -35168 319177 301750 171215
11784 171215 -997 -125658 170251 465273 313379 171054 327715 78956 -131520 83479
11774 83479 280879 117625 -179966 -448905 -193715 -405860 95568 342538 715027 477419
11764 477419 250319 -341413 -62511 260963 375255 343328 160088 115341 498877 439391
11754 439391 331121 28408 210095 155714 192722 308625 179104 304008 80680 49579
11744 49579 98937 360092 -121390 -88728 -273837 -235318 16605 308730 184081 -73946
11734 -73946 169015 258529 225596 233667 379080 446304 307630 360640 147474 -49591 509410
11723 509410 513296 287237 -61109 61672 258028 369624 387867 346767 30701 -263864
11713 -263864 466609 643643 489279 650210 861246 471163 289648 -1943 139555 300458
11703 300458 566308 602888 609447 131135 236800 280787 50087 464697 384781 288100 283963
11692 283963 535970 440910 207741 301216 323376 80686 119885 213578 82243 488989
11682 488989 887126 415417 315978 -129427 377807 374518 -15167 -300553 -535966 -32311
11672 -32311 312924 405103 148446 486775 460783 626747 348554 359921 533180 256258
11662 256258 232985 128744 308975 719998 619158 4698 327274 524181 312839 603939
11652 603939 581233 754760 1096673 878767 519361 120842 136463 351873 192431 689728
11642 689728 263459 178125 305209 284314 374649 271046 153117 120888 39905 -76331
11632 -76331 -19251 78198 362019 605612 467766 715355 312211 469874 846796 276121
11622 276121 256017 735975 1125624 947018 692529 923833 939462 991021 722372 563078
11612 563078 403774 269708 912866 1289470 995399 878799 1027259 1070114 1306767 955892
11602 955892 895668 1053114 1553571 1425516 1169900 1263342 1521970 1599591 1254845 1484295
11592 1484295 1205791 802934 1258181 932432 723652 896242 664029 789684 690621 794539
11582 794539 1055042 1255215 1189923 1176771 868643 971530 1050120 1026341 1148279 1308795
11572 1308795 1384891 1282024 1532906 1440572 1447969 1608817 1808613 1748445 1377299 1466582
11562 1466582 1175922 1143437 1412156 1513684 1518018 1467722 1686931 1833807 1567561 1347259
11552 1347259 1580777 1876426 1885701 2085791 2118844 2116741 2133991 2240298 2093153 1713033
11542 1713033 2116812 2251522 1974238 1754529 2188742 2517228 2952148 2663987 2487860
11533 2487860 2601099 2983382 2789380 3138038 3085092 3173623 4122289 4291650 4069922 4177009
11523 4177009 4520738 4652170 4750656 5064358 4882598 4767919 4608892 5026779 4826423 4802821
11513 4802821 4709045 5021107 5080558 5726989 6061263 6029330 7113169 7577306 7838302 8419448
11503 8419448 9752378 11176518 13146562 15111540 17590866 19871275 22190286 23115569
11495 23115569 22396829 19561879 15743077 12212596 9839233 8017503 6760945 5819155
11487 5819155 5132985 4580108 4156642 3822974 3783930 3969902 3509149 3324828 3191911 3246978
11477 3246978 3034448 3113512 2851146 2855942 2563524 2335145 2028241 1916692 1720341 1910306
11467 1910306 1806483 1501987 1231245 1233494 1453075 1422368 2009669 2222109 1948047 1608353
11457 1608353 1371904 1362215 1264420 1127374 1522214 1925327 2145421 2143493 2075921 1855253
11447 1855253 1910719 1643737 1563883 1492446 1384766 1280652 1241554 1136049 1560983 1456338
11437 1456338 1392800 1027698 1265743 1373461 1324466 1585220 1703348 1968437 2079288 1979615
11427 1979615 1561827 1508306 1521146 1485060 1320592 827656 741845 314182 485146 1258716
11417 1258716 1105271 724468 553390 45513 133731 180852 554418 711174 798577 511893
11407 511893 230894 349395 414468 699235 687472 915190 826028 700188 373790 350025
11397 350025 296521 565134 378188 345151 648668 513040 517170 76734 100317 227682
11387 227682 -165569 -25060 456037 589032 502188 253796 495415 507283 414044 473464
11377 473464 240831 439720 400479 213261 358437 610244 429206 16106 309487 348491
11367 348491 470912 127743 -7965 447708 625177 380741 608388 708064 600409 729579
11357 729579 868044 744683 419878 739215 753271 609952 42701 -174477 -94161 609989
11347 609989 750289 575444 297017 202459 -4065 -41706 120434 92508 309613 547051
11337 547051 310447 70782 39657 167363 238069 411622 646118 505055 224291 263679
11327 263679 129694 106238 212241 -182930 -305282 41363 242334 204408 149792 190158
11317 190158 458024 783834 543094 180814 16371 -201346 -281014 -195995 1307 515899
11307 515899 465047 297250 237219 495987 394432 120885 9809 -390812 -256956 247895
11297 247895 92719 163697 68482 108305 662613 221122 44461 131703 91630 49514 -82322
11286 -82322 -159251 7613 -32536 180272 -251807 -331369 -155140 319366 243280 -155262
11276 -155262 -173049 -47318 224767 188235 416707 333303 33355 -358280 -648345 -298188
11266 -298188 33313 118170 301218 34236 -1490 -214602 113421 -110624 -490382 -500884
11256 -500884 -109554 -157300 90961 362318 365147 243259 -163448 13731 -115219 -46074
11246 -46074 414534 32727 15122 339097 239485 182211 -531621 -158408 27657 -215434
11236 -215434 -255962 -42208 229922 -159986 -170530 234974 297276 192684 126716 123909 369908
11225 369908 368721 337505 412592 245880 -100516 13692 356652 550048 408590 270912
11215 270912 251012 -63509 235445 -16093 287536 517949 280308 373272 390814 14347
11205 14347 232687 521581 10381 -407580 -57242 29854 168678 219743 397219 662782
11195 662782 101563 -87037 -298027 -358258 124210 315285 8120 173963 352210 299579
11185 299579 279707 -192682 -34987 119985 142077 88428 315835 268271 341517 79779
11175 79779 57219 327993 272523 284173 327095 311339 43934 402095 381648 520764 357471
11164 357471 147607 199540 64332 398549 568110 629265 543795 361761 91888 383390
11154 383390 481555 393650 635286 281571 142138 83143 -168514 347311 263272 185531
11144 185531 -17155 -299913 -160059 -37342 135763 366954 334388 202927 334924 51775
11134 51775 -190556 16733 483950 164538 283827 20459 34721 561041 694817 402697
11124 402697 668053 763137 849854 552929 203009 241192 480407 415716 290501 120258
11114 120258 60121 148942 241113 294605 436563 478262 234865 177896 152287 -2313 303608
11103 303608 346065 21446 211990 658657 515732 66284 724884 513416 282738 419206
11093 419206 669416 1120893 559627 265382 624266 506535 508450 452589 405422 704164
11083 704164 767463 783869 552475 -168795 69958 349728 66585 373500 455632 124182
11073 124182 491151 678793 477923 165169 317874 289902 338729 260709 59737 -20257
11063 -20257 90818 8518 -174329 297343 113934 192659 118778 -37083 129128 340479
11053 340479 353213 107979 4587 189611 237873 305259 154338 -161666 -190084 45388
11043 45388 -42702 299309 358020 355139 526513 375149 142608 45626 -261475 214890 862933
11032 862933 591290 249699 441015 357877 364097 240559 216381 282357 380778 546959 336719
11021 336719 625089 744866 577046 309225 355458 580034 768345 561604 837166 635990
11011 635990 559447 1076047 879505 496660 356747 283467 470541 744720 668880 341619
11001 341619 116910 438362 196895 162080 -56471 101405 193634 -217757 503477 677987
10991 677987 302275 326357 473106 518568 746677 977010 922464 580541 771591 576160
10981 576160 452528 666129 248871 459732 622938 728183 803164 568819 552742 773998
10971 773998 799989 178988 -157418 315043 705954 760548 483914 474513 368285 462646
10961 462646 555422 460044 866222 853952 932174 384369 699899 896193 970450 908567 1083674
10950 1083674 539347 255955 600095 846739 602471 661448 661256 891411 795842 1112822
10940 1112822 1190300 900951 1287535 1330425 902841 876392 1073705 1014456 1007367 935911 1399870
10929 1399870 1495728 1365753 1118249 1048317 1353697 1213947 1677845 2289840 2024793 1997308
10919 1997308 1850545 1627464 1605666 1326371 1229746 1543397 1803934 1612964 1607665 1641417
10909 1641417 1669338 1583305 1926907 1868226 1551045 1898290 1660803 2091848 2017513 2193570
10899 2193570 2279728 2290825 2690520 2677501 2662886 2792173 2762497 3163646 2756477 3083196
10889 3083196 3155416 2916477 2896743 3340809 3406520 3360358 3334270 3601726 3480524 3462555
10879 3462555 3998808 4394501 4549952 4840836 4434398 4904535 5461838 5580890 6314324
10870 6314324 7077416 7482787 8118346 8507247 9357735 10456470 11245768 12340407 13588146
10861 13588146 14623387 14978865 15257861 14822088 14230805 13086866 11928156 10276007 9261004
10852 9261004 8304128 7103481 6041431 5840233 5580206 5212371 4726328 4181725 4274092
10843 4274092 4187115 4172229 4200846 3566473 3168628 3106364 2854641 3175010 3117435 2959601
10833 2959601 2767887 2654249 2318312 1908531 2161710 1835984 1598461 1795048 2078153
10824 2078153 1913637 1548437 1698454 1406821 1181164 1416260 1008775 980035 1109562 1252991
10814 1252991 979853 994202 1376949 1544521 1113876 914594 1178128 1366668 1198387 1287603
10804 1287603 897060 724607 1207679 883538 502416 777262 1342235 1318848 1271602 1151958
10794 1151958 963197 1104048 1140574 1096981 946215 695708 862273 755709 808248 609215
10784 609215 489522 564774 158411 47240 152233 536504 712738 740394 587275 363828
10774 363828 461696 422677 563443 840716 787317 697012 894438 770173 763400 796071 648998
10763 648998 831375 1266652 1068407 1006587 1092746 1435808 1144013 734358 627299 988313
10753 988313 1151227 1078937 600993 456972 822598 639816 707017 590638 807169 974699
10743 974699 1001359 1020162 953739 959374 1000272 688208 622307 520549 420947 281147 362233
10732 362233 511338 413965 103509 487769 945261 825183 1062128 1124716 810076 444113
10722 444113 316957 449039 458944 376105 286394 308924 492394 435846 340175 628920 635624
10711 635624 1084841 1186438 764672 655551 1121248 835824 719106 600269 668212 614215
10701 614215 543175 732677 509310 432036 521718 200136 56280 283064 221139 -21597
10691 -21597 513636 684564 225924 165632 831101 1156180 171940 257596 393068 828941
10681 828941 703457 283070 357339 409843 434212 683438 547162 890431 864468 602101
10671 602101 905126 1002442 950470 876334 1320296 1146864 780761 1225650 1205695 526052
10661 526052 370663 889549 734970 421336 999637 768239 813662 1072059 792256 1050695
10651 1050695 1030132 1086526 854277 843944 1222697 1295074 1446312 1566807 1162359 1037207
10641 1037207 1242075 1953945 1834907 1307755 1791611 1676017 1832656 1958610 2394595
10632 2394595 2368846 2582259 3041019 2550677 2452038 2511892 2801281 2876042 3223431 2976929
10622 2976929 3309306 3960329 4349309 4741488 4126486 4165673 4099848 3972145 3778814 3121050
10612 3121050 2921456 3270030 3416061 2974036 2907865 2817701 2982245 2915709 2570280 2555174
10602 2555174 2249675 1862078 2373829 2137588 1717406 1396835 1411547 986544 863426 991932
10592 991932 1136001 1484270 1135587 907318 824615 1003379 912091 1224721 1282327 998371
10582 998371 945411 741975 1093672 1235236 851711 1169578 1083391 1040226 950516 904343
10572 904343 1414268 1374465 1184508 1108438 992870 516164 440623 565388 570212 741871
10562 741871 519924 346825 486048 411506 -40655 184711 376828 311952 205309 516386
10552 516386 848442 669525 907023 887174 1007373 1118488 752513 491532 630544 686431
10542 686431 525489 509630 710121 792697 896043 912825 935604 1101712 819500 702171
10532 702171 810695 1030966 1074727 1029659 612694 378275 200956 631394 931133 1095601
10522 1095601 739584 572436 674856 900425 561419 749584 611098 885657 1061235
10513 1061235 1174153 1001318 716898 1035610 1001518 1186914 1354074 1710739 1523220 1289440
10503 1289440 1228983 1129328 1165708 1145402 452180 816396 671320 630307 1058834 1006397
10493 1006397 560648 802843 1255868 816728 940152 679367 837793 818294 794347 913399
10483 913399 887395 699633 522715 730137 911577 927296 941633 854020 512644 615180
10473 615180 575463 812458 842765 816647 354922 697907 749203 709584 984395 807092
10463 807092 644716 986934 761825 396034 701305 607983 543756 452697 682141 563006
10453 563006 804485 987125 1260033 1104872 717592 798303 609083 389609 410003 645786
10443 645786 722383 603382 686450 628432 625871 781995 598814 907799 1010122 744763
10433 744763 597233 425772 168743 463215 558608 518372 616898 946975 856179 840042
10423 840042 611471 896913 1172553 1030053 845038 1064301 1117745 975038 931635 484514
10413 484514 308351 443028 377677 695243 898720 1014639 786534 537279 907602 995152
10403 995152 946203 826240 660266 1098248 1113173 977403 1361515 910737 1124908 1432824
10393 1432824 1186224 708815 555007 605900 501353 942509 890389 666859 891530 454395
10383 454395 453858 308504 704448 564476 592775 1042077 1018349 1079847 1209076 1047970 1100989
10372 1100989 1234664 1560795 1603019 1347053 1056513 1105210 1304668 1061090 921690 1132630
10362 1132630 1118612 1063406 1269717 1328049 1463637 1494058 1610731 1292143 1376124 1499750
10352 1499750 1201740 904235 802616 673084 928920 1188632 1192331 1405346 1005547 993103
10342 993103 1264996 1136311 952215 595304 618596 1160068 1297682 1020615 1093218 1115461
10332 1115461 1321249 1295543 1702139 1616007 1539955 1085672 1281068 1446054 1541604 1784381
10322 1784381 1610258 1581170 1599544 1511525 1634072 1940080 1686008 1265361 1085183 1459994
10312 1459994 1415967 1424056 1688256 1701762 1698102 1615938 1648100 1771648 1316846 1443971 1448940
10301 1448940 1390085 1458777 1527987 1608912 1985539 1621182 1575155 1654241 1791203 1798125 1718579
10290 1718579 1821342 1751768 1887425 1584232 1556743 1774078 1691945 1446003 1606023 1842819
10280 1842819 2008066 1940304 1743360 2069877 1735010 1484477 1749384 1980459 2022164 1901459
10270 1901459 1789803 1797457 1811923 1452577 1812681 2201584 1975857 2093076 2109124 1764763
10260 1764763 1964080 2047014 1888221 1942536 2166102 2174735 1814794 1927762 2160257 2221623
10250 2221623 2303659 2478685 2302726 1911981 2158426 2546251 2439442 2626300 2771113 2450134
10240 2450134 2530298 2694002 3015894 3166071 3006866 3183277 2815076 2842943 2814362 2801134
10230 2801134 2910942 2913100 3099247 3222111 3329688 3385068 3484189 3252938 3126103 3138157
10220 3138157 3680876 4148577 4376793 4254712 3984365 4503410 4812668 4939000 5050196
10211 5050196 5222711 5106408 5302102 5454012 5454501 5162353 4898467 5087264 5261177 5123453
10201 5123453 5026972 5627883 5842617 6010547 6196817 6366258 6176521 6271314 6224117 6570756
10191 6570756 6930472 6956489 6912597 7514956 7518818 8055350 8468064 8840742 9457655 10316513
10181 10316513 10621184 11214853 11339288 10927118 10516912 10178133 10182559 9509066 9247985 9176808
10171 9176808 9104457 8357722 8005507 7805379 7805937 7777787 8344719 8193367 7971327 7851242
10161 7851242 7736220 7908041 7572865 7318682 7667092 8005378 7772527 7792926 8070670 8362826
10151 8362826 8483940 8706209 8829059 9409989 9771846 9793715 10284840 11376758 12321055
10142 12321055 13344953 14626161 16177553 16796871 16916345 17410653 17393523 17710812 17456222
10133 17456222 17554388 17477648 16813155 16169884 14970807 13319377 11712629 10656596 9880703
10124 9880703 9629104 9033748 8595803 7657304 6944427 6899656 6647604 6806125 6750275 6888077
10114 6888077 6269345 6127574 5927859 5807215 5596013 5700708 5350381 4735749 4425646
10105 4425646 4811788 5249845 5113623 4902012 5009670 5330801 5088885 4829034 4764564 5133702
10095 5133702 4939089 4668423 4746974 5089083 5433092 5578039 5689934 5817845 5784283 5465837
10085 5465837 5217528 4767765 4677918 4103972 4245123 4933203 4860097 4782095 4625663 4450437
10075 4450437 4541185 4850298 4269522 4107791 3908586 3955646 4212388 3810150 3386440 3658856
10065 3658856 3697989 3456721 3603835 3497448 3184862 3528898 3649576 3621665 3374852 3447112
10055 3447112 3370664 3142809 3280601 2999237 3044533 3084331 3109717 3228991 2800398 3279987
10045 3279987 3534728 3589568 3495455 3510879 3611814 3281724 3556218 3665688 3391104 3205414
10035 3205414 3343310 3272096 3437869 3435092 2989512 2670793 2499360 2203745 2491210 2654138
10025 2654138 2932526 3238048 3275837 3548527 3148716 2895820 3058129 3201663 3316259 3110612
10015 3110612 3275447 3342040 3312057 3261558 3181337 2911258 2646851 2865084 3388401 3636438
10005 3636438 3426247 3174942 3138790 3253622 3587157 3246911 3300045 3227657 3750000 3764205
9995 3764205 3798264 3271674 3224510 3588456 3584687 3541315 3594098 4100479 3834125 3485173 3505186
9984 3505186 4033792 3516231 3437823 3525876 3898152 3993998 3648359 3513877 3621618 3535488
9974 3535488 3703588 3824097 3920048 3594650 3973497 4016533 3871800 3995459 4165336 4351068
9964 4351068 4166967 4094414 4143363 4432704 4605112 4572593 4585275 4847486 4627052 4706290
9954 4706290 4388266 4337273 4483308 4635560 4799304 4662154 4482434 4317929 4536129 4604609
9944 4604609 4498198 4485210 4377264 4679062 4953931 5141763 5065731 4795523 4817964 4612114
9934 4612114 4869876 5120883 5272466 5083110 5136039 5150278 5574796 5624861 5525753 5408128
9924 5408128 5438358 5735769 5602318 5882471 5917689 5637046 5621755 5351570 5363269 5692264
9914 5692264 5959915 5981802 6004983 6481086 6867716 6873529 6755137 6870259 7139864 7117428
9904 7117428 7018856 6998830 6997816 7059754 6913723 6980775 7306833 7366120 7238776 7404445 7794711
9893 7794711 7400237 7451188 7861074 8210447 8092509 8073496 8405190 8413157 8498823 7946847
9883 7946847 7911975 8410497 8437599 8225781 8269904 8481927 8879193 8353210 8389659 9066882
9873 9066882 9863327 9460885 9525468 9734258 9930099 10029049 9712918 9411489 9687429 9769105
9863 9769105 9489115 9700152 9926549 10238870 10630700 10563081 10773049 11078537 10971810 11601643
9853 11601643 11336041 11208375 11501306 11667684 11648749 12119170 12084722 12193072 12374682 12404269
9843 12404269 13007294 13281739 13538461 13800449 14181838 14154001 14235756 14630656 14752826 14883279
9833 14883279 15440248 15866584 15844736 15631362 15549806 16364392 16603421 17224217 17201697 17263164
9823 17263164 17902618 18195324 18453426 18470058 18877474 19155025 19416360 19750374 20825190
9814 20825190 20628570 20976321 21964887 22572363 23155888 23503353 23771445 24674703 25390857
9805 25390857 26444432 27498590 28225543 29170288 29812050 30318964 30581124 30908088 30636275
9796 30636275 31004860 31847576 32265569 32800287 33285433 33364406 33294609 32972367 33106320 33144572
9786 33144572 33067147 33584473 34294424 34685758 35493549 36446817 37521038 38621819 39558239
9777 39558239 40187728 40738284 41710954 43457269 45063792 46567662 48266612 50341706 51681627
9768 51681627 53769298 55479290 56384253 57344200 59006761 61499651 63547619 66063720
9760 66063720 67939653 69630799 70735680 71995375 73946681 76072107 77670329 78569306
9752 78569306 79049644 80090245 81078536 81667024 82568921 84240192 85889673 87750178 88874440
9743 88874440 89556008 89687611 90918769 92994147 95135059 97897457 101481776 105526247
9735 105526247 109127228 113237984 117625150 121971959 126312042 131153317 136509939 142279855
9727 142279855 149048463 157136296 166311921 177239385 187840950 197986958 205854482 211860760
9719 211860760 217177603 220280457 218428394 212139847 203216547 193798897 184064920 172287750
9711 172287750 159743143 148907096 140972244 135326968 131000481 128412851 126866114 126127138
9703 126127138 126109098 126290736 126814995 127021177 127768112 128541045 128894866 129829687 131032267
9694 131032267 132339861 134077609 137206501 142285358 148923690 156707577 164890186 173247242
9686 173247242 179433858 183365771 187646659 190712208 187988969 178232040 165354341 153386164
9678 153386164 141990847 129351592 115831503 103863164 94196396 87007223 82015305
9671 82015305 78065264 74697680 71573508 68597890 66346532 63674677 60511103 57867282
9663 57867282 54752970 51670004 48694947 45834130 43784768 41000306 38389774 36741968
9655 36741968 35201064 33969961 32835198 31779607 30323636 28676962 27975530 27361696
9647 27361696 27378518 26746563 25996021 25673511 25678707 25086629 24717705 24499722 24366248 24203922
9637 24203922 23429171 23019080 22570673 21993475 21215239 20978789 20609340 19971390 19447528
9628 19447528 19172763 19051019 19209943 18599340 18402194 18434494 18196453 18223614 17942872 17800629
9618 17800629 18025656 17812886 17720388 17785615 17968226 18254218 18089723 18377686 18773460 18546748
9608 18546748 19182714 19462259 19846343 20352597 20240389 20313120 20172942 20516998 21047368 20925898
9598 20925898 20834249 20982952 20805086 20073186 19303219 18717293 18574150 18290400 17929790 17653025
9588 17653025 16746449 16305267 15652252 14848007 14489888 14187316 14002112 13884130 13637980
9579 13637980 13980207 14111203 13753457 14100121 14171232 14286526 15154436 15223316 15114709 15121721
9569 15121721 15010983 15579690 15342448 15385204 15612642 15553408 16279409 16518009 16697708 16906131
9559 16906131 17133491 17503810 17583495 17298641 16487950 16117119 16082673 15810689 15586187 15426575
9549 15426575 15044187 14156809 13125624 12617224 12140693 11905380 12199738 12069729 11512150
9540 11512150 11240532 11204883 11204699 11402437 11529247 11416020 11742078 12481015 12515520 12693111
9530 12693111 13174722 13574727 13965498 13805290 14051862 14579207 14573902 14050595 13984250 13862632
9520 13862632 13841967 14194439 13831903 13699971 13615146 13163444 12963014 12929219 12235375 11801737
9510 11801737 11383578 10870758 9833377 9823564 9726719 9105567 8647181 8392241 8627927 8253702
9500 8253702 8060950 8260566 7817531 7708860 7730068 7915167 7709583 7812508 7838116 7171454
9490 7171454 7313330 7348837 7203567 7694713 8019822 8092429 8100217 7839250 8140707 8051032
9480 8051032 7911727 7713109 8005973 8559520 8919512 8730236 8621030 8763094 9226406 8655593
9470 8655593 8372482 8529150 8329853 8305934 8467182 8360789 8158753 7777003 7834106 8084166
9460 8084166 8080394 8230054 8747869 8894451 8493770 8899053 8829472 9132421 8843135 8686602
9450 8686602 8974172 9071635 9375805 9683518 9505337 9356470 9916544 10427625 10921067 10989509
9440 10989509 11638075 11579498 11900817 11723170 11957365 11574417 11399892 11275028 11108004 10777395
9430 10777395 9985760 9821348 9233627 9502804 9991232 9913183 9947740 10304746 9760247 9802416
9420 9802416 9888735 9673429 9677593 9872811 9822110 9677938 9342452 9207733 9623116 9731538
9410 9731538 10173969 10117903 9905827 10132511 10061048 10588439 10636601 10997602 10967321 11029421
9400 11029421 11039420 11286826 11310941 11231613 11256944 10999921 10695582 10549709 10683428 10637469
9390 10637469 10940714 11490838 11616143 11639400 11932982 12033727 11976926 11775798 11642771 11489489
9380 11489489 11284306 11079601 11108400 11015063 10929588 10971459 11088210 11508154 11559324 11181882
9370 11181882 10705757 10512999 10389008 10782372 10799561 10476206 10564907 10394197 10073391 10192998
9360 10192998 10112894 10395512 10446266 10504458 10843788 10688361 10956465 10863758 10625750 10749603
9350 10749603 11020793 11802872 11772852 11696398 11685447 12143914 12274273 12331260 12831741 12642337
9340 12642337 12016996 11528863 11266763 11639632 12170912 11850185 11930101 11970556 11760654 11460139
9330 11460139 11552296 11481409 11325855 11128686 11444413 11084650 11035975 10942450 11101549 11265208
9320 11265208 10982721 10603568 11090805 11274003 10830917 11017565 11179740 10966026 10777303
9311 10777303 11125633 11602335 11268908 11266884 11218699 11472390 11751481 11623412 11623164 11581298 11446920
9300 11446920 11701563 11869032 11570110 11804781 11987915 12234380 12298184 12641253 12435936 12502983
9290 12502983 12705845 12932343 13209124 12979250 12736444 12773517 12736245 13069962 13180461 13128431
9280 13128431 13213225 13414882 13208059 13069953 13319361 13102555 13135837 13721433 13839766 13547020
9270 13547020 13562481 13502183 13624540 13786188 14098244 14462597 14896670 14982635 14951849 14631841
9260 14631841 14574144 14927103 15255461 15376256 15873471 16155939 16418563 16191913 16255696 16694692
9250 16694692 16609875 16855174 17021482 17308839 17405736 17577502 17485229 17397834 17615736 18118435
9240 18118435 18743073 18648542 18410659 18538403 18276009 18286868 18833447 19099822 19081025 19449372
9230 19449372 19205987 19910206 20185613 20434472 20660790 21032625 21150953 21347648 21924003
9221 21924003 22070373 22340044 22682422 22895113 23610977 24647330 25240525 25329914 25852762
9212 25852762 26573182 26947327 27192946 27524681 28193826 28376577 29011881 29699590 30009119
9203 30009119 30115855 30397525 30325882 30410493 30738221 31116347 31390463 32216577 33169760 33763683
9193 33763683 34313073 34913743 35438525 35949346 36275171 37102493 37545502 38278566 39030555
9184 39030555 40059434 41411075 42327119 43215145 44184234 44954799 45927700 47467521 48651132
9175 48651132 49853442 50776537 51959342 53481077 54464040 55561912 56890860 58723512
9167 58723512 60383464 62194805 64640283 67169351 69798500 71808094 72337148 72780923
9159 72780923 73531648 74086602 75321383 75083036 74415048 73683561 73357703 73681860 74638706
9150 74638706 75879702 77394029 79506766 81896825 84616857 87585555 90993471 94076587
9142 94076587 97616418 101356590 105016954 109111113 113064594 116637549 119878072 122369121
9134 122369121 125259265 127941339 132187274 138390946 145514066 154773535 165920308 178291644
9126 178291644 189824898 198954592 203690946 204826751 206441826 209049225 210642627 209122726
9118 209122726 202806518 195794993 190692456 189240220 191215300 196710043 205814570 218008433
9110 218008433 233374857 249885576 266448214 280439984 290737294 298010545 305296987
9103 305296987 311943915 319795066 332474105 349189796 367855943 380936826 386271711
9096 386271711 386789439 378974361 365222757 343431637 310830032 273050448 236596498
9089 236596498 206729357 184542331 169512114 158814185 150201559 143324299 137806424
9082 137806424 133159952 130211332 128331506 126700977 125752742 124888355 124138317 124785495 125831591
9073 125831591 127726806 129639586 130970324 131845207 131070038 128872061 125630373 121601118
9065 121601118 116632533 112197313 108548185 105571318 103690881 102640928 102175485 102127372
9057 102127372 102124257 102494410 103189739 103155709 102744603 102085731 101800245 101919727 101656679 100255431
9047 100255431 99122924 98883919 98807173 98445138 97442658 96470701 95352888 93499689 90275422
9038 90275422 86664870 84456277 82084402 80016077 78000554 76584336 74608010 72922426
9030 72922426 72071548 70873007 70530408 69453310 68312803 67986143 67915433 68011510 67323266
9021 67323266 66984156 66922281 67368639 67365021 66953414 67053317 67075746 67348196 67688227 68206439
9011 68206439 68402423 69619532 70483334 71365349 72011048 72602559 73532153 73847749 73542262
9002 73542262 73138055 72400548 71908751 71310070 71076565 70989025 70359885 70329035 70690121 71770065
8992 71770065 73334485 74270896 75476179 76960586 77536432 78240141 78697393 79151670 79805245
8983 79805245 80538859 81427060 82167394 83293846 84678054 86132242 87663150 89665499 91460830
8974 91460830 93703602 96146678 98718137 100880257 102630209 105501567 108568716 112330197
8966 112330197 116148392 121720524 128942548 137516237 145982967 152178522 154547778 151209323
8958 151209323 146718041 143275260 141745391 142478378 144459360 147765638 152220882 156426502
8950 156426502 158511054 157971639 154261246 149567937 145928561 142448252 140504063 140133728
8942 140133728 141172755 143248713 146463404 150505426 156196670 163897999 170900584 176427886
8934 176427886 179757084 178878078 178229927 180289455 185216716 194540850 208738515 224183757
8926 224183757 237690789 248469083 244948690 227716088 208377259 191652335 179791657
8919 179791657 172696138 169263934 168288554 169048126 170187183 170190624 167243415 161880362 156421775
8910 156421775 151006803 146363536 143225364 141458892 141032204 141407411 142793235 145202713
8902 145202713 148889823 152008144 153311638 151091492 145601883 140667448 136953153 135061605
8894 135061605 135312616 136885700 139329455 141939975 144131117 144891137 142146445 135762354
8886 135762354 127629960 121188175 116654605 113447425 111233744 109209418 106626813 104227160
8878 104227160 102500305 100233463 98038576 96384062 95192157 94923003 94740306 94225321
8870 94225321 94003617 93844961 93155981 92459515 91531731 91326790 91403685 91786681 92391267 93270458
8860 93270458 94352562 94953843 95340861 95252623 94779265 94515089 93765055 92895949 92508195
8851 92508195 92170810 92212095 92459027 92654623 92358044 91516153 90419993 89024033 88129105
8842 88129105 87632669 87670480 87516223 87497110 88052083 88214591 88321133 88923099 89791182 91116154
8832 91116154 92762660 94957499 97061407 99856401 102971482 107015192 112462248 118393033
8824 118393033 125423094 132306882 137420315 140027671 140148515 138254840 135397235 133400513
8816 133400513 132955917 133865749 136847951 141944852 147488165 152202596 154980606 155303000
8808 155303000 152959508 147955502 142234707 136125556 129867324 123349952 118141455 113423299
8800 113423299 109468076 106366610 103692202 102394340 102618678 102953644 104201081 105908689
8792 105908689 107337795 109489823 112852018 116413786 120435187 124969166 128496699 129618272
8784 129618272 129078904 127938358 127297659 127759368 129316661 130508162 129477979 127191463
8776 127191463 124042184 119793056 116766996 115756621 116836781 120832962 127868379 136666777
8768 136666777 145225509 151576206 152413989 147797431 138841846 126953515 115660238 106084823
8760 106084823 98752997 92980075 88135591 84710490 82274042 80673561 80516069 81395737
8752 81395737 83196403 85567408 89104546 93506090 96914725 99286542 99405967 96279298
8744 96279298 91531539 85064101 78514584 72350785 67142161 63067859 58899989 55531963
8736 55531963 53232668 51307137 50277440 49490707 48985440 48496777 48389721 48998077 49271204
8727 49271204 49887290 49778653 49739809 49854230 48357513 46351130 45184010 43759219 42380968
8718 42380968 40898581 40034892 39060346 38442988 37721236 37354148 36904906 36511825 36168124
8709 36168124 35547038 34991656 35083093 34893189 34681588 34660588 34535589 34933007 34786758 34239766
8699 34239766 34307766 34071491 33770906 33914239 34366083 34720986 35697837 36227496 36014402 36428650
8689 36428650 36786636 36784323 36708364 36647302 36719234 36334657 36378928 35722334 35295735 34406162
8679 34406162 33080150 32304630 31409556 30752815 30089121 30137622 30138591 30188451 30455831 30288289
8669 30288289 30024803 30112297 30089964 30892008 31355472 31826041 32816617 33899399 34525262 35143846
8659 35143846 35929485 36671290 37151192 37271663 37353649 36674870 36333013 35734588 35460998 34938049
8649 34938049 34960904 34599290 34225998 34106949 33651587 33423553 33200809 33100793 33062363 33181966
8639 33181966 33193967 33816820 33978235 33873352 33776621 33647338 33453592 33596676 34171120 34383849
8629 34383849 34799692 35672008 36104776 36882550 37529297 38626604 39343885 40314305 40902373
8620 40902373 41102428 41294820 41887899 42471414 42459753 42025183 42124837 42230089 42807885 42910141
8610 42910141 44030241 45899406 48328693 51575265 55089058 58295496 60460651 60278223
8602 60278223 58687220 56669657 54658452 53373953 53245291 53780236 54852725 56853221
8594 56853221 58493983 59070724 58192387 55797003 51963194 48591322 44912977 42131683
8586 42131683 40341513 40375759 39879296 39634497 39490630 39034800 39660933 40610991 40763386
8577 40763386 40900326 41034952 40839968 41318613 41640505 42304334 43925351 45220193 47629516
8568 47629516 50127675 53975074 58927224 64221632 68860270 71638114 73235188 71686591
8560 71686591 68519873 64340624 61089137 58826434 58318174 59522050 61748065 64406794
8552 64406794 65804066 65406651 63616195 59641405 54046949 48452403 43742121 40098839
8544 40098839 37144678 35144712 34031157 32990897 32527172 32051213 31454512 31370339 30838375
8535 30838375 30773713 30669360 30538216 31428104 31812095 31640892 31518405 32131503 32932710 33959497
8525 33959497 35956789 38154832 40624534 42835708 43632080 42346260 40346661 38200832
8517 38200832 35734772 34516931 34079561 33867150 34577250 36333209 38079643 38202645 37241544
8508 37241544 34832097 31632336 28515237 25899449 24222214 22978057 21973265 21759044
8500 21759044 21258465 20980133 20649892 20168099 19626329 19606814 19449625 18913617 18497198 18137907
8490 18137907 18180098 18039347 17970240 17836106 17607614 17232097 17443335 17938861 18460604 18674615
8480 18674615 19117322 19303081 19545591 19425780 18254876 18008143 17572926 17607995 17844452
8471 17844452 18251543 18364057 18430886 19353603 19428971 19111437 19305899 19682343 20163796 19913633
8461 19913633 20188262 20845658 21674018 22597434 23318668 23557101 23415759 23233139 22738087
8452 22738087 22206214 21572759 20929021 20409242 19348729 18283582 17409650 16704368 15920797
8443 15920797 15359307 15353913 14849725 14819809 15051554 15181389 14740782 14696245 14313457 13531919
8433 13531919 13029685 13238356 13138299 13211412 13740867 14089504 14982227 15660584 16164737 16683477
8423 16683477 16822528 17679978 17883163 18214612 18209231 18033616 17898199 17181812 16688094 15677161
8413 15677161 14991783 13789536 12362385 11092727 10255480 9769242 9309713 9143950 8773139
8404 8773139 8375208 7873313 7650024 7889904 7674091 7538339 7419726 6829440 6296049 6371053
8394 6371053 6769400 6602486 6452491 6550101 6375945 6246513 6200509 6076817 6421301 6262103
8384 6262103 5647290 5621911 5755011 5592025 5162476 5163323 5275831 4629986 4575187 4681350
8374 4681350 4852394 4852922 4428809 4525662 4766970 4341506 4350256 4242682 4119299 4122521 3772286
8363 3772286 4097984 4284605 3927177 4197458 4110263 3942768 3845566 3651079 3515838 3460727
8353 3460727 3776335 4244772 4189273 3711476 3781111 3551260 3967299 3769077 3610658 3567669
8343 3567669 3344613 3242851 3455454 3359854 3164179 3205382 2944791 2989413 2357012 2668375
8333 2668375 2912024 2973060 2907934 2749680 2874074 2649956 2532632 2146893 2147303 2158213 2433049
8322 2433049 2096279 1888449 1932728 1926461 2013850 1600261 2243507 2397684 2506586 2204968
8312 2204968 1953478 2400661 2102620 2156566 2124153 2173096 1800002 1819460 2214497 2171443
8302 2171443 1700999 1998973 2123860 2052432 2381408 2341965 1639440 1587803 1789132 2093633
8292 2093633 2234406 1737512 1332557 1230816 1665726 1828382 1970381 2574256 2542566 2327189
8282 2327189 2261223 2107482 1828541 1940554 2007511 2040848 2041904 1828459 1984440 1937342 1830250
8271 1830250 1616441 1615183 1931430 1931683 2079019 2142410 2121188 1763158 2062498 2106765 2000086
8260 2000086 2040307 1538385 1857071 2214429 2238807 1853230 1714913 1895625 2100126 2303916
8250 2303916 2042513 2253451 2471645 2073547 2220465 2025804 1994182 2285230 2655795 2714459
8240 2714459 2289921 2312680 2437560 2268354 2493902 2553156 2689468 3023133 3139677 2727741
8230 2727741 2812497 2583585 2611054 2106049 1922478 2193063 2288128 2075353 2327570 1992536
8220 1992536 1529364 1672816 2018745 1968283 1518690 1592607 2070706 2410755 2091837 2045800
8210 2045800 2079812 1954781 1871833 1969208 2413546 2563248 1873353 1771277 2111876 1741798
8200 1741798 1630846 2023640 2040151 1851164 1706476 1512715 1426592 243442 -427624 3075334
8190 3075334 3322550 2569583 3058705 3036602 2857463 2554021 2488959 2608346 2653910 2887749
8180 2887749 2552215 2846114 2753955 2483928 2770575 2740166 2941951 2881032 2742128 2361295
8170 2361295 2350004 2215643 2426242 2422440 2020767 1938908 1675984 1342904 1557115 1731764
8160 1731764 1701083 1823131 2161408 2359430 2486104 2298563 2176980 2056363 2330260 1992094
8150 1992094 1899398 1664524 1716121 1851696 1913559 1972506 2188006 2093840 1954310 1575407
8140 1575407 1325614 1626762 1468043 1636766 1941135 1946662 2379179 1796652 1583068 1592673
8130 1592673 1321574 1300885 1448582 1330731 1281637 1367343 1500080 1510351 1220726 1336596
8120 1336596 1367687 1902515 1670174 1830660 2102108 2153768 1982970 1526576 1551910 1618998
8110 1618998 1866189 1367981 1084379 1018153 1165303 1510883 1438250 1177271 1232559 1149878
8100 1149878 515612 734284 1185161 1231044 1336106 1467833 1435824 1192621 979749 1169424
8090 1169424 541530 799001 1274000 1262174 1571362 1233185 947317 1026901 808732 816017
8080 816017 892718 1063638 714517 870554 182719 685502 1093147 950133 1333463 1109463
8070 1109463 1189731 1396616 903540 658862 863492 969740 1239431 1336620 1243742 988382
8060 988382 788645 560143 586452 934518 1014625 562623 536856 861315 1075897 1190716
8050 1190716 825919 895369 1032320 1287635 1364421 1468125 1237825 1095649 877901 1179782
8040 1179782 989964 521251 556736 414977 140070 271507 771990 787942 516449 469124
8030 469124 809362 731605 917434 838656 418355 747214 944930 443287 752881 877209
8020 877209 977769 1000217 828355 710921 1151580 1247390 1266209 1219919 1238414 564504 652765
8009 652765 918998 942583 459900 546931 441333 858169 1323305 1266746 1060232 725418
7999 725418 573696 928742 870151 958685 793221 551310 1197817 1140068 815074 665652
7989 665652 1067292 1261247 1151616 1033565 1202833 1223796 1301962 1312189 1226537 1421244
7979 1421244 1493510 1406566 1118087 493009 534345 787944 1121477 984017 502706 658370
7969 658370 1000578 834134 1074630 710070 944097 1172794 942856 795082 886935 1116335
7959 1116335 1478089 1105250 664555 1070039 1320082 1529583 1201140 1384386 1262945 1498456
7949 1498456 1304232 1132098 1180456 1078644 1180449 1652588 1785061 1541777 1119490 975256
7939 975256 1159314 1514326 1564656 1499215 1404123 1048445 1029335 1212736 1285277 994191 1276024
7928 1276024 1501768 1284680 1411126 1729005 2155689 1897709 1674766 1675085 1611140 1589962
7918 1589962 1811915 1685229 1331349 1453579 1306869 1749443 1633043 1954372 1816193 1504336
7908 1504336 1406664 1338609 1581568 1353319 1148322 890101 1350591 1268286 1176587 1686420
7898 1686420 1751805 1293694 1485457 1519742 1311917 1576798 1563947 1825010 1629299 1595111
7888 1595111 1476159 1432269 1754780 1589353 1192809 1343262 1364389 1637892 1732152 1872830
7878 1872830 1674979 1971867 1958726 1610723 1722594 1517395 1419920 1584736 1471215 1271688
7868 1271688 1333333 1678534 1774369 1774309 1522898 1340594 1060504 1466471 1348730 852074 1232924
7857 1232924 1118773 859881 1254378 1161163 1103761 1454234 1231089 655717 643908 864481
7847 864481 937824 875604 1346042 1279126 1003783 858217 798879 1058817 1256149 1269278 1215331
7836 1215331 994871 1167914 1058516 762969 887891 305204 376056 772752 957929 696481
7826 696481 394263 756852 615129 450252 392963 394373 933506 840829 750238 746662 547691
7815 547691 687203 867813 807722 1081647 808173 995799 790369 908365 408233 262358
7805 262358 410463 862220 955441 1069712 931480 812701 1168868 1301231 883162 816122
7795 816122 991307 638570 407191 966091 682041 653575 434242 398356 86794 105989
7785 105989 814550 944751 833589 536973 278895 778176 712306 675236 540682 500881
7775 500881 817700 751577 670496 414124 680700 451573 216234 -126164 190008 225241
7765 225241 560499 531875 464923 234228 226092 504025 800260 399165 283886 178707
7755 178707 405858 474762 357404 150103 268831 560927 967801 779013 270530 156882
7745 156882 397637 480536 383670 529863 385107 99653 62207 161948 -160516 218217
7735 218217 -2965 266360 383225 283689 42716 177609 286205 279590 639901 567674
7725 567674 250523 209564 128586 256236 238839 275818 272751 128167 114945 460803 498183
7714 498183 559499 943665 696050 608769 197976 100741 2205 -81495 35054 66957 -129272
7703 -129272 49218 -135009 61045 452356 646202 276297 62719 145017 258921 223397
7693 223397 343212 421186 565146 521021 132705 -56891 -230203 -137926 -301277 -86136
7683 -86136 34522 164238 126437 62829 271647 152051 -130569 -344899 -50868 -15146
7673 -15146 277926 578184 340901 350421 21682 -160024 39382 -257145 -242108 106697
7663 106697 -80021 73227 449272 162683 87645 -25482 265930 142246 -18125 -299185
7653 -299185 -477747 -242400 87981 -39768 -263478 -210897 -219425 123645 -138941 -46633
7643 -46633 -18696 -253499 -171355 -615295 -279345 153404 51561 1905 -285900 -305369 46271
7632 46271 83136 -172758 -150387 -2075 50721 291234 107681 -13280 -22646 -177199 -148455
7621 -148455 -482331 -435366 58641 217780 -121079 -188152 -236662 -97408 179179 108525
7611 108525 106476 -263235 -616239 -619428 -296476 -378506 -438221 -547220 -486583 -247384 -338415
7600 -338415 -216976 -300426 48681 -200955 -330689 -390389 -35870 -407767 -132052 180435
7590 180435 -383208 -353873 -117926 -336282 -360524 -637555 -554713 -268070 -91074 269042
7580 269042 218887 78961 -346003 -212955 -171990 -426993 -291659 -570944 -644240 -296951
7570 -296951 -235084 -371614 -57080 -300404 -318956 -279755 -114418 -38422 67706 68044 6010
7559 6010 -93235 -274420 -20461 53698 174580 223081 10119 -298822 -439070 -402527 -200142
7548 -200142 -212332 -326054 -499045 -482846 -545837 -192865 55847 -451126 -548646 188431
7538 188431 77885 -246909 -416764 -549911 -405394 -260333 -628952 -778373 -394910 -362060
7528 -362060 -372384 -456427 -134852 -274063 12746 198390 32741 66012 116259 198002 262013
7517 262013 123881 31350 -188041 115226 385447 140719 -330627 -350602 -233089 -46520
7507 -46520 -111466 -402346 -113043 264080 553009 186365 659837 663294 500785 619934
7497 619934 862866 640528 531562 381331 572184 246559 352080 241940 -22914 -121223
7487 -121223 173573 259566 426792 333627 214250 23893 -103199 69720 55325 347385
7477 347385 657334 571982 368696 580494 756499 1093150 946669 1059505 1201987 763596
7467 763596 630342 989176 981003 901152 1079559 972245 543236 224307 703202 942320
7457 942320 528772 513087 28329 287508 412554 30809 369044 301604 166662 287514
7447 287514 459208 -64731 326286 798250 910993 619588 469112 397662 257002 346717
7437 346717 486336 501885 422574 557298 -73803 -91004 -26379 164874 325964 79953
7427 79953 2700 225834 100474 379690 314687 -189518 -22299 44044 -204922 -251690 4313
7416 4313 314860 -101355 -330919 -524131 -397216 -205500 -351612 -476810 -629486 -599515
7406 -599515 -292965 -380232 -74566 -553615 -794237 -643416 -673600 -582335 -661509 -784635
7396 -784635 -1092688 -819650 -737716 -1031320 -594207 -142459 -300249 -347425 -494635 -49237
7386 -49237 -11506 -388669 -575036 -66928 -186987 -311196 -668443 -530114 -482021 -597810
7376 -597810 -473380 -375022 -453413 -388490 -207698 -637174 -9727 161663 158679 433024 513267
7365 513267 310019 218395 226568 -227712 6066 -355544 -489057 -71483 -75362 -177681 -495008
7354 -495008 -260845 -88714 284325 -120289 -132359 -259648 -218976 -318497 -132231 202020
7344 202020 315816 185377 -117721 -321381 -614895 -629118 -252701 -8713 -138586 -308430
7334 -308430 -278459 -567202 -523988 -317423 -237564 -358959 -238767 724 129110 -177973
7324 -177973 -530637 7162 261719 132662 33868 -343230 -350129 140422 51522 451095
7314 451095 215852 272648 312792 -89139 195947 2578 188188 -211738 -156197 81513
7304 81513 36233 15348 -220459 270046 100626 -110473 -313161 -331209 -714460 -473350
7294 -473350 -651817 -432257 -414202 -809299 -768865 -324762 -328627 -732475 -472328 -182217
7284 -182217 -103914 -439898 -746324 -780380 -621108 -384812 -312292 -193983 -69838 22806
7274 22806 -125130 -552672 -722053 -498234 -306508 -198002 -179149 -458954 58378 302818
7264 302818 2174 -344455 -301167 -258015 -372620 -363561 -601973 -818406 -731336 -316515 -358268
7253 -358268 -639871 -442508 -315327 -473439 -561905 -548946 92536 -187515 -246997 258569
7243 258569 172997 -420021 -623641 -396121 -347693 -586607 -120207 205030 -368636 -296248
7233 -296248 -138783 -211961 -198616 -400455 -267195 37389 -200707 -193104 -171445 -192520 -423180
7222 -423180 -74349 102427 -265533 11261 -120093 -501559 -404384 -335413 -718720 -632465
7212 -632465 53078 -451671 -604482 -646221 -935916 -1025950 -1215744 -458967 -345816 33224
7202 33224 15654 -174594 101448 49186 -130455 -93312 -689039 -277591 -310948 -623179 -271815
7191 -271815 -564889 -405676 -338204 -113064 84332 -75720 144183 -353101 -528962 -689587
7181 -689587 -645867 -296253 -62481 300357 233992 302548 -192312 -190466 -270440 -227394 -343827
7170 -343827 -331569 -514687 -221893 -363835 -224154 -52592 128616 174465 28660 -467137
7160 -467137 -362129 -83805 -312156 -442641 -185931 -450333 -491997 -253791 -315260 -389105
7150 -389105 -393648 -258856 8658 154647 -205202 -418868 -581172 -597266 -115176 72751
7140 72751 -124165 -28522 -593235 -776755 -497572 -271307 116041 -24077 202154 122594
7130 122594 -170015 -162416 -89949 -92529 -312599 -473198 -412543 -81097 333698 -76576 -392934
7119 -392934 -152938 -487283 -380502 -400090 -421087 -786122 -801471 -479619 -522954 -611287 -518864
7108 -518864 -443748 -147695 -163186 -607764 -85402 -210613 -357948 3396 294754 44112
7098 44112 -344917 -143647 -145282 198909 -161669 -820683 -564916 -501140 -531819 -572364 -240845
7087 -240845 -110714 -178867 -367949 -599939 -360577 -366272 -39367 -25705 -136352 -7246
7077 -7246 -204043 -296603 208160 21740 -126906 -193448 -304977 -348057 16942 181610 207299
7066 207299 380479 402884 -267110 -216579 -473581 -98485 -177318 -124425 343527 51058
7056 51058 352954 131825 -262225 -360154 -139298 -33645 -101768 -254305 -290575 -2346
7046 -2346 -135637 -294721 20858 -116579 -268919 -56507 -47629 200602 132750 -120829 -89150
7035 -89150 -133433 187600 -1160 -189832 -108222 42208 154335 204333 119013 -385335 -971401
7024 -971401 -499359 -127213 -73064 -376816 -255502 83087 332819 -86037 -200895 247020
7014 247020 40225 -125976 -86688 235374 78470 48289 123091 -52950 -202758 105298
7004 105298 -186565 -438520 -125186 -526215 -688008 -374266 -159732 -18143 -269643 -53642
6994 -53642 30500 65222 159936 1207 -232105 -478912 -33407 -13442 58654 111004 -577029
6983 -577029 -558425 -198826 -258063 -314679 -367066 -492400 -57858 62355 -24670 -316814 -279875
6972 -279875 117184 -101628 -12807 -21505 -181430 -213558 -383852 -408589 -32365 -85994 -17486
6961 -17486 -122541 -154627 25045 72726 -384523 -671818 -333426 -230780 -295604 27940
6951 27940 18354 -23105 -54464 -124128 -225294 74655 -82902 -205483 236825 184936 38825
6940 38825 267390 16602 158270 -133967 -226720 237835 40584 34748 377446 -32695
6930 -32695 3923 345103 -333924 -174600 -316236 -12862 165461 153156 95978 -302043
6920 -302043 -274076 -429699 -314958 -331608 -472087 -135032 27673 157541 -174921 -229699
6910 -229699 -164837 11889 -40825 -58731 -383788 -350023 -178202 141188 373179 259577
6900 259577 344373 20785 -207330 -132198 -128823 -64935 94577 239594 315814 -130842 -149750
6889 -149750 414901 649281 418033 6919 -219179 -113876 208161 347817 79936 -27414
6879 -27414 200673 420377 -231862 -361304 -68668 -106228 -78963 425572 328237 -232936
6869 -232936 -33683 40458 -234319 -63747 151665 96468 280416 225441 228577 227721 319259
6858 319259 454625 28608 131819 15365 350057 299667 49761 -317862 -102605 -14449
6848 -14449 -247615 76085 -100411 128512 -143539 -97027 -171726 -32254 531730 753810
6838 753810 279940 -309339 41078 -4374 241491 316124 440655 31230 -175553 -39323
6828 -39323 11860 -90431 -96996 324645 91600 -32146 429633 91186 -168370 103475
6818 103475 -301128 161940 460313 800001 355514 100180 743 69517 -169628 -399505
6808 -399505 -645400 20827 293978 247608 285420 380626 366936 673437 576129 567796 175915
6797 175915 -80174 386863 615169 250328 59216 429900 572456 300382 -85499 196580
6787 196580 -139540 149660 96195 387882 607741 767272 643098 497515 253701 346273
6777 346273 516254 784803 264811 86471 353621 349597 610505 630186 559400 214419
6767 214419 374965 504440 418794 -166631 160400 276793 205066 660717 664988 563766
6757 563766 625364 605279 497459 227897 144191 344920 36374 254597 196072 432870
6747 432870 360811 11945 526328 541585 660050 890032 733669 665363 1005202 1036227
6737 1036227 613622 852826 1166443 915350 811272 775311 379460 280233 437924 786322
6727 786322 518016 554467 821770 899214 972315 745981 793949 1198236 567373 539836 764467
6716 764467 878125 1485854 1332240 1090270 934118 1125419 1507467 1191237 968931 1007383
6706 1007383 589260 721912 667466 621680 988789 900755 1219052 1288250 1241469 1352506
6696 1352506 1258521 1583594 1423188 1305503 1217101 1065766 1428194 1531812 1310126 1357306
6686 1357306 1915108 1734824 1685819 1698479 1665673 1551876 1371816 1136164 1443765 2105976
6676 2105976 1936432 1443971 1708374 1814934 1610344 1750050 1281120 1375093 1810565 1524054
6666 1524054 1734687 1734626 1333608 1640609 1265222 1047737 1491078 2049748 1494729 1497478 1497852
6655 1497852 1931558 1791906 1684370 1635339 1722198 1799936 1477670 1698624 1741958 1770611
6645 1770611 1489287 1201651 1245172 1470343 1583602 1786432 1804182 1759290 1776824 1626462
6635 1626462 1088508 985308 1540786 1483657 1877220 1883893 1503962 1632711 1412757 1716539
6625 1716539 1854165 1969681 1543396 1527091 1998774 1767665 1563562 1522735 1272217 1642036
6615 1642036 1926701 1974611 2121328 2163812 2187689 2005597 1793120 1704518 1525795 1910032
6605 1910032 1986599 1989871 1741819 1456816 1720069 1794800 1610784 1536297 1821995 2011100
6595 2011100 1772804 1798164 1774172 1785275 2135190 2435713 2483435 2302027 2369227 2203052
6585 2203052 2021451 2013321 2178747 2251501 2404915 2166607 2301169 2211191 2128664 2361719
6575 2361719 2541277 2370722 1803912 1921323 2465790 2617929 2168387 2278916 2082417 1864361
6565 1864361 2045974 2640617 2989939 2840785 2993903 3054494 2776832 2284595 2197525 2350910
6555 2350910 2725584 2777439 2706436 2767544 3131358 3361721 3589722 3164191 2957056 3222735
6545 3222735 3200171 3254562 3268955 3011288 2985368 3062205 3321813 3388487 3345532 3279393 3491904
6534 3491904 3646216 3546124 3645351 3486972 3627380 3785980 3890740 4078434 4229403 4395356
6524 4395356 4543268 4435843 4764235 4879278 4904617 4961687 4904805 4777623 4551861 4617770
6514 4617770 4819154 5218118 5028502 5098947 5343038 5510638 5628559 5516087 5213528 5463404
6504 5463404 5602413 5629119 5737783 6021777 5966096 5812945 6183209 6533197 6374811 6207111
6494 6207111 6299887 6487191 7035669 7002454 7272579 7565988 7806311 7711181 7916310 7758828
6484 7758828 7894913 8126702 8434944 8936218 9117413 8942174 9035795 8994521 9467007 9743393
6474 9743393 9651113 9929188 10211051 10435944 10423329 10353874 10795863 10863516 11032504 11437818
6464 11437818 11869356 12137764 12426801 12397488 12723137 12925140 12743085 13348278 13607107 13627053
6454 13627053 13843673 14073765 14522738 14948140 15392146 15580443 15640095 15730302 16173195 16527246
6444 16527246 16923755 17555805 17808371 18807557 18994177 19275110 19698597 20043314 20674276
6435 20674276 21264465 21418011 21585850 21984606 22807390 23081340 23411904 24778064 25323613
6426 25323613 25685095 26410314 27178224 27771144 29006138 30016629 30922888 32065386 33202298
6417 33202298 34590253 35849064 37442807 39527424 41230277 42989363 45635449 48548905
6409 48548905 51981450 55942649 60386515 65656619 71844260 78564249 84587399 89674289
6401 89674289 92592040 91498025 87744353 82081577 76520923 71263276 68222013 65705852
6393 65705852 63889783 63399386 63087436 63444716 64726821 66367158 68189821 70889830 74823013
6384 74823013 79825567 85192309 91570742 99848749 109333510 120169237 133019651 146915377
6376 146915377 160192899 169561208 172566729 167240116 153796413 136227557 118971308
6369 118971308 105184926 94476698 86542948 80701229 76282908 72997016 70744572 68964860
6361 68964860 67802849 67413807 67707492 69183165 71728258 74382957 77917501 82505863
6353 82505863 87718989 94222456 101966637 108390580 114115649 117953469 117223904 112200455
6345 112200455 103489615 93383370 83319073 74595783 67247656 61621866 56898695 52926515
6337 52926515 49642237 47172054 45298508 43602529 42300453 41312372 40400563 40004712 39655871
6328 39655871 39868202 40391874 40495671 40719829 41038698 41347560 41710261 42110527 41823409
6319 41823409 41287325 40259777 38104140 35835188 33674468 31934138 29831834 28613632
6311 28613632 27327818 26335045 25682497 24775340 24625754 24499030 24404848 24760740 24912537
6302 24912537 25488942 25851285 25926989 25907881 25436446 24287828 23786408 23286992 22966412 22289858
6292 22289858 21838162 21011542 19769116 18727439 17624160 16627521 16204809 15814587 15190630
6283 15190630 14782813 15045551 14723692 14575219 14734226 14634030 14712675 15295837 15673363 15259466
6273 15259466 15161585 14995976 15224631 14793876 13844445 13515742 13398384 13141577 12769058 12569152
6263 12569152 12520801 12087180 11848929 11321281 10800965 10812105 10579878 10634935 10839113 10681568
6253 10681568 10910941 10861899 10849652 10498480 10324506 10563126 11262427 11772196 11987506 11823146
6243 11823146 12162177 12783280 12672445 12385258 11836250 11079145 10788477 10661351 10578608 10182533
6233 10182533 10094576 9988069 9982328 10041062 10248503 10117708 9759319 9715360 10264572 10326179
6223 10326179 10380288 10855452 11422152 12038403 12464102 12947280 12967360 12551763 12053979 11220358
6213 11220358 10719366 10174943 9683008 8828016 8059982 8012217 8265415 8437528 8672714 8379274
6203 8379274 8108525 8076881 8051005 7714207 7880336 7734642 8236118 8449595 8436934 8504307
6193 8504307 8301968 8623115 8982570 9129913 8727802 8364421 8216822 7748356 7664553 7374857
6183 7374857 6948767 6658475 6492012 6567559 5812026 6046335 5890219 6027340 5962982 5793332
6173 5793332 6233101 5625533 5501804 6120324 6318839 6519993 6454779 6395962 6271794 6272009
6163 6272009 5814903 5971852 6200198 5908460 5598325 5688185 5848387 5929204 5639601 5634849
6153 5634849 5714191 6025470 6350255 6555313 6450501 6595638 6657917 6275735 6240797 6073093
6143 6073093 6195253 6350930 6484310 6841531 6542306 6504690 6690158 6928849 7155869 7268363
6133 7268363 7227616 7399159 7210739 6994431 7039492 7094483 7200951 7237450 6950479 6832596
6123 6832596 7028258 6947825 6839915 7652316 7604976 7847995 8037913 7780768 7754203 7752587
6113 7752587 7827328 7788902 8176235 8068174 8586628 9274139 9431366 9383743 9758540 9750578
6103 9750578 10038691 10440799 10613115 10984967 11171278 11891167 12228241 12297462 12318732 12274233
6093 12274233 11720170 11255192 11374914 11624378 11582456 11299920 11594007 11875428 11929776 12037853
6083 12037853 12072566 12255934 12887540 13400977 13810297 14256056 14480478 14979746 15879074 16546865
6073 16546865 17330787 17822804 18739433 19369785 19702551 19671164 19351384 18570233 18192058 17788889
6063 17788889 16869648 16714014 16647993 16393727 16437831 16518955 16768499 16933146 16793488 16908595
6053 16908595 17467108 17180229 17277302 18017444 18500487 19186528 19952752 20054031 20713845 21550675
6043 21550675 21826023 21841836 21973780 22169702 22192546 22339186 22153517 22299354 22754326 22750021
6033 22750021 23107158 23309885 23554295 23623508 23513184 23378903 23890966 24409832 24295004 24557997
6023 24557997 24926522 25940292 26369521 27119862 27762077 28596040 29103831 29893865 30916043
6014 30916043 32127178 33102534 34082769 35633269 37066788 38201644 39960677 42183144
6006 42183144 44038362 46396690 49115790 52169787 55312212 59192712 64167992 69404474
5998 69404474 74979570 81718071 87500354 92098946 94314261 94037167 91158028 86918816
5990 86918816 82180863 77915701 74463703 71773393 70287003 69682216 69357247 69094599 69389378
5981 69389378 70539912 72813680 75457935 78823046 83513024 88964513 95249869 103117514
5973 103117514 112408532 123650139 136088988 149216806 162037364 171159498 174036431
5966 174036431 168882394 157646545 143258145 128409641 114667412 103403987 94917413
5959 94917413 88611462 83163974 78884087 75155417 72036549 69840789 68543421 68519311
5951 68519311 69022406 70160364 71683338 74526824 77690517 81482348 86279768 92364178
5943 92364178 97923728 102356219 104304972 102706173 97468848 89766023 81641467 73666569
5935 73666569 66255342 60638984 55945972 51873861 47455986 44329890 41859093 39679609
5927 39679609 37609921 35999396 34518292 33354272 32218914 31269934 30029176 28817587
5919 28817587 27609077 26000020 24831504 24185115 23784382 22954534 22388792 21923692 21509733
5910 21509733 21300497 21103757 21107202 20925633 20361238 20287059 20489168 20564166 20129466 19857625
5900 19857625 19869140 20227161 20337051 20345411 19954774 19432481 19107640 19246375 18832830 18725449
5890 18725449 18679519 18677259 18480575 18121379 18147242 18242764 18042645 17886216 18248660 18135648
5880 18135648 18207259 18151660 17899647 18294957 18948423 18785640 18930377 19393853 19547106 19344835
5870 19344835 19340974 19152882 19529342 20271120 20285565 20427974 20983771 21397630 21378574 21775246
5860 21775246 22380136 22810245 22783027 23086297 23504231 23599365 24033948 24899609 25512924 25814393
5850 25814393 25875710 26285029 26782359 27203207 27735221 28379925 28732960 29404543 29727451 30106408
5840 30106408 30538061 30685646 31474844 32388451 33036797 33986558 34565918 35962650 37401504
5831 37401504 38063771 39241738 40354948 41466089 43095858 44817804 46677774 48442691
5823 48442691 50674170 53321054 56395134 60110283 64090491 68650156 73804316 79966182
5815 79966182 87423962 95309340 102875112 109271794 112781658 111579476 106361397 98793424
5807 98793424 90914202 84558974 79940294 76876190 74717930 73708579 73348329 73442954 74304912
5798 74304912 75736889 77865311 81327265 85302182 89880432 95895787 102585378 111326566
5790 111326566 121926110 134449814 149562925 165484350 180692518 191502257 193223668
5783 193223668 184032272 167821271 149514683 132418265 118410053 107548864 99501901
5776 99501901 92837978 88459875 85235752 82833410 81493608 80475378 80722575 81548685
5768 81548685 82937782 85309920 87950121 91845883 96521283 101942058 108061640 114941258
5760 114941258 122491911 129653354 133501605 133392918 128510389 119228364 109260357 98692623
5752 98692623 90481991 83602125 78063474 74313156 71578043 69374377 68249727 67185317
5744 67185317 66255374 65703734 64895893 64288788 63464046 62966604 62656833 61969815 62257279
5735 62257279 62047076 61886156 62279111 62265238 62173220 61487657 60776412 59290613 57148616
5726 57148616 55735869 54140583 53306878 52773550 52221034 52095239 52314301 52535087 51550885
5717 51550885 49995832 48110023 46328081 44817021 43552005 42505049 41410355 40686628
5709 40686628 39734868 39329811 39086879 38871979 38929074 38888038 38968114 38931772 38899236 38468848
5699 38468848 37668111 37186080 36949246 36460641 36539668 35884991 35364745 35118432 34332472 33423764
5689 33423764 32319916 31371516 30699874 29803355 29143249 29371789 29386186 29207607 29083029
5680 29083029 29221225 29036514 29090487 28784118 28848162 29198485 29082899 28834829 28070574 27712046
5670 27712046 27377387 27470013 27287239 27203850 27104161 27753311 27937209 28388174 28744765 28353995
5660 28353995 28668325 28305721 27825095 27717949 27672436 27517393 27726345 27805992 27854487 27736407
5650 27736407 27716691 27929553 28173138 28347844 28349857 28735789 29026770 28998578 29315972 29834096
5640 29834096 30296917 30059806 30551417 31125499 31357579 31640528 31381051 30771301 30415298
5631 30415298 29914425 29554631 29529508 29058475 29111110 28880091 29058826 29423089 29998812 30961374
5621 30961374 31903779 32556190 33429477 33459736 32919804 32448625 31997350 31783727 31644592 31186935
5611 31186935 31011369 31466387 31708928 31350965 30937025 30762935 30550192 30237834 30611290
5602 30611290 30725143 30950112 31262452 31637103 32185448 32067217 32349837 32752268 33632887
5593 33632887 34434286 35236651 36343181 36507056 36540482 37048403 37211614 37293571 37342376 37678809
5583 37678809 38645375 38986042 39018387 38940360 39678815 39903505 40399098 41463693 41898910 42195165
5573 42195165 42719309 43779018 44489935 45040013 45916201 46635748 47869866 49180692 50093936
5564 50093936 51498677 52911409 54763699 56406831 58277182 60385282 62660379 65222239
5556 65222239 67821412 70070889 72599250 75173058 77951786 81457761 85758851 90723062
5548 90723062 96524373 103341058 110825419 119747911 128267586 134644215 137754816 136971768
5540 136971768 132620582 125388853 117570793 110624858 105810068 102466017 100364787 100049969
5532 100049969 100657970 101570715 103073931 104538515 106221864 108230146 111323824 115768498
5524 115768498 121130554 127892976 136249899 146742631 158815145 174053409 190289105
5517 190289105 203650611 212962629 212981751 202064832 185449961 166932102 150546554 137603526
5509 137603526 127324860 119079120 113182749 109111355 105909299 103683344 102231696 101123080
5501 101123080 100443241 100743792 100688711 101371294 103230043 105940773 109162034 113067432 118098419
5492 118098419 123789916 129306774 133637923 135882499 135021418 130338487 123848632 116069130
5484 116069130 108692863 102740334 97775623 94070426 91502793 89309537 87572999 86467688
5476 86467688 85971986 85751331 85982344 86447033 87093786 88255249 90724995 92946199 95294099
5467 95294099 97999755 100117582 101583151 102602893 103778569 105272160 107011620 108928718
5459 108928718 110947124 112433939 113342859 114796485 116449314 118781513 122381156 126457160
5451 126457160 130989449 135727566 139668685 142369106 143083409 142157182 140472759 139614274
5443 139614274 140596306 142711316 145136020 147804096 149770936 151800028 155566070 161047324
5435 161047324 168863642 176690379 184230963 189138589 188885422 186549122 185419081 186405260
5427 186405260 190316568 196321757 201944604 204783836 204328638 200198474 193288661 182897267
5419 182897267 171114468 159329503 149257207 141604757 136250034 132508640 129519176 127971462
5411 127971462 127834303 128473070 130170805 133218831 137147506 141095238 146648417 153473289
5403 153473289 160910813 169652635 178806953 186918781 192956125 195139565 194044897 189864824
5395 189864824 182959643 174684385 167294613 161685376 159274202 158399055 158046969 156691065
5387 156691065 152520891 146818511 141970246 140222719 140029963 141664805 144388168 146477036
5379 146477036 147904577 149084470 150257911 152048576 154501500 155378892 153770849 148387289
5371 148387289 140631740 132783980 124829540 117579934 111520473 107122484 104122595 102510576
5363 102510576 101155342 99237383 97150230 94536933 91930529 90196691 88488767 88076483
5355 88076483 87001882 84452243 80966813 76500175 71755793 67777607 64701698 61851983
5347 61851983 59018571 57038718 54974331 52920157 50846274 49121931 47900556 46525880
5339 46525880 45186604 44698000 44066532 43096637 42442704 41642725 40826845 40067045 39348019
5330 39348019 38432094 37706203 37042973 36211127 36184236 36046438 35722282 35304419 34507402 33708339
5320 33708339 33086222 32008021 31397716 30242177 29176615 27931299 27074850 26595935 25994659
5311 25994659 25472495 25292686 24728944 24585376 24959131 24754757 25117172 25270702 25420245
5302 25420245 25678305 26290134 26828437 27809735 28141334 28819645 28875878 28207113 27112259
5293 27112259 25811402 24234304 22738442 21810403 21240530 19886085 18890830 18661489 17908677
5284 17908677 17354956 16973507 16763556 16318273 16549356 16693011 16465988 16171262 16520298
5275 16520298 16843053 16836794 16632520 16527691 16403056 16594870 16361603 15740445 15660267 14870647
5265 14870647 14238625 13888847 13707625 12889044 12108384 12454757 12151582 11905759 11433029
5256 11433029 10984994 10862181 10764816 10283960 9875295 9615425 9072847 9378479 9403480 9040980
5246 9040980 8957100 9386203 9345031 9300450 9326696 9114397 9072455 9246884 9151212 9378127 9181506
5235 9181506 9005497 8831191 8657909 8580795 8094162 7885023 7739570 8066065 8291801 8194063
5225 8194063 7757483 7788889 7768452 7961175 8185942 8119046 7430877 7118325 7351397 7528668
5215 7528668 7279307 6974326 6930801 7138524 7240580 6941052 6931630 6866090 7267985 7315548
5205 7315548 7638983 7373271 6761167 6943788 7081432 6612520 6526727 6540870 6523803 6549048
5195 6549048 6635251 6884846 6908940 7112220 7010038 6692000 6604513 6393072 6493841 6524570
5185 6524570 6569556 6202399 5943452 6189538 6519169 6655626 6609010 6674845 6253396 6050319
5175 6050319 6135951 6268993 6107762 5898578 5881225 6124946 6110918 5893626 6408168 6704612
5165 6704612 6283507 6061090 6393906 6439779 6527526 6614513 6520377 6781084 6941882 7074887
5155 7074887 7321859 7317362 7264748 7011057 7509860 7571094 7435309 7290823 7448403 7281399
5145 7281399 6984939 6739272 6751818 7332595 7249595 7193980 7691831 7925751 8091983 8138215
5135 8138215 8078817 7968476 8011504 8564296 8751176 8915780 8272328 7852464 7423039 7446384
5125 7446384 7847575 7642845 7045954 7505524 7335154 7131818 7317553 6885075 6960725 6733608
5115 6733608 6670851 6842880 6578224 6810183 6905917 7330052 7085472 6976181 6812678 6567726
5105 6567726 6642835 6710510 7024458 6761229 6392269 6714764 6344569 6036259 5999235 5620383
5095 5620383 6052691 5865244 5906078 6079963 6126522 5753599 6026200 5882828 6299233 6457600
5085 6457600 6121602 6236124 6350161 6392667 6327680 6426101 6332485 6302493 6190101 6304541
5075 6304541 6262813 5876969 6246105 6103620 6090875 6055182 6166178 6322656 6264413 6857623
5065 6857623 6572209 6355490 6785524 7019745 6840359 7073608 7074679 6701036 6436282 6808839
5055 6808839 7098320 7662600 7383777 6921071 6695398 6761556 6556649 6736558 7013475 7389344
5045 7389344 7694128 7397042 7670476 8035710 7703194 7290492 7384167 7489749 7668392 7742323
5035 7742323 7970232 7779602 7520001 7565909 7595597 7724113 8069821 8190369 7550493 7448567
5025 7448567 7644114 7782970 7830370 7751379 7522898 7696684 8020904 7957816 7775368 7701023
5015 7701023 7420379 7513712 7906510 8015382 8042583 8040908 7926474 7999601 8106705 8179274 8595537
5004 8595537 8909136 8205730 8387650 8924610 9219641 9008698 9000661 9201606 8924285 9602230
4994 9602230 9121997 9049459 9028169 9404275 9508269 9223031 8826542 8618984 8831428 9048206
4984 9048206 9436866 9498633 9249195 9110517 9163575 9852630 9907181 9799446 10141960 10221174
4974 10221174 9809396 10031085 10471790 10289693 9569484 9487598 9956069 10086484 10489068 10250676
4964 10250676 10272787 10325340 10656665 10688414 10246706 10396225 10098519 10246431 10207741 10315476
4954 10315476 10297570 10703622 10732205 10745218 10433918 10398672 10521134 10868486 11186744 10352223
4944 10352223 10456275 10614533 10625114 10842333 10916846 10998976 10670067 10476496 10469642 10178816
4934 10178816 10424321 10482069 10367978 10314470 10257708 10324685 10640802 10626417 10580468 10386174
4924 10386174 10637909 11042302 11153177 11031768 11147773 11446362 11194340 11385576 11369691 11272865
4914 11272865 10999012 11102512 11638263 11688459 11667379 11715527 11950780 11932187 12077875 11785241
4904 11785241 12114403 12221019 12391197 12242266 12078443 12140948 12016065 12222270 12716552 12995630
4894 12995630 12991716 12650981 12334952 12460599 12222155 12532538 12550866 12686419 12884199 12846035
4884 12846035 13378505 13739330 13577451 13264722 13184404 13678714 14121291 13879387 14066216 14648073
4874 14648073 14793514 14672906 15138937 15391261 15303585 15465840 15416462 15749618 15865371 16309972
4864 16309972 16516298 16907924 17033638 16954451 17327099 17549786 17757362 17947196 18352872 18618547
4854 18618547 18739944 18903800 19113122 19670103 20267815 20136232 20139475 20372904 21032340 21067475
4844 21067475 21625240 21919548 22339541 22698099 23462732 23654460 24035010 24525862 24934408
4835 24934408 25419901 25991006 26697545 27040556 27801163 28403786 29098675 29449017 30095307
4826 30095307 30689409 31776243 32616385 33322130 33866070 34614632 35674459 36703578 37392870
4817 37392870 38470730 39502999 40201572 41343349 42455927 43439016 44310771 45791772 46912390
4808 46912390 48470612 50013152 50818658 52098377 53590690 55291946 57374526 58909403
4800 58909403 61275825 63986830 66455726 69164391 71710649 75392540 78806977 81876683
4792 81876683 85420560 89194285 92935932 96086121 99107326 102852687 106330335 109692670
4784 109692670 112714791 115695196 117612368 118956766 120291923 121698933 123060946 124629442
4776 124629442 126711870 129127286 132242258 136082784 140049299 144369685 150170673 155796738
4768 155796738 162160555 169289361 176812040 184309102 191988629 199696835 205555028 210073779
4760 210073779 213186167 215278417 216823057 217923592 216892005 215483255 214362798 212285402
4752 212285402 210567977 209656328 208118988 206520063 205639349 205535090 205276551 205648945 206863143
4743 206863143 207795034 208951777 210887423 212512747 213141247 214041814 214162732 213055396 210146079
4734 210146079 206282653 201479212 194704282 186620711 177843877 168932054 160185273 152783396
4726 152783396 146371636 140164079 134605552 129658514 125282872 122251095 119676144 116986027
4718 116986027 115344795 113530271 111544648 109993170 108912676 107355623 105628284 103320631
4710 103320631 101062482 98515380 95226017 92285221 89259985 86197680 82710786 79730350
4702 79730350 76409633 73275031 70859983 68169752 65293714 62836789 60869979 58995367
4694 58995367 56840484 55026250 53548668 51872359 50189813 48720041 47075567 45602008
4686 45602008 44193610 42912850 42047740 40817514 39920369 38777061 37550993 36423031
4678 36423031 35818665 35129513 33935684 33111087 32911021 32390097 31723562 31077544 30472981
4669 30472981 29633865 28806603 28134110 27630130 27259217 26795190 26326595 25610957 24878536
4660 24878536 24412074 23632641 23154284 22912117 22573397 22264306 21982495 21255892 20742800
4651 20742800 20607396 20346333 19934216 19344047 18758184 18890655 18600046 18294673 18042545
4642 18042545 18128337 18168281 18095111 17896599 17794953 18047664 17989998 18122710 17914183 18114498
4632 18114498 18307817 18064536 17843266 17781790 17529973 17588700 17230274 16970593 16758378 16369955
4622 16369955 16425636 16141695 15418855 15000708 14547720 14224796 13976093 13644309 13847796 13200160
4612 13200160 13411969 14102503 13658451 13769246 13473756 13227309 12911162 13430318 13394119 13176254
4602 13176254 12888822 12438425 12346378 12353762 12307068 12320701 12538962 12111130 11589056 11412523
4592 11412523 11084764 10748288 10237093 10561372 11018324 10965219 11086225 10699001 10146363 10012894
4582 10012894 9985623 10288073 10337551 10435241 10306989 10118272 10642816 10501785 10543785 10650041
4572 10650041 10806527 10927521 11303795 11425337 11056491 10729341 10920704 11890098 11991936
4563 11991936 12300356 12665056 12641863 12687067 12686363 13141471 13250367 13614305 13521628 13925564
4553 13925564 14297944 14161026 14871483 14472480 13890465 14417655 14774940 15136538 15343110
4544 15343110 15099740 15354381 15342300 15816151 16058625 15892857 16492402 16517423 16837639 16694425
4534 16694425 16620588 16771724 17138188 16857373 16767214 16392649 16084011 15765565 15471717 15059729
4524 15059729 14410224 14263654 14426097 14289331 13536800 13195762 12916263 12857488 12903271 12746858
4514 12746858 12437966 12677144 12433743 12373049 12337391 11677596 11346730 11241832 11157525 11441587
4504 11441587 11013373 10508205 10162087 10048182 9646888 9385394 9158319 8607930 8608068 8645211
4494 8645211 8485955 8403597 7873795 7648268 8090200 8234836 8166883 7901452 7498040 6988991
4484 6988991 7487744 7891420 7206682 6981483 7352235 7024998 6602619 6844159 7226760 6920203
4474 6920203 7229595 7174973 6355510 6474705 6623384 6404051 6407042 6311933 6259942 6459957
4464 6459957 6432710 6148747 6172288 6359780 6268162 6298720 6455126 6433338 6574451 6474222
4454 6474222 6222033 6196539 6411765 6408518 6426550 6323649 6248537 6275671 6378858 6168603 5850116
4443 5850116 6260776 6097386 6017123 5644893 5808007 5703020 5657412 5664857 5894276 5854128
4433 5854128 5796345 5921962 5996410 5963669 5780428 5743689 5858931 6347703 6391087 5974227
4423 5974227 5792912 5673058 5817916 5959038 6037737 5852752 5626517 5548258 5233340 5284991
4413 5284991 4898731 4794555 5362189 5232793 4998216 4990169 5085824 5027584 5208685 5340028
4403 5340028 5573109 5495786 5523185 5437401 5157370 4997924 5071060 5538065 5268156 5184259
4393 5184259 5256144 5258010 5314502 5442666 5829708 5729785 5303374 5389346 5614784 5838790 6068320
4382 6068320 6139290 5592862 5725129 5789551 5764133 5565758 5696128 5384110 5732335 5977791
4372 5977791 6125545 5931836 6014724 6026354 6003782 6073646 5931663 5861270 5898905 6305321 6703447
4361 6703447 6651872 6299977 6315338 6493591 6671464 6635948 6621645 6639163 6933148 6509547
4351 6509547 6254650 6553908 6846674 6963679 6943416 6473785 6805731 6969827 6761900 6855685
4341 6855685 6665458 7261178 7101137 7122823 7082460 6741810 7169407 7440673 7196730 7490707
4331 7490707 7621440 7653718 7624716 7466540 7855936 7627341 7476222 7393288 7693513 7762164
4321 7762164 7488855 7330159 7623896 7254206 7399838 7391143 7228252 7247267 6543200 6424660
4311 6424660 6403811 7096234 7212802 7507944 7080482 6640017 6946811 6874557 6976635 7138380
4301 7138380 7687295 7610404 7184233 7138943 7106277 6941296 7222256 7267519 6995679 6762528
4291 6762528 6847952 6773273 6945466 6945597 7055761 6957452 7176452 7181341 7493610 6884242 6871482
4280 6871482 7200580 6955164 7091851 7458711 7574734 7341539 7334717 6651203 6569050 6897161
4270 6897161 6647292 6626746 6827345 6858845 7174316 6931619 6872220 7135992 6890426 6512685
4260 6512685 6697040 6751311 7215067 7360674 7093981 7312439 7167536 7232165 7603852 7916344
4250 7916344 7752418 7439193 7415737 7073497 7043199 7173041 7161051 7534721 8101502 7882717
4240 7882717 7618696 7317585 7188422 7276491 7535930 7413235 8225473 7992945 7655177 8027464
4230 8027464 8080792 8292396 8208095 8291326 8335437 8818153 8519530 8162701 8487813 8812130
4220 8812130 8477010 8560383 8588986 8669915 8661584 8915049 8998725 9218215 9120949 8862042 8706130
4209 8706130 8655719 8763268 9152248 9715676 9590481 9319677 9463212 9636956 9667302 9447834
$$ [...]
##END NTUPLES=NMR SPECTRUM
##END=
