##TITLE=1H_EC-3306(12)
 CDCl3
 8 sc, 
 18.12.2023
##JCAMPDX= 6.0         $$ Bruker NMR JCAMP-DX V2.0
##DATA TYPE= NMR SPECTRUM
##DATA CLASS= NTUPLES
##ORIGIN= UXNMR, Bruker Analytische Messtechnik GmbH
##OWNER= root
$$ XWIN-NMR		Version 3.5
$$ Mon Dec 18 13:59:11 2023 Russian Standard Time (UT+4h)  she@DPX200
##.OBSERVE FREQUENCY= 200.1313
##.OBSERVE NUCLEUS= ^1H
##.ACQUISITION MODE= SIMULTANEOUS
##.ACQUISITION SCHEME= undefined
##.AVERAGES= 8
##.DIGITISER RES= 18
##SPECTROMETER/DATA SYSTEM= spect
##.PULSE SEQUENCE= zg30
##.SOLVENT NAME= CDCl3
##.SHIFT REFERENCE= (INTERNAL, CDCl3, 0, 15.3326)
##AUDIT TRAIL= $$ (NUMBER, WHEN, WHO, WHERE, WHAT)
$$ ##TITLE= Audit trail, XWIN-NMR		Version 3.5
$$ ##JCAMPDX= 5.01
$$ ##ORIGIN= Bruker BioSpin GmbH
$$ ##OWNER= she
$$ F:/spectra/data/she/nmr/H-F/1/pdata/1/auditp.txt
$$ ##AUDIT TRAIL=  $$ (NUMBER, WHEN, WHO, WHERE, WHAT)
(   1,<2023-12-18 13:57:59.17 +0400>,<she>,<DPX200>,
      <created by zg, POWCHK disabled, PULCHK disabled
       configuration hash MD5:
       00 E9 B6 7A A2 85 ED C7 34 08 36 98 17 FE 4E 26
       data hash MD5: 16K
       22 93 BE 49 76 C6 AA D2 00 56 F7 C3 0C 39 2F 0A>)
(   2,<2023-12-18 13:58:01.39 +0400>,<she>,<DPX200>,
      <Start of raw data processing
       efp BC_mod = 2 LB = 0.24 FT_mod = 6 PKNL = 1 PHC0 = -24594.17 PHC1 = 13.25272 SI = 16K 
       data hash MD5: 16K
       EA 5F AB FE 9B 79 FD CB 09 B8 B1 34 9E D7 1A FD>)
(   3,<2023-12-18 13:58:20.29 +0400>,<she>,<DPX200>,
      <pk PHC0 = 4.072989 PHC1 = -2.4 
       data hash MD5: 16K
       66 5F C0 CD A1 FA 72 C1 4C CD 06 45 D7 96 0D 11>)
(   4,<2023-12-18 13:58:25.28 +0400>,<she>,<DPX200>,
      <abs ABSG = 5 
       data hash MD5: 16K
       1F 5C A3 41 7E C2 E4 3C 62 47 6C 2D CE 51 3A FA>)
$$ ##END=
$$ 
$$ hash MD5
$$ A0 1E 73 4C 1A D9 88 6C 78 22 EF AE 0B AC 81 D6
##$RELAX= 
##$RELAX= 
##$RELAX= 
##$RELAX= 
##$RELAX= 
##$RELAX= 
$$ Bruker specific parameters
$$ --------------------------
##$DU= <F:/spectra>
##$EXPNO= 1
##$NAME= <H-F>
##$PROCNO= 1
##$TYPE= <nmr>
##$USER= <she>
##$AMP= (0..31)
100 100 100 100 100 100 100 100 100 100 100 100 100 100 100 100 100 100 
100 100 100 100 100 100 100 100 100 100 100 100 100 100 
##$AQSEQ= 0
##$AQ_mod= 1
##$AUNM= <au_zg>
##$AUTOPOS= <>
##$BF1= 200.13
##$BF2= 200.13
##$BF3= 200.13
##$BF4= 200.13
##$BF5= 200.13
##$BF6= 200.13
##$BF7= 200.13
##$BF8= 200.13
##$BYTORDA= 1
##$CFDGTYP= 0
##$CFRGTYP= 5
##$CHEMSTR= <none>
##$CNST= (0..31)
1 1 145 1 1 1 1 1 1 1 1 1 1 1 1 1 1 1 1 1 1 1 1 1 1 1 1 1 1 1 1 1 
##$CPDPRG= <>
##$CPDPRG1= <>
##$CPDPRG2= <>
##$CPDPRG3= <>
##$CPDPRG4= <mlev>
##$CPDPRG5= <mlev>
##$CPDPRG6= <mlev>
##$CPDPRG7= <mlev>
##$CPDPRG8= <mlev>
##$CPDPRGB= <>
##$CPDPRGT= <>
##$D= (0..31)
0 1.2 0 0 0 0 0 0 0 0.06 0 0.03 0 0 0 0 0.0002 0 0 0 0 0 0 0 0 0 0 0 0 
0 0 0 
##$DATE= 1702893478
##$DBL= (0..7)
120 120 120 120 120 120 120 120 
##$DBP= (0..7)
150 150 150 150 150 150 150 150 
##$DBP07= 0
##$DBPNAM0= <>
##$DBPNAM1= <>
##$DBPNAM2= <>
##$DBPNAM3= <>
##$DBPNAM4= <>
$$ [...]
##$SUBNAM3= <"">
##$SUBNAM4= <"">
##$SUBNAM5= <"">
##$SUBNAM6= <"">
##$SUBNAM7= <"">
##$SUBNAM8= <"">
##$SUBNAM9= <"">
##$SW= 18.0517328524113
##$SWIBOX= (0..15)
0 0 2 0 0 0 0 0 0 0 0 0 0 0 0 0 
##$SW_h= 3612.71676300578
##$TD= 16384
##$TD0= 1
##$TE= 0
##$TE2= 300
##$TE3= 300
##$TEG= 300
##$TL= (0..7)
0 120 120 120 120 120 120 120 
##$TP= (0..7)
150 150 150 150 150 150 150 150 
##$TP07= 0
##$TPNAME0= <>
##$TPNAME1= <>
##$TPNAME2= <>
##$TPNAME3= <>
##$TPNAME4= <>
##$TPNAME5= <>
##$TPNAME6= <>
##$TPNAME7= <>
##$TPOAL= (0..7)
0.5 0.5 0.5 0.5 0.5 0.5 0.5 0.5 
##$TPOFFS= (0..7)
0 0 0 0 0 0 0 0 
##$TUNHIN= 0
##$TUNHOUT= 0
##$TUNXOUT= 0
##$USERA1= <user>
##$USERA2= <user>
##$USERA3= <user>
##$USERA4= <user>
##$USERA5= <user>
##$V9= 5
##$VALIST= <valist>
##$VCLIST= <CCCCCCCCCCCCCCC>
##$VD= 0
##$VDLIST= <DDDDDDDDDDDDDDD>
##$VPLIST= <PPPPPPPPPPPPPPP>
##$VTLIST= <TTTTTTTTTTTTTTT>
##$WBST= 1024
##$WBSW= 4
##$XGAIN= (0..3)
0 0 0 0 
##$XL= 0
##$YL= 0
##$YMAX_a= 599847
##$YMIN_a= -712901
##$ZGOPTNS= <>
##$ZL1= 120
##$ZL2= 120
##$ZL3= 120
##$ZL4= 120
##$ABSF1= 15.42076
##$ABSF2= -2.631087
##$ABSG= 5
##$ABSL= 3
##$ALPHA= 0
##$AQORDER= 0
##$ASSFAC= 0
##$ASSFACI= 0
##$ASSFACX= 0
##$ASSWID= 0
##$AUNMP= <proc_1d>
##$AZFE= 0.1
##$AZFW= 0.1
##$BCFW= 0
##$BC_mod= 2
##$BYTORDP= 0
##$COROFFS= 0
##$CY= -3
##$DATMOD= 1
##$DC= 0
##$DFILT= <>
##$DTYPP= 0
##$F1P= 0
##$F2P= 0
##$FCOR= 1
##$FTSIZE= 16384
##$FT_mod= 6
##$GAMMA= 0
##$GB= 0
##$INTBC= 1
##$INTSCL= 3.70164e-10
##$ISEN= 128
##$LB= 0.24
##$LEV0= 0
##$LPBIN= 0
##$MAXI= 10000
##$MC2= 0
##$MEAN= 0
##$ME_mod= 0
##$MI= 1.114404
##$NCOEF= 0
##$NC_proc= -6
##$NLEV= 6
##$NOISF1= 3.799351
##$NOISF2= 2.8
##$NSP= 0
##$NTH_PI= 0
##$NZP= 0
##$OFFSET= 15.33261
##$PC= 1
##$PHC0= -24590.1
##$PHC1= 10.85272
##$PH_mod= 1
##$PKNL= yes
##$PPARMOD= 0
##$PSCAL= 0
##$PSIGN= 0
##$REVERSE= no
##$SF= 200.130037843271
##$SI= 16384
##$SIGF1= 3
##$SIGF2= 2
##$SINO= 5.538805
##$SIOLD= 16384
##$SREGLST= <1H.CDCl3>
##$SSB= 0
##$STSI= 16384
##$STSR= 0
##$SW_p= 3612.71676300578
##$SYMM= 0
##$S_DEV= 0
##$TDeff= 16384
##$TDoff= 0
##$TI= <>
##$TILT= no
##$TM1= 0
##$TM2= 0
##$TOPLEV= 0
##$USERP1= <user>
##$USERP2= <user>
##$USERP3= <user>
##$USERP4= <user>
##$USERP5= <user>
##$WDW= 1
##$XDIM= 16384
##$YMAX_p= 281070381
##$YMIN_p= -810537
$$ End of Bruker specific parameters
$$ ---------------------------------
##NTUPLES= NMR SPECTRUM
##VAR_NAME=  FREQUENCY,     SPECTRUM/REAL,   SPECTRUM/IMAG
##SYMBOL=    X,             R,               I
##VAR_TYPE=  INDEPENDENT,   DEPENDENT,       DEPENDENT
##VAR_FORM=  AFFN,          ASDF,            ASDF
##VAR_DIM=   16384,         16384,           16384
##UNITS=     HZ,            ARBITRARY UNITS, ARBITRARY UNITS
##FACTOR=    0.220516191357247, 1,           1
##FIRST=     3068.51584561507, 0,            0
##LAST=      -544.200917390708, 0,           0
##MIN=       -544.200917390708, -810537,     0
##MAX=       3068.51584561507, 281070381,    0
$$ Real data points
##PAGE= N=1
##DATA TABLE= (X++(R..R)), XYDATA
$$ [...]
12254G1993p6774J4206K3555k8777J4602n9353j8249l2573Q0883O1838l2942l3557
$$ 71993 -4781 9425 32980 4203 18805 -40548 -58797 -91370 -10487 51351 18409 -15148
12242a5148o5504j05230m7871N7528N3012l2319P2138M4508p5230j9770K8821
$$ -15148 -80652 -185882 -233753 -176225 -123213 -155532 -83394 -38886 -114116 -133886 -105065
12231a05065Q5480Q3391m2704L1531p9160j25997M1651m2478O6753L5118r7735
$$ -105065 -19585 63806 21102 52633 -26527 -152524 -110873 -153351 -86598 -51480 -149215
12220a49215R5611K8937k2671l36K4401J1697M3549K4126j29433P4087M800j69565
$$ -149215 -53604 -24667 -47338 -47674 -23273 -11576 31973 56099 -73334 753 5553 -164012
12208a64012M1898O1322J35986m5650j28789L1713N4418N8021m8637K3004n0367
$$ -164012 -122114 -60792 75194 29544 -99245 -67532 -13114 44907 -3730 19274 -31093
12197c1093J7603k7798j6327o7045j06487J17961j11347Q9478O8659j850L3933
$$ -31093 -13490 -41288 -57615 -124660 -231147 -113186 -224533 -135055 -66396 -68246 -34313
12186c4313m821n348r0168o487Q7602M7066k6110K2450L1216n0299o2386m0908
$$ -34313 -39134 -44482 -134650 -141137 -53535 -6469 -32579 -10129 21087 -29212 -91598 -132506
12174a32506O7350L9744J2519P4583m3778k5995m4667p2847k9206O598j0326O8412
$$ -132506 -65156 -25412 -12893 61690 17912 -8083 -52750 -125597 -154803 -148205 -158531 -90119
12162i0119j2416m5077L6506R2564m3799N5536Q3523n0145q9588J9386k055q6083
$$ -90119 -102535 -147612 -111106 -18542 -62341 -6805 76718 26573 -63015 -43629 -45684 -131767
12150a31767j0390O3259O5918l9890j5071p4949j3217J25888o1074O997K3000
$$ -131767 -142157 -78898 -12980 -52870 -67941 -142890 -156107 -30219 -91293 -84296 -61296
12139f1296j0529m3438J11897L1201q5487o0360r759Q3101K5711l9681n02K4848
$$ -61296 -71825 -115263 -3366 27835 -57652 -118012 -127771 -44670 -18959 -58640 -59142 -34294
12127c4294J8431p5289j28308L5935J09680o286J45651k0616o9408j0895m8784
$$ -34294 -15863 -91152 -219460 -183525 -73845 -80131 65520 44904 -24504 -35399 -84183
12116h4183J05103j6696n9479O6308j8679m2981J7752K6703n6638m9279k7931
$$ -84183 20920 4224 -55255 11053 -7626 -50607 -32855 -6152 -62790 -112069 -140000
12105a40000m0055J4718J12742L5899m0446P3801K5046L1731k6222j09130J1727
$$ -140000 -180055 -165337 -52595 -16696 -57142 16659 41705 73436 47214 -61916 -50189
12094e0189q8862j6588O9083M742L0520r0693k7635N2961J74261n7319k131L1988
$$ -50189 -139051 -155639 -86556 -81814 -51294 -141987 -169622 -116661 57600 281 -1850 30138
12082C0138k42453J47663J31308q4937p0480M0704O8488j46065r639k19O7107
$$ 30138 -212315 -64652 66656 -18281 -88761 -48057 20431 -125634 -135273 -135492 -68385
12071f8385l633O5012L1982o929N8670j22781l0254O0088L8601o5917j18643n502
$$ -68385 -72018 -7006 24976 18047 76717 -46064 -76318 -16230 22371 -43546 -162189 -167691
12059a67691Q7411J31667K4646R497r9723J8654J9740j06892j13019J14110K7478
$$ -167691 -80280 51387 76033 85530 -14193 4461 24201 -82691 -195710 -81600 -54122
12048e4122k1986N2848J2399m4159p489k9282N6647N006P258L8640n628j55733
$$ -54122 -76108 -23260 -10861 -55020 -62509 -91791 -35144 -30138 -22880 15760 10132 -145601
12036a45601m014Q3564J27477l9096m7004m0305j23789J38619Q3654j30906J8750
$$ -145601 -149615 -66051 61426 22330 -24674 -64979 -188768 -50149 33505 -97401 -78651
12025g8651L9165K4235K9824j5128J5746M8053m2419j34894j5103N4614Q3513
$$ -78651 -39486 -15251 14573 -555 15191 63244 20825 -114069 -129172 -74558 8955
12014H955j5468l8458Q995N8964j8501n155K9513o5028k5383J01560r2631n6977
$$ 8955 -6513 -44971 -35976 22988 4487 -668 28845 -36183 -61566 39994 -52637 -109614
12002a09614k5131Q2448o7490R7659p618K7554j9609n4201O3620M8687K0264r2278
$$ -109614 -134745 -52297 -119787 -22128 -29746 -2192 -21801 -76002 -12382 36305 56569 -35709
11990c5709K2726L2395p2321r5931j06774Q9227J40959L6012N1972l2309n9838
$$ -35709 -12983 19412 -52909 -148840 -255614 -166387 -25428 10584 62556 30247 -29591
11979b9591m1414L6525j8400j1591R9871p6241j31224P2002M8876J3696q612k9999
$$ -29591 -71005 -34480 -52880 -64471 35400 -40841 -172065 -100063 -51187 -37491 -46103 -76102
11967g6102J339K3183p7467O3219l1040k5754J7473q2489L4681j7449J22832o1859
$$ -76102 -74763 -51580 -129047 -65828 -96868 -122622 -105149 -187638 -152957 -170406 -47574 -109433
11955a09433J34106j322j42705N241R675k944j5065N0921P5720r4996K3915J3592
$$ -109433 24673 23351 -119354 -114113 -104438 -107382 -122447 -71526 4194 -90802 -66887 -53295
11943e3295L5292O0899k2502j8671q7697L6999L6202k7580K2149l0265q4866O3809
$$ -53295 -18003 42896 20394 1723 -85974 -48975 -12773 -40353 -18204 -48469 -133335 -69526
11931f9526L8337J5445k8015m4465j114o5822P9593K136n2326J02536L4157L2152
$$ -69526 -31189 -15744 -43759 -88224 -89338 -155160 -75567 -73431 -125757 -23221 10936 43088
11919D3088o7121m0154L2945j5504p1425K8270k3155J6450P1981m2594L5445J5757
$$ 43088 -24033 -64187 -31242 -46746 -118171 -89901 -113056 -96606 -24625 -67219 -31774 -16017
11907a6017n5343m8172j8627J21972o3036q7088J3507N0872P2766r5970l0949
$$ -16017 -71360 -119532 -138159 -16187 -79223 -166311 -152804 -101932 -29166 -125136 -156085
11896a56085j0378m9261O2220m2030o711R1328M5259r910Q7948p1239m718J0013
$$ -156085 -166463 -215724 -153504 -195534 -202245 -110917 -65658 -75568 12380 -58859 -63577 -53564
11884e3564m142R614j43293k7926J04555P4287j05461Q0528L22m6012O8061K9502
$$ -53564 -57706 -48092 -191385 -219311 -114756 -40469 -145930 -65402 -65080 -111092 -43031 -13529
11872a3529m2442l3877N9943j2982N3246m4114j9957p0641N2342j8005m6919J7933
$$ -13529 -55971 -89848 -29905 -42887 10359 -33755 -53712 -124353 -72011 -90016 -136935 -119002
11860a19002P679j16971N1200J21295Q6811J1421r5979m3650M9897R7830j25194
$$ -119002 -111323 -228294 -177094 -55799 31012 42433 -53546 -97196 -47299 50531 -74663
11849g4663l4524k765R533N2501n9143M0189l3171J4819L0684n9456Q0416L8819
$$ -74663 -109187 -111952 -102419 -49918 -109061 -68872 -102043 -87224 -56540 -115996 -35580 3239
11837C239J852n6016n4575J6203M454q622l6118N382K5868p785L5890J1727o537
$$ 3239 5091 -50925 -105500 -89297 -84843 -93465 -129583 -124201 -98333 -106118 -70228 -58501 -65038
11824f5038r9949M1241P2325L9304o2173P313N2250p2327N6710K1499p4036q0973
$$ -65038 -164987 -123746 -51421 -12117 -74290 -66977 -14727 -87054 -30344 -8845 -82881 -163854
11812a63854k0079P9203K7320j8192j6538J89009q6385o4642L7761j7000j07009
$$ -163854 -183933 -104730 -77410 -95602 -112140 76869 -9516 -74158 -36397 -53397 -160406
11801a60406j6236J16177l2654O0828p1474N7510J1213l8162N2997o3210n8497
$$ -160406 -176642 -60465 -93119 -32291 -103765 -46255 -35042 -73204 -20207 -83417 -141914
11790a41914L1241P446k2890m3332n3753J13890j6287N9860L7323M3097J0619
$$ -141914 -110673 -103227 -126117 -169449 -223202 -109312 -125599 -65739 -28416 14681 25300
11779B5300j17032J8102N5076J7600J6775K1901P046j1535q5402l6806L2893Q8865
$$ 25300 -91732 -73630 -18554 -954 15821 37722 44768 33233 -52169 -88975 -56082 32783
11767C2783L4018j16133l7360N1906j9742K401J70408l3266j02161m8738K8088
$$ 32783 66801 -49332 -86692 -34786 -54528 -52127 118281 85015 -17146 -65884 -37796
11756c7796k4499p6933M7671l5822J9822O6781j914K071P6871l6029q9259l766
$$ -37796 -62295 -139228 -91557 -127379 -107557 -40776 -42690 -40619 36252 223 -89036 -92802
11744i2802L559o1487L5578P2583K4794l7930J6379p8402L6653j0308k6663j1068
$$ -92802 -89243 -150730 -115152 -42569 -17775 -55705 -39326 -117728 -81075 -91383 -118046 -129114
11732a29114J0183N899K9719k9096j820m0552l9827P3585N3463M379r2863n6511
$$ -129114 -118931 -113032 -83313 -112409 -114229 -154781 -194608 -121023 -67560 -63181 -156044 -212555
11720b12555L2396j7141l7317O7520j5536P7756J25714o6775j6900m8769N0925
$$ -212555 -180159 -197300 -234617 -167097 -182633 -104877 20837 -45938 -62838 -111607 -60682
11709f0682Q8894j3532k9665j10957L1379o2409J6311m8495N7909N465L6770j3333
$$ -60682 28212 14680 -14985 -125942 -94563 -156972 -140661 -189156 -131247 -125782 -89012 -102345
11697a02345K4350Q2131O161n8328l0191l9471j9733L5619N6742j9800l0189J6340
$$ -102345 -77995 4136 10297 -48031 -78222 -117693 -137426 -101807 -45065 -64865 -95054 -78714
11685g8714N3333l110q7045k3158R0270m7249p7156K6599R464O2216M8853j28068
$$ -78714 -25381 -28491 -115536 -138694 -48424 -95673 -172829 -146230 -136766 -74550 -25697 -153765
11673a53765P5411P7298K3426k1913q5065P1535o7715n858j0345M5421L5994P3523
$$ -153765 -78354 -1056 22370 457 -84608 -13073 -80788 -86646 -96991 -51570 -15576 57947
11661E7947j24630o629j6490M5043L7964p4590q1062N9089j6905J2495P4654n9835
$$ 57947 -66683 -73312 -89802 -44759 -6795 -81385 -162447 -103358 -120263 -107768 -33114 -92949
11649i2949m8903J50270l666n6066k5403k8404K3773m5193k4612p2420N3754Q2748
$$ -92949 -141852 8418 4752 -51314 -76717 -105121 -81348 -126541 -151153 -223573 -169819 -87071
11637h7071n3473k3862J90710p0744n5135j6969n014J39245o1379r4117R157O9679
$$ -87071 -140544 -164406 26304 -44440 -99575 -116544 -121558 17687 -43692 -137809 -128652 -58973
11625e8973K0630O575L151q4766j5954J8481L7850j4627L106K1624P280j4066
$$ -58973 -38343 -31768 -28617 -113383 -129337 -110856 -73006 -87633 -84527 -62903 -55623 -69689
11613f9689o4657K0433K252N5044N3328k7141o4326Q905o3277J01268J25777L2267
$$ -69689 -134346 -113913 -111661 -56617 -3289 -30430 -94756 -85851 -149128 -47860 77917 110184
11601A10184n4187n9877j5405l7725j9109L3528K2272n5401L628o5348J09102
$$ 110184 55997 -3880 -19285 -57010 -76119 -42591 -20319 -75720 -72092 -137440 -28338
11590b8338O3653l6408o6498p3450K3934O6150r310j18143L6302R8027k7897O0577
$$ -28338 35315 -1093 -67591 -141041 -117107 -50957 -60267 -178410 -142108 -44081 -71978 -11401
11578a1401P6718n7125q9736l3294K0517R4330J6598j6609o9927K2287k183Q465
$$ -11401 65317 8192 -81544 -114838 -94321 9 16607 -2 -69929 -47642 -49825 -41360
11566d1360Q2364o3269R227k4935o4145O2256m7048M3156l9220n7717J7412K309
$$ -41360 41004 -22265 -13038 -37973 -102118 -39862 -86910 -43754 -82974 -140691 -123279 -120970
11554a20970K9512J2863j6218k4302J11418r3063J5672M6396k1547O7687K8345
$$ -120970 -91458 -78595 -94813 -119115 -7697 -100760 -85088 -38692 -60239 7448 35793
11543C5793n1527k3827o8057p6167M5268M4322o2146o7459J05045M632k3842O6206
$$ 35793 -15734 -39561 -107618 -183785 -138517 -94195 -156341 -223800 -118755 -114123 -137965 -71759
11531g1759J05040q663j73440M5149n2667m3127k2016O8894P9477J10443k3892
$$ -71759 33281 24618 -148822 -103673 -156340 -199467 -221483 -152589 -73112 37331 13439
11520A3439L7491j24855m0765k4181p9740J37715j54411L3080J26196o0504l5457
$$ 13439 50930 -73925 -114690 -138871 -218611 -80896 -235307 -202227 -76031 -136535 -171992
11509a71992J08097L8445k0816n4584K5190l5608K7414M1789m9831j46314R5539
$$ -171992 -63895 -25450 -46266 -100850 -75660 -111268 -83854 -42065 -91896 -238210 -142671
11498a42671K247J24586j059q5100L6301M6117n9805j0281J17161j479j08514
$$ -142671 -140424 -15838 -16897 -101997 -65696 -19579 -79384 -89665 27496 26017 -82497
11487h2497m1146k3607J03994m0523R639J06877k7282j32115n2743R2766J7573
$$ -82497 -123643 -147250 -43256 -83779 -74140 32737 5455 -126660 -179403 -86637 -69064
11476f9064K1620k9446M7288m4024p0723N8179l3721r5078L6690l3942O8110J36140
$$ -69064 -47444 -76890 -29602 -73626 -144349 -86170 -119891 -214969 -178279 -212221 -144111 -7971
11464g971k5713m3085R5057m9349p3978m7684p0319L4435J06777o5013m7523l615
$$ -7971 -33684 -76769 18288 -31061 -105039 -152723 -223042 -188607 -81830 -146843 -194366 -197981
11452a97981K9709j286O3326J40613M3319p6274l8529k0280l7083J1658J9206
$$ -197981 -168272 -169558 -106232 34381 77700 1426 -37103 -57383 -94466 -82808 -63602
11441f3602j0539o203k9495l96K8757J03363j20249j30234R790J84661K8942n5038
$$ -63602 -74141 -80344 -109839 -110235 -81478 21885 -98364 -228598 -218808 -34147 -5205 -60243
11429f0243l407j27199M4405j0493j1338K6461L232K6825M5379j01473O4485L8648
$$ -60243 -63650 -190849 -146444 -156937 -168275 -141814 -138582 -111757 -66378 -167851 -103366 -64718
11417f4718K5074k2271j08674P7329O9826m3668M0275o5283J2085k680j964Q983
$$ -64718 -39644 -61915 -170589 -93260 -23434 -67102 -26827 -92110 -80025 -82705 -84669 -75686
11405g5686L3485P24l1024L4603o2490k1832m2361O4142p1210Q207Q9833N6541
$$ -75686 -42201 -41477 -72501 -37898 -100388 -122220 -164581 -100439 -171649 -163442 -73609 -17068
11393a7068l3120P7017J4497n9405j21296K2315p1027P3491J285j10314j0878
$$ -17068 -50188 26829 41326 -18079 -139375 -117060 -188087 -114596 -113311 -223625 -234503
11382b34503J60802R994k4816j8981j08153l0085m5593J5857Q4884J28365j3948
$$ -234503 -73701 -63707 -88523 -107504 -215657 -245742 -291335 -275478 -190594 -62229 -76177
11371g6177R4088o2149j09877p2489J01445N8178M1945l9032j34443J8752J9254
$$ -76177 17911 -44238 -154115 -226604 -125159 -66981 -25036 -64068 -198511 -179759 -160505
11360a60505O0993l7845k3017K9421L9970K3839j5608m8420j9879P9488J1556
$$ -160505 -99512 -137357 -160374 -130953 -90983 -67144 -82752 -131172 -151051 -71563 -60007
11349f0007j8295P7626J6688j38927O8206R777n7961j9290J90704k7694j19242
$$ -60007 -78302 -676 16012 -122915 -54709 -44932 -102893 -122183 68521 40827 -78415
11338g8415l346j31431k2336J06460l0205O72l2392j5784R1965J2734O5092o4221
$$ -78415 -81761 -213192 -235528 -129068 -159273 -158601 -190993 -206777 -114812 -102078 -36986 -101207
11326a01207L6056m8323R9541P4080j21678P3867j4478n812j01526K5302m4639
$$ -101207 -65151 -113474 -13933 60147 -61531 12336 -2142 -7954 -109480 -84178 -128817
11315a28817K7041O345j0559k7267J0916R855K3166L9779n9427J6143P2509p633
$$ -128817 -101776 -95431 -105990 -133257 -122341 -112486 -89320 -49541 -108968 -92825 -20316 -27949
11303b7949J3681K1382j5791Q623p8543k132K9948l8098j10742J5774N740Q0479
$$ -27949 -14268 7114 -8677 -54 -78597 -80729 -50781 -88879 -199621 -183847 -178107 -97628
11291i7628j0655j74509R0651L9293l2486N7560Q4128m9055m195p6000J1975L3768
$$ -97628 -108283 -282792 -192141 -152848 -185334 -127774 -43646 -92701 -96896 -172896 -160921 -127153
11279a27153M8961K3103K2265m3826r2413O2730j9720M1038k43J3170l3289j5471
$$ -127153 -78192 -55089 -32824 -76650 -169063 -106333 -126053 -85015 -85258 -72088 -105377 -120848
11267a20848O3238l533p3886P122J0050n8917l5613N8211P565L2704j760o7920
$$ -120848 -57610 -61143 -135029 -127907 -117857 -176774 -212387 -154176 -146611 -113907 -115667 -183587
11255a83587j659Q4066J23148o9916j64874j2846k7538J40508K6686j15151J8690
$$ -183587 -185246 -101180 21968 -47948 -212822 -225668 -253206 -112698 -86012 -201163 -182473
11244a82473J72094n3265J4139P2967p1233j862J03415p4602o607n3719N5234
$$ -182473 -10379 -63644 -49505 23462 -47771 -49633 53782 -20820 -27427 -81146 -25912
11233b5912R5619j92177k7359R595p7992J04682j9159m260M5330k1878j08983
$$ -25912 69707 -122470 -149829 -140234 -218226 -113544 -132703 -136963 -91633 -113511 -222494
11222b22494o077J44406m9231j4008J44669l2674p3530l803M9883J3947p7985
$$ -222494 -228571 -84165 -133396 -147404 -2735 -35409 -108939 -112742 -62859 -48912 -126897
11211a26897N1522O4770m9075j38721J4438L8196j2670r630J9173P1723r830J7820
$$ -126897 -75375 -10605 -59680 -198401 -183963 -145767 -158437 -168067 -148894 -77171 -87001 -69181
11199f9181j47q4835N1641K3126j9814N3751O0400n3542P7027l9351q513r8072
$$ -69181 -69328 -154163 -102522 -79396 -99210 -45459 14941 -38601 38426 -925 -9438 -107510
11187a07510R4510J9467j01513q0268k6768l8670M2081J66440o532j4541K0375
$$ -107510 -13000 6467 -95046 -175314 -202082 -240752 -198671 -32231 -38763 -53304 -32929
11176c2929j06920J05290l2452n6558j0597J5809N0207j05274P7388q8192j4876
$$ -32929 -139849 -34559 -67011 -123569 -134166 -118357 -68150 -173424 -96036 -184228 -199104
11165a99104R4772J5856L085M137P320J9550j39866O6740P1433r378o0635j1041
$$ -199104 -104332 -88476 -85391 -81254 -73934 -54384 -194250 -127510 -56077 -65455 -126090 -137131
11153a37131R7751j4827p0516n2646l7917P3833q834M3346J01582O2699k8786
$$ -137131 -39380 -54207 -124723 -177369 -215286 -141453 -150287 -106941 -5359 57340 28554
11142B8554m944K5419o1145M0278n6566n8643j3974m3567P7614m0206m4279J06415
$$ 28554 23610 49029 -12116 28162 -28404 -87047 -101021 -144588 -66974 -107180 -151459 -45044
11130d5044l3307N3224m5774m4741R0397L7117L0256r7466N2819L892r7944Q9332
$$ -45044 -78351 -25127 -70901 -115642 -25245 11872 42128 -55338 -2519 1373 -96571 -7239
11118g239O0652o9693j6558n4548O2833M3534k3690Q0152k9180j8200N7584Q441
$$ -7239 53413 -16280 -32838 -87386 -24553 18981 -4709 75443 46263 28063 85647 94088
11106I4088p4641m2331O2582N6578j03706L6808l4384K9034J8071L6675Q5012
$$ 94088 19447 -22884 39698 96276 -7430 29378 -5006 24028 42099 78774 163786
11095A63786K9281r4273r393J1667N4697j8950m3097M8224l8828p0480N7695Q1038
$$ 163786 193067 98794 89401 101068 155765 136815 93718 141942 103114 32634 90329 171367
11083A71367K7049Q8718p9827j12117r951J10840O0506k6683M4723Q3186M204
$$ 171367 198416 287134 207307 95190 85239 196079 256585 229902 274625 357811 362015
11072C62015P4558J50569K6078N7470K1312j84074j84794K5488q2151j55520l2900
$$ 362015 436573 587142 613220 670690 692002 507928 323134 348622 266471 110951 78051
11061G8051L3867M4434j19863J6498j2705k9761l7005N4892R6796O010o9669M7011
$$ 78051 111918 156352 36489 52987 40282 10521 -26484 28408 125204 131214 61545 108556
11049A08556m6233k0850l5594k7144L8119Q2079J6201q6519m3926q637n5152J56725
$$ 108556 62323 41473 5879 -21265 16854 98933 115134 28615 -15311 -23948 -79100 77625
11037G7625P601N7958M0552q1165o7647N0335K4623o5682k5236P1009J36094j5130
$$ 77625 85226 143184 183736 102571 34924 85259 109882 44200 18964 89973 226067 210937
11025B10937R2555j32989j52312o8582J13399j4449O2182M8490O0283m7454p9855
$$ 210937 303492 170503 18191 -50391 63008 48559 110741 159231 219514 172060 92205
11014I2205K6135Q5014l3899k4046M2070k8661j9652M446O3027J2205n4358K2877
$$ 92205 118340 203354 169455 145409 187479 158818 139166 143612 206639 218844 164486 187363
11002A87363P4960r412k2144L6179J4512J3033L8069j06709L3562O8044l4812
$$ 187363 262323 252911 230767 266946 281458 294491 332560 225851 259413 327457 292645
10991B92645J19771N873r9155P0619P7961n7386k3682k951m7640N0912L6013k1683
$$ 292645 412416 418289 319134 389753 467714 410328 386646 383695 336055 386967 422980 401297
10979D01297k505N740O1649R3910o0925Q2377K5627o558J79528Q802J28005L7512
$$ 401297 398792 404532 466181 560091 499166 581543 607170 600612 780140 788942 916947 954459
10967I54459J6070p8070o717J44575K7749o0218K0627Q1616j0771J10363Q2907
$$ 954459 970529 892459 885742 1030317 1058066 997848 1018475 1100091 1089320 1199683 1282590
10956A282590L5849P9127J40962J77780O9630M0368K48331J76621K18733K62086
$$ 1282590 1318439 1397566 1538528 1716308 1785938 1826306 2074637 2251258 2469991 2732077
10946B732077K03953K84436L40798M586J33312R0526p8063k4069k27607k83864
$$ 2732077 2936030 3220466 3561264 3565850 3699162 3789688 3711625 3687556 3459949 3176085
10936C176085m14740k02701k85137k89668j76509j73701j36650j38644k28714
$$ 3176085 2761345 2558644 2273507 1983839 1807330 1633629 1496979 1358335 1129621
10927A129621j17226K9589j42974l9798n6874m4093l802j29764q0259J8902j9811
$$ 1129621 1012395 1041984 899010 859212 802338 758245 754443 624679 544420 563322 543511
10916E43511o1735k8663L6046N0585j09856j76614O4521l6509P0855j15491J3350
$$ 543511 481776 453113 489159 539744 429888 253274 317795 281286 352141 236650 250000
10905B50000O8130n7392r8080j5247K5462r4906j1121J8504J16679M7657j9111
$$ 250000 318130 260738 162658 147411 172873 77967 66846 85350 202029 249686 230575
10894B30575o9485J8444j9394j9107j14458K1025O1145J3838J0612j7697M663
$$ 230575 161090 179534 160140 141033 26575 47600 108745 122583 133195 115498 120161
10883A20161N3293k9451j13296j4274k3031J26353k7683Q171q946q8693M9964
$$ 120161 173454 144003 30707 16433 -6598 119755 92072 100243 91297 2604 52568
10872E2568M4841M0944n8376N1768M3492k7792l7373j4914r6141K7841L8441J4757
$$ 52568 97409 138353 79977 131745 175237 147445 110072 95158 -983 26858 65299 80056
10860H0056k4606o5610N3909N7604l0583o229j18321m4965N9067M5881M2238O2483
$$ 80056 55450 -10160 43749 101353 70770 64541 -53780 -98745 -39678 6203 48441 110924
10848A10924r8612n0143j5437Q4594J57803M3907J9847r1424r5838p7412r604
$$ 110924 12312 -37831 -53268 31326 189129 233036 252883 161459 65621 -11791 -21395
10837b1395J31520K4481p3739N9492N2840J1255j36670R8209l0166p0198m545
$$ -21395 110125 134606 60867 120359 173199 184454 47784 145993 115827 45629 41084
10826D1084K522j4265m0071l2830N5743l4068j4045r1583j7824J16030J6517n5334
$$ 41084 43606 29341 -10730 -43560 12183 -21885 -35930 -127513 -145337 -29307 -12790 -68124
10814f8124j5484O5857j2236n8302R2191J2182n652l6181p6040J54993R681l7212
$$ -68124 -83608 -17751 -29987 -88289 3902 16084 10432 -25749 -101789 53204 62885 25673
10802B5673k0292q733l8531P1689k1636M713k5233J6688J10764l101j87025j6494
$$ 25673 5381 -3352 -41883 29806 8170 12883 -12350 4338 115102 112001 -75024 -91518
10790i1518J6276J4413N1264O4650l2717R973j0072k5570k0473q8625l2082J34606
$$ -91518 -75242 -60829 -9565 55085 22368 32341 22269 -3301 -23774 -112399 -144481 -9875
10778i875K7919r0100N6227M1291J1994j07691j9652J0582O4441P8867M6159o2449
$$ -9875 18044 -72056 -15829 25462 37456 -70235 -89887 -79305 -14864 64003 110162 47713
10766D7713n2300J15718P5161l3497n2057p9595N3544K5727o784N360j0731J8015
$$ 47713 -4587 111131 186292 152795 100738 21143 74687 100414 93630 98990 88259 106274
10754A06274j5386J1595P318o674M6015l0440N2392m2429o7468n0883O032K4375
$$ 106274 90888 102483 109801 103127 149142 118702 171094 128665 61197 10314 16346 40721
10742D0721m3673N3969P1922n7181M4873K0844k0303J88039j4876k02903j8241
$$ 40721 -2952 51017 122939 65758 110631 131475 111172 299211 284335 81432 63191
10731F3191J02001N337J14569k7757o326o2848N1557n7091n3178M9058L0251J05929
$$ 63191 165192 170529 285098 257341 251015 188167 239724 182633 129455 178513 208764 314693
10719C14693l0049N8129n8595J8902J025J0450L4578J03940k9785J6727R6089
$$ 314693 284644 342773 284178 303080 304105 314555 349133 453073 423288 440015 536104
10708E36104P3005N6895J1316J32906J51564N695J04925J71258J74059K15451
$$ 536104 609109 666004 677320 810226 961790 967485 1072410 1243668 1417727 1633178
10698A633178J10019O4591k8691k5818j42171j66239j45380l7970j31640r8603
$$ 1633178 1743197 1807788 1779097 1753279 1611108 1444869 1299489 1261519 1129879 1031276
10688A031276r6631r8933R1285M6569K8582N6637n1690j48513m750o7723j29285
$$ 1031276 934645 835712 926997 973566 1002148 1058785 1007095 858582 853832 786109 656824
10677F56824k481p7756r6504o1112o0617j20802n2281J2657O8135m2659l2165
$$ 656824 654343 576587 480083 418971 358354 237552 185271 197928 266063 223404 191239
10666A91239K7938o5521L9699m9369L2289J2898l5253l4786j15516M6948P9615
$$ 191239 219177 153656 193355 143986 176275 189173 153920 119134 3618 50566 130181
10655A30181k482j44539K9070j4760P323o6419q6188J55850n1283P0201O1981
$$ 130181 127699 -16840 12230 -2530 4793 -61626 -147814 8036 -43247 26954 88935
10644H8935j4248o8881o573J4728O5000k5578p8613Q1436j03358L6131Q8148N1464
$$ 88935 74687 5806 -767 13961 78961 53383 -25230 56206 -47152 -11021 77127 128591
10632A28591k7875L8999K953j42936q971l3610J4549k0383N0779J1562L0138n7653
$$ 128591 100716 139715 142668 -268 -9239 -42849 -28300 -48683 2096 13658 43796 -13857
10620a3857L6959n13P6506J2477j04673M0331p1965P50m634k1447P4741L7626
$$ -13857 23102 22589 99095 111572 6899 47230 -24735 -23985 -28619 -50066 24675 62301
10608F2301p8090n1133J01298Q1815m3597O3884l8577j06875l3949l6456P2284
$$ 62301 -15789 -66922 34376 116191 72594 136478 97901 -8974 -42923 -79379 -7095
10597g095N0987R507M7829j7929m1360j3810q0877n41J07615J04378N0245o5649
$$ -7095 43892 53399 101228 83299 41939 28129 -52748 -53289 54326 158704 208949 143300
10585A43300j2266q9337O2354K4502j05115j4111K0125K1773j02874j0333n8640
$$ 143300 131034 41697 104051 128553 23438 9327 29452 51225 -51649 -61982 -120622
10574a20622L2270L6490R1831l5544L6038l6860j23701P3316j48m8033o2475J037
$$ -120622 -88352 -51862 39969 4425 40463 3603 -120098 -46782 -46930 -94963 -157438 -156401
10562a56401r8702J27398Q6699L4511o9669N7197o6293O7721J6897m5032Q1768
$$ -156401 -255103 -127705 -41006 -6495 -76164 -18967 -85260 -17539 -642 -45674 36094
10551C6094L5803j6361q5589K320K6381L3254L1218o6247r997k573J09731q86
$$ 36094 71897 55536 -30053 -27733 -1352 31902 63120 -3127 -13124 -15697 94034 93148
10539I3148n1481k0189k975P7357p0454q2795K547J042R1316L2028R7775j10688
$$ 93148 41667 21478 18503 95860 25406 -57389 -54842 -53800 37516 69544 167319 56631
10527E6631q6588J1280R7338J6222o5266L2793r1586N1779K5259o4442q2627M3271
$$ 56631 -29957 -18677 78661 94883 29617 62410 -29176 22603 47862 -16580 -99207 -55936
10515e5936K0189O7318k6869P2898j6710o9006o7708q7895L5364N3969L4075N2479
$$ -55936 -35747 31571 4702 77600 60890 -8116 -75824 -163719 -128355 -74386 -40311 12168
10503A2168k0512K5178J0215l5493j77149R7784N4630N0182p1678k505R503n3891
$$ 12168 -8344 16834 27049 -8444 -185593 -87809 -33179 17003 -54675 -57180 -47677 -101568
10491a01568K7729O5882L9427j2259o7152O3693L9950J1003k8305k459N6671L9090
$$ -101568 -73839 -7957 31470 19211 -47941 15752 55702 66705 38400 35941 92612 131702
10479A31702q6095N225k7093l2308p6624J4799L5137r829Q6333q5192J15312O8137
$$ 131702 45607 50832 23739 -8569 -85193 -70394 -35257 -45086 41247 -43945 71367 139504
10467A39504j4707l035j27599K010P4623p1304j42591k1121K21676J10502k2588
$$ 139504 124797 121762 -5837 -3827 70796 -508 -143099 -164220 57456 167958 145370
10456A45370q4760k6011J02527L671j01482J2909o9833L1272n201K4923n0567
$$ 145370 60610 34599 137126 140797 39315 52224 -17609 13663 8462 33385 -17182
10445a7182J6566K128l9122l8935N0061n8174k0334O925J17305P4087p6914o06
$$ -17182 -616 1512 -37610 -76545 -26484 -84658 -104992 -98067 19238 93325 16411 15805
10433A5805O4996n7418M5730N7391J3708p5966K23R1709K3600P2978J1658m3781
$$ 15805 80801 23383 69113 126504 140212 64246 64469 156178 179778 252756 264414 220633
10421B20633o0914J2515q4463K7791L8769Q9754O58r390j0337P3927q8245k1158
$$ 220633 159719 172234 87771 115562 154331 244085 244743 235353 225016 298943 210698 189540
10409A89540j6300m3379P4974r3461o7316K128J23167l3866k176R5150j8510p4151
$$ 189540 173240 129861 204835 111374 44058 46186 169353 135487 133311 228461 209951 135800
10397A35800k9752p6039J26813N4926L2694l5114q907P4436J8173j8593j1651
$$ 135800 106048 30009 156822 211748 244442 209328 200421 274857 293030 274437 262786
10386B62786L1235K0390M0525J23624P909N3502J70338M894J3622K5234N9086
$$ 262786 294021 314411 354936 478560 486469 539971 710309 715203 728825 754059 813145
10375H13145O832K1604P0891K6309m1658q5135j24512R6348m7677l3199j25724
$$ 813145 819977 841581 912472 938781 897123 811988 687476 783824 736147 702948 577224
10364E77224j8230o9279n0721O2129o4655j79415Q082M7428M4803L1805n5569
$$ 577224 558994 489715 438994 501123 436468 257053 265135 312563 357366 389171 333602
10353C33602o0351j05767J25988N0948J9524q4244N3949J5271k5980J0345N4349
$$ 333602 273251 167484 293472 344420 363944 279700 333649 348920 322940 333285 387634
10342C87634R1698K7952q2964J331n7q2919R185M7204J3707L5664Q342Q6658N1342
$$ 387634 479332 507284 424320 425651 425594 342675 351860 399064 412771 448435 456777 543435 594777
10329E94777l6081n8268j03395O4949J8972Q4034j03423M1604M6566o325j4207
$$ 594777 558696 500428 397033 461982 480954 564988 461565 503169 549735 543410 529203
10318E29203l474j3350L363l7772l4742O6657J34424L6549n6865q480J6608P6791
$$ 529203 525729 512379 515742 477970 443228 509885 644309 680858 623993 615513 632121 708912
10306G08912k3595J03085L570l5937O5728N9865j22325K9138K1700P1440N4068
$$ 708912 685317 788402 791972 756035 821763 881628 759303 788441 810141 881581 935649
10295I35649q1014K198J08952O9918k9916o084O8479R8892J53018R8510L24j6585
$$ 935649 854635 856833 965785 1035703 1005787 999703 1068182 1167074 1320092 1418602 1418926 1402341
10283A402341p5116P4473J88271N9768n3804M2567J72406J85192N6285J1461O8204
$$ 1402341 1327225 1401698 1589969 1649737 1595933 1638500 1810906 1996098 2052383 2063844 2132048
10272B132048J36912L3629j593M4500J10867N0949P1222J34413J57370J50385
$$ 2132048 2268960 2302589 2300996 2345496 2456363 2507312 2578534 2712947 2870317 3020702
10262C020702J36383L21063L50489L61118L07270K29975L76926L27456J76107
$$ 3020702 3157085 3478148 3828637 4189755 4497025 4727000 5103926 5431382 5607489
10253E607489K09176J60651m7619p7250j43233j40583k29240k68190j96005k82885
$$ 5607489 5816665 5977316 5929697 5852447 5709214 5568631 5339391 5071201 4875196 4592311
10243D592311j72670j46552l11351l13591k09972k43508k62607k85191k17685
$$ 4592311 4419641 4273089 3961738 3648147 3438175 3194667 2932060 2646869 2429184
10234B429184k16496j05773k2567j47658j82792q3181q149j79566o7335J5258
$$ 2429184 2212688 2106915 2084348 1936690 1753898 1670717 1662568 1483002 1415667 1430925
10224A430925r2933m9851M6571o4358m1134k3642q8399n186q4446M2794p0765
$$ 1430925 1337992 1288141 1334712 1270354 1229220 1205578 1117179 1111993 1027547 1070341 999576
10213I99576j19563m2570O4346L9525j06551j0920P428k5403J18372k2965n9993
$$ 999576 880013 837443 901789 941314 834763 823843 831271 805868 924240 901275 841282
10202H41282N7449K4133n6718j7691m3490J3260J9014N0737k7455j24228K7301
$$ 841282 898731 922864 866146 848455 804965 818225 837239 887976 860521 736293 763594
10191G63594K1254q029J2635m5899p9844J54073M067j05466J9609M3506O9194
$$ 763594 784848 776819 789454 743555 663711 817784 821851 716385 735994 779500 848694
10180H48694K7063l2011M8835M5599j3855P385j5523k9954J27744Q457m5637k187
$$ 848694 875757 843746 892581 938180 924325 931710 916187 886233 1013977 1022434 976797 974610
10168I74610N2745l8997k8141J5874J716K2583O1765J9735Q3529P1662l34N1150
$$ 974610 1027355 988358 960217 976091 977807 1000390 1062155 1081890 1165419 1237081 1236747 1287897
10156A287897J1992J44499Q7352m1830P7190M5736k9298j8405j16729m6878o0086
$$ 1287897 1299889 1444388 1531740 1489910 1567100 1612836 1583538 1565133 1448404 1401526 1341440
10145A341440o2234o541J5602m3078q8855R4821o8183L7627Q2274J9240O7119
$$ 1341440 1279206 1272665 1288267 1245189 1156334 1251155 1182972 1220599 1302873 1322113 1389232
10134A389232N5374L9357q2539M4006l7318o1350O072j39767j36898P0145R6426
$$ 1389232 1444606 1483963 1401424 1445430 1408112 1346762 1352834 1213067 1076169 1146314 1242740
10123A242740l5340j33163o2164K2213o8988N2798k7089j26244O0288P417J54519
$$ 1242740 1207400 1074237 1012073 1034286 965298 1018096 991007 864763 925051 932468 1086987
10112A086987q773j14735J02643k1628o0913R0611j17459P9403L2211K1461P1097
$$ 1086987 1078214 963479 1066122 1044494 983581 1074192 956733 1036136 1068347 1089808 1160905
10101A160905J76K4964N8328J05359l2089K9553L0588o1454j12653n8781O4615
$$ 1160905 1161081 1186045 1244373 1349732 1317643 1347196 1377784 1316330 1203677 1144896 1209511
10090A209511Q4743j67882p4645o0405o4877J5529O9580m7172k19851j3708J53891
$$ 1209511 1294254 1126372 1051727 991322 926445 941974 1011554 964382 744531 730823 884714
10079H84714Q0085j07867k7966n5321K3865K2062q4809K23631k4611r1530o179
$$ 884714 964799 856932 828966 773645 797510 819572 734763 958394 933783 842253 836074
10068H36074P1456p194n3990O6481j0331m6285k5527K8949M0403Q3557l5579L6082
$$ 836074 907530 900336 846346 912827 902496 856211 830684 859633 900036 983593 948014 984096
10056I84096k5137r675P1902m9410n2475P2095J6482p9280k0932Q3428J3663j14183
$$ 984096 958959 949284 1021186 971776 919301 991396 1007878 928598 907666 991094 1004757 890574
10044H90574l9494P7308P1426J7172j297m6287q7292M1998K6387J00978j2797
$$ 890574 851080 928388 999814 1016986 1015689 969402 882110 924108 950495 1051473 1038676
10033A038676p8546M7530n93M7067l0178N2450Q2890o9908N5564O4006O6153p2057
$$ 1038676 960130 1007660 1007067 1054134 1023956 1076406 1159296 1089388 1144952 1208958 1275111 1203054
10021A203054j07963j4297R9499J07082J06596J3653n5557N5122k3945j6699J47338
$$ 1203054 1095091 1080794 1180293 1287375 1393971 1407624 1352067 1407189 1383244 1366545 1513883
10010A513883R6091r7777o7920J9581O0217L5336K3113j18716R6578l4368k0608
$$ 1513883 1609974 1512197 1444277 1463858 1524075 1559411 1582524 1463808 1560386 1526018 1505410
9999A505410k4112m0670N7317L187N3567L7010L8940J26842n1828K1090l1803
$$ 1505410 1481298 1440628 1497945 1501132 1554699 1591709 1630649 1757491 1705663 1726753 1694950
9988A694950r2714P4073J34665j4588K7794l432L0371M7567L3928J88793m1032
$$ 1694950 1602236 1676309 1810974 1796386 1824180 1820748 1851119 1898686 1932614 2121407 2080375
9977B080375n2741p4263k1443J0094K1188P0390M0766N7487k4414k6718k1290
$$ 2080375 2027634 1953371 1931928 1942022 1963210 2033600 2074366 2131853 2107439 2080721 2059431
9966B059431K9204N3752P949K7185O9777N1534J6968K8816o0261R9780m4455R4498
$$ 2059431 2088635 2142387 2150336 2177521 2247298 2298832 2315800 2344616 2284355 2384135 2339680 2434178
9954B434178M9602l2789J1607P5872K5364j8062J9442J18944J5537r0278N4925
$$ 2434178 2483780 2450991 2462598 2538470 2563834 2545772 2565214 2684158 2699695 2609417 2664342
9943B664342J11189N7675L0591R355R795P2524L2080J55629M1106M8738O3430
$$ 2664342 2775531 2833206 2863797 2873152 2882947 2955471 2987551 3143180 3184286 3233024 3296454
9932C296454Q5037k7434l642O1677L632N205J15534P0663O44q2241L6818Q0755
$$ 3296454 3381491 3354057 3350415 3412092 3415724 3420929 3536463 3607126 3607770 3525529 3562347 3643102
9920C643102j8910N8705L8714Q4809O3619J35402N7683J29254P703j32396J8790
$$ 3643102 3624192 3682897 3721611 3806420 3870039 4005441 4063124 4192378 4200081 4067685 4086475
9909D086475Q3837J60200P2293M4918M417Q8277J84447P0213N3306J24168L5815
$$ 4086475 4170312 4330512 4402805 4447723 4452140 4540417 4724864 4795077 4848383 4972551 5008366
9898E008366L9472N5295M3692Q2399J71741K45290J44806O2105J34131o3262N1797
$$ 5008366 5047838 5103133 5146825 5229224 5400965 5646255 5791061 5853166 5987297 5924035 5975832
9887E975832J19035J3802J16406K74702J81041Q6979J32263J75548K19387L0494
$$ 5975832 6094867 6108669 6225075 6499777 6680818 6767797 6900060 7075608 7294995 7325489
9877G325489O4382J46972K30913K24620J84148M1489J09639J27980K18568J72163
$$ 7325489 7389871 7536843 7767756 7992376 8176524 8218013 8327652 8455632 8674200 8846363
9867H846363J37320J59948J42653J17300K44563L32321J77938K54255K45742J53952
$$ 8846363 8983683 9143631 9286284 9403584 9648147 9980468 10158406 10412661 10658403 10812355
9857A0812355K23834K44618K71324K42486K71529L14765K31744L29270M43667
$$ 10812355 11036189 11280807 11552131 11794617 12066146 12380911 12612655 12941925 13385592
9848A3385592M67720N65439L99644N10806L96253L56595M43804L66372L97316
$$ 13385592 13853312 14418751 14818395 15329201 15725454 16082049 16525853 16892225 17289541
9839A7289541L85372K46718L05772J83614J77542L82058J46873L78755L62841
$$ 17289541 17674913 17921631 18227403 18411017 18588559 18970617 19117490 19496245 19859086
9830A9859086K32403L43173N21687M88410N08535N61420M99404N91798P31862
$$ 19859086 20091489 20434662 20956349 21444759 21953294 22514714 23014118 23605916 24337778
9821B4337778P72601Q07670P67270R61959J020435J011260J210122J243939J394014
$$ 24337778 25110379 25918049 26685319 27647278 28667713 29678973 30889095 32133034 33527048
9812C3527048J471995J640247J757122J795271J780324J530112J037992Q41891
$$ 33527048 34999043 36639290 38396412 40191683 41972007 43502119 44540111 45382002
9804D5382002P51993O19204M93479P83989J111773J390422J705447J857188J786775
$$ 45382002 46133995 46753199 47246678 48030667 49142440 50532862 52238309 54095497 55882272
9795E5882272J228090R05010J016031J351991J493055J929561K391779K696135
$$ 55882272 57110362 58015372 59031403 60383394 61876449 63806010 66197789 68893924
9787F8893924L156767L440925L705984M294304N177937O419958P483201Q448583
$$ 68893924 72050691 75491616 79197600 83491904 88669841 95089799 102573000 111021583
9779A11021583Q772656R489104Q706502N592369L808594L781072J824877q96928
$$ 111021583 119794239 129283343 137989845 143582214 147390808 151171880 152996757 152099829
9771A52099829m059358p586880p516824p123505r561576j0430832q795454o892741
$$ 152099829 148040471 140453591 132936767 125813262 116251686 105820854 97025400 90132659
9763I0132659n342879m126367k949646k288775j639839j017790l14080J61733
$$ 90132659 84789780 80663413 77713767 75424992 73785153 72767363 72453283 72615016
9755G2615016N91156R35054J353404J860482K220034K484739K991085L785599
$$ 72615016 73206172 74141226 75494630 77355112 79575146 82059885 85050970 88836569
9747H8836569M876781O102829P566023Q282062R183454R206278O059193L421182
$$ 88836569 93713350 99816179 107382202 115664264 124847718 134053996 140113189 143534371
9739A43534371L120821J817125j827832o876552j0352968r867621r355591j1648168
$$ 143534371 146655192 148472317 146644485 139767933 129414965 119547344 110191753 98543585
9731I8543585j3127104j1341648r092382p234146n853896m742455l757031l230032
$$ 98543585 85416481 74074833 64982451 57748305 51894409 47151954 43394923 40164891
9723D0164891k696206k348172j910922j750227j586012j578153j403862r93441
$$ 40164891 37468685 35120513 33209591 31459364 29873352 28295199 26891337 25897896
9715B5897896j001032j066353p97396n77505n94136m37581l41763j02631j26415
$$ 25897896 24896864 23830511 23033115 22455610 21861474 21423893 21082130 20979499 20853084
9706B0853084k46969j61113j34024l6800j04099j62704j38839l34768o26476o78833
$$ 20853084 20606115 20445002 20310978 20274178 20170079 20007375 19868536 19533768 18907292 18228459
9696A8228459r29000j034326r24917r79199r84330p79788p42487o12692n40318
$$ 18228459 17299459 16265133 15340216 14361017 13376687 12596899 11854412 11241720 10701402
9687A0701402m17111l56482l64295k70474l42796k59689k44757k72419l76534
$$ 10701402 10284291 9927809 9563514 9293040 8950244 8690555 8445798 8173379 7796845
9678G796845k90934k13756j53245k45498j99031j09064n3184j45289m8980q5299
$$ 7796845 7505911 7292155 7138910 6893412 6694381 6585317 6532133 6386844 6337864 6252565
9668F252565j0594j0891n3062j16110j4793N4512m4860n9820k1680k2141l1699
$$ 6252565 6241971 6231080 6178018 6061908 6047115 6101627 6056767 5996947 5975267 5953126 5921427
9657E921427R498p1748K9885r7886j50119j8751J3901Q8091j326j50749J24790
$$ 5921427 5930925 5859177 5889062 5791176 5641057 5622306 5636207 5724298 5722972 5572223 5697013
9646E697013j5951o0092j47319k1566l5824j51896j92494Q779n7740N8078Q9029
$$ 5697013 5681062 5620970 5473651 5452085 5416261 5264365 5071871 5080650 5022910 5080988 5170017
9635E170017j009K667m3822q46J4473m5823j2710N1939m8235N9666j14828J25650
$$ 5170017 5169008 5171675 5127853 5127007 5141480 5095657 5082947 5134886 5086651 5146317 5031489 5157139
9623E157139k3629j52149L4481P2026J33442K66r927P3581Q5823L4571N5043J29246
$$ 5157139 5133510 4981361 5015842 5087868 5221310 5221576 5211649 5285230 5371053 5405624 5460667 5589913
9611E589913J31662J24639R5780J45146J55384J33446J67287L28558K51376K43306
$$ 5589913 5721575 5846214 5941994 6087140 6242524 6375970 6543257 6871815 7123191 7366497
9601G366497L43899K61449Q1274J14908R5200o6205q4311p6618n0434k07805k22667
$$ 7366497 7710396 7971845 8053119 8168027 8263227 8197022 8112711 8036093 7985659 7777854 7555187
9590G555187k22995l24398l02598l46296l83315k30152k18061k52461k04057j09298
$$ 7555187 7332192 7007794 6705196 6358900 5975585 5745433 5527372 5274911 5070854 4961556
9580D961556n6746R4471J02072J8909m7958O0873P8707J07244O2710Q3922l5440
$$ 4961556 4904810 4999281 5101353 5120262 5072304 5133177 5211884 5319128 5381838 5465760 5430320
9569E430320p0415L8954j4083J42755o0318j09509j70612j56234j37089j24713
$$ 5430320 5359905 5398859 5384776 5527531 5467213 5357704 5187092 5030858 4893769 4769056
9559D769056j44369j09593l8653q1558P0570K8376n1142j28382J63816J21760
$$ 4769056 4624687 4515094 4476441 4394883 4465453 4493829 4442687 4314305 4478121 4599881
9549D599881m728J04571n444J26920L4295l417O8380L6915N325k9426q4648n4510
$$ 4599881 4595153 4699724 4694280 4821200 4855495 4852078 4920458 4957373 4962698 4933272 4848624 4794114
9537D794114J2621m1029m6293n5223l1089m246n5236N487K5055r531l0683O6491
$$ 4794114 4806735 4765706 4719413 4664190 4633101 4628855 4573619 4579106 4604161 4594630 4563947 4630438
9525D630438l4227J3333N6954L65m1948J38107R0820j0580J10045J32906k4847
$$ 4630438 4596211 4609544 4666498 4666863 4624915 4763022 4853842 4843262 4953307 5086213 5061366
9514E061366R5191N3501N9483N7351L2152K1107J17361J85672L7364K6343J19137
$$ 5061366 5156557 5210058 5269541 5326892 5359044 5380151 5497512 5683184 5720548 5746891 5866028
9503E866028J20212J26400J11205J51572R5660L0088J72687J69229K01324J73699
$$ 5866028 5986240 6112640 6223845 6375417 6471077 6501165 6673852 6843081 7044405 7218104
9493G218104N7837J14335M2762m18R9792J38082J46796p376O018k0961q6555P8465
$$ 7218104 7275941 7390276 7433038 7432620 7532412 7670494 7817290 7809914 7815932 7794971 7708416 7786881
9481G786881J10851N3853J08246J9962R9006K01314J35988o4842K9251j1095o8015
$$ 7786881 7897732 7951585 8059831 8079793 8178799 8380113 8516101 8451259 8480510 8469415 8401400
9470H401400j06690j75738k62474k16461k82630j93788k61834k62570m14476j58185
$$ 8401400 8294710 8118972 7856498 7640037 7357407 7163619 6901785 6639215 6224739 6066554
9460F066554r4833l7309m3996j6473Q0340o7299J00437N6790K6638J9991p0929
$$ 6066554 5971721 5934412 5890416 5873943 5954283 5886984 5987421 6044211 6070849 6090840 6019911
9449F019911J07103N997J3002J08095J47378L29064K00483J93334K81197L31843
$$ 6019911 6127014 6133011 6146013 6254108 6401486 6730550 6931033 7124367 7405564 7737407
9439G737407J94349J33919R4623J93288N7406o5599p8468j99431j77036k73672
$$ 7737407 7931756 8065675 8160298 8353586 8410992 8345393 8266925 8067494 7890458 7616786
9429G616786k40504k58449l93298k63741k78521k89196j74484k8813o4391n0772
$$ 7616786 7376282 7117833 6724535 6460794 6182273 5893077 5718593 5689780 5625389 5574617
9419E574617o1840o7057L0152K0042r365K6245J1571r401j8351m5252m556J8169
$$ 5574617 5512777 5445720 5475872 5495914 5486549 5512794 5524365 5514964 5496613 5451361 5446805 5464974
9407E464974N6354j634J26203J96558K15273J58580K5325J73026J17824J77866
$$ 5464974 5521328 5519694 5645897 5842455 6057728 6216308 6241633 6414659 6532483 6710349
9397F710349J10156l2515j52157k83369j02991j47100j14295L1542l6404r0484
$$ 6710349 6820505 6787990 6635833 6352464 6249473 6102373 5988078 6019620 5983216 5892732
9387E892732k56603m7099j99220r6116n7087j2475J4392M0989j7559o1609O3741
$$ 5892732 5636129 5589030 5389810 5293694 5236607 5224132 5238524 5279513 5261954 5200345 5264086
9376E264086M0602q3909r6230r1390P7561K057m0889O912J57o5446j0025J38263
$$ 5264086 5304688 5220779 5124549 5033159 5110720 5112777 5071888 5078800 5078957 5013511 5003486 5141749
9364E141749p5173J47745P7485K639M9059M2604P5370J52260o7557m8450L1402
$$ 5141749 5066576 5214321 5291806 5294445 5343504 5386108 5461478 5613738 5546181 5497731 5529133
9353E529133k6382L7510l5380O3222Q2391l3799l989q8254M9363M831Q9428O328
$$ 5529133 5502751 5540261 5504881 5568103 5650494 5616695 5612706 5524452 5573815 5578646 5668074 5674402
9341E674402Q4284J02958R7990O9796Q3983P2872l6684J08337J32591N5436O4623
$$ 5674402 5758686 5861644 5959634 6029430 6113413 6186285 6149601 6257938 6390529 6445965 6510588
9330F510588JL4995J99714O8397K102J16094L2984M1268L1489j2990j2696N7545
$$ 6510588 6510589 6545584 6745298 6813695 6815797 6931891 6964875 7006143 7037632 7024642 7011946 7069491
9318G069491N7648m1183K9154J47880N8898J3418K4858L3646M6114Q2745J4657
$$ 7069491 7127139 7085956 7115110 7262990 7321888 7335306 7360164 7393810 7439924 7522669 7537326
9307G537326R5992J60390j7485l0527M594J83661J28004R781J9047J65565J12389
$$ 7537326 7633318 7793708 7776223 7745696 7750290 7933951 8061955 8071736 8090783 8256348 8368737
9296H368737J25838Q3380P8103J94062M1739K51633J27119K18249J20302N822
$$ 8368737 8494575 8577955 8656058 8850120 8891859 9143492 9270611 9488860 9609162 9614984
9286I614984J11137J29967J83973J08130K12021K02170J76060J95745K59420J54173
$$ 9614984 9726121 9856088 10040061 10148191 10360212 10562382 10738442 10934187 11193607 11347780
9276A1347780J47799J31162J37667J57285K22447K34208K66296K29097K05224
$$ 11347780 11495579 11626741 11764408 11921693 12144140 12378348 12644644 12873741 13078965
9267A3078965J61428J79339J96167M21486K44780L23331K19370J59192L87449
$$ 13078965 13240393 13419732 13615899 14037385 14282165 14605496 14824866 14984058 15371507
9258A5371507L08508K31622L11825L07441M21820M21151M09206L09869L41858
$$ 15371507 15680015 15911637 16223462 16530903 16952723 17373874 17783080 18092949 18434807
9249A8434807M68768K94706K79616M17794M78749L43687L74475N13247M57047
$$ 18434807 18903575 19198281 19477897 19895691 20374440 20718127 21092602 21605849 22062896
9240B2062896M91839O16565N67348M95831O27484M62940P10098N33667N93700
$$ 22062896 22554735 23171300 23738648 24234479 24861963 25324903 26035001 26568668 27162368
9231B7162368O91545Q86489R04645Q10056J086114J075072J324513J620730J914413
$$ 27162368 27853913 28740402 29645047 30455103 31541217 32616289 33940802 35561532 37475945
9222C7475945K190708K516721K901365K845432K697521J560347M31228N14056
$$ 37475945 39666653 42183374 45084739 47930171 50627692 52188039 52619267 53133323
9214E3133323L93875O22487l546j349729j890525j355060j029153p77541l83941
$$ 53133323 53527198 54149685 54146139 52796410 50905885 49550825 48521672 47744131 47360190
9205D7360190K04477O31931P80785Q55661J214768J224184J329444J474262J855298
$$ 47360190 47564667 48196598 48977383 49833044 51047812 52271996 53601440 55075702 56931000
9196E6931000K144876K139954K446806L073102L590370L876671M506367M494590
$$ 56931000 59075876 61215830 63662636 66735738 70326108 74202779 78709146 83203736
9188H3203736L870157M060488N030205O476207P762177P913595P011677O781316
$$ 83203736 87073893 91134381 96164586 102640793 110402970 118316565 125328242 132109558
9180A32109558M224199K85856o38959J24456M00129m15425m854454q631991p786887
$$ 132109558 136333757 136619613 135980654 136105110 136505239 136089814 131235360 122603369 114816482
9171A14816482o013340m492654k990102j861875p80675J43036R53091J680983
$$ 114816482 108803142 104310488 101320386 99458511 98677836 98820872 99773963 101454946
9163A01454946K452858L328500M404671N636386P216881R184980J1246657J4164629
$$ 101454946 103907804 107236304 111640975 117277361 124494242 133679222 144925879 159090508
9155A59090508J7532054K0198281K1950691K1999507J6731330J0187517O397140
$$ 159090508 176622562 196820843 218771534 240771041 257502371 267689888 274087028
9148B74087028L927616L055737j360417j1046301j4573456j1213176p274681o603263
$$ 274087028 278014644 281070381 279709964 268663663 254090207 242877031 235602350 228999087
9140B28999087j0283493j2621015j2949904j5571347j9466167j9104624j5967115
$$ 228999087 218715594 206094579 193144675 177573328 158107161 139002537 123035422
9133A23035422j2935168j0275235q165212o301177m856980l763128l008997k395755
$$ 123035422 110100254 99825019 91659807 85358630 80501650 76738522 73729525 71333770
9125G1333770j741459j164298p65896m65161k17270J89371O09240J495087K397839
$$ 71333770 69592311 68428013 67662117 67196956 66979686 67169057 67778297 69273384 71671223
9116G1671223L104762L857107L838532L510839K154762J41674j121561j757102
$$ 71671223 74775985 78633092 82471624 85982463 88137225 88278899 87157338 85400236
9108H5400236l082661m457177m330146l493450l053123l071435l178261k831416
$$ 85400236 82317575 77860398 73530252 70036802 66983679 63912244 60733983 57902567
9100E7902567k612414k882194k848016k508998k023554j812711j395116r82026
$$ 57902567 55290153 52407959 49559943 47050945 45027391 43214680 41819564 40837538
9092D0837538p81862n52010l67419k58073Q7936J89735N79102P06964P20972P73922
$$ 40837538 40055676 39503666 39136247 38878174 38966110 39155845 39734947 40441911 41162883 41936805
9082D1936805L66098L24304M70476O67614J032689R30618N22689J93899P8899
$$ 41936805 42302903 42627207 43097683 43765297 44797986 45728604 46251293 46445192 46524091
9073D6524091R1105M3545r8112l84104o92373p82307o51286p72403p13051o07446
$$ 46524091 46615196 46658741 46560629 46176525 45484152 44701845 44050559 43278156 42565105 41957659
9063D1957659m54502m15818l04073l65271l65977k02030k28702j43672q0299J47774
$$ 41957659 41503157 41087339 40783266 40417995 40052018 39849988 39621286 39477614 39397315 39545089
9053C9545089K05872L58001L76784N30676N51822Q03243Q73576J115005J136459
$$ 39545089 39750961 40108962 40485746 41016422 41568244 42371487 43245063 44360068 45496527
9044D5496527J387931J373258J580066J826538J999436J987215J894695K021541
$$ 45496527 46884458 48257716 49837782 51664320 53663756 55650971 57545666 59567207
9036E9567207K114223K167947K275912K286142K445073K377685K444896K753808
$$ 59567207 61681430 63849377 66125289 68411431 70856504 73234189 75679085 78432893
9028G8432893L502350M244542N156247N755051N558831N215129L952199n79242
$$ 78432893 81935243 86179785 91336032 97091083 102649914 107865043 111817242 111238000
9020A11238000m422930l923628j894394p7083J244455J926744J760654p93721
$$ 111238000 106815070 102891442 100997048 100919965 102164420 104091164 105851818 105058097
9012A05058097m690625n373946l902015k528398j069700M08121J509735K333848
$$ 105058097 100367472 94993526 91091511 88563113 87493413 87901534 89411269 91745117
9004I1745117L019584L768903M174856M770128M551418L906347M273226N516920
$$ 91745117 94764701 98533604 102708460 107478588 112030006 115936353 120209579 125726499
8996A25726499N863018M880219L640684K423281r94106j716553L74307K341126
$$ 125726499 131589517 136469736 140110420 142533701 141539595 139823042 140197349 142538475
8988A42538475L819815L969171N98208l763875o611620p756595n997908l439366
$$ 142538475 146358290 150327461 150925669 147161794 140550174 132793579 126795671 123356305
8980A23356305j795642o48004j366775m611302n742071m556608l153121j553711
$$ 123356305 121560663 120912659 119545884 114934582 109192511 104635903 101482782 99929071
8972I9929071j61864Q13335J426719K018591K298129K149043K008757K270839
$$ 99929071 99767207 100580542 102007261 104025852 106323981 108473024 110481781 112752620
8964A12752620K186080K735061L295280L481121K906796K340369j10834l975950
$$ 112752620 114938700 117673761 120969041 124450162 127356958 129697327 129586493 125610543
8956A25610543n541503m144802k217496l73012M84618Q68661P16313j686671m902093
$$ 125610543 120069040 115924238 113706742 113333730 113818348 114687009 115403322 113716651 108814558
8947A08814558m904095l933039k609097j581436l02673M23624J009793J409593
$$ 108814558 103910463 99977424 97368327 95786891 95484218 95907842 96917635 98327228
8939I8327228J738980J684202J987002J690135K049267K992153M349242N936910
$$ 98327228 100066208 101750410 103737412 105427547 107476814 110468967 114818209 120755119
8931A20755119P940502R716038J3874691J9529879K1978658J9011998K2251227
$$ 120755119 128695621 138411659 152286350 171816229 193794887 212806885 235058112
8924B35058112P109070l2505808l6253955k5088147j9598682j4164829r161622
$$ 235058112 242167182 209661374 173407419 148319272 128720590 114555761 105394139
8917A05394139n946501m241073l179403k560240j888654j706957j423685j017737
$$ 105394139 99447638 95206565 92027162 89466922 87578268 85871311 84447626 83429889
8909H3429889p61242l68544j137K39497L14478O03816J296871K125351K769927
$$ 83429889 82668647 82300103 82298966 82538463 82852941 83456757 84753628 86878979 89648906
8900H9648906L311301L551581K358858O21950j130990k850721l531512k734055
$$ 89648906 92960207 96511788 98870646 99492596 98361606 95510885 91979373 89245318
8892H9245318j628758j52280R61628J942035K548003J912382N2671j945660l802485
$$ 89245318 87616560 87464280 88425908 90367943 92915946 94828328 94880999 92935339 89132854
8883H9132854m946993m860976m189377l456849k946927k487534j877270j418761
$$ 89132854 84185861 79324885 75135508 71678659 68731732 66244198 64366928 62948167
8875F2948167r84867o18083k83161k42331J39420L07435K50505M28517O08098
$$ 62948167 61963300 61345217 61062056 60819725 60959145 61266580 61517085 61945602 62553700
8866F2553700P96141J080435J419251J762556J954162J918011K231705K710330
$$ 62553700 63349841 64430276 65849527 67612083 69566245 71484256 73715961 76426291
8858G6426291L170701M039809M545325M672150L429488K036356P06151m91267
$$ 76426291 79596992 83636801 88182126 92854276 96283764 98320120 99026271 98535004
8850I8535004n73566k67190n82524n94842o32136o06961l82719q41499k249113
$$ 98535004 97961438 97694248 97111724 96516882 95884746 95277785 94895066 94053567 91804454
8841I1804454l906598n378330n930085n420534l974356k602008j347138j48854
$$ 91804454 87897856 82519526 76589441 71168907 67194551 64592543 63245405 63096551
8833F3096551Q64060J709278K096930K030743J255601n15638k250568l655057
$$ 63096551 63960611 65669889 67766819 69797562 71053163 70537525 68286957 64631900
8825F4631900m244290l840242l050543k487343j911663j222511o78729j03644
$$ 64631900 60387610 56547368 53496825 51009482 49097819 47875308 47196579 47092935
8817D7092935N66101J014628J576280K242659L026810L687353M153142L976178
$$ 47092935 47659036 48673664 50249944 52492603 55519413 59206766 63359908 67336086
8809F7336086L073072N09880k045630l848259n347546n380819m496901l390376
$$ 67336086 70409158 70919038 68873408 65025149 59677603 54296784 49799883 46409507
8801D6409507k348315j556850p07231k3533M88136J036624J510919K299568K746987
$$ 46409507 44061192 42504342 41797111 41773578 42261714 43298338 44809257 47108825 49855812
8792D9855812L317255L653736L344206K071351o16229k900527m595001n656905
$$ 49855812 53173067 56826803 60171009 62242360 61626131 58725604 54130603 48473698
8784D8473698n396401m423068l439483k619856j814053j455746j099006p94782
$$ 48473698 43077297 38654229 35214746 32594890 30780837 29325091 28226085 27431303
8776B7431303l94251k98268k59448k96158m05173n02683o35071n80775n74185
$$ 27431303 27037052 26738784 26479336 26183178 25778005 25275322 24640251 24059476 23485291
8767B3485291l88603m25721k67285p7775R7370r402N7905J68738J58651K07609
$$ 23485291 23096688 22670967 22403682 22325907 22423277 22413875 22471780 22640518 22799169 23006778
8757B3006778L75536M44773L52977L05406K15459O4489K02097p1879o2777k2744
$$ 23006778 23382314 23827087 24180064 24485470 24700929 24765418 24967515 24895636 24832859 24810115
8747B4810115j7609Q8508K67420M94055N04529O40379Q37462R75236R09443J124964
$$ 24810115 24792506 24881014 25148434 25642489 26147018 26787397 27624859 28600095 29509538 30634502
8737C0634502Q27810Q90847P82815N21955J25108l5063n27704q36606j005582
$$ 30634502 31462312 32353159 33135974 33657929 33783037 33747974 33220270 32383664 31378082
8728C1378082r12919o44055o53554n26856n53507p66261p00974p39266n11450
$$ 31378082 30465163 29821108 29167554 28640698 28087191 27320930 26619956 25880690 25369240
8719B5369240m07050k07407k8633m1129R6685J83577K08753K49696R2168J47563
$$ 25369240 24962190 24754783 24726150 24685021 24781706 24965283 25174036 25423732 25515900 25663463
8709B5663463J02785n2721K18597K21334K91916L61959J62627l3600j6342R8681
$$ 25663463 25766248 25713527 25932124 26153458 26445374 26807333 26969960 26936360 26920018 27018699
8699B7018699J20351M07502L27720K18330R078L3649j22187r6635j50201l15315
$$ 27018699 27139050 27546552 27874272 28092602 28101680 28135329 28013142 27916507 27766306 27450991
8689B7450991k58760k22633n9171m5098K25173L23707N91433O37643P03638R83342
$$ 27450991 27192231 26969598 26910427 26865329 27090502 27414209 28005642 28643285 29346923 30330265
8679C0330265J236362J451266K094548K381629K375383K340951J234321l55441
$$ 30330265 31566627 33017893 35112441 37494070 39869453 42210404 43444725 43089284
8671D3089284j635614k045911j463949r39136l10038M30712J070656J558379J465746
$$ 43089284 41453670 39407759 37943810 37004674 36694636 37125348 38196004 39754383 41220129
8662D1220129Q68968m21625k082344k775241k576704k153176j789540j378082
$$ 41220129 42089097 41667472 39585128 36809887 34233183 32080007 30290467 28912385
8654B8912385r17308n76589k65509j67653j67252j50681m5495M4025K76678L94161
$$ 28912385 27995077 27418488 27152979 26985326 26818074 26667393 26621898 26665923 26942601 27336762
8644B7336762P84170J020137J039465J228662J423175J621872K043377K506297
$$ 27336762 28120932 29141069 30180534 31409196 32832371 34454243 36497620 39003917
8636C9003917L062913L463821L819123L343787K236707Q29391q84446k451940
$$ 39003917 42066830 45530651 49349774 52693561 54930268 55759659 54875213 52423273
8628E2423273k937142k136659j112419K3339Q43699J727621J693097P91503o03732
$$ 52423273 49486131 47349472 46237053 46260392 47104091 48831712 50524809 51316312 50712580
8619E0712580j969100l444276m226729m253537l752860k945893k238538j745702
$$ 50712580 48743480 45299204 41072475 36818938 33066078 30120185 27881647 26135945
8611B6135945j389096r98344p72122o46463o49757o32039l27024k64538O767O3101
$$ 26135945 24746849 23748505 22976383 22329920 21680163 21048124 20721100 20456562 20463329 20526430
8601B0526430J91053J60925K76113M13963O52719P72663J086463J274560J501775
$$ 20526430 20717483 20878408 21154521 21568484 22221203 22993866 24080329 25354889 26856664
8592B6856664J658607J295530K17863j092376j752958j497018j298779q88570
$$ 26856664 28515271 29810801 30028664 28936288 27183330 25686312 24387533 23498963
8584B3498963k73653K60235O92452P36123O82231o2863r74449j825416k123166
$$ 23498963 23225310 23485545 24177997 24914120 25596351 25533488 24559039 22733623 20610457
8575B0610457k039644j595894j338320j075770r52687o33348n08224n73044m20296
$$ 20610457 18570813 16974919 15636599 14560829 13608142 12974794 12466570 11893526 11473230
8566A1473230l57319k73791j64384j32500m9413j15146N11O5907p859k37382m6824
$$ 11473230 11115911 10842120 10677736 10545236 10495823 10380677 10381188 10447095 10439236 10201854 10155030
8555A0155030j32354j15544O7642R3304M8154j8907L21509K97812O454j03016
$$ 10155030 10022676 9907132 9974774 10068078 10116232 10097325 10418834 10716646 10723100 10620084
8545A0620084j26242j51445j76055R633J58280L45119K80661L86160M63059M17282
$$ 10620084 10493842 10342397 10166342 10175975 10334255 10679374 10960035 11346195 11809254 12226536
8535A2226536J34947j01007r9623k79584k60496m71413o10635o64654n30293m46921
$$ 12226536 12361483 12260476 12160853 11881269 11620773 11149360 10538725 9874071 9343778 8896857
8525H896857n39018l57861k78997l13970k29737j44605n6795L6481n4315j11797
$$ 8896857 8357839 7999978 7720981 7407011 7177274 7032669 6975874 7012355 6958040 6846243
8515F846243j38859k28003j2522Q978K1168J66537Q8053N3943J32418J16445K42637
$$ 6846243 6707384 6479381 6466859 6475837 6497005 6663542 6751595 6805538 6937956 7054401 7297038
8504G297038J46842J34517J70682J58983K48107K75145L41986R3435K1722p4090
$$ 7297038 7443880 7578397 7749079 7908062 8156169 8431314 8773300 8866735 8888457 8814367
8494H814367l37871m52518m04087n43916m71858l65085m66624m17256l41168k54225
$$ 8814367 8476496 8023978 7619891 7075975 6604117 6239032 5772408 5355152 5013984 4759759
8484D759759k99807k52995j72141o5899n1390q2621j54279j98520o3825r6002
$$ 4759759 4459952 4206957 4034816 3968917 3917527 3834906 3680627 3482107 3418282 3322280
8474C322280j05412j54003m4539J27449k0298r8782K2325l3231R894J04578j17593
$$ 3322280 3216868 3062865 3018326 3145775 3125477 3026695 3049020 3015789 3025683 3130261 3012668
8463C012668j05235m1097J168j27729r7517L2691n8486o7981j58258n4425P6760
$$ 3012668 2907433 2866336 2867504 2739775 2642258 2674949 2616463 2548482 2390224 2335799 2412559
8452B412559j5592J15560J29190K1421J1105J10437m7262l32076j67636o7834
$$ 2412559 2396967 2512527 2641717 2663138 2674243 2784680 2737418 2405342 2237706 2169872
8442B169872r4884j30308p7941K8491j54075n1069R0665P3463o5542p5135O1110
$$ 2169872 2074988 1944680 1866739 1895230 1741155 1690086 1780751 1854214 1788672 1713537 1774647
8431A774647j12012J4086L1847K4327N5918K9210o0128j8573k9088q9438j16588
$$ 1774647 1662635 1676721 1708568 1732895 1788813 1818023 1757895 1739322 1710234 1620796 1504208
8420A504208j4439j150j55066O624K8817P878j17360p2383J8471Q8785o8767r4931
$$ 1504208 1489769 1488619 1333553 1340177 1368994 1376872 1259512 1187129 1205600 1294385 1225618 1130687
8408A130687p0469p1597m2079L9516J15884o2298M0622j47287j7249j00815M6209
$$ 1130687 1060218 988621 946542 986058 1101942 1039644 1080266 932979 915730 814915 861124
8397H61124Q3545p2035J0746n4483K3656m214R5810l5361p1371l4264n503K4359
$$ 861124 944669 872634 883380 828897 852553 848339 944149 908788 837417 803153 797650 822009
8385H22009N8190p0332M6277P6619j51591R516M4614J9007O2777j07679Q914O8418
$$ 822009 880199 809867 856144 932763 781172 790688 835302 854309 917086 809407 818321 886739
8373H86739N1022m6780j7673O8584n7224j8001o3837Q6433J00119j1227j3463
$$ 886739 937761 890981 873308 941892 884668 866667 802830 889263 989382 978155 964692
8362I64692m4890m3621k5834k507n9870j7857J7976n4626L0074o742j3733J2706
$$ 964692 919802 876181 850347 847840 787970 770113 788089 733463 763537 756795 743062 755768
8350G55768q6033L3196J05155K5938m1900N1100r0103j33759L7012J1559l8520
$$ 755768 669735 702931 808086 834024 792124 843224 753121 619362 656374 667933 629413
8339F29413J2493J47358l7073r0042j2739P5001O9872r033l0696J36180L7361
$$ 629413 641906 789264 752191 662149 649410 724411 794283 785250 754554 890734 928095
8328I28095q4742l9495j09377J7770O1209J12804J30955J14949l5559N8929j21764
$$ 928095 843353 803858 694481 712251 773460 886264 1017219 1132168 1096609 1155538 1033774
8317A033774m4783J0808j8028J43246q7899r1285J06952J16836q7013n7225n1380
$$ 1033774 988991 999799 981771 1125017 1037118 945833 1052785 1169621 1082608 1025383 974003
8306I74003l9664r247r4154r0745n0950J6214Q076R1619n3035q296j30847n1223
$$ 974003 934339 925092 830938 740193 689243 705457 713533 805152 752117 743821 612974 561751
8294E61751N9424J1054L9202r2635k0660J35203M0793j4310N7127j9256l8012
$$ 561751 621175 632229 671431 578796 558136 693339 734132 719822 776949 757693 719681
8283G19681j9619J20592R5766m1538O8278J23274P7957m1611j23295k7163L4495
$$ 719681 700062 820654 916420 874882 943160 1066434 1144391 1102780 979485 952322 986817
8272I86817O7033j22215R8614P6281J27561J7225j14276Q838m6017P0622k3679
$$ 986817 1053850 931635 1030249 1106530 1234091 1251316 1137040 1145878 1099861 1170483 1146804
8261A146804q2880L9387k3237l6865O3909R7443N5895J20066n6453j06074o8071
$$ 1146804 1063924 1103311 1080074 1043209 1107118 1204561 1260456 1380522 1324069 1217995 1149924
8250A149924l9127p1582q9723o2200j90986P8632K4075J2561N8561n9835O6322
$$ 1149924 1110797 1039215 949492 887292 696306 774938 799013 811574 870135 810300 876622
8239H76622l96k255P2587p4864J0573K39284J68720M860l0793k3471r6703r500
$$ 876622 876226 873971 946558 871694 882267 1121551 1290271 1295131 1264338 1240867 1144164 1134664
8227A134664k8539l7051j18606l2117q6866k1671P1290m9794j68356p9499J37300
$$ 1134664 1106125 1069074 950468 918351 831485 809814 881104 831310 662954 583455 720755
8216G20755k2749M5734J04843r445n3912l1905O7770m4242p6724j33012m0906
$$ 720755 698006 743740 848583 839138 785226 753321 821091 776849 700125 567113 526207
8205E26207n4760L7062J96295j30358N7749j24670j04295J87516L0158p0572R8553
$$ 526207 471447 508509 704804 574446 632195 507525 403230 590746 620904 550332 648885
8194F48885j31800Q5696k70373j97963K37865l8439Q4341n1982M4164q0375l7776
$$ 648885 517085 602781 332408 134445 372310 333871 418212 366230 410394 330019 292243
8183B92243O1838J4637l9344j27913J3926Q0610j8824j4754q8202l7676K1676
$$ 292243 354081 368718 329374 201461 215387 295997 277173 262419 174217 136541 158217
8172A58217M0579l375J3035L0668q309n9326J5503J9579p17o0141n1497n7494
$$ 158217 198796 195421 208456 239124 230815 171489 186992 206571 205854 145713 94216 36722
8160C6722P6440j5600O822R1923m8979p4144P1964j1301j31792m5118O7065J8604
$$ 36722 113162 97562 104384 196307 147328 73184 145148 133847 2055 -43063 24002 42606
8148D2606q7906P2347j01697K5905J04084m2722j06507P5618P775R1493Q4510
$$ 42606 -45300 27047 -74650 -48745 55339 12617 -93890 -18272 -10497 80996 165506
8137A65506M6742j01459p4430j06897N750l1480N3967J03628k0567q1541m9997
$$ 165506 212248 110789 36359 -70538 -64788 -96268 -42301 61327 40760 -40781 -90778
8126i0778k6118p074O8731l0529K8433L6535J00431q2265j21656o4673o014Q7260
$$ -90778 -116896 -123970 -55239 -85768 -57335 -20800 79631 -2634 -124290 -188963 -194977 -107717
8114a07717O7401l0899j04794O8091L8392k6465O8554n5682Q9809J27611j05590
$$ -107717 -40316 -71215 -176009 -107918 -69526 -95991 -27437 -83119 6690 134301 28711
8103B8711l1329p1404m0467K2480k131M7474l6613j00170M9586M2810o1253L7475
$$ 28711 -2618 -74022 -114489 -92009 -94140 -46666 -83279 -183449 -133863 -91053 -152306 -114831
8091a14831P0447J5420k3018n5281m5460Q730M2607M920M253K0485k6992N4753
$$ -114831 -44384 -28964 -51982 -107263 -152723 -143993 -101386 -96466 -92213 -71728 -98720 -43967
8079d3967P166k4141L0309j2635o7439N2733K4146L3572r4613j9107O5348J4481
$$ -43967 -36801 -60942 -30633 -43268 -110707 -57974 -33828 -256 -94869 -113976 -48628 -34147
8067c4147K0274L9686j17957l7594r2134k8134J53122J3340j2238M8883r2653
$$ -34147 -13873 25813 -92144 -129738 -221872 -250006 -96884 -83544 -95782 -46899 -139552
8056a39552p2394O3197j6079P3671l3454n5169N4573K1514j1284Q1804j8369m4538
$$ -139552 -211946 -148749 -164828 -91157 -124611 -179780 -125207 -103693 -114977 -33173 -51542 -96080
8044i6080P203O8338M1906j1766J869L8416J08855L6888J05110J2852o9492k514
$$ -96080 -88877 -20539 21367 9601 11470 49886 158741 195629 300739 313591 244099 241585
8032B41585n146o0844k8351p4025m8163P9448r0270n9915K2928N0282J994j9096
$$ 241585 236439 175595 147244 73219 25056 104504 14234 -45681 -22753 27529 29523 10427
8020A0427k1622j3346k7821r117j15825P0130J16372M0783l9111j59042J29014
$$ 10427 -11195 -24541 -52362 -61479 -177304 -107174 9198 49981 10870 -148172 -19158
8009a9158n891j03633K1542K5436K7285m9314N5065J52502j4328P2740K9726n9332
$$ -19158 -25049 -128682 -107140 -81704 -54419 -103733 -48668 103834 89506 162246 191972 132640
7997A32640m5238n7600m2624Q4602K683r1339o1436J929O0632n7805n6461K9983
$$ 132640 87402 29802 -12822 71780 74463 -16876 -78312 -76383 -15751 -73556 -130017 -100034
7985a00034o3697l0324L4537n3798m7284P7056P5856r7439m6363J75658M5075
$$ -100034 -163731 -194055 -159518 -213316 -260600 -183544 -107688 -205127 -251490 -75832 -30757
7974c0757l5788K6967P4002n567Q218Q8614n7760O117j5074o3881m1356J1913
$$ -30757 -66545 -39578 34424 28857 37075 125689 67929 74046 58972 -4909 -46265 -34352
7962c4352j6252Q9736J963p2155j1985L3914m7097L3247l0306p3334P105k5857
$$ -34352 -50604 39132 41095 -31060 -43045 -9131 -56228 -22981 -53287 -126621 -119516 -145373
7950a45373L6421o649l3090l1765l5213J35300m23j28492J07898K8868N729J4398
$$ -145373 -108952 -115601 -148691 -180456 -215669 -80369 -80792 -209284 -101386 -72518 -66789 -52391
7938e2391M1739p1666q3274O0115J18467o4244k1275L8651M7545o3002l9434l572
$$ -52391 -10652 -82318 -165592 -105477 12990 -51254 -72529 -33878 13667 -49335 -88769 -92341
7926i2341o8L5226l7536r4556k8898J11673j1043K4850p579r0548l0430M8653
$$ -92341 -92409 -57183 -94719 -189275 -218173 -106500 -117543 -92693 -100272 -190820 -221250 -172597
7914a72597Q5857j7451j05262J13532q8263n2353k1601L3507K8252l7060m6882
$$ -172597 -86740 -104191 -209453 -95921 -184184 -236537 -258138 -224631 -196379 -233439 -280321
7903b80321l7423O7707L1599k2887J6892P8641K1776n6135j28131J4375L3252
$$ -280321 -317744 -250037 -218438 -241325 -224433 -145792 -124016 -180151 -308282 -293907 -260655
7892b60655j2462K5842J476J5964K3602m7678P6427K9548J0221r6052J3798K6574
$$ -260655 -273117 -247275 -245799 -229835 -206233 -253911 -177484 -147936 -137715 -233767 -219969 -193395
7880a93395M2594N0919j57530m7358M9700N8120P4146q333j20918o6955J08755
$$ -193395 -150801 -99882 -257412 -304770 -255070 -196950 -122804 -131137 -252055 -319010 -210255
7869b10255N3486o0491J6172N2905R2305J1610p2380o4756N6570m455l2119j1547
$$ -210255 -156769 -217260 -201088 -148183 -55878 -44268 -116648 -181404 -124834 -129289 -161408 -172955
7857a72955R2886N5674R0839k6768J2524k0820p5664K0523j27031m8368l3785
$$ -172955 -80069 -24395 66444 39676 52200 31380 -44284 -23761 -150792 -199160 -232945
7846b32945j117O199N7776J4831M4407M0812P353m8544j152L2064m4185J164j07248
$$ -232945 -234062 -227863 -170087 -155256 -110849 -70037 -62684 -111228 -112380 -80316 -124501 -123337 -230585
7833b30585k3041L2960L816k6769M4040m7860O8809K080J7153L1677p8395O2278
$$ -230585 -253626 -220666 -216850 -243619 -199579 -247439 -178630 -176550 -159397 -127720 -206115 -143837
7821a43837Q7606r7072j91377J4161J02149m9559m5047P3420k6940R5811j1950
$$ -143837 -56231 -153303 -344680 -330519 -228370 -277929 -322976 -249556 -276496 -180685 -192635
7810a92635m1956R2213M2684j26953j05631J91574J12061l5317p5645j07633N2894
$$ -192635 -234591 -142378 -99694 -226647 -332278 -140704 -28643 -63960 -139605 -247238 -194344
7799a94344n565l4116m7342j4288R7552J4658L4329k0999j08316k7966o4724R6022
$$ -194344 -199909 -234025 -281367 -295655 -198103 -183445 -149116 -170115 -278431 -306397 -371121 -275099
7787b75099l2457Q8576J8895r2614l3715N5737o1898L0161J07331O2137j04822
$$ -275099 -307556 -218980 -200085 -292699 -326414 -270677 -332575 -302414 -195083 -132946 -237768
7776b37768j58527J43O1227m6406P2782k2830m08R8570M8187j27073j20917P3520
$$ -237768 -396295 -396152 -334925 -381331 -308549 -331379 -331787 -233217 -185030 -312103 -433020 -359500
7764c59500k9411N0699j0490M8903J5108N914k4551N8512K832j7847l9947K1760
$$ -359500 -388911 -338212 -348702 -299799 -284691 -278777 -303328 -244816 -241984 -259831 -299778 -278018
7752b78018m836P6854o0448P0237K8732o9922k734L9044L8338l6017M811J19070
$$ -278018 -282854 -206000 -266448 -196211 -167479 -237401 -240135 -201091 -162753 -198770 -193959 -74889
7740g4889j36870l9625Q6991j35373M2860l6131L3230J344o9749k3022P5547L7573
$$ -74889 -211759 -251384 -164393 -299766 -256906 -293037 -259807 -258463 -328212 -351234 -275687 -238114
7728b38114j858L3180l8433l5184n0939O6835r114K1110q2522j0467J15282j12315
$$ -238114 -239972 -206792 -245225 -280409 -331348 -264513 -273627 -252517 -335039 -345506 -230224 -342539
7716c42539l0991M6676O35J4226J4734L9721N5144q9137M1434m9427l4658l1010
$$ -342539 -373530 -326854 -326219 -311993 -297259 -257538 -202394 -291531 -250097 -299524 -334182 -365192
7704c65192J7005J11268k5383o2819N8339N192n1682j5800Q3065j5317n6661k7437
$$ -365192 -348187 -236919 -262302 -325121 -266782 -261590 -313272 -329072 -246007 -261324 -317985 -345422
7692c45422j11736J26346M0420j0984L8973m6188M0355J20190q2976j51954j6726
$$ -345422 -457158 -330812 -290392 -301376 -262403 -308591 -268236 -148046 -231022 -382976 -399702
7681c99702J5206m6369M2385J8424P0302Q5827m9201m4559J9115O655N125L5124
$$ -399702 -384496 -430865 -388480 -370056 -299754 -213927 -263128 -307687 -288572 -281917 -276792 -241668
7669b41668K4822p1476q4323j9724j3350l8918k2601L5368M0184L2232m8168j0523
$$ -241668 -216846 -288322 -372645 -392369 -405719 -444637 -467238 -431870 -391686 -359454 -407622 -418145
7657d18145L1284J10911p760j01882k0198N6465M0735j39645K5057R08M5557k886
$$ -418145 -386861 -275950 -283710 -385592 -405790 -349325 -308590 -448235 -423178 -422270 -376713 -379599
7645c79599k1443o1558R7692M5216K749j14439p7865O783P4914L6666p120N6440
$$ -379599 -401042 -462600 -364908 -319692 -316943 -431382 -509247 -502464 -427550 -390884 -398004 -341564
7633c41564l8628O7861p1514l2735q103O701l4267n7394o5191N6595J29571m6971
$$ -341564 -380192 -312331 -383845 -416580 -424683 -417982 -452249 -509643 -574834 -518239 -388668 -435639
7621d35639K288O35L3158M3574j10651n5918Q0709J03872l9134O8224M6056J1868
$$ -435639 -433351 -432716 -399558 -355984 -466635 -522553 -441844 -337972 -377106 -308882 -262826 -250958
7609b50958q1299N4204j17312j42515J36884P4538M6884Q667R093q0829r9894
$$ -250958 -332257 -278053 -395365 -537880 -400996 -326458 -279574 -270907 -261814 -342643 -442537
7598d42537N2080o343J082J05182p1896O7513J32544j10683m9731l412j19133
$$ -442537 -390457 -396800 -395718 -290536 -362432 -294919 -162375 -273058 -322789 -326201 -445334
7587d45334l594O5851K1977o106n3716P2520o676N9673R756j945n7228M0780M3016
$$ -445334 -448928 -383077 -361100 -367206 -420922 -348402 -355078 -295405 -285649 -287594 -344822 -304042 -261026
7574b61026k2374P0894R5462k3695j09923j8032J62901n0320q7773l8140k7280
$$ -261026 -283400 -212506 -117044 -140739 -250662 -268694 -105793 -156113 -243886 -282026 -309306
7563c09306J0493J6890O6462j25688L7086J02048N429K8189m3591L0004K7368
$$ -309306 -298813 -281923 -215461 -341149 -304063 -202015 -196586 -168397 -211988 -181984 -154616
7552a54616m2883O4045K2670p01J0014m62q1851J0986J306J5260J1034k4351O9768
$$ -154616 -197499 -133454 -110784 -111485 -101471 -101933 -183784 -172798 -171492 -156232 -145198 -169549 -99781
7539i9781l3281k1410O7037M8282k5356L7306j030j9259m8659K7828Q0319N5980
$$ -99781 -133062 -154472 -87435 -39153 -64509 -27203 -28233 -47492 -96151 -68323 11996 67976
7527F7976o3200R414p4686N4782O0098J9578L9291J5419J1337N7767L9205r3715
$$ 67976 4776 14190 -60496 -5714 54384 73962 113253 128672 140009 197776 236981 143266
7515A43266j0525j35836k6564j518k140m3954M0848N3347k3786n7953K6385J0025
$$ 143266 132741 -3095 -29659 -31177 -33317 -77271 -36423 16924 -6862 -64815 -38430 -28405
7503b8405O6787m6102n6697m522n0265j33297J31874l4215l7007j9016K2685O7099
$$ -28405 38382 -7720 -64417 -68939 -119204 -252501 -120627 -154842 -191849 -210865 -188180 -121081
7491a21081K421q1719K390j1619R0299N2242l050p6632q6553j9071K3252n7118
$$ -121081 -118660 -200379 -197989 -209608 -119309 -67067 -70117 -146749 -233302 -252373 -229121 -286239
7479b86239M5524K6969m7006j10791p8416N062J6630P4692J0494Q285l1171k8214
$$ -286239 -240715 -213746 -260752 -371543 -449959 -444897 -428267 -353575 -343081 -334796 -365967 -394181
7467c94181l3287P5422j2071J3101r618m0936m0695j2853r722J25524j937n7370
$$ -394181 -427468 -352046 -364117 -351016 -360634 -401570 -442265 -455118 -464840 -339316 -341253 -398623
7455c98623k3904N6068M2102r1424l4964O5966p8092j5076O6100m5918N9221O6488
$$ -398623 -422527 -366459 -324357 -415781 -450745 -384779 -462871 -477947 -411847 -457765 -398544 -332056
7443c32056j04427j0602N4912R342l031j6132q8787l3387R1528J9135r6405J1192
$$ -332056 -436483 -447085 -392173 -382831 -385862 -401994 -490781 -524168 -432640 -413505 -509910 -498718
7431d98718N5704O061m2095M8404M2334J0127j2279k9492k4309N422l9384Q0323
$$ -498718 -443014 -436953 -479048 -430644 -388310 -378183 -390462 -419954 -444263 -438841 -478225 -397902
7419c97902J0113o5473j5850k8906l948Q152J1472O946K1468J9055j29542O4183
$$ -397902 -387789 -453262 -469112 -498018 -501966 -493814 -482342 -475396 -453928 -434873 -564415 -500232
7407e00232k7430l7011M5583j3394K438J5811R1573N1942o1732l5194K5581l9979
$$ -500232 -527662 -564673 -519090 -532484 -530046 -514235 -422662 -370720 -432452 -467646 -442065 -482044
7395d82044p1351r670K2537Q2839K9024l3828m6513K7646p059P8441j21656q6039
$$ -482044 -553395 -563065 -540528 -457689 -428665 -462493 -509006 -481360 -488419 -409978 -531634 -617673
7383f17673J75638o7744L5674n9961m617m9282K0519M0510r508j0529r7721M2824
$$ -617673 -442035 -509779 -474105 -534066 -538683 -587965 -567446 -526936 -536444 -546973 -644694 -601870
7371f01870R1221l9888l0641j2481J2520K1867j9332Q2139M6693j06644j24363
$$ -601870 -510649 -550537 -581178 -593659 -581139 -559272 -578604 -496465 -449772 -556416 -680779
7360f80779K2501R5203l0344p4585R9369k770k0325J03371q1120j18007M7507
$$ -680779 -658278 -563075 -593419 -668004 -568635 -571405 -591730 -488359 -569479 -687486 -639979
7349f39979L3060l9467k2746j41405J03700O9626K6442J04104j5634o2117k4128
$$ -639979 -606919 -646386 -669132 -810537 -706837 -637211 -610769 -506665 -522299 -584416 -608544
7338f08544q2903n9595Q9222L0975M8951R730m7410J51468Q44o2262k3744J3532
$$ -608544 -691447 -751042 -661820 -630845 -581894 -572164 -619574 -468106 -467262 -529524 -553268 -539736
7326e39736r0631N6667J2263j9783j8007Q7992L6527j04627M8719l4426O6872
$$ -539736 -630367 -573700 -561437 -581220 -599227 -511235 -474708 -579335 -530616 -565042 -498170
7315d98170Q978L7164p3929q894m278N5606J2222l5185L0916l2495L4904m2342
$$ -498170 -489192 -452028 -525957 -534851 -539129 -483523 -471301 -506486 -475570 -508065 -473161 -515503
7303e15503M8268k7419J7176M2485m2757M3727J2481o4984K1311j4352m9576O6608
$$ -515503 -467235 -494654 -477478 -434993 -477750 -434023 -421542 -486526 -465215 -479567 -529143 -462535
7291d62535P0274o4238L3072L6876j36934m1566K6003N8584j61369L0629P0078
$$ -462535 -392261 -456499 -423427 -386551 -523485 -565051 -539048 -480464 -641833 -611204 -541126
7280e41126J6463j6060n5121N8022J3826q8553K721J04197L3787n9502q1405R8844
$$ -541126 -524663 -540723 -595844 -537822 -523996 -612549 -609828 -505631 -471844 -531346 -612751 -513907
7268e13907R8157j8994l3138k4322q3873K6976o753k2188J9127P9023q7276K23
$$ -513907 -415750 -434744 -467882 -492204 -576077 -549101 -555854 -578042 -558915 -479892 -567168 -566945
7256e66945L2739k10109J57984N4312n7821L0835P9478M1594K6231L6574m9014
$$ -566945 -534206 -744315 -586331 -532019 -589840 -559005 -479527 -437933 -411702 -375128 -424142
7245d24142j25565L3784Q4N6252J940m7920J2538M3447Q5780n4489m9293l8277
$$ -424142 -549707 -515923 -515839 -459587 -457647 -505567 -493029 -449582 -363802 -418291 -467584 -505861
7233e05861J333O1041M6724j21911R0134l0477p213n6658J7125J0040j0903L0149
$$ -505861 -504528 -443487 -396763 -518674 -428540 -459017 -466230 -522888 -505763 -495723 -506626 -476477
7221d76477K4708O803l480k2695P887N4326k6031j35872N6746O5817p0272M6957
$$ -476477 -451769 -444966 -448446 -471141 -463254 -408928 -434959 -570831 -514085 -448268 -518540 -471583
7209d71583N3293k0823j54674j05107O5345K7892M2350Q8701r0713k5512O1647
$$ -471583 -418290 -439113 -593787 -698894 -633549 -605657 -563307 -474606 -565319 -590831 -529184
7198e29184O4981r9272k5293L5420J5567o1024N0497o375R3568J8727n421m8021
$$ -529184 -464203 -563475 -588768 -553348 -537781 -598805 -548308 -554683 -461115 -442388 -447809 -495830
7186d95830N6333J5557j5766k427q7689m0345l8352L2343R0491K1918n6726K8709
$$ -495830 -439497 -423940 -439706 -442133 -529822 -570167 -608519 -576176 -485685 -463767 -520493 -491784
7174d91784j9225l2487q9894j7142J05502L4999M8417k6144j00543J850j8687
$$ -491784 -511009 -543496 -633390 -650532 -545030 -510031 -461614 -487758 -588301 -586451 -605138
7163f05138J6640N9942M4091l352k6529j0135r0858J09793j582o831J7303m4737
$$ -605138 -588498 -528556 -484465 -487817 -514346 -524481 -615339 -505546 -507128 -513959 -496656 -541393
7151e41393m9898j6739K8517K4836K5301j11885K26432O2406j51589K4113l1670
$$ -541393 -591291 -608030 -579513 -554677 -529376 -641261 -414829 -352423 -504012 -479899 -511569
7140e11569r0603m1836O1685M9728r038j8862l9954l106N7792J04182j16679K2849
$$ -511569 -602172 -644008 -582323 -532595 -541633 -560495 -600449 -603555 -545763 -441581 -558260 -535411
7128e35411j08632j5461q492J8519O1105k8050Q0090j438N0028j19071R8841K2575
$$ -535411 -644043 -659504 -667996 -649477 -588372 -616422 -536332 -537770 -487742 -606813 -507972 -485397
7116d85397n6231r290K0429R2611j4534K8575j552j9638j7933J02926j08277r9104
$$ -485397 -541628 -550918 -530489 -437878 -452412 -423837 -425389 -445027 -462960 -360034 -468311 -567415
7104e67415r4613Q0205N3415r2494r106O7667J05882K4392k9816R144p3922l3136
$$ -567415 -662028 -581823 -528408 -620902 -630008 -562341 -456459 -432067 -461883 -452739 -526661 -559797
7092e59797M297l5406K6063M3792k461L407k2261L7907o7620n4137n046K1975
$$ -559797 -555500 -590906 -564843 -521051 -523512 -520105 -542366 -504459 -572079 -626216 -631262 -609287
7080f09287O624k0186N565J1884O3970K5334m849j21577j3077J3425N9202l1753
$$ -609287 -602663 -622849 -617284 -605400 -541430 -516096 -520945 -642522 -655599 -642174 -582972 -614725
7068f14725N5025O4671Q9546K4829l2551j19440n3616L7645O3501l106L109m487
$$ -614725 -559700 -495029 -405483 -380654 -413205 -532645 -586261 -548616 -485115 -488221 -485112 -489599
7056d89599p9902J09717k6940j86275L6151J17611k0893k931N0211K8731l7910
$$ -489599 -569501 -459784 -486724 -672999 -636848 -519237 -540130 -543061 -492850 -464119 -502029
7045e02029j28426J15736m8022q7911N9016J1783K7937M7093O7998p238m5925
$$ -502029 -630455 -514719 -562741 -650652 -591636 -579853 -551916 -504823 -436825 -444063 -489988
7034d89988Q7195K8916q2079R008o1933n0475j9431L9212M765n7458O4564j7950
$$ -489988 -402793 -373877 -455956 -446948 -508881 -559356 -578787 -539575 -534810 -592268 -527704 -545654
7022e45654J351J38782L891n539Q8400k0349L8591k3345j58380m3355k7572R6649
$$ -545654 -544303 -405521 -401630 -407169 -318769 -339118 -300527 -323872 -482252 -525607 -553179 -456530
7010d56530j9425n349J36846j03049M2193o3942j14640J29113K7396r7235k7236
$$ -456530 -475955 -481304 -344458 -447507 -405314 -469256 -583896 -454783 -427387 -524622 -551858
6999e51858K7125L1695K883j7374M9491N4295j30771K7139J74562k42349o1822
$$ -551858 -524733 -493038 -490155 -507529 -458038 -403743 -534514 -507375 -332813 -575162 -636984
6988f36984M7058O7035Q6981n9049L7681j6295q8120n9057j9423N6734O1466k3706
$$ -636984 -589926 -522891 -435910 -494959 -457278 -473573 -561693 -620750 -640173 -583439 -521973 -545679
6976e45679o5022N9802J3917M7984K7327n6593q5133N6770J6966r0836P3519L1761
$$ -545679 -610701 -550899 -536982 -488998 -461671 -518264 -603397 -546627 -529661 -620497 -546978 -515217
6964e15217l7641P1735j3240j5813Q5419N4517J5454q7517m4174K137k899R5544
$$ -515217 -552858 -481123 -494363 -510176 -424757 -370240 -354786 -442303 -486477 -484340 -487239 -391695
6952c91695K9427j19512R3589J9222q2050j2937j25641J47948K4013k9610K703
$$ -391695 -362268 -481780 -388191 -368969 -451019 -463956 -589597 -441649 -417636 -447246 -444543
6941d44543r903M4073m9894R462N3207q5437M057j8498p4017k6157j4933P0248
$$ -444543 -454446 -410373 -460267 -450805 -397598 -483035 -478978 -497476 -571493 -597650 -612583 -542335
6929e42335M4436r9l0819j9779m9242K1422N180J912K9174O1760r6242N459N0715
$$ -542335 -497899 -497998 -528817 -548596 -597838 -576416 -571236 -569324 -540150 -478390 -574632 -569173 -518458
6916e18458r8249M7934Q0844M7235K9444p0080J12403l3246r5899O0243l0917
$$ -518458 -616707 -568773 -487929 -440694 -411250 -481330 -368927 -402173 -498072 -437829 -468746
6905d68746j5112N7022n2760J6638P063J1174l1357n7371N7510L2302l2974m0246
$$ -468746 -483858 -426836 -479596 -462958 -455895 -444721 -476078 -533449 -475939 -443637 -476611 -516857
6893e16857J1047O4888M4369K8879J4594j21087r4385Q6921J18238l2679O2606
$$ -516857 -505810 -440922 -396553 -367674 -353080 -474167 -568552 -481631 -363393 -396072 -333466
6882c33466k05j33010m2986j2967K6807k2775o133K6498P0124O8863n3226l8423
$$ -333466 -333671 -466681 -509667 -522634 -495827 -518602 -524735 -498237 -428113 -359250 -412476 -450899
6870d50899R245K3199k7292l2230K2355Q0981l4548j4730N7748O2395m6206j05253
$$ -450899 -441654 -418455 -445747 -477977 -455622 -374641 -409189 -423919 -366171 -303776 -349982 -455235
6858d55235K2694q2719j0752L0489Q58Q6855Q4330M289n1450K8932J249j00788
$$ -455235 -432541 -515260 -526012 -495523 -494665 -407810 -323480 -319191 -370641 -341709 -340460 -441248
6846d41248R603N3091j23970p117J41331o7580M93K1773J8224J8182k3019l8344
$$ -441248 -431645 -378554 -502524 -509641 -368310 -435890 -435397 -413624 -395400 -377218 -400237 -438581
6834d38581j23720P5486M2211J3318q2197J3250O5327q861J3930m8939N0221Q498
$$ -438581 -562301 -486815 -444604 -431286 -513483 -500233 -434906 -443767 -429837 -478776 -428555 -420057
6822d20057L1139k0632L3429j4316m6470R556m8078O4814O1230O486J8330q9243
$$ -420057 -388918 -409550 -376121 -390437 -436907 -427351 -475429 -410615 -349385 -342899 -324569 -413812
6810d13812o3057O8376K5059O2452j14208j9327L9643O9749Q227q2797n6645l2006
$$ -413812 -476869 -408493 -383434 -320982 -435190 -454517 -414874 -345125 -336898 -419695 -476340 -508346
6798e08346J39480R8546q356k5813P6687m3454o0401k321q6024O4022R6917k6714
$$ -508346 -368866 -270320 -278676 -304489 -227802 -271256 -331657 -333978 -420002 -355980 -259063 -285777
6786b85777J05010j38549q9564M6837M781K7873M8664O1313o5948L7832J32708
$$ -285777 -180767 -319316 -408880 -362043 -357262 -329389 -280725 -219412 -285360 -247528 -114820
6775a14820m8107N3442N5742j38768q3976Q3747J61817r9780m3767n6436P8930
$$ -114820 -162927 -109485 -53743 -192511 -276487 -192740 -30923 -130703 -174470 -230906 -151976
6764a51976k5493J4253J8979o4225J4279k2941L7049J4148M4646m3665K1757M7801
$$ -151976 -177469 -163216 -144237 -208462 -194183 -217124 -180075 -165927 -121281 -164946 -143189 -95388
6752i5388o2719O3839j30578J3507O4381P950r2459K4867J38378n560J39777l7596
$$ -95388 -158107 -94268 -224846 -211339 -146958 -139008 -231467 -206600 -68222 -73782 65995 28399
6740B8399o3327M9550k9642m240Q0713j9895K4744P8059o881j10726K2054J38680
$$ 28399 -34928 14622 -15020 -19260 61453 41558 66302 144361 137480 26754 48808 187488
6728A87488o9013N8390M1883j4638J4800k1621m7936K5019m943l1719R3387j14016
$$ 187488 118475 176865 218748 204110 218910 197289 149353 174372 169429 137710 231097 117081
6716A17081r582J22437j2460l2873J352J7714K2160M3041M8982l0216L1101j9778
$$ 117081 107499 229936 217476 184603 185955 203669 225829 268870 317852 287636 318737 298959
6704B98959M8251J08097p817q591k3754J40586K5391j22016J17118j18768k7228
$$ 298959 347210 455307 447490 438899 415145 555731 581122 459106 576224 457456 430228
6693D30228q4825m3744j6922q4190K110Q6941j37498r400K1809M5535M1091N0688
$$ 430228 345403 301659 284737 200547 202657 289598 152100 142700 164509 210044 251135 301823
6681C01823p846n341R1285J68817j4676j280p697J9346m1573p8942L4029k4345
$$ 301823 293977 288636 379921 548738 534062 532782 525085 544431 502858 423916 457945 433600
6669D33600q0371p323R6034l5396M3296o9431r6163M3789Q2276o9198m5476n4398
$$ 433600 353229 345906 441940 406544 449840 380409 284246 328035 410311 341113 295637 241239
6657B41239J0767n8885N8150P2700j1082J7073J7588L4320j1704K9362J03456
$$ 241239 252006 193121 251271 323971 312889 329962 347550 381870 370166 399528 502984
6646E02984j40851o5316J41905J4451n3316k8224l0870l8793Q7653q434N750M5059
$$ 502984 362133 296817 438722 453173 399857 371633 340763 301970 389623 381189 386939 431998
6634D31998l8784N9632M9267O4031k2806R346r8495p0493O7465L5348P576P5184
$$ 431998 393214 452846 502113 566144 543338 552684 454189 383696 451161 486509 494085 569269
6622E69269J6273K1361l4381J19728n2545o010J5928j4217p3405K6838l5770J1852
$$ 569269 585542 606903 572522 692250 639705 633695 649623 635406 562001 588839 553069 564921
6610E64921o649J6960O1076R7483q2459j2271R9806K479Q6012k4819p2180M0350
$$ 564921 558272 575232 636308 733791 651332 639061 738867 741346 827358 802539 730359 770709
6598G70709J65331k7649k2021M8900j01557O9962Q0479m0955R970m0013j1951
$$ 770709 936040 908391 886370 935270 833713 903675 984154 943199 953169 913156 901205
6587I01205N1643M1068Q0503J19785L9735r7825l925K5296L7528J6903J9527m0844
$$ 901205 952848 993916 1074419 1194204 1233939 1136114 1132189 1157485 1195013 1211916 1231443 1190599
6575A190599K4835O6587K2475P3287r8518J04355l0686O8017L2699K0516J3800
$$ 1190599 1215434 1282021 1304496 1377783 1279265 1383620 1352934 1420951 1453650 1474166 1487966
6564A487966R1645k1531L1718r4998L6794J2540k8591J7770J10111L6558J26622
$$ 1487966 1579611 1558080 1589798 1494800 1531594 1544134 1515543 1533313 1643424 1679982 1806604
6553A806604R1928q8547j4190l5881R8118M75l2926K5256J12465J88871k2436
$$ 1806604 1898532 1809985 1795795 1759914 1858032 1858507 1825581 1850837 1963302 2152173 2129737
6542B129737p7439R2419L1253j3953Q9539M8711j3066O2510P5436Q0435L7711
$$ 2129737 2052298 2144717 2175970 2162017 2251556 2300267 2287201 2349711 2425147 2505582 2543293
6531B543293r216J21104L8278P3567N4228J04297P4888N022q6073J37392J15780
$$ 2543293 2534077 2655181 2693459 2767026 2821254 2925551 3000439 3005461 2919388 3056780 3172560
6520C172560M9383J43276P4504k0081J05295R5982p151J14948l1686P4791J40882
$$ 3172560 3221943 3365219 3439723 3419642 3524937 3620919 3613768 3728716 3697030 3771821 3912703
6509C912703J38265L6820R8932J01675J18786N0653L3854R1071J80953O2319R6595
$$ 3912703 4050968 4087788 4186720 4288395 4407181 4457834 4491688 4582759 4763712 4826031 4922626
6498D922626K45935J15836N2849J32388J50630K17636J90319J23889O98J86864
$$ 4922626 5168561 5284397 5337246 5469634 5620264 5837900 6028219 6152108 6152806 6339670
6488F339670J45865J06101J91790J36308J56870K70703J42679J54629J40463J02923
$$ 6339670 6485535 6591636 6783426 6919734 7076604 7347307 7489986 7644615 7785078 7888001
6478G888001J67251J06175R9593L14855L25764M5448K01740L20063K82820K28699
$$ 7888001 8055252 8161427 8261020 8575875 8901639 8947087 9148827 9468890 9751710 9980409
6468I980409L80158L47108L10747M11177K73501J42257K53656J37217J65487J78967
$$ 9980409 10360567 10707675 11018422 11429599 11703100 11845357 12099013 12236230 12401717 12580684
6458A2580684J96653K04065L10105L28666K48196K97926L12743L84813M03153
$$ 12580684 12777337 12981402 13291507 13620173 13868369 14166295 14479038 14863851 15267004
6449A5267004N59426M38035M39845L51660N53982O29515O61106P80601P62306
$$ 15267004 15826430 16264465 16704310 17055970 17609952 18239467 18900573 19681174 20443480
6440B0443480Q75873P80548P73859Q05579Q44025P80631O77126Q14570R26131
$$ 20443480 21319353 22099901 22873760 23679339 24523364 25303995 25981121 26795691 27721822
6431B7721822J121238J153098J312445J598753J968064K067172K412692K761182
$$ 27721822 28843060 29996158 31308603 32907356 34875420 36942592 39355284 42116466
6423D2116466L218464L648593M139967M615369M819687M682525L684306K051103
$$ 42116466 45334930 48983523 53123490 57738859 62558546 67241071 70925377 72976480
6415G2976480M3647j963791l358988l862273l655121k979610k256474j491092
$$ 72976480 73020127 71056336 67697348 63835075 60179954 57200344 54943870 53452778
6407E3452778j049312m52077J94809O63246J083705J745613K325152K985596L600117
$$ 53452778 52403466 51951389 52146198 52809444 53893149 55638762 57963914 60949510 64549627
6398F4549627M428166N368757O253280P411587Q647296R584635R960920Q754896
$$ 64549627 68977793 74346550 80599830 88011417 96658713 106243348 116204268 124959164
6390A24959164N994576J403693m757752r999479j2299483j2330462j0558930q559516
$$ 124959164 130953740 132357433 127599681 117600202 105300719 92970257 82411327 73851811
6382G3851811o632211n058138l975901k926954k067592j403338r28589k24954
$$ 73851811 67219600 62161462 58185561 55258607 53191015 51787677 50859088 50634134
6374E0634134K17522O19653J103736J725234K287249K918357L442128L984631
$$ 50634134 50851656 51471309 52575045 54300279 56587528 59505885 62948013 66932644
6366F6932644M129922L563810K333615L67442k203725m855948o266147o626257
$$ 66932644 71062566 74626376 76959991 77327433 75123708 70267760 64001613 57375356
6358E7375356o258757n351029m417841l541033k936941k368275j942240j783812
$$ 57375356 51116599 45765570 41347729 37806696 34869755 32501480 30559240 28775428
6350B8775428j405478r25350q48739o29234o28037m01362l36189l57550l01821
$$ 28775428 27369950 26444600 25595861 24966627 24338590 23937228 23601039 23243489 22941668
6341B2941668l57797l53618n06553n12514n76752o97135q21153q55201p27641
$$ 22941668 22583871 22230253 21723700 21211186 20634434 19937299 19116146 18260945 17533304
6332A7533304o20603n31193l78366l63145l31214k63179k02955k05546j14780
$$ 17533304 16912701 16381508 16003142 15639997 15308783 15045604 14842649 14637103 14522323
6323A4522323m2852P7533O4960K01392L39716L41575M64845M96886N09910N38510
$$ 14522323 14479471 14557004 14621964 14823356 15163072 15504647 15969492 16466378 16976288 17514798
6313A7514798L35362J36075k98895r07019j009595j189635j027166q88519p85306
$$ 17514798 17850160 17986235 17687340 16780321 15770726 14581091 13553925 12665406 11880100
6304A1880100n67125n52028l59938k89492k12802j91717k17369k80046q2140J15548
$$ 11880100 11312975 10760947 10401009 10111517 9898715 9706998 9489629 9209583 9127443 9242991
6294I242991n0753P3654J47271J58333J95859K34497K02081K25945q2121j79454
$$ 9242991 9192238 9265892 9413163 9571496 9767355 10001852 10203933 10429878 10347757 10168303
6284A0168303k80080m08918n30426l59518l44606l69536l42972l16810k63519
$$ 10168303 9888223 9479305 8948879 8589361 8244755 7875219 7532247 7215437 6951918
6275F951918k74477k82827k40396j27530k00277j87509r4077n8210j59046r5566
$$ 6951918 6677441 6394614 6154218 6026688 5826411 5638902 5544825 5486615 5327569 5232003
6265E232003k40577j65070N8630J71563L5935K570q7425k1598J11923J51189J51593
$$ 5232003 4991426 4826356 4884986 5056549 5092484 5095054 5007629 4986031 5097954 5249143 5400736
6254E400736J92916j7784j59047o247m3814k30409k97481r7813j21772j10393
$$ 5400736 5593652 5575868 5416821 5410574 5366760 5136351 4838870 4741057 4619285 4508892
6244D508892p4391j50240j25913m4603k09623j07392J08575o8519m1330j4048
$$ 4508892 4434501 4284261 4158348 4113745 3904122 3796730 3905305 3836786 3795456 3781408
6234C781408K22837M0789L2597J42645J70551N5418M7J30328J01124L659j59325
$$ 3781408 4004245 4045034 4077631 4220276 4390827 4446245 4446292 4576620 4677744 4681403 4522078
6223D522078Q1591k4592q1975j13550k96490l4356j16726j37429j68657q5854
$$ 4522078 4603669 4579077 4497102 4383552 4087062 4052706 3935980 3798551 3629894 3544040
6213C544040o846o4116j25711q5814L6961J0365N0065j1640P0213L3037k2700
$$ 3544040 3537194 3473078 3347367 3261553 3298514 3308879 3358944 3347304 3417517 3450554 3427854
6202C427854Q572R5013M2717L2218J44464L9332L344l0669K1056j75945J4009
$$ 3427854 3436426 3531439 3574156 3606374 3750838 3790170 3793514 3762845 3783901 3607956 3621965
6191C621965N4081r4643p4199J8870j04139r6397J20246p663p0466N6508J19528
$$ 3621965 3676046 3581403 3507204 3526074 3421935 3325538 3445784 3438121 3367655 3424163 3543691
6180C543691J0698k1459q2672N9538K7473J2614J5982N3667p6890P7593P1316
$$ 3543691 3554389 3532930 3450258 3509796 3537269 3549883 3565865 3619532 3542642 3620235 3691551
6169C691551K6976O2588O5408J0684L9127m8274N2809N3766j9170J3026k7963
$$ 3691551 3718527 3781115 3846523 3857207 3896334 3848060 3900869 3954635 3935465 3948491 3920528
6158C920528L1361L0684k600J47679J34854Q7513j2723j5649J07956J24197K0985
$$ 3920528 3951889 3982573 3979973 4127652 4262506 4350019 4337296 4321647 4429603 4553800 4574785
$$ [...]
##END NTUPLES=NMR SPECTRUM
##END=
