##TITLE=1H_EC-3306(12)-0
 CDCl3
 8 sc, 
 20.12.2023
##JCAMPDX= 6.0         $$ Bruker NMR JCAMP-DX V2.0
##DATA TYPE= NMR SPECTRUM
##DATA CLASS= NTUPLES
##ORIGIN= UXNMR, Bruker Analytische Messtechnik GmbH
##OWNER= root
$$ XWIN-NMR		Version 3.5
$$ Wed Dec 20 13:57:55 2023 Russian Standard Time (UT+4h)  she@DPX200
##.OBSERVE FREQUENCY= 200.1313
##.OBSERVE NUCLEUS= ^1H
##.ACQUISITION MODE= SIMULTANEOUS
##.ACQUISITION SCHEME= undefined
##.AVERAGES= 8
##.DIGITISER RES= 18
##SPECTROMETER/DATA SYSTEM= spect
##.PULSE SEQUENCE= zg30
##.SOLVENT NAME= CDCl3
##.SHIFT REFERENCE= (INTERNAL, CDCl3, 0, 15.3447)
##AUDIT TRAIL= $$ (NUMBER, WHEN, WHO, WHERE, WHAT)
$$ ##TITLE= Audit trail, XWIN-NMR		Version 3.5
$$ ##JCAMPDX= 5.01
$$ ##ORIGIN= Bruker BioSpin GmbH
$$ ##OWNER= she
$$ F:/spectra/data/she/nmr/H-F/1/pdata/1/auditp.txt
$$ ##AUDIT TRAIL=  $$ (NUMBER, WHEN, WHO, WHERE, WHAT)
(   1,<2023-12-20 13:56:37.15 +0400>,<she>,<DPX200>,
      <created by zg, POWCHK disabled, PULCHK disabled
       configuration hash MD5:
       00 E9 B6 7A A2 85 ED C7 34 08 36 98 17 FE 4E 26
       data hash MD5: 16K
       32 63 64 8A 12 90 96 BA 76 F3 F1 C4 FC 31 BA EF>)
(   2,<2023-12-20 13:56:39.46 +0400>,<she>,<DPX200>,
      <Start of raw data processing
       efp BC_mod = 2 LB = 0.24 FT_mod = 6 PKNL = 1 PHC0 = -24597.69 PHC1 = 19.05272 SI = 16K 
       data hash MD5: 16K
       1F AF B8 00 66 BC AD 17 18 A6 22 FC AC 4F 17 51>)
(   3,<2023-12-20 13:57:06.62 +0400>,<she>,<DPX200>,
      <pk PHC0 = 5.71207 PHC1 = -9.399997 
       data hash MD5: 16K
       4C A0 47 2C A4 7E DB 46 55 CC 52 D9 44 2E 41 FE>)
(   4,<2023-12-20 13:57:09.50 +0400>,<she>,<DPX200>,
      <abs ABSG = 5 
       data hash MD5: 16K
       A4 47 A0 70 42 B4 5E 99 36 88 2B B5 BB 65 C2 C8>)
$$ ##END=
$$ 
$$ hash MD5
$$ 75 70 91 5E 5D 79 92 06 75 EC C6 51 E9 11 11 6E
##$RELAX= 
##$RELAX= 
##$RELAX= 
##$RELAX= 
##$RELAX= 
##$RELAX= 
$$ Bruker specific parameters
$$ --------------------------
##$DU= <F:/spectra>
##$EXPNO= 1
##$NAME= <H-F>
##$PROCNO= 1
##$TYPE= <nmr>
##$USER= <she>
##$AMP= (0..31)
100 100 100 100 100 100 100 100 100 100 100 100 100 100 100 100 100 100 
100 100 100 100 100 100 100 100 100 100 100 100 100 100 
##$AQSEQ= 0
##$AQ_mod= 1
##$AUNM= <au_zg>
##$AUTOPOS= <>
##$BF1= 200.13
##$BF2= 200.13
##$BF3= 200.13
##$BF4= 200.13
##$BF5= 200.13
##$BF6= 200.13
##$BF7= 200.13
##$BF8= 200.13
##$BYTORDA= 1
##$CFDGTYP= 0
##$CFRGTYP= 5
##$CHEMSTR= <none>
##$CNST= (0..31)
1 1 145 1 1 1 1 1 1 1 1 1 1 1 1 1 1 1 1 1 1 1 1 1 1 1 1 1 1 1 1 1 
##$CPDPRG= <>
##$CPDPRG1= <>
##$CPDPRG2= <>
##$CPDPRG3= <>
##$CPDPRG4= <mlev>
##$CPDPRG5= <mlev>
##$CPDPRG6= <mlev>
##$CPDPRG7= <mlev>
##$CPDPRG8= <mlev>
##$CPDPRGB= <>
##$CPDPRGT= <>
##$D= (0..31)
0 1.2 0 0 0 0 0 0 0 0.06 0 0.03 0 0 0 0 0.0002 0 0 0 0 0 0 0 0 0 0 0 0 
0 0 0 
##$DATE= 1703066196
##$DBL= (0..7)
120 120 120 120 120 120 120 120 
##$DBP= (0..7)
150 150 150 150 150 150 150 150 
##$DBP07= 0
##$DBPNAM0= <>
##$DBPNAM1= <>
##$DBPNAM2= <>
##$DBPNAM3= <>
##$DBPNAM4= <>
$$ [...]
##$SUBNAM3= <"">
##$SUBNAM4= <"">
##$SUBNAM5= <"">
##$SUBNAM6= <"">
##$SUBNAM7= <"">
##$SUBNAM8= <"">
##$SUBNAM9= <"">
##$SW= 18.0517328524113
##$SWIBOX= (0..15)
0 0 2 0 0 0 0 0 0 0 0 0 0 0 0 0 
##$SW_h= 3612.71676300578
##$TD= 16384
##$TD0= 1
##$TE= 0
##$TE2= 300
##$TE3= 300
##$TEG= 300
##$TL= (0..7)
0 120 120 120 120 120 120 120 
##$TP= (0..7)
150 150 150 150 150 150 150 150 
##$TP07= 0
##$TPNAME0= <>
##$TPNAME1= <>
##$TPNAME2= <>
##$TPNAME3= <>
##$TPNAME4= <>
##$TPNAME5= <>
##$TPNAME6= <>
##$TPNAME7= <>
##$TPOAL= (0..7)
0.5 0.5 0.5 0.5 0.5 0.5 0.5 0.5 
##$TPOFFS= (0..7)
0 0 0 0 0 0 0 0 
##$TUNHIN= 0
##$TUNHOUT= 0
##$TUNXOUT= 0
##$USERA1= <user>
##$USERA2= <user>
##$USERA3= <user>
##$USERA4= <user>
##$USERA5= <user>
##$V9= 5
##$VALIST= <valist>
##$VCLIST= <CCCCCCCCCCCCCCC>
##$VD= 0
##$VDLIST= <DDDDDDDDDDDDDDD>
##$VPLIST= <PPPPPPPPPPPPPPP>
##$VTLIST= <TTTTTTTTTTTTTTT>
##$WBST= 1024
##$WBSW= 4
##$XGAIN= (0..3)
0 0 0 0 
##$XL= 0
##$YL= 0
##$YMAX_a= 492220
##$YMIN_a= -602013
##$ZGOPTNS= <>
##$ZL1= 120
##$ZL2= 120
##$ZL3= 120
##$ZL4= 120
##$ABSF1= 15.41194
##$ABSF2= -2.639908
##$ABSG= 5
##$ABSL= 3
##$ALPHA= 0
##$AQORDER= 0
##$ASSFAC= 0
##$ASSFACI= 0
##$ASSFACX= 0
##$ASSWID= 0
##$AUNMP= <proc_1d>
##$AZFE= 0.1
##$AZFW= 0.1
##$BCFW= 0
##$BC_mod= 2
##$BYTORDP= 0
##$COROFFS= 0
##$CY= -3
##$DATMOD= 1
##$DC= 0
##$DFILT= <>
##$DTYPP= 0
##$F1P= 0
##$F2P= 0
##$FCOR= 1
##$FTSIZE= 16384
##$FT_mod= 6
##$GAMMA= 0
##$GB= 0
##$INTBC= 1
##$INTSCL= 3.70164e-10
##$ISEN= 128
##$LB= 0.24
##$LEV0= 0
##$LPBIN= 0
##$MAXI= 10000
##$MC2= 0
##$MEAN= 0
##$ME_mod= 0
##$MI= 1.114404
##$NCOEF= 0
##$NC_proc= -7
##$NLEV= 6
##$NOISF1= 3.799351
##$NOISF2= 2.8
##$NSP= 0
##$NTH_PI= 0
##$NZP= 0
##$OFFSET= 15.34473
##$PC= 1
##$PHC0= -24591.98
##$PHC1= 9.652722
##$PH_mod= 1
##$PKNL= yes
##$PPARMOD= 0
##$PSCAL= 0
##$PSIGN= 0
##$REVERSE= no
##$SF= 200.130035416507
##$SI= 16384
##$SIGF1= 3
##$SIGF2= 2
##$SINO= 5.538805
##$SIOLD= 16384
##$SREGLST= <1H.CDCl3>
##$SSB= 0
##$STSI= 16384
##$STSR= 0
##$SW_p= 3612.71676300578
##$SYMM= 0
##$S_DEV= 0
##$TDeff= 16384
##$TDoff= 0
##$TI= <>
##$TILT= no
##$TM1= 0
##$TM2= 0
##$TOPLEV= 0
##$USERP1= <user>
##$USERP2= <user>
##$USERP3= <user>
##$USERP4= <user>
##$USERP5= <user>
##$WDW= 1
##$XDIM= 16384
##$YMAX_p= 503123018
##$YMIN_p= -808637
$$ End of Bruker specific parameters
$$ ---------------------------------
##NTUPLES= NMR SPECTRUM
##VAR_NAME=  FREQUENCY,     SPECTRUM/REAL,   SPECTRUM/IMAG
##SYMBOL=    X,             R,               I
##VAR_TYPE=  INDEPENDENT,   DEPENDENT,       DEPENDENT
##VAR_FORM=  AFFN,          ASDF,            ASDF
##VAR_DIM=   16384,         16384,           16384
##UNITS=     HZ,            ARBITRARY UNITS, ARBITRARY UNITS
##FACTOR=    0.220516191357247, 1,           1
##FIRST=     3070.94143384524, 0,            0
##LAST=      -541.77532916054, 0,            0
##MIN=       -541.77532916054, -808637,      0
##MAX=       3070.94143384524, 503123018,    0
$$ Real data points
##PAGE= N=1
##DATA TABLE= (X++(R..R)), XYDATA
$$ [...]
$$ plain form
12079 -250336 -243275 -111936 -48532 -3064 -72629 -144026 -86496 671 -203609 -202640 -232755 -470425
12067 -470425 -403551 -139730 -265422 -163215 -59117 -236859 -230551 -218190 -107737 -133207
12057 -133207 -326103 -226787 -139233 2619 72943 -173238 143162 201005 75247 52953
12047 52953 -220274 -306846 -175312 -8869 -143169 -71737 -89411 49999 -129810 -147668
12037 -147668 61060 -56140 105575 13384 -155381 -72577 -167839 -216003 -197251 -89788
12027 -89788 -111600 56331 207500 167748 51614 -441807 -482248 -388798 -238368 -61628
12017 -61628 -234413 -341714 -272328 -159440 34348 -138172 -24108 -40283 -138428 -53609
12007 -53609 -37114 -250107 8012 282437 -72765 -19834 16130 -94813 -234914 -208571
$$ packed form
12079b50336P061J31339O3404M5468o9565p1397N7530Q7167k04280R69l0115k37670
12067d70425O6874K63821j25692J02207J04098j77742O308J2361J10453k5470
12057a33207j92896R9316Q7554J41852P0324k46181L16400N7843j25758k2294
12047E2953k73227q6572J31534J66443j34300P1432j7674J39410j79809j7858
12037a47668K08728j17200J61715r2191j68765Q2804r5262m8164J8752J07463
12027h9788k1812J67931J51169l9752j16134m93421m0441R3450J50430J76740
12017f1628j72785j07301O9386J12888J93788j72520J14064j6175r8145Q4819
12007e3609J6495k12993K58119K74425l55202N2931L5964j10943j40101K6343
$$ plain form
11997 -208571 -209137 -98674 -119707 -160717 -249409 -427852 -237236 -245685 -87939 18808 -72307
11986 -72307 -181740 -282678 -413571 -384157 27877 -91727 -232699 -133323 -357778 -108916
11976 -108916 25421 -83866 -286843 -189568 -91664 145646 2434 -159593 -330098 -201983
11966 -201983 -42292 -341356 -158494 -68733 39113 -27980 -122801 -243435 -170352 -238533
11956 -238533 -414472 -227780 -330010 -265477 8317 102353 -24433 -255980 -55914 -26765
11946 -26765 -88111 -210566 -354802 -357544 -205113 -47384 72314 21325 13095 131040 45657
11935 45657 -159057 -301161 -209819 -28899 36869 -91005 -2053 75643 42095 -86714 -105384
11924 -105384 -83223 -225353 -162154 -138702 -117062 -226896 -204056 63635 -609 -157833 -305543
$$ packed form
11997b08571n66J10463k1033m1010q8692j78443J90616q449J57746J06747r1115
11986g2307j09433j00938j30893K9414M12034j19604j40972R9376k24455K48862
11976a08916J34337j09287k02977R7275R7904K37310j43212j62027j70505J28115
11966b01983J59691k99064J82862Q9761J07846o7093r4821j20634P3083o8181
11956b38533j75939J86692j02230O4533K73794R4036j26786k31547K00066K9149
11946b6765o1346j22455j44236k742J52431J57729J19698n0989q230J17945q5383
11935D5657k04714j42104R1342J80920O5768j27874Q8952P7696l3548j28809j8670
11924a05384K2161j42130O3199K3452K1640j09834K2840K67691o4244j57224j47710
$$ plain form
11913 -305543 -145291 -204951 -173433 -174921 -228065 30620 154572 -155640 -308581 -124271
11903 -124271 -170302 -172626 -143424 -2411 -8063 -107361 14771 235342 -33843 -67481 -62869
11892 -62869 -47200 -224504 -291293 -163473 -269198 -320382 -272463 -286004 -269981 19427 47153
11881 47153 127654 -34426 -73215 -230699 -244851 -57189 -24055 133529 111339 170098 4666
11870 4666 1977 62818 19681 -18523 -8453 -93934 -245359 -395232 -254208 -115090 -67020
11859 -67020 -109207 -19313 -26457 463 -82123 -191090 -448287 -520339 -379594 29673 -2871
11848 -2871 -41182 -6970 -211772 -203020 -266578 -65724 9757 12179 -20122 49334 -49995 -212534
11836 -212534 -47991 -51566 160345 108419 83942 -97092 -219538 -177255 -193999 -168170 -279651
$$ packed form
11913c05543J60252n9660L1518j488n3144K58685J23952l10212j52941J84310
11903a24271m6031k324K9202J41013n652r9298J22132K20571k69185l3638M612
11892f2869J5669j77304o6789J27820j05725n1184M7919j3541J6023K89408K7726
11881D7153Q0501j62080l8789j57484j4152J87662L3134J57584k2190N8759j65432
11870D666k689O0841m3137l8204J0070q5481j51425j49873J41024J39118M8070
11859f7020m2187Q9894p144K6920q2586j08967k57197p2052J40745M09267l2544
11848b871l8311L4212k04802Q752o3558K00854P5481K422l2301O9456r9329j62539
11836b12534J64543l575K11911n1926k4477j81034j22446M2283j6744K5829j11481
$$ plain form
11825 -279651 -264002 -244070 -14998 -46625 -130184 -169398 -330881 -341544 -65358 -124901 -99195
11814 -99195 -205585 -210560 -75165 -112676 -247873 -91383 -103514 54577 -204820 -278498 -185546
11803 -185546 -260771 32231 10681 -140068 -218452 -203549 -255429 -251775 -205531 -255257 -196267
11792 -196267 -70605 -93890 -87649 65002 31616 122688 148682 86115 84228 54945 -255726
11781 -255726 -184312 44021 43854 -47577 -284830 -328537 -65279 -68350 135711 137147 62622
11770 62622 -42631 -154023 -269515 -435681 -124013 -74055 -316679 -121856 13014 -130866
11760 -130866 60656 -43846 -179486 -149979 -227038 -249415 -121792 15871 -90197 -249295
11750 -249295 -27473 58263 -78005 45839 -142408 -233735 -52371 -5986 37959 37356 96232
$$ packed form
11825b79651J5649J9932K29072l1627q3559l9214j61483j0663K76186n9543K5706
11814i9195j06390m975J35395l7511j35197J56490j2131J58091k59397p3678R2952
11803a85546p5225K93002k1550j50749p8384J4903n1880L654M6244m9726N8990
11792a96267J25662k3285O241J52651l3386R1072K5994o2567j887k9283l10671
11781b55726P1414K28333j67r1431k37253m3707K63258l071K04061J436p4525
11770F2622j05253j11392j15492j66166L11668M9958k42624J94823J34870j43880
11760a30866J91522j04502j35640K9507p7059k2377J27623J37663j06068j59098
11750b49295K21822Q5736j36268J23844j88247r1327J81364M6385M3945o03N8876
$$ plain form
11739 96232 155349 184219 352922 375692 236016 15779 9948 62961 -56377 -128124 -102625
11728 -102625 229191 -41005 -120646 -98371 -171514 -62776 -180516 -110049 -83326 -184270
11718 -184270 -130205 -40288 203973 378987 250387 153791 130784 226495 213183 187504 249740
11707 249740 306535 331469 257883 285934 77988 151245 350966 506778 453809 282938 312190
11696 312190 491799 525528 360046 169072 233953 264151 541431 514162 551525 262574
11686 262574 158368 134817 408884 442979 268961 333296 362747 147052 64317 178807
11676 178807 204240 324735 333842 250175 374435 280208 261731 403492 320348 195057 344380
11665 344380 333833 178625 220007 210266 363690 151455 171583 256633 377008 289076 206122
$$ packed form
11739I6232N9117K8870J68703K2770j39676k20237n831N3013j19338p1747K5499
11728a02625L31816k70196p9641K2275p3143J08738j17740P0467K6723j00944
11718a84270N4065Q9917K44261J75014j28600r6596k3007R5711j3312k5679O2236
11707B49740N6795K4934p3586K8051k07946P3257J99721J55812n2969j70871K9252
11696C12190J79609L3729j65482j90974O4881L0198K77280k7269L7363k88951
11686B62574j04206k3551K74067L4095j74018O4335K9451k15695q2735J14490
11676A78807K5433J20495R107q3667J24260r4227j8477J41761q3144j25291J49323
11665C44380j0547j55208M1382r741J53424k12235K0128Q5050J20375q7932q2954
$$ plain form
11654 206122 28582 109671 103934 373972 239072 314947 164182 217859 105278 113708 313332
11643 313332 268248 264023 156202 182417 88681 77409 21354 -81015 167308 306973 137365
11632 137365 119401 64402 59130 -22489 127655 -10889 5135 65668 70765 124555 127314 288650
11620 288650 210035 383431 397573 297426 283686 288826 267660 244901 186717 338904 435022
11609 435022 226594 544184 689596 679417 809241 864600 1009473 1194123 1629995 1892880
11599 1892880 2045742 2225849 1972993 1710012 1745737 1542210 1091679 761664 904328 829907
11589 829907 854881 1099431 864151 742811 665571 655970 612903 806791 939844 1126930
11579 1126930 973083 964392 944659 755049 675968 648551 776653 794061 871979 778187 1029484
$$ packed form
11654B06122j77540Q1089n737K70038j34900P5875j50765N3677j12581Q430J99624
11643C13332m5084m225j07821K6215r3736j1272n6055j02369K48323J39665j69608
11632A37365j7964n4999n272q1619J50144j38544J6024O0533N097N3790K759J61336
11620B88650p8615J73396J4142j00147j3740N140k1166k2759n8184J52187R6118
11609D35022k08428L17590J45412j0179J29824N5359J44873J84650M35872K62885
11599A892880J52862J80107k52856k62981L5725k03527m50531l30015J42664p4421
11589H29907K4974K44550k35280j21340p7240r601m3067J93888J33053J87086
11579A126930j53847q691j9733j89610p9081k7417J28102J7408P7918r3792K51297
$$ plain form
11568 1029484 1110534 1217586 1192478 1053351 1116872 1017827 1192311 1431884 1494695 1556244
11558 1556244 1735582 1675992 1845077 2147024 2376654 2474415 2609633 2590175 2668974 2594133
11548 2594133 2503654 2368194 2254009 2422592 2596227 2778593 2701807 2727315 2807357 3197436
11538 3197436 3188828 3374579 3684368 3936889 4346955 4955322 5800599 7063256 8671104
11529 8671104 10583752 12370686 13395374 13200079 11812543 9954136 8293331 6910421
11521 6910421 5655421 5021258 4449028 4349518 4271304 4332331 4726227 4989751 5477820 5686774
11511 5686774 5721950 5407134 4756512 4080945 3354003 2782917 2633482 2492154 2011316 1688472
11501 1688472 1649214 1654696 1616258 1454010 1103408 1035253 1172201 1143060 908699 933056 895578
$$ packed form
11568A029484Q1050J07052k5108j39127O3521r9045J74484K39573O2811O1549
11558A556244J79338n9590J69085L01947K29630R7761J35218j9458P8799p4841
11548B594133r0479j35460j14185J68583J73635J82366p6786K5508Q0042L90079
11538C197436q608J85751L09789K52521M10066O08367Q45277J262657J607848
11529H671104J912648J786934J024688j95295j387536j858407j660805j382910
11521F910421j255000o34163n72230r9510p8214O1027L93896K63524M88069K08954
11511E686774L5176l14816o50622o75567p26942n71086j49435j41328m80838l22844
11501A688472l9258N482l8438j62248l50602o8155J36948k9141k34361K4357l7478
$$ plain form
11490 895578 794148 712729 907321 929486 705717 735911 601038 441562 633418 488847
11480 488847 520984 526203 433085 587573 788530 750259 603442 662006 580814 405414 382183
11469 382183 378562 309022 568542 428746 350241 429576 371019 347552 279893 334959 388112
11458 388112 423355 354455 348141 449696 453102 607292 371126 265743 295216 319078 360578
11447 360578 357218 220524 265198 260833 107191 388678 497438 254105 197221 178310 -35231
11436 -35231 158534 417644 394230 344534 317314 247227 311662 466856 222579 370443 516270
11425 516270 547425 740765 633120 716504 698977 701415 715635 469073 187113 191860 184611
11414 184611 357764 257998 384471 332929 284598 517453 359407 108280 -95683 131875
$$ packed form
11490H95578j01430q1419J94592K2165k23769L0194j34873j59476J91856j44571
11480D88847L2137N219r3118J54488K00957l8271j46817N8564q1192j75400k3231
11469C82183l621o9540K59520j39796p8505P9335n8557k3467o7659N5066N3153
11458C88112L5243o8900o314J01555L406J54190k36166j05383K9473K3862M1500
11447C60578l360j36694M4674m365j53642K81487J08760k43333n6884j8911k13541
11436c5231J93765K59110k3414m9696k7220p0087O4435J55194k44277J47864J45827
11425E16270L1155J93340j07645Q3384j7527K438J4220k46562k81960M747p249
11414A84611J73153r9766J26473n1542m8331K32855j58046k51127k03963K27558
$$ plain form
11404 131875 170351 236565 208329 164620 73708 41607 230 27450 104501 -19529 -77362
11393 -77362 -35862 -239565 -267109 15709 131824 50757 -9146 -89374 -57668 -68474 -17445
11382 -17445 54837 112254 5407 184271 380187 70329 60347 -105976 -180732 -161546 -11327
11371 -11327 -48600 -52618 28756 -82615 -317155 -426715 -196390 -176028 -403628 -290789 -168700
11360 -168700 41173 275 -208377 -146560 -115879 -157202 -233592 -135666 -92698 -27061 225326
11349 225326 -103661 -191918 -68640 -85971 -60347 -210335 38137 54605 -57181 59723
11339 59723 -260145 -131145 -85090 -182500 120475 76481 18313 -31130 5375 49418 -42936
11328 -42936 -182242 -8547 82550 15900 -242670 -183842 -65646 -210455 -293076 -372724 -397855
$$ packed form
11404A31875L8476O6214k8236m3709r0912l2101m1377K7220P7051j24030n7833
11393g7362M1500k03703k7544K82818J16115q1067n9903q0228L1706j0806N1029
11382a7445P2282N7417j06847J78864J95916l09858r982j66323p4756J9186J50219
11371a1327l7273m018Q1374j11371k34540j09560K30325K0362k27600J12839J22089
11360a68700K09873m0898k08652O1817L0681m1323p6390R7926M2968O5637K52387
11349B25326l28987q8257J23278j7331K5624j49988K48472J6468j11786J16904
11339E9723l19868J29000M6055r7410L02975m3994n8168m9443L6505M4043r2354
11328d2936j39306J73695R1097o6650k58570N8828J18196j44809q2621p9648k5131
$$ plain form
11317 -397855 -242780 -243380 -147656 -338368 -194257 -211177 -165012 -76667 -129511 -148874 -294650
11306 -294650 -141529 -17606 -171438 -204263 -99579 -265715 -40142 -144759 -327551 -98640
11296 -98640 -74425 -176625 -154595 -114388 -27674 -66103 -163775 -61497 -123644 -210001 -66192
11285 -66192 -161727 -119818 -16399 -153385 -208388 108169 45822 -172406 -97238 -7565 -57400
11274 -57400 15345 -170797 -213372 -156493 -24531 -7589 125045 150354 -20952 -79609 -97703
11263 -97703 8774 -136446 -56206 -60910 -310916 -290630 -248788 -161329 -234963 -241339 -84495
11252 -84495 23126 -24661 -136386 -103655 -240318 -327821 -317284 -274840 -171126 5691 -144017
11241 -144017 -176447 -6836 14562 32342 -113685 -374572 -369627 -486744 -432815 -392547 -255889
$$ packed form
11317c97855J55075o00R5724j90712J44111j6920M6165Q8345n2844j9363j45776
11306b94650J53121J23923j53832l2825J04684j66136K25573j04617j82792K28911
11296i8640K4215j02200K2030M0207Q6714l8429r7672J02278o2147q6357J43809
11285f6192r5535M1909J03419j36986n5003L16557o2347k18228P5168Q9673m9835
11274e7400P2745j86142m2575N6879J31962J6942J32634K5309j71306n8657j8094
11263i7703J06477j45220Q0240m704k50006K0286M1842Q7459p3634o376J56844
11252h4495J07621m7787j11725L2731j36663q7503J0537M2444J03714J76817j49708
11241a44017l2430J69611K1398J7780j46027k60887M945j17117N3929M0268J36658
$$ plain form
11230 -255889 -112896 -24590 162273 232978 217065 70130 -85403 110804 117318 -95400
11220 -95400 -168320 3525 158115 141647 -184397 -269770 -187530 -210674 -169789 -18967 105650
11209 105650 118390 113265 8233 -75658 -111864 145212 -126939 -93208 -63772 -193225 -194693
11198 -194693 -155690 -240763 -129482 -240343 -220206 -268357 -207401 -123133 -224681 -239067 -98868
11187 -98868 -18353 -115170 -26478 48716 -113622 -29657 -71674 -150929 -14827 -238502 -56776
11176 -56776 -192066 -215779 -39740 -149628 -371991 -555240 -405178 -257138 -242848 -110990
11166 -110990 -66140 -39634 -70915 -75071 -173164 -121186 -259185 -275984 -396070 -218438 -40659
11155 -40659 36750 -211 -11725 -80889 -43431 -91971 -127203 -339675 -271261 12782 -117895
$$ packed form
11230b55889J42993Q8306J86863P0705j5913j46935j55533J96207O514k12718
11220i5400p2920J71845J54590j6468l26044q5373Q2240k3144M0885J50822J24617
11209A05650J2740n125j05032q3891l6206K57076k72151L3731K9436j29453j468
11198a94693L9003q5073J11281j10861K0137m8151O0956Q4268j01548j4386J40199
11187i8868Q0515r6817Q8692P5194j62338Q3965m2017p9255J36102k23675J81726
11176e6776j35290k3713J76039j09888k22363j83249J50062J48040J4290J31858
11166a10990M4850K6506l1281m156r8093N1978j37999j6799j20086J77632J77779
11155d0659P7409l6961j1514o9164L7458m8540l5232k12472O8414K84043j30677
$$ plain form
11144 -117895 -161411 -164356 -229659 -217774 -50513 -10484 41122 -23688 -12676 -78980 -375769
11133 -375769 -199850 -65386 -282058 -194504 8540 53402 -24462 -80328 -193275 -84219
11123 -84219 -192045 -107833 -53416 -61242 -20242 -38692 -110025 -89648 -97199 36231 -44192 -252842
11111 -252842 -115535 42892 53104 -32915 9639 -188995 -385206 -270652 -211140 43517
11101 43517 36904 115813 32051 42156 83892 148427 28406 100852 177099 283368 258465
11090 258465 122679 262367 236445 144726 197240 280907 275293 239914 106527 105391 262012
11079 262012 455687 485806 601987 736354 990174 943514 902993 886541 748476 628104
11069 628104 540971 309717 442958 282602 55560 3645 184375 109389 34072 249099
$$ packed form
11144a17895m3516k945o5303J1885J67261M0029N1606o4810J1012o6304k96789
11133c75769J75919J34464k16672Q7554K03044M4862p7864n5866j12947J09056
11123h4219j07826Q4212N4417p826M1000j8450p1333K0377p551J33430q0423k08650
11111b52842J37307J58427J0212q6019M2554j98634j96211J14554N9512K54657
11101D3517o613P8909q3762J0105M1736O4535j20021P2446P6247J06269k4903
11090B58465j35786J39688k5922r1719N2514Q3667n614l5379j33387j136J56621
11079B62012J93675L0119J16181J34367K53820m6660m0521j6452j38065j20372
11069F28104q7133k31254J33241j60356k27042n1915J80730p4986p5317K15027
$$ plain form
11059 249099 342972 117726 107966 -16330 -191730 67100 27504 28015 -83016 -40393 -72661
11048 -72661 -102341 -168112 -34421 37789 -78993 52906 -56259 16575 167361 116413 278782
11037 278782 285244 376178 379287 299548 290077 199917 50457 94727 215419 184108 157647 185746
11025 185746 201210 341560 398489 300927 273876 242656 37138 15707 55239 -15081 -101065
11014 -101065 -47444 362478 443130 186268 161051 264626 290247 260736 436120 564435
11004 564435 404562 419262 298550 124398 98561 360152 496101 651485 516173 429860
10994 429860 380504 471171 438173 344968 406847 535326 384416 489566 350810 216206
10984 216206 414208 691925 787249 677212 780506 795989 1002096 675142 473411 519352
$$ packed form
11059B49099R3873k25246r760j24296j75400K58830l9596N11j11031M2623l2268
11048g2661k9680o5771J33691P2210j16782J31899j09165P2834J50786n0948J62369
11037B78782O462R0934L109p9739r471r0160j49460M4270J20692l1311k6461K8099
11025A85746J5464J40350N6929r7562k7051l1220k05518k1431L9532p0320q5984
11014a01065N3621M09922Q0652k56862k5217J03575K5621k9511J75384J28315
11004E64435j59873J4700j20712j74152k5837K61591J35949J55384j35312q6313
10994D29860m9356R0667l2998r3205O1879J28479j50910J05150j38756j34604
10984B16206J98002K77717R5324j10037J03294J5483K06107l26954k01731M5941
$$ plain form
10974 519352 749974 623217 686114 889548 815140 967900 967838 945784 977043 1115505 1424497
10963 1424497 1419164 1473182 1417007 1513332 1414249 1421742 1633358 1999703 2001975 1795720 1778691
10952 1778691 1945944 2239085 2505186 2493325 2485131 2712411 2976067 3145182 3213290 3687924
10942 3687924 3749747 4053193 4577997 5033154 5508658 5926549 6769770 7533555 8268863 8843699
10932 8843699 9294873 9729389 9888142 9877106 9509363 9233178 8624242 7689850 6922751 6164879
10922 6164879 5553689 5042392 4434764 4070373 3881338 3560863 3198918 3131309 2788519 2563614
10912 2563614 2301738 2133978 2065887 2005378 1947340 1941707 1859272 1581007 1606080 1670130 1619276
10901 1619276 1377963 1205204 1034754 1095531 1035310 975316 861771 891390 843481 711277
$$ packed form
10974E19352K30622j26757O2897K03434p4408J52760o2k2054L1259J38462L08992
10963A424497n333N4018n6175R6325r9083P493K11616L66345K272k06255j7029
10952A778691J67253K93141K66101j1861q194K27280K63656J69115O8108M74634
10942C687924O1823L03446N24804M55157M75504M17891Q43221P63785P35308N74836
10932H843699M51174M34516J58753j1036l67743k76185o08936r34392p67099p57872
10922F164879o11190n11297o07628l64391j89035l20475l61945o7609l42790k24905
10912B563614k61876j67760o8091o0509n8038n633q2435k78265K5073O4050n0854
10901A619276k41313j72759j70450O0777o0221n9994j13545K9619m7909j32204
$$ plain form
10891 711277 599558 356018 626961 626206 667135 472141 643998 711266 540512 613297 370699
10880 370699 351043 526324 451708 521522 546044 309512 373404 545378 722007 665381 576441
10869 576441 463010 373135 325325 482113 280964 373083 397953 212884 185229 236463 322349
10858 322349 119576 79083 90563 -1968 87309 78153 71561 161280 321155 238199 269578
10847 269578 224670 201416 254041 353913 508285 336749 173464 249700 227111 67241 110121
10836 110121 105245 176094 374062 323644 328710 168415 129478 389 171384 226416 151546
10825 151546 194519 120569 413718 253993 424107 468673 181157 204147 184990 56089
10815 56089 257877 168759 241079 162159 84303 162009 16038 7690 -21890 -73462 66407
$$ packed form
10891G11277j11719k43540K70943p55M0929j94994J71857O7268j70754P2785k42598
10880C70699j9656J75281p4616O9814K4522k36532O3892J71974J76629n6626q8940
10869E76441j13431q9875m7810J56788k01149R2119K4870j85069k7655N1234Q5886
10858C22349k02773m0493J1480r2531Q9277r156o592Q9719J59875q2956L1379
10847B69578m4908k3254N2625R9872J54372j71536j63285P6236k2589j59870M2880
10836A10121m876P0849J97968n0418N066j60295l8937j29089J70995N5032p4870
10825A51546M2973p3950K93149j59725J70114M4566k87516K2990j9157j28901
10815E6089K01788q9118P2320p8920p7856P7706j45971q348k9580n1572J39869
$$ plain form
10804 66407 92153 -38043 -32782 122693 -18342 9472 -97629 55175 11071 -81405 -196480
10793 -196480 19071 16874 -5095 -71913 -183876 171205 179200 299686 218267 195515 69012
10782 69012 -532 -12066 124694 199995 99028 -63987 -51792 -296183 -126261 64805
10772 64805 248937 244768 -19281 -54967 -51809 -1332 52129 -132967 -124304 152318 138974
10761 138974 -22749 6907 -15874 246230 191229 -93609 12813 119355 186284 127876
10751 127876 4642 66472 294109 4880 -155698 47427 163535 35289 119951 76121
10741 76121 223129 210118 96184 126715 129489 128992 27556 70121 102098 176530 191116 262186
10729 262186 240744 68008 118618 148454 100341 276293 269998 230256 240813 281745 212385
$$ packed form
10804F6407K5746j30196N261J55475j41035K7814j07101J52804m4104r2476j15075
10793a96480K15551k197k1969o6818j11963L55081P995J20486q1419k2752j26503
10782F9012o9544j1534J36760P5301j00967j63015J2195k44391J69922J91066
10772F4805J84132m169k64049l5686L158N0477N3461j85096Q663K76622j3344
10761A38974j61723K9656k2781K62104n5001k84838J06422J06542O6929n8408
10751A27876j23234O1830K27637k89229j60578K03125J16108j28246Q4662m3830
10741G6121J47008j3011j13934L0531K774m97j01436M2565L1977P4432J4586P1070
10729B62186k1442j72736N0610K9836m8113J75952o295l9742J0557M0932o9360
$$ plain form
10718 212385 307423 507090 529421 551520 565911 450437 427162 471572 564160 704469 668318
10707 668318 727666 725167 705566 775177 851164 858828 877271 1074084 1089531 1405921 1589910
10696 1589910 1715628 1824417 1903377 2187673 2289335 2632352 2805652 2954136 3123893 3335086
10686 3335086 3490250 3367613 3075892 2880363 2670719 2497609 2102262 2030807 2088309 2026472
10676 2026472 2041081 2148035 2271894 2118577 2141870 2071516 1734904 1627672 1387375 1366178
10666 1366178 1425482 1091749 886778 803854 881390 878024 859736 736386 469215 408121 505441
10655 505441 458261 191711 240367 256659 84861 348085 411933 220485 275467 365143 326043
10644 326043 311283 151007 61440 196505 480655 312497 196953 394353 439838 321488
$$ packed form
10718B12385R5038J99667K2331K2099J4391j15474k3275M4410R2588J40309l6151
10707F68318N9348k499j9601O9611P5987P664J8443J96813J5447L16390J83989
10696A589910J25718J08789P8960K84296J01662L43017J73300J48484J69757K11193
10686C335086J55164j22637k91721j95529k09644j73110l95347p1455N7502o1837
10676B026472J4609J06954J23859j53317K3293p0354l36612j07232k40297k1197
10666A366178N9304l33733k04971q2924P7536l366j8288j23350k67171o1094R7320
10655E05441m7180k66550M8656J6292j71798K63224O3848j91448N4982Q9676l9100
10644C26043j4760j60276q9567J35065K84150j68158j15544J97400M5485j18350
$$ plain form
10634 321488 235134 126666 164974 143596 50740 92367 159072 -4100 -22367 -31613 94832
10623 94832 31661 765 -188157 -246823 -220658 -217840 148564 311662 249619 340761 214725
10612 214725 -179275 -103991 60830 25991 102088 20513 115359 116349 -152116 -47566 -295358
10601 -295358 -155564 61511 46327 52830 -60029 8993 185737 94310 -50726 5733 191211
10590 191211 72977 143281 30342 -143942 92405 54732 5023 17413 -205569 -107483
10580 -107483 152371 40943 -43482 28490 -76154 63349 187170 240725 124097 168964
10570 168964 169003 98211 166462 185281 42829 61070 92174 248186 254444 196853 342966 382920
10558 382920 212351 58474 2108 45938 -34225 171233 244784 130397 81847 66246 -12621
$$ packed form
10634C21488q6354j08468L8308k1378r2856M1627O6705j63172j8267r246J26445
10623I4832o3171l0896j88922n8666K6165K818L66404J63098o2043R1142j26036
10612B14725l94000P5284J64821l4839P6097q1575R4846R90k68465J04550k47792
10601b95358J39794K17075j5184O503j12859O9022J76744r1427j45036N6459J85478
10590A91211j18234P0304j12939j74284K36347l7673m9709J2390k22982R8086
10580a07483K59854j11428q4425P1972j04644J39503J23821N3555j16628M4867
10570A68964L9p0792O8251J8819j42452J8241L1104J56012O258n7591J46113L9954
10558C82920j70569j53877n6366M3830q0163K05458P3551j14387m8550j5601p8867
$$ plain form
10547 -12621 17694 76849 192315 64241 112636 -26202 15634 106138 90913 181336 -25409
10536 -25409 40241 164803 351733 42297 29255 -28877 -114981 -144958 -39951 122316 191970
10525 191970 -25840 9974 28085 -24707 -162058 67076 92476 167966 133215 134658 238358
10514 238358 82882 62581 201022 164234 52636 112871 153002 -48356 111288 127965
10504 127965 -51095 -72803 134686 166631 -96223 20462 197343 139243 55334 -67022
10494 -67022 -207304 -133545 -81510 27423 29441 183222 45413 110707 86731 -44438 -102523
10483 -102523 -200534 -35803 -61949 -152653 -91344 43252 58268 33814 31133 77361 269873
10472 269873 124548 163033 137704 11286 33419 -105245 22524 124997 285399 45639
$$ packed form
10547a2621L0315N9155J15466j28074M8395j38838M1836R0504j5225R0423k06745
10536b5409O5650J24562J86930l09436j3042n8132q6104k9977J05007J62267O9654
10525A91970k17810L5814J8111n2792j37351K29134K5400P5490l4751J443J03700
10514B38358j55476k0301J38441l6788j11598O0235M0131k01358J59644J6677
10504A27965j79060k1708K07489L1945k62854J16685J76881n8100q3909j22356
10494f7022j40282P3759N2035J08933K018J53781j37809O5294k3976j31169n8085
10483a02523r8011J64731k6146r0704O1309J34596J5016k4454k681M6228J92512
10472B69873j45325L8485k5329j26418K2133j38664J27769J02473J60402k39760
$$ plain form
10462 45639 -178262 -112422 -148072 -110269 40925 48351 99181 48713 122159 154239 133651
10451 133651 197205 75763 74324 203145 -619 13513 -42815 -74926 21683 -11480 181972
10440 181972 230077 275438 244324 128237 -61671 -152468 -138200 -128689 -67351 42966 127302
10429 127302 208968 -103995 -120040 -132319 -93839 153140 219521 150757 368166 191412 -28474
10418 -28474 225207 282444 218748 196508 150261 309725 235098 172027 47737 -43361 20540
10407 20540 97291 138519 144450 239226 347118 277581 199422 303566 187059 463901 312539
10396 312539 148640 252549 111297 128303 149084 250168 127875 212674 -72444 -13845
10386 -13845 183888 337039 274800 218929 327087 183859 296801 387735 400361 177094
$$ packed form
10462D5639k23901O5840l5650L7803J51194P426N0830n0468P3446L2080k0588
10451A33651O3554j21442j439J28821k03764J4132n6328l2111R6609l3163J93452
10440A81972M8105M5361l1114j16087j89908r0797J4268R511O1338J10317Q4336
10429A27302Q1666l12963j6045j2279L8480K46979O6381o8764K17409j76754k19886
10418b8474K53681N7237o3696k2240m6247J59464p4627o3071j24290r1098O3901
10407B0540P6751M1228N931R4776J07892o9537p8159J04144j16507K76842j51362
10396C12539j63899J03909j41252J7006K0781J01084j22293Q4799k85118N8599
10386a3845J97733J53151o2239n5871J08158j43228J12942R0934J2626k23267
$$ plain form
10376 177094 127317 333476 378338 438211 632088 597011 350506 315625 293499 485517 538329
10365 538329 452114 616568 479719 317896 368883 382843 423764 505439 445070 369424 399586
10354 399586 643796 662497 646763 552908 618785 785040 582608 326490 310721 392073 372011
10343 372011 241672 395765 368145 401608 457299 658603 649365 546509 591392 626581 349401
10332 349401 301127 457071 581988 650533 529028 531024 655716 612702 548124 494556 376169
10321 376169 311524 494448 600486 701241 640648 463219 372756 498354 693423 617377
10311 617377 796823 820069 705400 674029 612395 597137 657590 707632 817529 904454 781054
10300 781054 646356 674038 796862 932513 978599 892138 883974 821283 981842 1158670 938111
$$ packed form
10376A77094m9777K06159M4862N9873J93877l5077k46505l4881k2126J92018N2812
10365E38329q6215J64454j36849j61823N0987J3960M0921Q1675o0369p5646L0162
10354C99586K44210J8701j5734r3855O5877J66255k02432k56118j5769Q1352k0062
10343C72011j30339J54093k7620L3463N5691K01304r238j02856M4883L5189k77180
10332C49401m8274J55944J24917O8545j21505J996J24692m3014o4578n3568j18387
10321C76169o4645J82924J06038J00755o0593j77429r0463J25598J95069p6046
10311F17377J79446K3246j14669l1371o1634j5258O0453N0042J09897Q6925j23400
10300G81054j34698K7682J22824J35651M6086q6461q164o2691J60559J76828k20559
$$ plain form
10289 938111 966751 1063847 1032051 1095253 1067250 1108022 1204806 1269926 1392272 1405751 1289829
10278 1289829 1319316 1462975 1623948 1681216 1613968 1743636 1825364 1835349 1789127 1986188 2023365
10267 2023365 2109964 2409245 2475922 2584891 2499574 2690434 2776255 2654766 2880377 2938161
10257 2938161 3129650 3107328 3367264 3449634 3617231 4025876 4483749 4554167 4733332 5170051
10247 5170051 5823524 6147471 6398731 6951468 7277115 7352543 7450269 7531910 7569016 7407342
10237 7407342 7053725 6737255 6464981 6185247 6006600 5640234 5430372 5366017 5026098 4663254
10227 4663254 4247641 4384550 4120034 3889208 3836600 3566083 3265550 3306821 3171874 2985761
10217 2985761 2900031 2672779 2488333 2536913 2659156 2723198 2683307 2767423 2526473 2347919
$$ packed form
10289I38111K8640R7096l1796O3202k8003M0772R6784O5120J22346J3479j15922
10278A289829K9487J43659J60973N7268o7248J29668Q1728R985m6222J97061L7177
10267B023365Q6599K99281O6677J08969q5317J90860Q5821j21489K25611N7784
10257B938161J91489k2322K59936Q2370J67597M08645M57873P0418J79165M36719
10247E170051O53473L23947K51260N52737L25647P5428R7726Q1641L7106j61674
10237G407342l53617l16470k72274k79734j78647l66366k09862o4355l39919l62844
10227D663254m15613J36909k64516k30826n2608k70517l00533M1271j34947j86113
10217B985761q5730k27252j84446M8580J22243O4042l9891Q4116k40950j78554
$$ plain form
10207 2347919 2423689 2474271 2474244 2588905 2520751 2368263 2375211 2512508 2553915 2481563 2544953
10196 2544953 2535767 2666679 2718480 2666080 2701858 2778822 2762687 3002397 2917582 2968804 3325976
10185 3325976 3359627 3680087 3765552 3625079 3727597 3853891 3944391 3790956 3758156 3881022
10175 3881022 4118308 4082026 3953039 4102833 4183706 4226790 4538247 4721512 4786259 4947809
10165 4947809 5455083 6160985 7081473 8200776 9127952 9767821 10086782 10344197 10315792
10156 10315792 10108848 10278528 10490351 10508799 10466131 10139111 9500327 8782447 7816430 7133875
10146 7133875 6719213 6344979 6270067 5966472 5883121 5612830 5450856 5411822 5424132 5133427
10136 5133427 4920669 4941921 5115736 5245620 5407469 5330057 5445769 5656652 5732145 5753093
$$ packed form
10207B347919P5770N0582k7J14661o8154j52488O948J37297M1407p2352O3390
10196B544953r186J30912N1801n2400L5778P6964j6135K39710q4815N1222L57172
10185C325976L3651L20460Q5465j40473J02518J26294R0500j53435l2800J22866
10175C881022K37286l6282j28987J49794Q0873M3084L11457J83265O4747J61550
10165D947809N07274P05902R20488J119303R27176O39869L18961K57415k8405
10156A0315792k06944J69680K11823J8448m2668l27020o38784p17880r66017o82555
10146G133875m14662l74234p4912l03595q3351k70291j61974l9034J2310k90705
10136E133427k12758K1252J73815J29884J61849p7412J15712K10883P5493K0948
$$ plain form
10126 5753093 5674117 6019602 6002937 5835958 5708234 5604586 5292900 4953784 4830477 4420572
10116 4420572 4096017 3789071 3342388 3068191 2819323 2919709 2917438 2813761 2599059 2480684
10106 2480684 2454125 2307326 2220458 2398919 2443205 2418822 2515916 2456350 2344118 2336315 2545129
10095 2545129 2439980 2379736 2670834 2704553 2819595 2785291 2961302 2960631 2975788 3037992 2781838
10084 2781838 2791911 2755060 2459903 2311575 2418622 2403395 2311465 2118134 1824226 1731223
10074 1731223 1659018 1638871 1766081 1857761 1803269 1954533 1802271 1658448 1747567 1741297 1551386
10063 1551386 1607718 1762482 1722770 1769494 1654270 1803302 1753592 1744663 1860974 1977196
10053 1977196 1865165 1752355 1702626 1600949 1872284 1857988 1943070 1872423 1933334 1957177
$$ packed form
10126E753093p8976L45485j6665j66979j27724j03648l11686l39116j23307m09905
10116D420572l24555l06946m46683k74197k48868J00386k271j03677k14702j18375
10106B480684k6559j46799q6868J78461M4286k4383R7094n9566j12232p803K08814
10095B545129j05149o0244K91098L3719J15042l4304J76011o71J5157O2204k56154
10084B781838J0073l6851k95157j48328J07047j5227r1930j93331k93908r3003
10074A731223p2205k0147J27210R1680n4492J51264j52262j43823Q9119o270j89911
10063A551386N6332J54764l9712M6724j15224J49032m9710q929J16311J16222
10053A977196j12031j12810m9729j01677K71335j4296Q5082p0647O0911K3843
$$ plain form
10043 1957177 1830926 1914664 1878214 1970466 1818875 1756451 1795335 1779305 1735557 1775238 1892536
10032 1892536 2004030 1858503 1794783 1763855 1965782 1974276 1935591 2006982 2000832 2126944 2122108
10021 2122108 2019815 1992293 1966484 2010127 1863968 2100578 2280280 2219520 2240452 2253763
10011 2253763 2147491 2173964 2157673 2317293 2427411 2496942 2658130 2511357 2330787 2302404
10001 2302404 2477442 2592866 2614057 2683279 2811430 2749465 2845269 2617444 2599439 2708164
9991 2708164 2826412 2835449 2826100 2681313 2678395 2852562 2901422 3007289 3000530 3139174 3095476
9980 3095476 3010996 2940860 3085886 3197957 3222482 3305843 3283057 3432779 3586083 3505485 3487760
9969 3487760 3630597 3715560 3763006 3872939 3782287 3745290 3765684 3498571 3381634 3568500
$$ packed form
10043A957177j26251Q3738l6450R2252j51591o2424L8884j6030m3748L9681J17298
10032A892536J11494j45527o3720l0928K01927Q494l8685P1391o150J26112m836
10021B122108j02293k7522k5809M3643j46159K36610J79702o0760K0932J3311
10011B253763j06272K6473j6291J59620J10118O9531J61188j46773j80570k8383
10001B302404J75038J15424K1191O9222J28151o1965R5804k27825j8005J08725
9991B708164J18248R037r349j44787k918J74167M8860J05867o759J38644m3698
9980C095476q4480p0136J45026J12071K4525Q3361k2786J49722J53304q0598j7725
9969C487760J42837Q4963M7446J09933r0652l6997K0394k67113j16937J86866
$$ plain form
9959 3568500 3845511 3954187 3919827 3822917 3862136 4110908 4380465 4245278 4241401 4435027
9949 4435027 4350365 4419342 4493672 4512171 4551988 4593341 4642349 4440516 4477341 4694067 4876135
9938 4876135 4947531 5083500 4990170 5367821 5417124 5388365 5554453 5730277 5583041 5528522
9928 5528522 5578370 5740651 5517181 5459931 5708195 5652536 5728316 5805974 5769619 5889987 5956841
9917 5956841 5884741 5983220 5985817 6058325 6058355 6219824 6441259 6692980 6615584 6757131 6654627
9906 6654627 6779375 6987907 7153287 7245624 7230102 7478407 7675751 7789901 7982708 7994786
9896 7994786 8067889 7960100 8032991 7923100 8092388 8349806 8502087 8412684 8472613 8555782
9886 8555782 8562227 8889871 8965998 9020632 9308808 9181628 9436845 9583749 9597538 9619246 9819863
$$ packed form
9959C568500K77011J08676l4360r6910L9219K48772K69557j35187l877J93626
9949D435027q4662O8977P4330J8499L9817M1353M9008k01833L6825K16726J82068
9938D876135P1396J35969r3330L77651M9303k8759J66088J75824j47236n4519
9928E528522M9848J62281k23470n7250K48264n5659P5780P7658l6355J20368O6854
9917E956841p2100R8479K597P2508L0J61469K21435K51721p7396J41547j02504
9906F654627J24748K08532J65380R2337j5522K48305J97344J14150J92807J2078
9896G994786P3103j07789P2891j09891J69288K57418J52281q9403N9929Q3169
9886H555782O445L27644P6127N4634K88176j27180K55217J46904J3789K1708K00617
$$ plain form
9875 9819863 10094976 10283699 10620730 10638627 10929200 11025035 11480957 11871408 11933647 12211040
9865 12211040 12440345 12504934 12863909 13285825 13662956 13930324 14228803 14478287 14746654 14891906
9855 14891906 15072830 15363527 15741233 16112134 16583899 16826042 17328370 17721426 18203474
9846 18203474 18826968 19193141 19608552 20143114 20997999 21658289 22364650 23099920 23997613
9837 23997613 25095127 25928805 26571319 27274997 27922433 28583923 29111672 29713589 30226598
9828 30226598 30373193 30587352 30965874 31052822 31293136 31698260 32103752 32626221 33326201 34069044
9818 34069044 34663205 35326410 35738565 36522896 37502244 38470951 39689645 41135682 42707691
9809 42707691 44246225 45807815 47529000 49572512 51929032 54428339 57269649 60043681
$$ packed form
9875I819863K75113J88723L37031J7897K90573R5835M55922L90451O2239K77393
9865A2211040K29305O4589L58975M21916L77131K67368K98479K49484K68367J45252
9855A4891906J80924K90697L77706L70901M71765K42143N02328L93056M82048
9846A8203474O23494L66173M15411N34562Q54885O60290P06361P35270Q97693
9837B3997613J097514Q33678O42514P03678O47436O61490N27749O01917N13009
9828C0226598J46595K14159L78522Q6948K40314M05124M05492N22469O99980P42843
9818C4069044N94161O63205M12155P84331R79348R68707J218694J446037J572009
9809D2707691J538534J561590J721185K043512K356520K499307K841310K774032
$$ plain form
9801 60043681 62885277 65331764 67653766 69733021 71307176 72430034 73448788 74684601
9793 74684601 76341610 78683949 81187545 84467314 87628898 90447904 92683485 94649974
9785 94649974 96549408 98854295 101554832 104528506 107635986 111167191 115223944 119174216
9777 119174216 123589126 128679986 135183317 142998602 152874363 164785712 179380763 197263470
9769 197263470 215593254 230144217 240936448 251396674 261052594 266760953 265536847
9762 265536847 257452256 246858521 236745208 223469358 206040234 188151672 173307176
9755 173307176 162026100 153553407 147586202 143271334 140066192 137704184 136275450 135645689
9747 135645689 135333551 135767041 137072663 138740181 140959663 143461792 146721626 151509205
$$ packed form
9801F0043681K841596K446487K322002K079255J574155J122858J018754J235813
9793G4684601J657009K342339K503596L279769L161584K819006K235581J966489
9785I4649974J899434K304887K700537K973674L107480L531205M056753L950272
9777A19174216M414910N090860O503331P815285R875761J1911349J4595051J7882707
9769A97263470J8329784J4550963J0792231J0460226R655920N708359j224106
9762B65536847q084591j0593735j0113313j3275850j7429124j7888562j4844496
9755A73307176j1281076q472693n967205m314868l205142k362008j428734o29761
9747A35645689l12138M33490J305622J667518K219482K502129L259834M787579
$$ plain form
9739 151509205 157837033 166264636 177903776 192716028 211506823 231967214 248393557
9732 248393557 259838770 270763685 281820122 287983127 284155399 270678832 254261882
9725 254261882 238084450 218646644 195196743 171185627 149987330 132395904 118498750
9718 118498750 107613874 98802947 91720814 85666058 80450108 75896742 72120578 68918070
9710 68918070 66136363 63599220 61426320 59331941 57619247 56640138 56067891 55544829 55532410
9701 55532410 56436343 57359434 58305801 59088146 60045262 60579303 60702302 60393520 59903282
9692 59903282 58688313 56848209 54787289 51706958 48581893 45272963 41886282 38607381
9684 38607381 35889333 33729681 31799535 30397379 29290263 28149504 27053963 26220108
$$ packed form
9739A51509205O327828Q427603J1639140J4812252J8790795K0460391J6426343
9732B48393557J1445213J0924915J1056437O163005l827728j3476567j6416950
9725B54261882j6177432j9437806k3449901k4011116k1198297j7591426j3897154
9718A18498750j0884876q810927p082133o054756n215950m553366l776164l202508
9710F8918070k781707k537143k172900k094379j712694r79109n72247n23062j2419
9701E5532410R03933R23091R46367P82345R57116N34041J22999l08782m90238
9692E9903282j214969j840104k060920l080331l125065l308930l386681l278901
9684C8607381k718048k159652j930146j402156j107116j140759j095541q33855
$$ plain form
9676 26220108 25333974 24528843 23622752 23192813 22528474 21828195 21033859 20287523 19850118
9667 19850118 19136650 18735283 18127154 17573229 17112078 17039584 16725180 16475300 16221614 15997895
9657 15997895 15755752 15717881 15631239 15540138 15463315 15389610 15289092 15379094 15425152 15348647 14934223
9646 14934223 14973552 15206315 15211617 15191134 15227798 15376805 15258625 15346430 15402115 15377765 15306817
9635 15306817 15191102 14998379 14917619 14822401 15053175 15241342 15225990 15863144 16184784 16418341
9625 16418341 16590558 16268094 16219431 16058456 15849648 15745581 15704989 15490430 15216357 14727936
9615 14727936 14077593 13605609 13346146 13262170 12913847 12868165 13095172 13043054 13114601 13191636
9605 13191636 13104137 13183438 13441973 13692457 13705898 13674524 13886582 14219533 14475919 14501540
$$ packed form
9676B6220108q86134q05131r06091m29939o64339p00279p94336p46336m37405
9667A9850118p13468m01367o08129n53925m61151p2494l14404k49880k53686k23719
9657A5997895k42143l7871q6642r1101p6823p3705j00518R0002M6058p6505m14424
9646A4934223L9329K32763N302k0483L6664J49007j18180Q7805N5685k4350p0948
9635A5306817j15715j92723q0760r5218K30774J88167j5352O37154L21640K33557
9625A6418341J72217l22464m8663j60975k08808j04067m0592k14559k74073m88421
9615A4727936o50343m71984k59463q3976l48323m5682K27007n2118P1547P7035
9605A3191636q7499P9301K58535K50484J3441l1374K12058L32951K56386K5621
$$ plain form
9595 14501540 14701357 14977333 15627399 16291508 16764173 17385075 18022565 18557693 19120901
9586 19120901 19342910 19075901 18823416 18554711 18501847 18400895 18231117 18032753 17209262 16474157
9576 16474157 15508327 14698487 14136202 13704413 13604699 13458445 13354171 13455860 13460791 13473617
9566 13473617 13391321 13668414 13773507 13917957 13786419 13746556 13645810 13617060 13589507 13358161
9556 13358161 13412761 13309347 13308513 13182330 13316835 13465484 13667652 13411241 13537847 13627022
9546 13627022 13646595 13814129 14057710 14542616 14991922 15361939 15652523 16091119 16431414 16715430
9536 16715430 17197617 17908213 18242547 18747502 19298895 19427963 19486826 19761180 20045924 20038768
9526 20038768 19916705 19595270 19013671 18575659 18342798 18023266 17529973 17144394 16569129
$$ packed form
9595A4501540J99817K75976O50066O64109M72665O20902O37490N35128N63208
9586A9120901K22009k67009k52485k68705n2864j00952j69778j98364q23491p35105
9576A6474157r65830q09840n62285m31789r9714j46254j04274J01689M931J2826
9566A3473617q2296K77093J05093J44450j31538l9863j00746k8750k7553k31346
9556A3358161N4600j03414q34j26183J34505J48649K02168k56411J26606Q9175
9546A3627022J9573J67534K43581M84906M49306L70017K90584M38596L40295K84016
9536A6715430M82187P10596L34334N04955N51393J29068N8863K74354K84744p156
9526B0038768j22063l21435n81599m38012k32861l19532m93293l85579n75265
$$ plain form
9517 16569129 16021404 15586201 15115890 14526748 14170696 13760493 13321974 13209352 12815883
9508 12815883 12404888 12373030 12288260 11941003 11751134 11696677 11488580 11089476 10778310 10586319
9498 10586319 10339431 10209211 10190891 10045097 9819070 10020175 10050890 9952070 9943324 9808058
9488 9808058 9870693 9877968 10002048 9844508 9894670 10124130 9852652 9505711 9489244 9559512 9607725
9477 9607725 9578459 9546201 9597348 9983857 9871190 10172000 10418318 10670276 10688533 11085484
9467 11085484 11137770 11302597 11448124 11564931 11787422 11706537 11682535 11534488 11552562 11149400
9457 11149400 10751504 10647096 10230752 9935127 9739829 9409678 9380156 9424782 9532213 9569975
9447 9569975 9416980 9359482 9569073 9617506 9656665 9827727 10072171 9967793 10002757 10283351
$$ packed form
9517A6569129n47725m35203m70311n89142l56052m10203m38519j12622l93469
9508A2815883m10995l1858q4770l47257j89869n4457k08097l99104l11166j91991
9498A0586319k46888j30220j8320j45794k26027K01105L0715r8820q746j35266
9488I808058O2635P275J24080j57540N0162K29460k71478l46941j6467P0268M8213
9477I607725k9266l2258N1147L86509j12667L00810K46318K51958J8257L96951
9467A1085484N2286J64827J45527J16807K22491q0885k4002j48047J8074m03162
9457A1149400l97896j04408m16344k95625j95298l30151k9522M4626J07431L7762
9447I569975j52995n7498K09591M8433L9159J71062K44444j04378L4964K80594
$$ plain form
9437 10283351 10246139 10567036 10871991 11109423 11562625 12099592 12838016 13037240 13396590 13524902
9427 13524902 13796451 13824528 13677846 13555467 13340066 13189353 12902529 12271403 12052908 11678484
9417 11678484 11185641 10558330 10198187 10055453 9765046 9610317 9631130 9594889 9606585 9523652
9407 9523652 9629758 9660516 9672556 9737171 9818398 10025661 10015848 10251664 10060047 10075445 10191502
9396 10191502 10179802 10221672 10317758 10602926 11115652 11131900 11174050 11264608 11343726 11280468 10895885
9385 10895885 10784899 10612295 10734704 10800039 10938921 10880839 10620269 10476373 10158646 10297007
9375 10297007 10269968 10004565 10015100 9975350 10037532 10095573 10134376 10117016 10272299 10266022 10116806
9364 10116806 10161350 10004624 9795316 10042521 9841241 9433214 9470421 9773299 9905955 9809324
$$ packed form
9437A0283351l7212L20897L04955K37432M53202N36967P38424J99224L59350J28312
9427A3524902K71549K8077j46682j22379k15401j50713k86824o31126k18495l74424
9417A1678484m92843o27311l60143j42734k90407j54729K0813l6241J1696q2933
9407I523652J06106L0758J2040O4615Q1227K07263r813K35816j91617J5398J16057
9396A0191502j1700M1870R6086K85168N12726J6248M2150R0558P9118o3258l84583
9385A0895885j10986j72604J22409O5335J38882n8082k60570j43896l17727J38361
9375A0297007k7039k65403J0535l9750O2182N8041L8803j7360J55283o277j49216
9364A0116806M4544j56726k09308K47205k01280m08027L7207L02878J32656r6631
$$ plain form
9354 9809324 9837539 10152125 10207778 10169710 10265319 10006824 10028121 10020053 10213583 10205663 10068018
9343 10068018 10281066 10361763 10189383 10403471 10443181 10340702 10498789 10451996 10444064 10420138
9333 10420138 10549695 10706652 10726471 10718114 10590683 10941434 11038585 10980407 11024802 10989478 11031967
9322 11031967 11136802 11346690 11526436 11957649 12066702 12118130 12242672 12183628 12064827 12119884
9312 12119884 12167267 12048031 12142772 12164089 12376901 12680849 12774731 12794373 12872453 12796296 12888423
9301 12888423 12833741 13045868 13129076 13103388 13180492 13101077 13215612 13439155 13643501 13881049
9291 13881049 14098451 14456029 14606184 14678287 14579306 14771346 15153564 15256588 15507735 15692149
9281 15692149 15874006 15814298 16123306 16352258 16544599 16695439 16842818 16966923 17066240 17198306
$$ packed form
9354I809324K8215L14586N5653l8068R5609k58495K1297q068J93530p920j37645
9343A0068018K13048Q0697j72380K14088L9710j02479J58087m6793p932k3926
9333A0420138J29557J56957J9819q357j27431L50751R7151n8178M4395l5324M2489
9322A1031967J04835K09888J79746M31213J09053N1428J24542n9044j18801N5057
9312A2119884M7383j19236R4741K1317K12812L03948R3882J9642P8080p6157R2127
9301A2888423n4682K12127Q3208k5688P7104p9415J14535K23543K04346K37548
9291A3881049K17402L57578J50155P2103r8981J92040L82218J03024K51147J84414
9281A5692149J81857n9708L09008K28952J92341J50840J47379J24105R9317J32066
$$ plain form
9271 17198306 17461815 17756153 17893771 18285587 18608593 19084413 19566234 19659319 20049678 20420600
9261 20420600 20497984 20790513 21143449 21573676 21844545 22293343 22676632 22943302 23597598 24112792
9251 24112792 24805783 25273095 25694423 26450911 27062302 27618017 28101751 28562179 29270027
9242 29270027 29897952 30436278 30892741 31292213 31633709 32272812 32717305 33495598 34182715
9233 34182715 34804915 35521637 36063778 36815821 37838877 38676472 39668888 40703308 41652381
9224 41652381 42980873 44150385 45258606 46630658 48150009 49752050 51753738 53790650
9216 53790650 56213919 58939672 62129147 66034462 71179596 77522191 83915570 88516006
9208 88516006 89782335 89846076 90908450 92787982 94072121 93255399 90013605 86139080 82765280
$$ packed form
9271A7198306K63509K94338J37618L91816L23006M75820M81821R3085L90359L70922
9261B0420600P7384K92529L52936M30227K70869M48798L83289K66670O54296N15194
9251B4112792O92991M67312M21328P56488O11391N55715M83734M60428P07848
9242B9270027O27925N38326M56463L99472L41496O39103M44493P78293O87117
9233C4182715O22200P16722N42141P52043J023056Q37595R92416J034420R49073
9224D1652381J328492J169512J108221J372052J519351J602041K001688K036912
9216E3790650K423269K725753L189475L905315N145134O342595O393379M600436
9208H8516006J266329O3741J062374J879532J284139q16722l241794l874525l373800
$$ plain form
9199 82765280 80667878 79581961 79075785 79359418 80106931 81318633 82438260 83656741 85094203
9190 85094203 86974829 89105119 91814775 94419929 97634041 101442348 106393069 112671916
9182 112671916 120429649 128364709 135083677 140724893 147895772 157999030 170459994 184880537
9174 184880537 200915611 217266346 228891465 232109972 230673893 230750356 234749080 238973266
9166 238973266 235737296 223198814 207339745 193465431 182855954 175788605 171049755
9159 171049755 168224160 167344422 168035091 169903422 172644036 176658353 182077834 189084123
9151 189084123 198359521 210000348 224782434 244574010 270827123 304924214 347362800
9144 347362800 392701096 430137852 454106461 469644632 483764332 498254127 503123018
$$ packed form
9199H2765280k097402j085917n06176K83633P47513J211702J119627J218481J437462
9190H5094203J880626K130290K709656K605154L214112L808307M950721O278847
9182A12671916P757733P935060O718968N641216P170879J0103258J2460964J4420543
9174A84880537J6035074J6350735J1625119L218507j436079P6463L998724M224186
9166B38973266l235970j2538482j5859069j3874314j0609477p067349m738850
9159A71049755k825595q79738O90669J868331K740614M014317N419481P006289
9151A89084123R275398J1640827J4782086J9791576K6253113L4097091M2438586
9144C47362800M5338296L7436756K3968609J5538171J4119700J4489795M868891
$$ plain form
9137 503123018 489135765 464211606 443668944 431901706 423393282 410061006 392406962
9130 392406962 373090134 348231554 315566708 280098840 248685796 222868011 202714344
9123 202714344 186805837 174036636 163891297 155744129 149380848 144260502 140673249 138298280
9115 138298280 136997733 136214967 135314634 135252373 136838051 140044609 145085861 150253219 154684758
9106 154684758 159227221 164739703 169965011 172580009 171865628 168530217 163122641 156133956
9098 156133956 149181743 143212522 138460852 134145677 129055838 123834623 118742220 112891620
9090 112891620 106893406 101614228 97238598 93951302 91425658 89502884 88307016 87705250
9082 87705250 87704450 88744938 90566303 92826977 95482698 97262590 97168371 96074764 95654803
$$ packed form
9137E03123018j3987253k4924159k0542662j1767238q508424j3332276j7654044
9130C92406962j9316828k4858580l2664846l5467868l1413044k5817785k0153667
9123B02714344j5908507j2769201j0145339q147168o363281n120346l587253k374969
9115A38298280j300547p82766r00333o2261J585678L206558N041252N167358M431539
9106A54684758M542463N512482N225308K614998p14381l335411n407576o988685
9098A56133956o952213n969221m751670m315175n089839n221215n092403n850600
9090A12891620n998214n279178m375630l287296k525644j922774j195868o01766
9082H7705250q00J040488J821365K260674K655721J779892r4219j093607m19961
$$ plain form
9073 95654803 96560999 98738255 99780746 98733616 96638733 94941427 93983473 93453528 92586601
9064 92586601 91235456 89491550 87890281 86586817 84894242 82957385 81438088 80133516
9056 80133516 79455775 79231965 79213481 79222365 79072079 78790548 78151595 77547123 77368030 77501618
9046 77501618 77523747 77909625 78534374 79082890 79638493 80504205 81281044 82140050 83338092
9037 83338092 84885623 86403951 88175609 90452510 92957124 95339011 97747327 100311358
9029 100311358 102984745 105709220 108699262 111934230 115239009 118972351 122670656 126212306
9021 126212306 130130482 135277429 141760969 150087087 160535382 173542419 189470093 204989297
9013 204989297 213097646 211415987 205245955 200613340 199875442 204221165 213151655 223948333
$$ packed form
9073I5654803R06196K177256J042491j047130k094883j697306r57954n29945q66927
9064I2586601j351145j743906j601269j303464j692575j936857j519297j304572
9056H0133516o77741k23810j8484Q884j50286k81531o38953o04472j79093J33588
9046G7501618K2129L85878O24749N48516N55603Q65712P76839Q59006J198042
9037H3338092J547531J518328J771658K276901K504614K381887K408316K564031
9029A00311358K673387K724475K990042L234968L304779L733342L698305L541650
9021A26212306L918176N146947O483540Q326118J0448295J3007037J5927674J5519204
9013B04989297Q108349j681659o170032m632615p37898M345723Q930490J0796678
$$ plain form
9005 223948333 228914629 222853410 209386178 195810392 184441989 174843840 167646001 163182115
8997 163182115 160337119 159221436 160137739 163062456 168333295 174928180 182679987 191248756
8989 191248756 198993716 205891206 214365682 225613019 236215400 240081668 237466116 234011192
8981 234011192 235179991 243292694 256154654 266927773 269772694 263300477 250873352 238778211
8973 238778211 230705265 227589543 229251908 231480117 227607163 216553850 203332450 191756393
8965 191756393 183621436 178035614 174008208 171592965 171048411 171810686 173229323 174331321
8957 174331321 175555325 177980284 181304752 184783856 188921130 194581610 201355559 205457030
8949 205457030 201826303 191296180 179612954 171059210 166710202 166597561 169445688 173824460
$$ packed form
9005B23948333M966296o061219j3467232j3575786j1368403r598149p197839m463886
8997A63182115k844996j115683R16303K924717N270839O594885P751807Q568769
8989A91248756P744960O897490Q474476J1247337J0602381L866268k615552l454924
8981B34011192J168799Q112703J2861960J0773119K844921o472217j2427125j2095141
8973B38778211q072946l115722J662365K228209l872954j1053313j3221400j1576057
8965A91756393q134957n585822m027406k415243n44554P62275J418637J101998
8957A74331321J224004K424959L324468L479104M137274N660480O773949M101471
8949B05457030l630727j0530123j1683226q553744m349008j12641K848127M378772
$$ plain form
8941 173824460 174026500 167769688 157837960 147773387 139928585 134874719 131990290 130612681
8933 130612681 130494491 130860196 131490227 132581722 134224174 136162644 138599646 141431363
8925 141431363 144258325 140903755 134798446 128623931 123192257 119803978 117641678 115742444
8917 115742444 112951312 109986451 107340053 105725981 104854223 104945888 105007355 105589347 106081643
8908 106081643 106224727 106511332 106884377 107223678 107412348 107193951 107076121 106914571 106819383
8899 106819383 107268715 107969786 109142168 110771766 112551363 114489300 116983354 120569476
8891 120569476 125576287 132732675 141135827 148932875 154438944 155928665 152991361 146834185
8883 146834185 140095230 135278235 133421498 134939827 139655946 146867616 154820908 160236076
$$ packed form
8941A73824460K02040o256812r931728j0064573p844802n053866k884429j377609
8933A30612681j18190L65705O30031J091495J642452J938470K437002K831717
8925A41431363K826962l354570o105309o174515n431674l388279k162300j899234
8917A15742444k791132k964861k646398j614072q71758R1665O1467N81992M92296
8908A06081643J43084K86605L73045L39301J88670k18397j17830j61550r5188
8899A06819383M49332P01071J172382J629598J779597J937937K494054L586122
8891A20569476N006811P156388Q403152P797048N506069J489721k937304o157176
8883A46834185o738955m816995j856737J518329M716119P211670P953292N415168
$$ plain form
8875 160236076 161692919 158204259 150424164 140683124 131367781 123516087 117280280 112591586
8867 112591586 108802270 106535130 104815347 103656742 102997897 102572471 102726210 102866000 102640182
8858 102640182 103028306 103786852 105050839 106767807 108938375 111094833 113128484 115435553
8850 115435553 118232598 121820214 126732628 133775771 143445801 155091404 166846886 176618696
8842 176618696 182639408 183494422 179565521 172787594 165346822 158758530 155286978 156058406
8834 156058406 159810558 164086262 165892664 163146057 155607687 145012568 134211772 125855622
8826 125855622 120596915 118540576 119210725 122265461 126478329 129378161 129361660 126067430
8818 126067430 120062639 112906797 105790017 99703682 94890732 91258571 88475951 86170278
$$ packed form
8875A60236076J456843l488660p780095r741040r315343p851694o235807m688694
8867A12591586l789316k267140j719783j158605o58845m25426J53739J39790k25818
8858A02640182L88124P58546J263987J716968K170568K156458K033651K307069
8850A15435553K797045L587616M912414P043143R670030J1645603J1755482R771810
8842A76618696O020712Q55014l928901o777927p440772o588292l471552P71428
8834A56058406L752152M275704J806402k746607p538370j0595119j0800796q356150
8826A25855622n258707k056339O70149L054736M212868K899832j6501l294230
8818A26067430o004791p155842p116780o086335m812950l632161k782620k305673
$$ plain form
8810 86170278 85023953 84746382 85645621 87567284 90658463 95366610 101798634 110137607
8802 110137607 119674655 127515697 131184965 129949576 123919999 115038158 105492079 96645183
8794 96645183 89704984 84530252 80533729 77767461 75892461 74831708 74825404 76095232 78650847
8785 78650847 82842238 88843501 96454743 104829820 111187594 113077837 109881975 102430782
8777 102430782 92712488 82853515 74782928 68459435 63601673 59760553 56560507 53924642
8769 53924642 52023476 50372388 49363685 48600595 47765550 47083812 46173553 45150901 44046471
8760 44046471 42938054 42009037 41237289 40681585 40096031 39632513 39140670 38540182 38221755
8751 38221755 38033655 38126621 38688446 39229710 39817816 40220443 40620659 40697541 40606555 40194300
$$ packed form
8810H6170278j146325k77571Q99239J921663L091179M708147O432024Q338973
8802A10137607R537048P841042L669268j235389o029577q881841r546079q846896
8794I6645183o940199n174732l996523k766268j875000j060753o304J269828K555615
8785G8650847M191391O001263P611242Q375077O357774J890243l195862p451193
8777A02430782r718294r858973q070587o323493m857762l841120l200046k635865
8769E3924642j901166j651088j008703p63090q35045o81738r10259j022652j104430
8760D4046471j108417r29017p71748n55704n85554m63518m91843o00488l18427
8751C8221755j88100R2966N61825N41264N88106M02627M00216P6882r0986m12255
$$ plain form
8741 40194300 39848156 39472232 39338959 39538072 39646723 39896293 40287375 40788006 41402497
8732 41402497 42256788 43481760 45014357 46815969 48652613 50307337 52061766 53044615
8724 53044615 53595348 53342327 52497046 51503229 50393857 49199164 47994925 46950488 45877654
8715 45877654 44759881 43731032 42695605 41553981 40814529 40365454 40250198 40325516 40525048
8706 40525048 40685067 40767140 40537643 39953293 39420719 39061216 38633333 38398299 38592192 38976812
8696 38976812 39962948 40853540 41642340 42173977 42527259 43097163 43419974 43822945 44737975
8687 44737975 45486281 46361564 47172517 47704036 48105419 48141853 47841112 47327269 46524625 45557908
8677 45557908 45180527 45133604 45086689 45634810 46476561 47536855 48651214 50150237 52074495
$$ packed form
8741D0194300l46144l75924j33273J99113J08651K49570L91082N00631O14491
8732D1402497Q54291J224972J532597J801612J836644J654724J754429R82849
8724E3044615N50733k53021q45281r93817j109372j194693j204239j044437j072834
8715D5877654j117773j028849j035427j141624p39452m49075j15256P5318J99532
8706D0525048J60019Q2073k29497n84350n32574l59503m27883k35034J93893L84620
8696C8976812R86136Q90592P88800N31637L53282N69904L22811M02971R15030
8687D4737975P48306Q75283Q10953N31519M01383L6434l00741n13843q02644r66717
8677D5557908l77381m6923m6915N48121Q41751J060294J114359J499023J924258
$$ plain form
8668 52074495 54862335 59205696 64526071 70671950 75621429 77112696 75250322 71632506
8660 71632506 68045808 65168891 63585532 63600080 65016336 67812233 71675538 75467074
8652 75467074 76866203 74610988 70337301 65506775 60870680 57110067 54147544 52014047
8644 52014047 50628658 49705732 49037845 48648280 48264035 48085573 48245494 48507065 49029514
8635 49029514 49717311 50501377 51337648 52519554 54095344 56112804 58611289 61845448 66309059
8626 66309059 72513333 80215035 88225073 95329404 99888426 100386609 97236179 92063361
8618 92063361 87378201 83723955 82367020 83406050 86101418 90056362 93669429 95128255
8610 95128255 93718256 89103004 81960527 74241046 66730787 60568057 55376185 51355207
$$ packed form
8668E2074495K787840M343361N320375O145879M949479J491267j862374l617816
8660G1632506l586698k876917j583359J4548J416256K795897L863305L791536
8652G5467074J399129k255215m273687m830526m636095l760613k962523k133497
8644E2014047j385389r22926o67887l89565l84245j78462J59921K61571N22449
8635D9029514O87797P84066Q36271J181906J575790K017460K498485L234159M463611
8626F6309059O204274P701702Q010038P104331M559022M98183l150430n172818
8618I2063361m685160l654246j356935J039030K695368L954944L613067J458826
8610I5128255j409999m615252p142477p719481p510259o162730n191872m020978
$$ plain form
8602 51355207 48463646 46151705 43993920 42339285 40982658 39578080 38509734 37938508
8594 37938508 37507973 37287124 37260027 37438606 37859018 38038490 38343052 39282363 40777478
8585 40777478 43203348 46386346 50034222 54045091 56034592 55088299 52523027 49213368
8577 49213368 46044683 43653311 42587991 42698756 43640011 45567882 48163481 49693485
8569 49693485 48963053 46137678 42576866 38899001 35655957 33065191 30744486 28717856
8561 28717856 27236458 25913568 24633363 23532433 22643276 21905666 21294724 21006309 20887278
8552 20887278 20620574 20429219 20346281 20300290 20166259 19881211 19587811 19431273 19341143 19483222
8542 19483222 19798449 20034642 20744075 21294033 21413592 21162304 20690972 20331953 20199427
$$ packed form
8602E1355207k891561k311941k157785j654635j356627j404578j068346n71226
8594C7938508m30535k20849k7097J78579M20412J79472L04562R39311J495115
8585D0777478K425870L182998L647876M010869J989501r46293k565272l309659
8577D9213368l168685k391372j065320J10765R41255J927871K595599J530004
8569D9693485p30432k825375l560812l677865l243044k590766k320705k026630
8561B8717856j481398j322890j280205j100930q89157p37610o10942k88415j19031
8552B0887278k66704j91355q2938m5991j34031k85048k93400j56538r0130J42079
8542A9483222L15227K36193P09433N49958J19559k51288m71332l59019j32526
$$ plain form
8533 20199427 19909690 20117464 20646314 21194654 22083429 23242102 24331024 24929945 25027302
8524 25027302 25037519 25089884 24935335 24447387 23623027 22541234 21478708 20418476 19559668
8515 19559668 18702486 17824967 17199772 16499171 15973334 15597960 15330068 15085466 15024798 14730652
8505 14730652 14386924 14134778 14088257 13963556 13934352 14135779 14134720 14342322 14642679 14829018
8495 14829018 15017863 15172034 15493608 15876488 16349316 17273445 18162734 18603627 18885254
8486 18885254 19062817 18905147 18553032 17663451 16886325 16032314 15030756 14270907 13383303
8477 13383303 12501201 11835234 11160570 10687065 10392588 10079529 9834111 9596266 9172135
8468 9172135 8895038 8756038 8668186 8619315 8444260 8423937 8184446 7750091 7608323 7269222
$$ packed form
8533B0199427k89737K07774N28850N48340Q88775J158673J088922N98921R7357
8524B5027302J0217N2365j54549m87948q24360j081793j062526j060232q58808
8515A9559668q57182q77519o25195p00601n25837l75374k67892k44602o0668k94146
8505A4730652l43728k52146m6521j24701k9204K01427j059K07602L00357J86339
8495A4829018J88845J54171L21574L82880M72828R24129Q89289M40893K81627
8486A8885254J77563j57670l52115q89581p77126q54011j001558p59849q87604
8477A3383303q82102o65967o74664m73505k94477l13059k45418k37845m24131
8468I172135k77097j39000q7852m8871j75055k0323k39491m34355j41768l39101
$$ plain form
8458 7269222 7300743 7351277 7285469 7447720 7390001 7531796 7404973 7321347 7114932 6824070
8448 6824070 6459955 6171493 5972409 6070398 5970999 5814213 5632542 5513227 5050936 5138711
8438 5138711 5291329 5006834 5000540 4938316 5031915 5019235 4690191 4323279 4563776 4772268
8428 4772268 4925485 4571036 4440129 4267594 4445830 4346195 4296906 4332308 4508982 4364453
8418 4364453 4328690 4352378 4331969 4383694 4368364 4522523 4454103 4499238 4421179 4183212 4241763
8407 4241763 4258896 3815019 3744674 3601195 3740001 3731010 3467140 3582044 3766693 3641114
8397 3641114 3615123 3219368 3057588 2963007 2806137 2869521 2915392 2909593 3003609 2930239 2886461
8386 2886461 2680481 2530413 2645386 2730371 2529301 2437727 2497503 2564811 2698182 2782284
$$ packed form
8458G269222L1521N0534o5808J62251n7719J41795j26823q3626k06415k90862
8448F824070l64115k88462j99084R7989r9399j56786j81671j19315m62291Q7775
8438E138711J52618k84495o294o2224R3599j2680l29044l66912K40497K08492
8428D772268J53217l54449j30907j72535J78236r9635m9289L5402J76674j44529
8418D364453l5763K3688k0409N1725j5330J54159o8420M5135p8059k37967N8551
8407D241763J7133m43877p0345j43479J38806q991k63870J14904J84649j25579
8397C641114k5991l95755j61780r4581j56870O3384M5871n799R4016p3370m3778
8386B886461k05980j50068J14973Q4985k01070r1574N9776O7308J33371Q4102
$$ plain form
8376 2782284 2835894 2785623 2689282 2510991 2566390 2648030 2795795 2636750 2554171 2653453 2324084
8365 2324084 2361243 2690058 2658158 2763165 2603201 2531101 2692113 2633485 2565833 2687284
8355 2687284 2649942 2593720 2479836 2399075 2528119 2519653 2533461 2493178 2601777 2456419 2356247
8344 2356247 2218025 2216609 2347894 2238094 2425610 2321062 2325511 2135324 1881607 2114601
8334 2114601 2104517 2037570 2136996 2212173 2147351 2139106 2277257 2037645 2032604 2195505 1967662
8323 1967662 2064715 2204657 2278240 2316747 2221129 2207208 2169840 2247542 2337844 2350868 2386199
8312 2386199 2334589 2597974 2885568 2820804 2937857 2700256 2607931 2346047 2484447 2507804
8302 2507804 2472032 2748951 2868259 2850702 2835057 2857564 2652198 2438401 2328116 2369018
$$ packed form
8376B782284N3610n0271r6341j78291N5399Q1640J47765j59045q2579R9282l29369
8365B324084L7159L28815l1900J05007j59964p2100J61012n8628o7652J21451
8355B687284l7342n6222j13884q0761J29044q466J3808m0283J08599j45358j00172
8344B356247j38222j416J31285j09800J87516j04548M449j90187k53717K32994
8334B114601j0084o6947R9426P5177o4822q245J38151k39612n041J62901k27843
8323A967662R7053J39942P3583L8507r5618j3921l7368P7702R0302J3024L5331
8312B386199n1610K63385K87594o4764J17053k37601r2325k61884J38400K3357
8302B507804l5772K76919J19308j7557j5645K2507k05366k13797j10285M0902
$$ plain form
8292 2369018 2129792 2203241 2290732 2322442 2291267 2123155 2202724 2334325 2036489 1801646
8282 1801646 1771675 1889398 2014660 2214339 2021406 1982478 2005693 2108927 2054635 2085575
8272 2085575 2155494 2212623 2405432 2695662 2756119 2812096 2713929 2522146 2583580 2449938 2342090
8261 2342090 2256682 2340756 2515523 2899542 2854038 2807270 2603521 2662492 2706375 2492254 2359394
8250 2359394 2412438 2416341 2347229 2607236 2687922 2704599 2861553 2966821 2806437 2917379 2653311
8239 2653311 2577461 2508290 2262384 2166543 2251654 2222710 1979957 2106524 2081067 2088060 2085830
8228 2085830 2042489 1926123 2128253 2198668 2461285 2622044 2611026 2639027 2863468 2874040
8218 2874040 2331908 2477061 2517769 2300440 2207153 2038187 2011395 1968157 1917838 1992255 1874985
$$ packed form
8292B369018k39226P3449Q7491L1710l1175j68112P9569J31601k97836k34843
8282A801646k9971J17723J25262J99679j92933l8928K3215J03234n4292L0940
8272B085575O9919N7129J92809K90230O0457N5977r8167j91783O1434j33642j07848
8261B342090q5408Q4074J74767L84019m5504m6768k03749N8971M3883k14121j32860
8250B359394N3044L903o9112K60007Q0686J6677J56954J05268j60384J10942k64068
8239B653311p5850o9171k45906r5841Q5111k8944k42753J26567k5457O993k230
8228B085830m3341j16366K02130P0415K62617J60759j1018K8001K24441J0572
8218B874040n42132J45153M0708k17329r3287j68966k6792m3238n0319P4417j17270
$$ plain form
8207 1874985 1846917 2140095 2063734 2174374 2223058 2169311 2249900 2197896 2007200 1839541 1613250
8196 1613250 1807050 1533617 1354614 1053648 1971269 2329994 1694826 1827834 1567435 1446367
8186 1446367 1368321 1490142 1592882 1663308 1624633 1780749 1717114 1626971 1327191 1443137
8176 1443137 1408686 1239076 1277638 1239519 1312692 1312533 1173868 1228144 1203588 1117766 897232
8165 897232 1040522 1372268 1295662 1171180 1283799 1338389 1303225 1109162 1032760 1086060 1140771
8154 1140771 1167227 1231131 1270167 1263391 1364312 1560568 1416678 1016491 1112123 1349892 1225902
8143 1225902 1202001 1285139 1180391 1175543 1365103 1345117 1158539 930667 1006533 1100470 1074071
8132 1074071 867230 825660 884126 882819 813873 756699 942360 971959 859204 758274 1091992
$$ packed form
8207A874985k8068K93178p6361J10640M8684n3747Q0589n2004j90696j67659k26291
8196A613250J93800k73433j79003l00966R17621L58725o35168J33008k60399j21068
8186A446367p8046J21821J02740P0426l8675J56116o3635r0143k99780J15946
8176A443137l4451j69610L8562l8119P3173j59j38665N4276k4556q5822k20534
8165H97232J43290L31746p6606j24482J12619N4590l5164j94063p6402N3300N4711
8154A140771K6456O3904L9036o776J00921J96256j43890m00187R5632K37769j23990
8143A225902k3901Q3138j04748m848J89560j9986j86578k27872P5866R3937k6399
8132A074071k06841m1570N8466j307o8946n7174J85661K9599j12755j00930L33718
$$ plain form
8121 1091992 1001539 879983 696375 726780 588740 795935 852121 840758 893043 1030458
8111 1030458 1020953 776104 858268 945839 859417 955530 990780 862406 801350 683550 768898
8100 768898 763803 689055 423288 528847 758301 675836 746916 596840 596691 766792 631065
8089 631065 714250 789385 620305 523307 760207 703385 647035 726429 708691 486302 564552
8078 564552 639013 499573 565529 731852 760151 894106 919947 693019 707369 687598 674527
8067 674527 603875 429472 469737 458774 534715 702835 900897 715237 677009 763977 590722
8056 590722 677956 919776 830118 868231 769740 886970 993405 865428 773664 493659 571815
8045 571815 585104 467895 568725 530694 524503 785615 660109 492006 563036 791862 735524
$$ packed form
8121A091992r0453j21556j83608L0405j38040K07195N6186j1363N2285J37415
8111A030458r505k44849Q2164Q7571q6422R6113L5250j28374o1056j17800Q5348
8100G68898n095p4748k65767J05559K29454q2465P1080j50076j49J70101j35727
8089F31065Q3185P5135j69080r6998K36900n6822n6350P9394j7738k22389P8250
8078E64552P4461j39440O5956J66323K8299J33955K5841k26928J4350j9771j3071
8067F74527p0652j74403M0265j0963P5941J68120J98062j85660l8228Q6968j73255
8056E90722Q7234K41820q9658L8113r8491J17230J06435j27977r1764k80005P8156
8045E71815J3289j17209J00830l8031o191K61112j25506j68103P1030K28826n6338
$$ plain form
8034 735524 778311 886382 864848 763527 979100 1096099 987683 886150 915379 1225119
8024 1225119 1218048 945921 928174 1044319 805627 782825 826688 792207 668477 508397 585123
8013 585123 613294 675414 797159 816772 626050 618758 490154 598906 781498 844209 833970
8002 833970 864647 1020714 982981 931982 831922 769947 753334 882009 1201268 1071944 967089
7991 967089 771227 644113 961825 1216213 998605 1017075 936919 955710 941540 979092 1120057
7980 1120057 1163113 1160276 1180435 1102972 884666 887261 1121079 1117899 996971 894425 732478
7969 732478 810889 772628 885304 966809 1040690 1123923 1060813 910496 761755 947987 1025656
7958 1025656 984271 1211511 1148682 1303237 1217639 1162426 959091 1076334 1176435 1383030
$$ packed form
8034G35524M2787J08071k1534j01321K15573J16999j08416j01533K9229L09740
8024A225119p071k72127j7747J16145k38692k2802M3863l4481j23730j60080P6726
8013E85123K8171O2120J21745J9613j90722p292j28604J08752J82592O2711j0239
8002H33970L0677J56067l7733n0999j00060o1975j6613J28675L19259j29324j04855
7991I67089j95862j27114L17712K54388k17608J8470q0156J8791j4170L7552J40965
7980A120057M3056k837K0159p7463k18306K595K33818l180j20928j02546j61947
7969G32478P8411l8261J12676Q1505P3881Q3233o3110j50317j48741J86232P7669
7958A025656m1385K27240o2829J54555q5598n5213k03335J17243J00101K06595
$$ plain form
7948 1383030 1272613 1315674 1457919 1457273 1290164 1137546 1232103 1281631 1289612 1319118 1208125
7937 1208125 1222473 1227683 1275230 1216351 1136703 1237187 1253278 1067440 1114029 1164526 1237457
7926 1237457 1230033 1013110 1033093 1040196 1061354 1166400 1348746 1355919 1479529 1229063 1193483
7915 1193483 1169591 1089012 1046775 1013204 1039755 846096 935717 1168434 929369 766488 542368
7904 542368 801449 943885 937433 868895 877658 855801 624396 416060 293946 468992 526546
7893 526546 711877 818731 712391 809421 692315 532570 648213 708473 635722 579029
7883 579029 516025 387749 521188 526728 585297 308753 408227 576135 225814 288835 404104
7872 404104 297514 326184 429515 403176 402808 480338 452487 426739 448221 399828 253005
$$ packed form
7948A383030j10417M3061J42245o46j67109j52618R4557M9528P981K9506j10993
7937A208125J4348N210M7547n8879p9648J00484J6091j85838M6589N0497P2931
7926A237457p424k16923J9983P103K1158J05046J82346P173J23610k50466l5580
7915A193483k3892q0579m2237l3571K6551j93659Q9621K32717k39065j62881k24120
7904E42368K59081J42436o452o8538Q763k1857k31405k08336j22114J75046N7554
7893E26546J85331J06854j06340R7030j17106j59745J15643O0260p2751n6693
7883E79029o3004j28276J33439N540N8569k76544R9474J67908l50321O3021J15269
7872D04104j06590K8670J03331k6339l68P7530k7851k5748K1482m8393j46823
$$ plain form
7861 253005 361649 574212 476561 405161 431470 470670 383168 416041 491888 647004 581507
7850 581507 454299 309370 251682 426316 451782 277874 179974 302167 541869 526010
7840 526010 530285 682286 592250 172925 340802 573541 515071 526984 539307 407550 178724
7829 178724 332480 384220 377987 648408 531945 484683 344003 152864 280497 266649 141696
7818 141696 159995 120135 199847 183093 60716 226339 257024 25438 107932 133514 105889
7807 105889 249570 212657 111007 -182174 15478 111047 249270 3734 363939 619202
7797 619202 345150 257470 293708 375974 63066 90716 167836 82810 223752 245919 455906
7786 455906 274867 181332 285790 336023 65873 56145 247574 205727 128570 -27566 57279
$$ packed form
7861B53005J08644K12563r7651p1400K6309L9200q7502L2873P5847J55116o5497
7850E81507j27208j44929n7688J74634K5466j73908r7900J22193K39702j5859
7840E26010M275J52001r0036m19325J67877K32739n8470J1913J2323j31757k28826
7829A78724J53756N1740o233K70421j16463m7262j40680j91139J27633j3848j24953
7818A41696J8299l9860P9712j6754j22377J65623L0685k31586Q2494K5582k7625
7807A05889J43681l6913j01650k93181J97652R5569J38223k45536L60205K55263
7797F19202k74052q7680L6238Q2266l12908K7650P7120q5026J40942K2167K09987
7786D55906j81039r3535J04458N0233k70150r728J91429m1847p7157j56136Q4845
$$ plain form
7775 57279 -97005 -67966 -56908 116266 142017 208968 209506 233202 315501 361003 190285 129016
7763 129016 169935 163941 39044 114497 86798 -128689 -338372 -24872 168502 208957 75325
7752 75325 -45666 72764 98465 142711 157875 237882 119628 59533 44254 242064 103720
7741 103720 63640 228511 297220 342817 167229 393801 447578 102652 151819 267682 219611
7730 219611 111216 35345 250484 380405 239182 168092 179152 239542 179203 106839 257836
7719 257836 323477 288540 223778 -66272 123021 131400 138303 55461 34918 -47700 -49914 -61176
7707 -61176 -65972 102442 41709 -14422 -53300 3981 -27671 -229852 -219467 -90054 -191327
7696 -191327 -334738 -20156 -138628 -85716 -131488 -138545 -54864 -94619 -14095 -116007 -97419
$$ packed form
7775E7279j54284K9039J1058J73174K5751O6951N38K3696Q2299M5502j70718o1269
7763A29016M0919n994j24897P5453k7699k15487k09683L13500J93374M0455j33632
7752G5325j20991J18430K5701M4246J5164Q0007j18254o0095j5279J97810j38344
7741A03720m0080J64871O8709M5597j75588K26572N3777l44926M9167J15863m8071
7730B19611j08395p5871K15139J29921j41223p1090J1060O0390o0339p2364J50997
7719B57836O5641l4937o4762k90050J89293Q379O903q2842k0543q2618k214j1262
7707f1176m796J68414o0733n6131l8878N7281l1652k02181J0385J29413j01273
7696a91327j43411L14582j18472N2912m5772p057Q3681l9755Q0524j01912J8588
$$ plain form
7685 -97419 -91659 -215718 -168464 -83574 -78512 18291 22829 -32904 203303 118463 -41520 11296
7673 11296 -22601 23002 54488 51616 -111300 -153504 -151197 -180576 -153741 -145842 -254069 -343744
7661 -343744 -176256 -194633 -239698 -106957 34008 -250396 -442983 -285775 -277668 -135710
7651 -135710 -211760 -246228 -198751 -165109 -216082 -34748 -131188 -119362 -211617 -232249 -80184
7640 -80184 -14562 -69546 -101529 -27838 55953 2068 196 -129641 -273568 -301029 -175817
7629 -175817 -268101 -305512 -527355 -504865 -473476 -493652 -414246 -344905 -491629 -326531 -365214
7618 -365214 -477478 -348032 -217538 -389492 -468337 -265666 -281592 -333361 -298547 -242552 -172792
7607 -172792 -171797 -120469 -208330 -221231 -34057 -118034 -154594 -166213 -222242 -112755 -42470 -333299
$$ packed form
7685i7419N760j24059M7254Q4890N062R6803M538n5733K36207q4840j59983N2816
7673A1296l3897M5603L1486k872j62916m2204K307k9379K6835P899j08227q9675
7661c43744J67488j8377m5065J32741J40965k84404j92587J57208Q107J41958
7651a35710p6050l4468M7477L3642n0973J81334r6440J1826r2255k0632J52065
7640h0184O5622n4984l1983P3691Q3791n3885j872j29837j43927k7461J25212
7629a75817r2284l7411k21843K2490L1389k0176P9406O9341j46724J65098l8683
7618c65214j12264J29446J30494j71954p8845K02671j5926n1769L4814N5995O9760
7607a72792R95N1328q7861j2901J87174q3977l6560j1619n6029J09487P0285k90829
$$ plain form
7595 -333299 -328355 -140193 -109115 -206792 -172931 -274526 -225287 -88479 -197612 -307734 -361579
7584 -361579 -415905 -148062 -178222 -331802 -124469 35148 -196432 -259259 -79189 -153747
7574 -153747 -168973 -160628 -122634 -170516 -124351 -105736 -56537 -2207 -48926 -56236 -171607 -18814
7562 -18814 504 49600 37987 57735 -226042 -180362 -148743 -112877 37819 229617 58549
7551 58549 156315 -56402 83367 169980 -59181 146959 222307 445677 273435 260352 211516
7540 211516 224876 239352 265460 312206 365965 551281 543358 262193 128587 286794 237381
7529 237381 207882 168835 361330 168182 356053 299678 293994 451787 508355 365012 307230
7518 307230 573052 666007 654962 737315 593088 621503 816491 695454 682054 772407 799435
$$ packed form
7595c33299M944J88162L1078r7677L3861j01595M9239J36808j09133j10122n3845
7584c61579n4326K67843l0160j53580K07333J59617k31580o2827J80070p4558
7574a53747j5226Q345L7994m7882M6165J8615M9199N4330m6719p310j15371J52793
7562a8814J9318M9096j1613J9748k83777M5680L1619L5866J50696J91798j71068
7551E8549R7766k12717J39769Q6613k29161K06140P5348K23370j72242j3083m8836
7540B11516J3360J4476K6108M6746N3759J85316p923k81165j33606J58207m9413
7529B37381k9499l9047J92495j93148J87871n6375n684J57793N6568j43343n7782
7518C07230K65822R2955j1045Q2353j44227K8415J94988j21037j3400R0353K7028
$$ plain form
7507 799435 697540 799786 592572 647265 744413 757767 615341 524288 470420 498106 429758
7496 429758 268471 219250 137609 85518 278048 343869 535055 578122 564905 516534 360421
7485 360421 327540 172625 264670 361051 340802 335171 333524 369159 306036 382168 218693 262956
7473 262956 200547 193446 80518 101512 -104997 -211704 -309258 -463984 -401306 -253152 -202986
7462 -202986 -85206 -23865 -84949 2931 -56119 -42875 15400 -139806 -201617 -295243 -357130
7451 -357130 -425468 -332281 -378240 -491085 -373169 -332231 -335059 -400794 -417842 -207446 -286936
7440 -286936 -438425 -398961 -341259 -332690 -301948 -130210 -218344 -140212 -233596 -132506 -159513
7429 -159513 -157846 -88388 -271854 -197240 -236155 -375990 -228376 -204766 -99574 -55065 -114032
$$ packed form
7507G99435j01895J02246k07214N4693R7148J3354j42426r1053n3868K7686o8348
7496D29758j61287m9221q1641n2091J92530O5821J91186M3067j3217m8371j56113
7485C60421l2881j54915R2045R6381k0249n631j647L5635o3123P6132j63475M4263
7473B62956o2409p101j12928K0994k06509j06707r7554j54726O2678J48154N0166
7462b02986J17780O1341o1084Q7880n9050J3244N8275j55206o1811r3626o1887
7451c57130o8338R3187m5959j12845J17916M0938k828o5735j7048K10396p9490
7440b86936j51489L9464N7702Q569L0742J71738q8134P8132r3384J01090k7007
7429a59513J667O9458j83466P4614l8915j39835J47614K3610J05192M4509n8967
$$ plain form
7418 -114032 -236215 -501261 -519080 -359642 -236811 -140326 -229941 -174524 -186133 64368 -97047
7407 -97047 -271367 -185760 -226471 -193339 -344796 -443655 -465132 -313274 -274765 -389290 -240592
7396 -240592 -112502 -189095 -320264 -419273 -373537 -248808 -341685 -415607 -288846 -266454 -286250
7385 -286250 -287037 -373566 -417789 -333838 -153218 -2235 -44975 -64576 -137198 -181133 -128171 -410729
7373 -410729 -452987 -519662 -501487 -450275 -415725 -205755 -86129 -336751 -273979 -323639 -400274
7362 -400274 -576179 -574531 -368049 -400373 -359968 -536853 -442754 -471402 -306318 -211696 -365688
7351 -365688 -406128 -406361 -285189 -454402 -609922 -383205 -530743 -554211 -384041 -297577 -404051
7340 -404051 -503225 -414679 -297600 -586899 -659191 -645699 -483512 -414616 -507702 -423170 -416048
$$ packed form
7418a14032j22183k65046j7819J59438J22831R6485q9615N5417j1609K50501j61415
7407i7047j74320Q5607m0711L3132j51457r8859k1477J51858L8509j14525J48698
7396b40592J28090p6593j31169r9009M5736J24729r2877p3922J26761K2392j9796
7385b86250p87q6529m4223Q3951J80620J50983m2740j9601p2622m3935N2962k82558
7373d10729m2258o6675J8175N1212L4550K09970J19626k50622O2772m9660p6635
7362d00274j75905J648K06482l2324M0405j76885R4099k8648J65084R4622j53992
7351c65688m0440k33J21172j69213j55520K26717j47538k3468J70170Q6464j06474
7340d04051r9174Q8546J17079k89299p2292J3492J62187O8896r3086Q4532P122
$$ plain form
7329 -416048 -436043 -436506 -523940 -540878 -562398 -515631 -361922 -457297 -507569 -239492 -250583 -351506
7317 -351506 -537669 -491156 -406283 -123450 -329004 -408785 -387476 -548661 -477476 -417758 -404379
7306 -404379 -536706 -234614 -305603 -494068 -411625 -345911 -477650 -223775 -182496 -123627 -160859
7295 -160859 -271820 -314944 -281455 -170306 -116729 -316199 -372229 -306374 -244806 -268619 -329057
7284 -329057 -421576 -481432 -574606 -654512 -656433 -640827 -647246 -613862 -502491 -529235 -469738 -327295
7272 -327295 -296906 -491809 -453449 -415607 -406102 -269571 -359398 -321838 -218447 -291671 -303093
7261 -303093 -212925 -267017 -214617 -277876 -451172 -377107 -343048 -461120 -460736 -522100 -505051 -413731
7249 -413731 -413069 -278364 -463498 -438180 -284507 -159623 -157726 -313098 -365446 -301033 -220912
$$ packed form
7329d16048j9995m63q7434j6938k1520M6767J53709r5375n0272K68077j1091j00923
7317c51506j86163M6513Q4873K82833k05554p9781K1309j61185P1185N9718J3379
7306d04379j32327L02092p0989j88465Q2443O5714j31739K53875M1279N8869l7232
7295a60859j10961m3124L3489J11149N3577j99470n6030O5855O1568k3813o0438
7284c29057r2519n9856r3174p9906j921J5606o419L3384J11371k6744N9497J42443
7272c27295L0389j94903L8360L7842R505J36531q9827L7560J03391p3224j1422
7261c03093R0168n4092N2400o3259j73296P4065L4059j18072L84o1364J7049R1320
7249d13731O62J34705j85134K5318J53673J24884J897j55372n2348O4413Q0121
$$ plain form
7238 -220912 -222462 -251611 -246205 -135816 -144994 -294670 -309355 -62061 -54838 103351 32294 -273277
7226 -273277 -420897 -130102 -69796 -276322 -400428 -446854 -227966 -231250 -97689 -115794 -261572
7215 -261572 -180071 -121561 -149823 -303805 -178672 153237 -65073 102408 22793 -27628 -26138
7204 -26138 840 -120578 -91804 12719 -43621 117139 84342 182381 158459 32517 11843
7193 11843 190082 90982 168392 54186 127223 19163 -68576 -70281 53888 139619 8013
7182 8013 316396 321865 475765 628592 685389 622342 460480 363474 465947 692690 647825
7171 647825 574655 633631 616824 837186 994469 1045893 945647 903131 1068983 1097871 1116644
7160 1116644 1229396 1133232 1220138 1465152 1534303 1745232 2117802 2598810 2922116 3329080
$$ packed form
7238b20912j550k9149N406J10389r178j49676j4685K47294P223J58189p1057l05571
7226b73277j47620K90795O0306k06526j24106m6426K18888l284J33561j8105j45778
7215b61572Q1501N8510k8262j53982J25133L31909k18310J67481p9615n0421J490
7204b6138K6978j21418K8774J04523n6340J60760l2797R8039k3922j25942k0674
7193A1843J78239r9100P7410j14206P3037j08060q7739j705J24169Q5731j31606
7182H013L08383N469J53900J52827N6797o3047j61862r7006J02473K26743m4865
7171F47825p3170N8976j6807K20362J57283N1424j00246m2516J65852K8888J8773
7160A116644J12752r6164Q6906K45014O9151K10929L72570M81008L23306M06964
$$ plain form
7150 3329080 4274950 5392496 6728445 8673369 10672813 13148768 13378440 10706348 8525371
7141 8525371 6280753 4691943 3700696 3053172 2492605 2152723 1746009 1310076 1227278
7132 1227278 909377 909128 969738 757083 843014 688759 639839 665088 351728 211718 298662
7121 298662 356652 339883 167247 55497 250234 217020 140251 74147 -78962 -4348 58729
7110 58729 -85791 -8410 -34075 98974 97844 117061 68941 160916 -67959 -345478 -295258
7099 -295258 -138607 -297932 -377614 -198863 -292244 -65771 -25535 -19332 3208 -166516 -58698
7088 -58698 106755 72157 -42460 -53329 -202060 -310994 -240791 -100828 -236119 -181932 -171050
7077 -171050 -359109 -507614 -300362 -355981 -219079 -182935 -551264 -308091 -418031 -451700
$$ packed form
7150C329080R45870J117546J335949J944924J999444K475955K29672k672092k180977
7141H525371k244618j588810r91247o47524n60567l39882m06714m35933q2798
7132A227278l17901k49O0610k12655Q5931j54255m8920K5249l13360j40010Q6944
7121B98662N7990j6769j72636j11750J94737l3214p6769o6104j53109P4614O3077
7110E8729j44520P7381k5665J33049j130J9217m8120R1975k28875k77519N0220
7099b95258J56651j59325p9682J78751r3381K26473M0236O203K2540j69724J07818
7088e8698J65453l4598j14617j0869j48731j08934P0203J39963j35291N4187J0882
7077a71050j88059j48505K07252n5619J36902L6144l68329K43173j09940l3669
$$ plain form
7067 -451700 -122177 -338185 -307964 -337376 -309029 -233747 -197086 -285468 -231936 -322054 -494894
7056 -494894 -457041 -493718 -398648 -154119 130405 -98752 -125520 -359646 -372255 -362709 -547609
7045 -547609 -603834 -519392 -555749 -475418 -636831 -578482 -307842 -353628 -360703 -576055 -433706
7034 -433706 -265956 -349766 -450953 -348751 -373021 -322461 -359380 -507644 -445807 -365088 -291287
7023 -291287 -348990 -187912 -226260 -341897 -244509 -218597 -259718 -448513 -541432 -497457 -413923
7012 -413923 -382658 -506270 -473964 -345263 -419492 -585513 -497729 -431496 -347064 -355614 -268553
7001 -268553 -368523 -423058 -507902 -808637 -741032 -478805 -359632 -195143 -60778 -324285
6991 -324285 -435189 -382954 -414387 -287002 -399290 -450354 -552125 -465661 -479672 -299596 -158834
$$ packed form
7067d51700L29523k16008L0221k9412K8347P5282L6661q8382N3532r0118j72840
7056d94894L7853l6677R5070K44529K84524k29157k6768k34126j2609R546j84900
7045e47609n6225Q4442l6357Q0331j61413N8349K70640m5786p075k15352J42349
7034d33706J67750q3810j01187J02202k4270N0560l6919j48264O1837Q0719P3801
7023b91287n7703J61078l8348j15637R7388K5912m1121j88795r2919M3975Q3534
7012d13923L1265j23612L2306J28701p4229j66021Q7784O6233Q4432q550Q7061
7001b68553r9970n4535q4844l00735O7605K62227J19173J64489J34365k63507
6991c24285j10904N2235l1433J27385j12288n1064j01771Q6464j4011J80076J40762
$$ plain form
6980 -158834 -342607 -331998 -460747 -421260 -355974 -325189 -211455 -174965 -183737 -304077 -481020
6969 -481020 -508580 -326872 -341850 -149942 -203409 -372705 -452740 -385350 -275724 -355782 -342437
6958 -342437 -352242 -319841 -469628 -246674 -171917 -315880 -316697 -379891 -476110 -368748 -422065
6947 -422065 -331732 -355885 -259613 -469254 -479152 -389110 -77085 -174490 -329920 -432758 -498674
6936 -498674 -427783 -465082 -196856 -96717 -177501 -169610 -318963 -498818 -413672 -352716 -565899
6925 -565899 -577392 -304746 -127706 -170637 -91019 -197677 -416375 -485821 -517021 -315151 -85052
6914 -85052 -160953 -159231 -192028 -321697 -156321 -192272 -285793 -285573 -90020 -418461 -292805
6903 -292805 -258461 -300670 -512481 -367238 -231075 -209394 -351783 -298650 -422382 -246865
$$ packed form
6980a58834j83773J0609j28749L9487O5286L0785J13734L6490q772j20340j76943
6969d81020k7560J81708j4978J91908n3467j69296q0035O7390J09626q0058J3345
6958c42437r805L2401j49787K22954P4757j43963q17o3194r6219J07362n3317
6947d22065R0333k4153R6272k09641r898R0042L12025r7405j55430j02838o5916
6936d98674P0891l7299K68226J00139q0784P891j49353j79855Q5146O0956k13183
6925e65899j1493K72646J77040m2931P9618j06658k18698o9446l1200K01870K30099
6914h5052p5901J722l2797j29669J65376l5951r3521K20J95553l28441J25656
6903b92805L4344m2209k11811J45243J36163K1681j42389N3133j23732J75517
$$ plain form
6893 -246865 -30764 -165661 -331103 -428937 -275360 -88391 -190901 -78040 -130852 -372180
6883 -372180 -384770 -357634 -164433 -267122 -468487 -487627 -246444 -66436 -20459 -125747
6873 -125747 -33198 25623 -16065 -196781 -238378 -143827 -345254 -154855 -64371 -163991 -369887
6862 -369887 -552177 -436101 -121155 -117508 -223728 -171075 -189570 -202985 -289406 -245519 -214172
6851 -214172 4754 -180346 -222841 -155545 -118619 -40859 70350 -82157 -52825 -123854 -121070
6840 -121070 -165853 -283266 -392605 -321813 -224012 -270164 -206441 -388181 -233966 -177634 -259125
6829 -259125 -113271 -83523 75279 99641 9229 -172777 -67897 14453 -53415 -151933 -228210
6818 -228210 -253974 -5649 -4124 114805 28571 -55565 -113822 -66400 -126106 -137371 -195868
$$ packed form
6893b46865K16101j34897j65442r7834J53577J86969j02510J12861n2812k41328
6883c72180j2590K7136J93201j02689k01365j9140K41183J80008M5977j05288
6873a25747R2549N8821m1688j80716m1597R4551k01427J90399R0484r9620k05896
6862c69887j82290J16076L14946L647j06220N2653j8495j3415q6421M3887L1347
6851b14172K18926j85100m2495O7296L6926P7760J11209j52507K9332p1029K784
6840a21070m4783j17413j09339P0792R7801m6152O3723j81740J54215N6332q1491
6829b59125J45854K9748J58802K4362r0412j82006J04880Q2350o7868r8518p6277
6818b28210k5764K48325J525J18929q6234q4136n8257M7422n9706j1265n8497
$$ plain form
6807 -195868 -124872 -60552 -205336 -143636 49457 -197231 -279882 -212900 -278231 -166552 -183819
6796 -183819 -47038 75683 80364 29235 -113961 -113567 198620 261676 77819 21280 232652
6785 232652 247073 117966 61215 152440 134363 262613 273169 62554 -37522 -18364 83644
6774 83644 -5087 -31442 42149 43743 336360 256419 220523 201869 214670 241398 406859 301289
6762 301289 113743 126790 201679 324736 102052 103593 73883 103879 210796 344096 475845
6751 475845 356009 349438 288351 457424 366046 472908 366600 349587 235096 215095 100879
6740 100879 307358 486348 526581 517485 287459 249205 209225 351843 382896 578263 598012
6729 598012 445535 393591 331813 459661 667276 703070 768857 800115 671433 669775 744362
$$ packed form
6807a95868P0996O4320j44784O1700J93093k46688q2651O6982o5331J11679j7267
6796a83819J36781J22721M681n1129j43196L94L12187O3056j83857n6539K11372
6785B32652J4421j29107n6751R1225j8077J28250J0556k10615j00076J9158J02008
6774H3644q8731k6355P3591J594K92617p9941l5896j8654J2801K6728J65461j05570
6762C01289j87546J3047P4889J23057k22684J541k9710K9996J06917J33300J31749
6751D75845j19836o571o1087J69073r1378J06862j06308j7013j14491k0001j14216
6740A00879K06479J78990M0233r096k30026l8254l9980J42618L1053J95367J9749
6729E98012j52477n1944o1778J27848K07615L5794O5787L1258j28682j658P4587
$$ plain form
6718 744362 1029329 1128748 813171 717841 732822 879810 755789 753219 847780 897780 839391
6707 839391 749517 839113 669406 675414 947888 1108706 1084906 1192932 1271757 1248103 1182230
6696 1182230 1334255 1482956 1463323 1527301 1712136 1665677 1653566 1488618 1547225 1351922
6686 1351922 1304919 1361944 1170229 1121707 1232337 1220792 1162809 1182101 1114062 1130914 1122501
6675 1122501 1055635 1169166 1387830 1145697 1131640 1123452 1139033 1268504 1407871 1441063 1528935
6664 1528935 1589391 1518678 1374356 1346278 1225142 1268343 1282679 1424899 1392339 1365783 1562398
6653 1562398 1560580 1276278 1160568 1002386 1236139 1357585 1298792 1337407 1411309 1197221
6643 1197221 1316366 1491974 1467299 1337496 1473665 1431648 1444444 1395732 1512412 1446044
$$ packed form
6718G44362K84967R9419l15577r5330J4981J46988j24021k570R4561N0000n8389
6707H39391q9874Q9596j69707O008K72474J60818k3800J08026P8825k3654o5873
6696A182230J52025J48701j9633O3978J84835m6459j2111j64948N8607j95303
6686A351922m7003N7025j91715m8522J10630j1545n7983J9292o8039J6852q413
6675A122501o6866J13531K18664k42133j4057q188J5581J29471J39367L3192Q7872
6664A528935O0456p0713j44322k8078j21136M3201J4336J42220l2560k6556J96615
6653A562398j818k84302j15710j58182K33753J21446n8793L8615P3902k14088
6643A197221J19145J75608k4675j29803J36169m2017J2796m8712J16680o6368
$$ plain form
6633 1446044 1198294 1239799 1253493 1426433 1330776 1441060 1372310 1521131 1372208 1443780
6623 1443780 1415181 1297774 1572030 1953205 1816161 1737333 1916799 1891360 1883225 1746659
6613 1746659 1712931 1835639 1847119 1699746 1718250 1622989 1694750 1808030 1996958 1926009 1895441
6602 1895441 1950506 1812573 1695412 1816015 1966091 2129147 2243315 1999414 2060416 2226233
6592 2226233 2293295 2222751 2087134 2088164 2167666 2162931 2019148 2132097 2235340 2222163 2323425
6581 2323425 2311315 2179976 2129859 2180843 2391511 2471464 2545947 2645642 2774960 2631878 2643637
6570 2643637 2672256 2615240 2668698 2702890 2682604 2751673 2866687 2737374 2832249 2796126 2749258
6559 2749258 2765297 2868285 2891880 3192893 3201033 3149375 3121277 3133838 3125452 3147448 3298793
$$ packed form
6633A446044k47750M1505J3694J72940r5657J10284o8750J48821j48923P1572
6623A443780k8599j17407K74256L81175j37044p8828J79466k5439q135j36566
6613A746659l3728J22708J1480j47373J8504r5261P1761J13280J88928p0949l0568
6602A895441N5065j37933j17161J20603J50076J63056J14168k43901O1002J65817
6592B226233O7062p0544j35617J030P9502m735j43783J12949J03243j3177J01262
6581B323425j2110j31339n0117N0984K10668P9953P4483R9695J29318j43082J1759
6570B643637K8619n7016N3458L4192k0286O9069J15014j29313R4875l6123m6868
6559B749258J6039J02988K3595L01013Q140n1658k8098J2561q386K1996J51345
$$ plain form
6548 3298793 3405253 3220996 3206543 3222395 3452508 3592349 3647856 3574450 3585753 3600091 3724548
6537 3724548 3711865 3775801 3944900 4132933 4060895 4148142 4080273 4118861 4227433 4302251 4346394
6526 4346394 4102246 4319180 4283070 4463974 4476833 4543731 4617615 4638307 4681740 4808033 4845919
6515 4845919 5066005 5192738 5189598 5283184 5408885 5693881 5771631 5636545 5835703 5836026 6065490
6504 6065490 6200646 6354970 6273716 6345280 6393880 6609731 6787661 6928766 7022300 7045404
6494 7045404 7135978 7302863 7621792 7935300 8006445 8173510 8467836 8538031 8849458 9215736
6484 9215736 9366506 9617747 9853194 9933782 10167910 10433961 10782753 10838249 11130997 11147365
6474 11147365 11528467 11637864 11748116 12086644 12385169 12877431 13274173 13361272 13797114 14168897
$$ packed form
6548C298793J06460j84257j4453J5852K30113J39841N5507p3406J1303J4338J24457
6537C724548j2683O3936J69099J88033p2038Q7247o7869L8588J08572P4818M4143
6526D346394k44148K16934l6110J80904J2859O6898P3884K0692M3433J26293L7886
6515D845919K20086J26733l140R3586J25701K84996P7750j35086J99158L23K29464
6504F065490J35156J54324q1254P1564M8600K15851J77930J41105R3534K3104
6494G045404R0574J66885L18929L13508P1145J67065K94326P0195L11427L66278
6484I215736J50770K51241K35447Q0588K34128K66051L48792N5496K92748J6368
6474A1147365L81102J09397J10252L38528K98525M92262L96742Q7099M35842L71783
$$ plain form
6464 14168897 14510953 14728508 15236163 15536386 15812426 16226021 16689300 16964999 17119733
6455 17119733 17341788 17583092 18009185 18517140 19033331 19687219 20166648 20656524 21208037
6446 21208037 21656862 22434173 23181976 23780249 24339442 25003337 25838134 26784644 27525063
6437 27525063 28369800 29370307 30472763 31451981 32575125 33770624 34477063 35304581 36697472
6428 36697472 37788689 38892679 40204063 41645238 43211029 45388579 48002737 50776914
6420 50776914 53959228 57455314 61510074 66128791 71878729 78797435 86672455 95832422
6412 95832422 105550457 114819813 122070752 125248775 124064541 119263602 112346338 105307489
6404 105307489 99145432 94151230 89985475 87180414 85329551 84498778 84365497 85386944
$$ packed form
6464A4168897L42056K17555N07655L00223K76040M13595M63279K75699J54734
6455A7119733K22055K41304M26093N07955N16191O53888M79429M89876N51513
6446B1208037M48825P77311P47803N98273N59193O63895Q34797R46510P40419
6437B7525063Q44737J000507J102456R79218J123144J195499P06439Q27518J392891
6428C6697472J091217J103990J311384J441175J565791K177550K614158K774177
6420E0776914L182314L496086M054760M618717N749938O918706P875020R159967
6412I5832422R718035R269356P250939L178023j184234m800939o917264p038849
6404A05307489o162057m994202m165755k805061j850863q30773j33281J021447
$$ plain form
6396 85386944 87239819 89934391 93583854 98470006 104433159 111598681 120612718 131606612
6388 131606612 145278463 162154554 181365858 202001994 220376441 232091471 232501910
6381 232501910 220809928 200883008 178388769 157627574 140387255 126557380 115787032
6374 115787032 107322813 100628246 95341880 91305778 88747793 87238798 86722339 87067429
6366 87067429 88094303 89946963 92745539 96684736 101987998 108857316 116869351 125662455
6358 125662455 133690699 138848000 139521436 134432567 125583456 114530992 103384581 93359146
6350 93359146 84800802 77598593 71607879 66297702 62049203 58502475 55516324 53306368
6342 53306368 51489327 49846452 48733208 47863319 47248126 46855128 46478122 46039507 45702060
$$ packed form
6396H5386944J852875K694572L649463M886152N963153P165522R014037J0993894
6388A31606612J3671851J6876091J9211304K0636136J8374447J1715030M10439
6381B32501910j1691982j9926920k2494239k0761195j7240319j3829875j0770348
6374A15787032q464219o694567n286366m036102k557985j508995n16459L45090
6366H7067429J026874J852660K798576L939197N303262O869318Q012035Q793104
6358A25662455Q028244N157301O73436n088869q849111j1052464j1146411j0025435
6350I3359146q558344p202209n990714n310177m248499l546728k986151k209956
6342E3306368j817041j642875j113244q69889o15193l92998l77006m38615l37447
$$ plain form
6333 45702060 45157930 44525501 43555553 42722827 41697665 40981955 40429007 39625620 38928749
6324 38928749 38083102 37067306 35991088 35127980 34271173 33623713 32856558 32483981 32366245
6315 32366245 32183392 32390238 32945085 33607650 34626014 35932595 37120809 37978286 38499008
6306 38499008 38024127 37170398 35731597 33855779 32018980 30224919 28760200 27459719
6298 27459719 26435688 25459674 24542614 23769525 23068363 22569950 22172337 21780479 21307327
6289 21307327 20877606 20803200 20936337 20977573 21289286 22016628 22383727 22812511 22911678 22432633
6279 22432633 21492757 20699342 19759231 18662055 17909536 17146799 16528934 16087422 15546335
6270 15546335 15216093 14829258 14439112 14090394 13737508 13333528 13098694 12869035 12655998
$$ packed form
6333D5702060n44130o32429r69948q32726j025162p15710n52948q03387o96871
6324C8928749q45647j015796j076218q63108q56807o47460p67155l72577j17736
6315C2366245j82853K06846N54847O62565J018364J306581J188214Q57477N20722
6306C8499008m74881q53729j438801j875818j836799j794061j464719j300481
6298B7459719j024031r76014r17060p73089p01162m98413l97613l91858m73152
6289B1307327m29721p4406J33137M1236L11713P27342L67099M28784R9167m79045
6279B2432633r39876p93415r40111j097176p52519p62737o17865m41512n41087
6270A5546335l30242l86835l90146l48718l52886m03980k34834k29659k13037
$$ plain form
6261 12655998 12391059 12296063 11909629 11956447 11749901 11672368 11661804 11849770 11862796 11727891
$$ packed form
6261A2655998k64939r4996l86434M6818k06546p7533j0564J87966J3026j34905
$$ [...]
##END NTUPLES=NMR SPECTRUM
##END=
