##TITLE=1H_EC-3305(VII-2)
 CDCl3
 8 sc, 
 25.7.2024
##JCAMPDX= 6.0         $$ Bruker NMR JCAMP-DX V2.0
##DATA TYPE= NMR SPECTRUM
##DATA CLASS= NTUPLES
##ORIGIN= UXNMR, Bruker Analytische Messtechnik GmbH
##OWNER= root
$$ XWIN-NMR		Version 3.5
$$ Thu Jul 25 13:58:46 2024 Russian Standard Time (UT+4h)  she@DPX200
##.OBSERVE FREQUENCY= 200.1315
##.OBSERVE NUCLEUS= ^1H
##.ACQUISITION MODE= SIMULTANEOUS
##.ACQUISITION SCHEME= undefined
##.AVERAGES= 8
##.DIGITISER RES= 18
##SPECTROMETER/DATA SYSTEM= spect
##.PULSE SEQUENCE= zg30
##.SOLVENT NAME= D2O
##.SHIFT REFERENCE= (INTERNAL, D2O, 0, 20.5052)
##AUDIT TRAIL= $$ (NUMBER, WHEN, WHO, WHERE, WHAT)
$$ ##TITLE= Audit trail, XWIN-NMR		Version 3.5
$$ ##JCAMPDX= 5.01
$$ ##ORIGIN= Bruker BioSpin GmbH
$$ ##OWNER= she
$$ F:/spectra/data/she/nmr/H-F/1/pdata/1/auditp.txt
$$ ##AUDIT TRAIL=  $$ (NUMBER, WHEN, WHO, WHERE, WHAT)
(   1,<2024-07-25 13:57:28.34 +0400>,<she>,<DPX200>,
      <created by zg, POWCHK disabled, PULCHK disabled
       configuration hash MD5:
       00 E9 B6 7A A2 85 ED C7 34 08 36 98 17 FE 4E 26
       data hash MD5: 16K
       2B 72 DA 8E D9 54 35 54 23 C6 BD EF 10 C4 9D 99>)
(   2,<2024-07-25 13:57:36.35 +0400>,<she>,<DPX200>,
      <Start of raw data processing
       efp BC_mod = 2 LB = 0.24 FT_mod = 6 PKNL = 1 PHC0 = -25793.81 PHC1 = 13.18749 SI = 16K 
       data hash MD5: 16K
       83 47 29 8B E4 A8 DD 4E C7 6B 70 C9 8F 47 9F C4>)
(   3,<2024-07-25 13:57:54.10 +0400>,<she>,<DPX200>,
      <pk PHC0 = -2.68516 PHC1 = 2.6 
       data hash MD5: 16K
       77 82 BE 0B 3D 33 62 FE 35 40 3C 70 9B 35 65 4A>)
(   4,<2024-07-25 13:57:57.90 +0400>,<she>,<DPX200>,
      <abs ABSG = 5 
       data hash MD5: 16K
       6C D9 60 5D 7D 53 3B 9C 3A 39 B6 1D 53 EA 65 9A>)
$$ ##END=
$$ 
$$ hash MD5
$$ 2A 94 AB 4B DD 89 85 2D AD AA DF 29 DC 8B 99 8A
##$RELAX= 
##$RELAX= 
##$RELAX= 
##$RELAX= 
##$RELAX= 
##$RELAX= 
$$ Bruker specific parameters
$$ --------------------------
##$DU= <F:/spectra>
##$EXPNO= 1
##$NAME= <H-F>
##$PROCNO= 1
##$TYPE= <nmr>
##$USER= <she>
##$AMP= (0..31)
100 100 100 100 100 100 100 100 100 100 100 100 100 100 100 100 100 100 
100 100 100 100 100 100 100 100 100 100 100 100 100 100 
##$AQSEQ= 0
##$AQ_mod= 1
##$AUNM= <au_zg>
##$AUTOPOS= <>
##$BF1= 200.13
##$BF2= 200.13
##$BF3= 200.13
##$BF4= 200.13
##$BF5= 200.13
##$BF6= 200.13
##$BF7= 200.13
##$BF8= 200.13
##$BYTORDA= 1
##$CFDGTYP= 0
##$CFRGTYP= 5
##$CHEMSTR= <none>
##$CNST= (0..31)
1 1 145 1 1 1 1 1 1 1 1 1 1 1 1 1 1 1 1 1 1 1 1 1 1 1 1 1 1 1 1 1 
##$CPDPRG= <>
##$CPDPRG1= <>
##$CPDPRG2= <>
##$CPDPRG3= <>
##$CPDPRG4= <mlev>
##$CPDPRG5= <mlev>
##$CPDPRG6= <mlev>
##$CPDPRG7= <mlev>
##$CPDPRG8= <mlev>
##$CPDPRGB= <>
##$CPDPRGT= <>
##$D= (0..31)
0 1.2 0 0 0 0 0 0 0 0.06 0 0.03 0 0 0 0 0.0002 0 0 0 0 0 0 0 0 0 0 0 0 
0 0 0 
##$DATE= 1721901447
##$DBL= (0..7)
120 120 120 120 120 120 120 120 
##$DBP= (0..7)
150 150 150 150 150 150 150 150 
##$DBP07= 0
##$DBPNAM0= <>
##$DBPNAM1= <>
##$DBPNAM2= <>
##$DBPNAM3= <>
##$DBPNAM4= <>
$$ [...]
##$SUBNAM3= <"">
##$SUBNAM4= <"">
##$SUBNAM5= <"">
##$SUBNAM6= <"">
##$SUBNAM7= <"">
##$SUBNAM8= <"">
##$SUBNAM9= <"">
##$SW= 24.0689530833862
##$SWIBOX= (0..15)
0 0 2 0 0 0 0 0 0 0 0 0 0 0 0 0 
##$SW_h= 4816.95568400771
##$TD= 16384
##$TD0= 1
##$TE= 0
##$TE2= 300
##$TE3= 300
##$TEG= 300
##$TL= (0..7)
0 120 120 120 120 120 120 120 
##$TP= (0..7)
150 150 150 150 150 150 150 150 
##$TP07= 0
##$TPNAME0= <>
##$TPNAME1= <>
##$TPNAME2= <>
##$TPNAME3= <>
##$TPNAME4= <>
##$TPNAME5= <>
##$TPNAME6= <>
##$TPNAME7= <>
##$TPOAL= (0..7)
0.5 0.5 0.5 0.5 0.5 0.5 0.5 0.5 
##$TPOFFS= (0..7)
0 0 0 0 0 0 0 0 
##$TUNHIN= 0
##$TUNHOUT= 0
##$TUNXOUT= 0
##$USERA1= <user>
##$USERA2= <user>
##$USERA3= <user>
##$USERA4= <user>
##$USERA5= <user>
##$V9= 5
##$VALIST= <valist>
##$VCLIST= <CCCCCCCCCCCCCCC>
##$VD= 0
##$VDLIST= <DDDDDDDDDDDDDDD>
##$VPLIST= <PPPPPPPPPPPPPPP>
##$VTLIST= <TTTTTTTTTTTTTTT>
##$WBST= 1024
##$WBSW= 4
##$XGAIN= (0..3)
0 0 0 0 
##$XL= 0
##$YL= 0
##$YMAX_a= 239449
##$YMIN_a= -432514
##$ZGOPTNS= <>
##$ZL1= 120
##$ZL2= 120
##$ZL3= 120
##$ZL4= 120
##$ABSF1= 20.45526
##$ABSF2= -3.613897
##$ABSG= 5
##$ABSL= 3
##$ALPHA= 0
##$AQORDER= 0
##$ASSFAC= 0
##$ASSFACI= 0
##$ASSFACX= 0
##$ASSWID= 0
##$AUNMP= <proc_1d>
##$AZFE= 0.1
##$AZFW= 0.1
##$BCFW= 0
##$BC_mod= 2
##$BYTORDP= 0
##$COROFFS= 0
##$CY= -3
##$DATMOD= 1
##$DC= 0
##$DFILT= <>
##$DTYPP= 0
##$F1P= 0
##$F2P= 0
##$FCOR= 1
##$FTSIZE= 16384
##$FT_mod= 6
##$GAMMA= 0
##$GB= 0
##$INTBC= 1
##$INTSCL= 3.70164e-10
##$ISEN= 128
##$LB= 0.24
##$LEV0= 0
##$LPBIN= 0
##$MAXI= 10000
##$MC2= 0
##$MEAN= 0
##$ME_mod= 0
##$MI= 1.114404
##$NCOEF= 0
##$NC_proc= -6
##$NLEV= 6
##$NOISF1= 3.799351
##$NOISF2= 2.8
##$NSP= 0
##$NTH_PI= 0
##$NZP= 0
##$OFFSET= 20.50521
##$PC= 1
##$PHC0= -25796.5
##$PHC1= 15.78749
##$PH_mod= 1
##$PKNL= yes
##$PPARMOD= 0
##$PSCAL= 0
##$PSIGN= 0
##$REVERSE= no
##$SF= 200.129804775191
##$SI= 16384
##$SIGF1= 3
##$SIGF2= 2
##$SINO= 5.538805
##$SIOLD= 16384
##$SREGLST= <1H.CDCl3>
##$SSB= 0
##$STSI= 16384
##$STSR= 0
##$SW_p= 4816.95568400771
##$SYMM= 0
##$S_DEV= 0
##$TDeff= 16384
##$TDoff= 0
##$TI= <>
##$TILT= no
##$TM1= 0
##$TM2= 0
##$TOPLEV= 0
##$USERP1= <user>
##$USERP2= <user>
##$USERP3= <user>
##$USERP4= <user>
##$USERP5= <user>
##$WDW= 1
##$XDIM= 16384
##$YMAX_p= 305959423
##$YMIN_p= -525690
$$ End of Bruker specific parameters
$$ ---------------------------------
##NTUPLES= NMR SPECTRUM
##VAR_NAME=  FREQUENCY,     SPECTRUM/REAL,   SPECTRUM/IMAG
##SYMBOL=    X,             R,               I
##VAR_TYPE=  INDEPENDENT,   DEPENDENT,       DEPENDENT
##VAR_FORM=  AFFN,          ASDF,            ASDF
##VAR_DIM=   16384,         16384,           16384
##UNITS=     HZ,            ARBITRARY UNITS, ARBITRARY UNITS
##FACTOR=    0.29402158847633, 1,            1
##FIRST=     4103.70384958103, 0,            0
##LAST=      -713.251834426678, 0,           0
##MIN=       -713.251834426678, -525690,     0
##MAX=       4103.70384958103, 305959423,    0
$$ Real data points
##PAGE= N=1
##DATA TABLE= (X++(R..R)), XYDATA
$$ [...]
7420B776367J1129P0097n970O1398Q2990Q7546N1842Q2882N0342J41566J8085
7409C428274O9664j02591J9210J09929k7512P3179P1357J65686O0801K43606J83932
7398D295535J14346K33179K00509J81818K53388J21434J98719L28870L62313L75881
7388F665992L98760K88798M19851M41155P81193Q32360Q97612J116308P55398
7379A2597427j3498K75913K06559M72112L30700O40797O53508R62947R95398J186337
7369A8308200J180597J649715J520416K157915K237663L180471L785983O051744
7361D0072704P429116J1437404J6412498K4835071K107566j9047624j7766433
7354F5480302j4083872r086756p265932m570258l797755k457860k342415j425328
$$ plain form
7420 2776367 2787496 2857593 2851623 2913021 2996011 3083557 3135399 3218281 3268623 3410189 3428274
7409 3428274 3497938 3395347 3414557 3524486 3496974 3570153 3641510 3807196 3867997 4111603 4295535
7398 4295535 4409881 4643060 4843569 5025387 5278775 5400209 5598928 5927798 6290111 6665992
7388 6665992 7064752 7353550 7773401 8214556 8995749 9828109 10725721 11842029 12597427
7379 12597427 12583929 12859842 13066401 13538513 13869213 14510010 15163518 16126465 17121863 18308200
7369 18308200 19488797 21138512 22658928 24816843 27054506 30234977 34020960 40072704
7361 40072704 47501820 58939224 75351722 100186793 102294359 83246735 65480302
7354 65480302 51396430 42309674 35043742 30473484 26675729 24217869 21875454 20450126
7346B0450126j612421q48077r73630l54258m55361q4170k53708K06761N4669N40057
7336A6669988L07357N83122N43896P96356J008448J351763J719495K566754L322980
7327B8870159L057825J309658n68329k372163k354885j985138j199779p51274
7319B4006074j70504P6368N43401R11292J837444K380594L124893K521206O60281
7310C5891049j277658k412994k438252j694810j086410o02937k86842L15759P60256
7301B7167161J296120K081328L048412L944247L724064J703223r47454l147494
7293C8869607l254666k623989k110916j387328p54447k44417N42810J282255K129378
7284C2448287K837498L703234K815076N13227j991043l616972l410135k852849
$$ plain form
7346 20450126 18837705 17989628 17015998 16661740 16206379 16122209 15868501 16075262 16129931 16669988
7336 16669988 16977345 17560467 18104363 18900719 19909167 21260930 22980425 25547179 28870159
7327 28870159 31927984 33237642 32669313 30297150 27942265 25957127 24757348 24006074
7319 24006074 23835570 23911938 24455339 25366631 27204075 29584669 32709562 35230768 35891049
7310 35891049 34613391 32200397 29762145 28067335 26980925 26377988 26091146 26406905 27167161
7301 27167161 28463281 30544609 33593021 37537268 41261332 42964555 42017101 38869607
7293 38869607 35614941 32990952 30880036 29492708 28738261 28493844 29036654 30318909 32448287
7284 32448287 35285785 38989019 41804095 42317322 40326279 36709307 33299172 30446323
7276C0446323k298569j801841j282272p83557m33036j21815L01524N21290R02339
7267B5450386J505664K230205K903592L737735L376361J719311o14796j880214
7259C8428244j496066m03674Q56190J973278K614982J405637j057329l072646
7251C9248616l716144l183102k449141j510448j354409j394472j623723j269074
7243B2748103j146273r02654n09584l10210m8217K46407L73937P13941J191738
7234B2357188J631911K335600K990757L481482K662330Q81416r89513j839354
7226C3511817j177436m1605J174235K139154K124270L64778k113818l793112l987858
7217B8200425l344754k561072j943379j733934j669796j633448j534922j341459
$$ plain form
7276 30446323 28147754 26345913 25063641 24280084 23847048 23725233 24026757 24548047 25450386
7267 25450386 26956050 29186255 32089847 35827582 39203943 40923254 40308458 38428244
7259 38428244 36932178 36528504 37384694 39357972 41972954 43378591 42321262 39248616
7251 39248616 35532472 32349370 29900229 28389781 27035372 25640900 24017177 22748103
7243 22748103 21601830 20699176 20189592 19879382 19831165 20077572 20451509 21165450 22357188
7234 22357188 23989099 26324699 29315456 32796938 35459268 36340684 35351171 33511817
7226 33511817 32334381 32292776 33467011 35606165 37730435 38095213 35981395 32188283 28200425
7217 28200425 24855671 22294599 20351220 18617286 16947490 15314042 13779120 12437661
7209A2437661j007544r82603p96297o12130n58021m28683l89100k04080k39411
7200G219792k95870j76079j01238k29996k26581k24539r0733j80048j45678k19546
7190E329484j73203p7004j19528k08373j46455j72296j53686j62582q6321j91498
7180C838538j06336j09063N781k16702r1106K6760p9815j02299O7808R447j3304
7169C229709j45413n203M2285R6525j19207Q2353P749l189p5274n5750K3650M0235
7157C118470Q6943J00452L5336r45Q8742l7777K3394K3307K6452J26789J41591
7146C732754J7116J35184J42079J86171R8073J56078K82812K12805Q8049K20886
7136E272007J24532J65205L27448K67014L52064L32110J83702K71168K64028M05653
$$ plain form
7209 12437661 11430117 10447514 9651217 9039087 8481066 8052383 7663283 7459203 7219792
7200 7219792 6923922 6747843 6646605 6416609 6190028 5965489 5874756 5694708 5549030 5329484
7190 5329484 5156281 5079277 4959749 4751376 4604921 4432625 4278939 4116357 4030036 3838538
7180 3838538 3732202 3623139 3628920 3412218 3321112 3347872 3268057 3165758 3233566 3243013 3229709
7169 3229709 3084296 3079093 3121378 3217903 3098696 3181049 3188798 3185609 3110335 3054585 3078235 3118470
7157 3118470 3205413 3305865 3341201 3340256 3428998 3391221 3414615 3437922 3464374 3591163 3732754
7146 3732754 3749870 3885054 4027133 4213304 4311377 4467455 4750267 4963072 5051121 5272007
7136 5272007 5396539 5561744 5889192 6156206 6508270 6840380 7024082 7295250 7559278 7964931
7126G964931M50887N79679M75241O45974P51099J045601J390002J773924K422773
7117A7500111K712565J447193k67852j134563r50877l09125L08038J004026J365264
7108B1674780J368662K344j381165j751567j564323j031199n15136m95162m02023
7099A5905211m74388l09250j7005R4545M04906M86715Q84287J014377J113213
7090A9102611J388440K061907K802145L464212L239319J837638K31274j394837
7082C2732709j935185j146036N6958R99802J598325R28562l24927k027862l176935
7073B7705411k946061k327936j773602j453387j335052j341622j131192q26663
7065A4569896n29508l70508q3202m3788O8633R9300M06419M64740Q19380J500243
$$ plain form
7126 7964931 8415818 8995497 9470738 10116712 10867811 11913412 13303414 15077338 17500111
7117 17500111 20212676 21659869 21392017 20257454 19306577 18997452 19305490 20309516 21674780
7108 21674780 23043442 23045786 21664621 19913054 18348731 17317532 16802396 16307234 15905211
7099 15905211 15430823 15121573 15104568 15199113 15604019 16090734 16975021 17989398 19102611
7090 19102611 20491051 22552958 25355103 28819315 32058634 33896272 34127546 32732709
7082 32732709 30797524 29651488 29708446 30708248 32306573 33235135 32910208 30882346 27705411
7073 27705411 24759350 22431414 20657812 19204425 17869373 16527751 15396559 14569896
7065 14569896 14040388 13669880 13586678 13542890 13611523 13710823 14117242 14581982 15401362 16901605
7055A6901605J619562N29157p01579j288501j080820m94576p3886M06050P19632
7046A6536644N58437n46935j534769j713145j432054r66825p93445p11620q77436
7037H518852p21453n45105n44729l91727l20041k48751j81913k73148m00689l73979
7027D517317j85494k55124j90268j38011q2186j28524k43420j77664N7703j00748
7017C073581n3917o3208j04895p5316m9082P3137q2347M6459l070k48946k0832
7006B491564J6120j3848k7044K8712n5345k0488K6457l6488k35936r6768j95280
6995A881656k49125m9666p9419k5592L2397l923k5774j13039Q6042Q714J1446
6984A473717l9467j37369K7441m3667k436k8707J52n8949n7507m5658M5678j9041
$$ plain form
7055 16901605 18521167 19050324 18348745 17060244 15979424 15484848 15410962 15817012 16536644
7046 16536644 17095081 16548146 15013377 13300232 11868178 10901353 10107908 9396288 8518852
7037 8518852 7797399 7252294 6707565 6315838 5995797 5747046 5565133 5291985 4891296 4517317
7027 4517317 4331823 4076699 3886431 3748420 3666234 3537710 3294290 3116626 3174329 3073581
7017 3073581 3019664 2956456 2851561 2776245 2727163 2800300 2717953 2764412 2761342 2512396 2491564
7006 2491564 2507684 2493836 2466792 2495504 2440159 2419671 2446128 2409640 2173704 2076936 1881656
6995 1881656 1632531 1582865 1503446 1477854 1510251 1506328 1480554 1367515 1453557 1462271 1473717
6984 1473717 1434250 1296881 1324322 1280655 1278219 1249512 1249664 1190715 1133208 1087550 1133228 1114187
6972A114187j3918q1598r4887o7834p9295m8900j0479j4586j8512o4136M8942
6961F68984k3064K7440N2564J136q5815n3179k626Q6058l6301L3070j34727p0578
6949D62962O802N2490J5879N685l5055k1177k6598q4464j6780L8086l947J9633
6937D13516o7953l1472r1247P3252k1537L5901L0282J2825n2193m3969j0394K5998
6925B73009R89j4661M1458o1524N2622R670K854q5272R0460O952k73J1717o8817
6912B59184j2224J9479Q3200k228L8651L4442J3353j75810j0080R7300O4981k5173
6900C85075j3243J30137N411m4158M5764M7955O9129k2867J49532Q9668m3850
6889G98553M9230L431j30599M6839k2928P0621n5854k9393P1617M1372M5204o2506
$$ plain form
6972 1114187 1100269 1018671 923784 855950 776655 727755 717276 702690 684178 620042 668984
6961 668984 645920 673360 725924 727060 641245 588066 585440 671498 635197 668267 533540 462962
6949 462962 469764 522254 538133 543818 508763 487586 460988 376524 359744 397830 393883 413516
6937 413516 345563 314091 222844 296096 274559 310460 340742 353567 301374 257405 247011 273009
6925 273009 273998 259337 300795 239271 291893 301563 304417 219145 309605 316557 316284 328001 259184
6912 259184 246960 266439 349639 347411 386062 420504 433857 258047 247967 345267 410248 385075
6900 385075 371832 501969 507380 463222 508986 556941 626070 603203 752735 842403 798553
6889 798553 847783 851214 720615 767454 744526 815147 759293 729900 801517 842889 888093 825587
6877H25587L0633M2760J23899N2746m5612O3258O293J2766K8445O9625n7178n1207
6865A102015Q7047J14061M2977l0589k2733Q8727l6546P8573m7576j16229P0555
6854A330282j12594n527P543N2731J3186N8826m8311N9469k2390J37686M4422
6843A515323n6607n0909O746j01675k1300m3770K4054r4043o5750l5403l3941
6832A042725J00963N0960q8287J9369j30159n3536q1542k7274m8045J19793j4688
6821H90279J1649P0027J64l0923l6859l4958m8965M4229M3228k9147N3966P9088
6809A011778J56772J22599j04821J892J12285k7850J46799J51104N347M6278M9548
6798A671731J41092K0994k9860o3606j06568q0049k40007o258O2887l1776m7203
$$ plain form
6877 825587 856220 898980 1022879 1075625 1030013 1093271 1099564 1112330 1140775 1210400 1153222 1102015
6865 1102015 1189062 1303123 1346100 1315511 1292778 1381505 1344959 1423532 1375956 1259727 1330282
6854 1330282 1217688 1212161 1219704 1272435 1285621 1344447 1296136 1355605 1333215 1470901 1515323
6843 1515323 1458716 1407807 1414553 1312878 1291578 1247808 1271862 1177819 1112069 1076666 1042725
6832 1042725 1143688 1194648 1106361 1125730 995571 942035 860493 833219 785174 904967 890279
6821 890279 901928 971955 972119 941196 904337 869379 820414 864643 907871 878724 932690 1011778
6809 1011778 1168550 1291149 1186328 1188220 1300505 1272655 1419454 1570558 1575905 1622183 1671731
6798 1671731 1812823 1833817 1803957 1740351 1633783 1553734 1313727 1307469 1370356 1338580 1291377
6787A291377J9925L7630o264N8971o1564m6949J0750j02159M9464J0603j22691
6776A139093p9913j09104O3782l6690P8029Q1861R0157O4733l100n940L627M760
6764A291295r0137m2702o4277o3731M8461j06104n2255P2153j08382q9515N0222
6753H45028L2131j37491j44337j6024q167K1144j28060m2383l1541n4905N9119
6742C94514N5648O8371J7308j22031K2037J30546j04165K220J1313L6294j0934
6731E01121o2544j04252J2057R9041k1833J4731j46795q5631R7957o1489l3648
6720B08715N4206j1803o5609K799N8936j31455M7238K9192J38870j48872P0334
6709B52551n9282m1712J0764l4943K3493j3345q5682k9000Q1604J13277j6105
$$ plain form
6787 1291377 1311302 1348932 1342668 1401639 1340075 1293126 1303876 1201717 1251181 1261784 1139093
6776 1139093 1059180 950076 1013858 977168 1055197 1137058 1227215 1291948 1288848 1282908 1286535 1291295
6764 1291295 1201158 1158456 1094179 1030448 1078909 972805 920550 992703 884321 794806 845028
6753 845028 877159 739668 595331 579307 571140 592284 464224 421841 390300 335395 394514
6742 394514 450162 518533 535841 413810 435847 566393 462228 464448 475761 512055 501121
6731 501121 438577 334325 346382 445423 423590 438321 291526 205895 303852 242363 208715
6720 208715 262921 251118 185509 188308 247244 115789 163027 192219 331089 182217 252551
6709 252551 193269 151557 162321 127378 150871 137526 51844 22844 104448 217725 201620
6698B01620m9461k8052j3646J9509p6573N5784N3699j61895m081N8610o87Q1191
6686A36018J4296L7465m3822L9687N8221k8673J1666j06074q806l0248r1942L0559
6674A8347J6069K0551M8198n4444N7632N0853p9173q3607k4323R6470k4507p864
6662C4202J35790m9867m149m7167n7086K8560M783N4830j09902J1563K7992L7772
6650F7321K7483l458j1007m0611M0051k1907n655J6790M4401m8828o094M433Q126
6637G1045j8110j3013M9664J5481k1375j4007o171k4358Q0172m0956L193M2219
6625A23784L6467j48022l248J6201J36814j09113L4971l5055N3759j0545K1247
6614A17260N7626J8560j498N6578k377n7016N4396l2290K1604r5758J1611L219
$$ plain form
6698 201620 152159 124107 110461 129970 53397 109181 162880 985 -3096 55514 54827 136018
6686 136018 150314 187779 143957 183644 241865 213192 224858 118784 109978 79730 -12212 18347
6674 18347 34416 54967 103165 48721 106353 157206 78033 -5574 -29897 66573 42066 34202
6662 34202 169992 120125 115976 68809 11723 40283 45066 99896 -10006 1557 29549 67321
6650 67321 94804 91346 80339 39728 79779 57872 52217 69007 113408 64580 58486 62919 71045
6637 71045 52935 39922 89586 105067 83692 69685 63514 39156 119328 78372 81565 123784
6625 123784 160251 12229 8981 25182 161996 52883 87854 52799 106558 96013 117260
6614 117260 174886 193446 191948 248526 246149 189133 243529 211239 232843 137085 148696 151915
6602A51915J57922p7788L6695R735J35305L8371J5516Q9283K2347L780K6366M0356
6590F49803M2924j4080N7728M1947p7709J363q957m6859J6186P0067K6515n5452
6578G03476j4270j16923O9314P916k6542l4774m2721l5247o6576K2232K2624J19657
6566F08166j8350l9906M1617J0574M9952O6411M6600r33k3145J29335l6417r914
6554H23990p7705O1582K5285R8316n1298N8045j7787m7154j02751l4621k6706
6543G09196n3432n6311o7755k8640l1783j0786l7393N1328k6303n2560R8751Q3949
6531E78261o4683n8714m626K6469n5751K7526M523n0248k8809J7951j6160L4052
6519D09791L3543j26987J10110m9341O4076J2121m7418P4602l051l8950Q362Q9682
$$ plain form
6602 151915 309837 232049 268744 278479 413784 452155 467671 556954 579301 583081 609447 649803
6590 649803 692727 678647 736375 778322 700613 701976 693019 646160 662346 732413 758928 703476
6578 703476 689206 572283 641597 649513 622971 588197 545476 510229 443653 465885 488509 608166
6566 608166 589816 549910 591527 602101 652053 718464 765064 764131 740986 870321 833904 823990
6554 823990 746285 807867 833152 931468 880170 938215 920428 873274 770523 735902 709196
6543 709196 655764 599453 531698 503058 471275 460489 423096 474424 448121 395561 494312 578261
6531 578261 513578 454864 450238 476707 420956 448482 453005 402757 373948 391899 375739 409791
6519 409791 443334 316347 426457 377116 441192 453313 405895 480497 477446 438496 446858 536540
6507E36540q0702l0052J07197J8860o0537m1934N4065P1806j4826r8896j8406
6496D43115R4263K6714j07870n0312N5115L2665m2123M356j2647k0270n4324k7538
6484C41144K0858J01979J0064j09371J973P0496q2486k443k6084k1221N1469N2294
6472D08672Q6973m4530J6645Q501K8319K592l6129k6670Q4960O157n9445o6395
6460D09650O7352m3040K3590j9549j02081J5638M5993l8005j4678K1853k9977
6449C36746K0084N9827n2250n2306n0376Q6306Q223O9167k4357O2457q626j6936
6437D37959k6292K462q3558O4131o7463Q1202J12699p3034j00359q0599N6664
6426C23812n0974L9902k4913J9638K014o2207Q8625q4952N9729N649o0352j3742
$$ plain form
6507 536540 455838 425786 532983 551843 491306 449372 503437 575243 560417 461521 443115
6496 443115 537378 564092 456222 405910 461025 493690 451567 455923 443276 423006 368682 341144
6484 341144 362002 463981 474045 364674 366647 437143 354657 352214 326130 304909 356378 408672
6472 408672 495645 451115 467760 476261 504580 507172 471043 444373 529333 535490 476045 409650
6460 409650 477002 433962 457552 438003 335922 351560 397553 359548 344870 366723 336746
6449 336746 356830 416657 364407 312101 261725 348031 356254 425421 401064 463521 454895 437959
6437 437959 411667 414129 330571 394702 327239 408441 521140 448106 347747 267148 323812
6426 323812 272838 312740 287827 307465 309479 247272 335897 250945 310674 316323 255971 242229
6414B42229l6396R0257j12585O4351Q1282j62598L3287N4644n9274l2636Q1099
6403B43660M6106N01J2381j29553P091K6041M5599p0240r2856M1643n8879K9506
6391A01000Q0584Q882o7892j23996J12453O5432k4861o293n7058o870N0602J6669
6379A48652L0194r078M815j1682L246Q095q8720k1584Q4712j228k4864J00936
6367B23494r5078L4659j2019k727K173l1453N381J80362q0464n9690N1443o6136
6355A49945M3088p9230q3239J10273J05216j5749l3391m3562J15360J00712n7268
6344C12155n9136N7702k5564N1898J3427N9060l9341J00293q3289m3304O5837
6333D09738j0802J9060k98j8807m165q2759P7682J122J04668r989K3125n5578
$$ plain form
6414 242229 205833 296090 183505 247856 329138 166540 199827 254471 195197 162561 243660
6403 243660 289766 290267 302648 173095 180186 206227 251826 181586 88730 130373 71494 101000
6391 101000 181584 190466 122574 -1422 111031 176463 151602 145309 88251 81381 131983 148652
6379 148652 178846 169768 174583 162901 166147 174242 85522 63938 148650 147422 122558 223494
6367 223494 128416 163075 151056 148329 150502 119049 124430 304792 224328 164638 216081 149945
6355 149945 193033 113803 30564 140837 246053 230304 196913 153351 268711 369423 312155
6344 312155 253019 310721 285157 337055 350482 409542 370201 470494 387205 343901 409738
6333 409738 398936 417996 417698 398891 394726 311967 389649 390771 495439 485450 508575 452997
6321D52997J5031J62253p5183N3786k1734m7819N9172K9558k8673J014Q0380m1692
6309F39090N6982k1023n006j0219n4176q8067j00576J04994J9380p1819l2454
6298D37106m7257j5229n5592J24170j4901n861J3507p4673O0052J37712K8181
6287E87215q2681m2519N250N7169p79j3374Q767Q8111J0213o3853L8291k3301
6275E68509j6509J13237m9135p3055O6406j5359M626p1021J9669J01548m2792
6264F06124Q9170p0462O3655R8855n3324k8503j2897j3619K1544N0390n153m6169
6252F99611j1388K992j605Q9995J4927k5508M5993o6966j4203K3945j12068m659
6240F41066M8931n0958J7372q8286M2871k8468J3786Q3814m7346o6726k7018J14855
$$ plain form
6321 452997 468028 630281 555098 608884 587150 539331 598503 628061 599388 600402 680782 639090
6309 639090 696072 675049 670043 659824 605648 517581 417005 521999 541379 469560 437106
6298 437106 389849 374620 319028 443198 428297 422436 435943 361270 421322 559034 587215
6287 587215 504534 462015 467265 524434 523655 510281 519048 607159 617372 553519 591810 568509
6275 568509 552000 665237 616102 543047 609453 594094 598720 527699 547368 648916 606124
6264 606124 695294 624832 688487 787342 734018 705515 692618 678999 700543 750933 745780 699611
6252 699611 688223 691215 689610 779605 794532 769024 815017 748051 733848 757793 645725 641066
6240 641066 689997 639039 656411 568125 610996 582528 596314 680128 632782 566056 539038 653893
6228F53893O8832j04043l289m1373q634R423J7429p2911r3442o205N7890p576
6216D69994m2259P386o4084M3025o5111j9701P3072j5814J1297j15487q8686M1930
6204B35562N3421P395j196p2877n7382P3862L7488n7988p348o7799O3851l1332
6192A75657q237O1086o7008p037N055M986n57R861j1269Q51n1333k5036N3492
6179A40511K5072o079k8964N372q7244j8391K4892J6301O6406J7739k6582p4331
6167E4702L4707K2524K1644K020M5732k1982m8453j14946J61067j3082m8163Q5318
6155A81088j7423l841n5826J4896J7461L5775k2886l9854Q0701K5878j2974p5963
6143A27032J7698J937j05085Q7440j3706o517n6330J3312P9303J4267M8913n0074
$$ plain form
6228 653893 722725 618682 615393 574020 565386 574809 592238 519327 425885 419680 477570 469994
6216 469994 427735 435121 371037 414062 348951 329250 402322 386508 397805 282318 193632 235562
6204 235562 288983 296378 295182 222305 164923 238785 276273 218285 210937 143138 206989 175657
6192 175657 167420 228506 161498 154461 159516 164502 163945 173806 162537 163388 112055 87019 140511
6179 140511 165583 159504 130540 135912 48668 30277 55169 71470 137876 155615 129033 54702
6167 54702 89409 111933 133577 135597 181329 159347 110894 -4052 157015 143933 95770 181088
6155 181088 163665 159824 103998 118894 136355 172130 149244 109390 190091 215969 202995 127032
6143 127032 144730 146667 41582 129022 115316 108799 52469 65781 145084 159351 208264 158190
6131A58190l7411J02372M2682r734j00154r346K1461J13110M4468j1339R772q3210
6119B40861l7540P726o9583l255Q635J3760m8216k6580n868L1095K3922R7658
6107B32615j1122p3739K8401k5459m5323J6628J40n3905L2179j02073K7942Q9891
6095A16175R572N6917o1081Q3643N209q2133k5571J2456J5J3913p006n0971J5825
6082H6963L9722K7268O4670q0753J3977m8668p3294J62377k6630j23935o3061
6071b1364M5953Q5197l803K4241o62R322L1190p4843M0304j21237J26992j9626
6059A21664p6256N4157L0775J8478n810n9160j1809j460n6548K0711R9054p3248
6047F0548N4309K057j06920r400O1838k1276J17146J00216n6484r2412k1773O4762
$$ plain form
6131 158190 120779 223151 265833 256099 155945 146599 168060 281170 325638 314299 324071 240861
6119 240861 203321 211047 141464 138209 146844 160604 112388 85808 79940 111035 134957 232615
6107 232615 221493 147754 176155 150696 105373 122001 122141 68236 100415 -1658 26284 116175
6095 116175 125747 182664 121583 205226 210435 128302 102731 115187 115202 129115 122109 71138 86963
6082 86963 126685 153953 218623 137870 151847 103179 29885 192262 165632 41697 -21364
6071 -21364 24589 109786 105983 130224 129562 138884 170074 95231 135535 14298 141290 121664
6059 121664 45408 99565 130340 148818 143008 83848 72039 70579 14031 34742 133796 60548
6047 60548 114857 116914 9994 594 62432 41156 158302 258518 202034 109622 87849 152611
6035A52611K2729n4983p2382O9725O6278n748k4274j02830J33231O7147m2267
6024B09237j9654q5412N2722m2660l6515m64K1876k0225l6563O7196j8484l3979
6012E7075l902N9629N4170j1188l5226k8558M4120P0130j3926L6694k3653q5269
6000A20096n7192l3538l4108k347J52731M5161Q3682k404r3110L2199N4615m9891
5988B15894n396L8626r1017n4933p494j6980R5008L2547o6894P054q8281L0758
5976H8892K4849j3847R418M1557M329L8751N6168r0840o4047p438j9336P8239
5964A46695J16425q8043O978k4082O5911J8128r291o47j02154L4235o899J6392
5952A73648N0616M6922l5057K2862j3888n8231J9620m4168Q012K7772k3081N7599
$$ plain form
6035 152611 175340 120357 47975 117700 183978 178230 153956 51126 184357 251504 209237
6024 209237 189583 104171 156893 114233 77718 77254 99130 78905 42342 109538 91054 57075
6012 57075 53173 112802 166972 155784 120558 92000 136120 206250 192324 229018 205365 120096
6000 120096 62904 29366 -4742 -7089 145642 190803 274485 272081 178971 211170 265785 215894
5988 215894 210498 249124 158107 103174 95680 78700 173708 206255 139361 146415 58134 88892
5976 88892 113741 99894 109312 150869 155198 193949 250117 159277 95230 87792 68456 146695
5964 146695 263120 175077 182055 157973 223884 242012 232721 232074 129920 164155 157256 173648
5952 173648 224264 271186 236129 258991 245103 186872 206492 162324 170336 198108 175027 232626
5940B32626q785j3807L0374q117L3638r9131J49985n2969k5528L7579O1149J8187
5928C55201l4092n9379o085K8486J33262N3002r3033L3419o4833N059p2696j03471
5916A74840J05188k6363j01702k6869J04503N1076j950O8638q9682l4406m9694
5905A73579P4509p306K6941n6328L6188N6828j14179N0963j3809j6592P2300K0003
5893C03097M4980n4999J7292l7223p8078N0576m5500l8519N4343Q926n7627K3209
5881A90477J08386p8089o4730J0704K942L0516j23656J92438L5811n6944m9428
5870A98427J09309r1950P7692n7013K1257L8315j25147R3J24442l1754m8602j0950
5858B04119m3545M5798m9207J7233M2015M0590k3115l7875J8592J8414j9699o627
$$ plain form
5940 232626 223841 210034 240408 232291 265929 166798 316783 263814 238286 275865 337014 355201
5928 355201 321109 261730 255645 284131 417393 470395 377362 410781 345948 351007 278311 174840
5916 174840 280028 253665 151963 125094 229597 280673 278723 347361 257679 223273 173579
5905 173579 248088 240782 267723 211395 247583 304411 190232 241195 227386 210794 283094 303097
5893 303097 348077 293078 310370 273147 195069 245645 200145 161626 215969 224895 167268 190477
5881 190477 298863 220774 156044 166748 169690 200206 76550 268988 304799 247855 198427
5870 198427 307736 215786 293478 236465 257722 296037 170890 170983 295425 263671 215069 204119
5858 204119 160574 206372 157165 174398 216413 257003 233888 196013 214605 233019 213320 206693
5846B06693j7285o119K4168m3745L9758m319P1179o7231l23P592L938K9789j2811
5833B31284j4539J4664J09049j19347j8713L1892O4547m6449r134n7222p382K0371
5821A99021L2261K2845N7082n5347l5009j17214R4542M7726J270J8990j0597N6927
5809C12497j1102j2975K4869L1930r7135K9184M1577k7966m7631R2602O6150r9709
5797C02291p8480k7648J5459K2899K8228J09325n2415j14632k4855L3899P8531
5786B92602n1350J1659k8763J1830j9024l7021K3441J37143j2061L2642m0259
5775C20839J2351q4432L8400m5499m3016M2512K2598Q2601K3626q3443O0557k41
5763C46853J2148n6467l0379J53157q3962J1143N4799j15912l1671N5777J6960
$$ plain form
5846 206693 189408 183289 207457 163712 203470 199151 270330 203099 202776 210368 214306 244095 231284
5833 231284 216745 231409 340458 221111 202398 234290 298837 252388 243254 186032 178650 199021
5821 199021 231282 254127 311209 255862 220853 103639 198181 245907 247177 266167 255570 312497
5809 312497 301395 288420 313289 345219 248084 277268 318845 290879 243248 335850 402000 302291
5797 302291 223811 196163 211622 234521 262749 372074 319659 205027 180172 214071 292602
5786 292602 241252 252911 224148 235978 216954 179933 203374 340517 328456 361098 320839
5775 320839 333190 248758 287158 241659 198643 241155 263753 346354 369980 286537 347094 346853
5763 346853 359001 302534 272155 425312 341350 352493 407292 291380 259709 315486 332446
5752C32446K0065j7612j35300J25979K9011J4685j2744l1636Q6856n2889N0108
5741D08969k0269L8665p5583j0000j7315n349J2796k8039P0158q5224q323j7788
5729B62698L5384k4798n9421R3938J13142n3821j780o7062O9006J2061j7746M519
5717C66120N407m9078J5549P9251J783J5118r8340M8378J1376Q7260m2534o1909
5705C78381J8222O8168o2567P5538j09976o1484l9562O2441J14573n3480M6858
5694D37112j283n4228N3742P3526j14691p386K5858L4990r041J0799R721k723
5682D56396k3111L8962m9480j126J03258k9352J29553o9711j04928l3130P3160
5671D90491m2592M7142K5245p4681R2360J8390l8664r211O2641R665q7842K5182
$$ plain form
5752 332446 352511 334899 199599 325578 354589 369274 356530 324894 411750 358861 408969
5741 408969 388700 427365 351782 341782 324467 319118 331914 303875 374033 288809 280486 262698
5729 262698 298082 273284 213863 307801 420943 367122 365342 298280 367286 379347 361601 366120
5717 366120 371527 322449 337998 417249 419032 434150 335810 384188 395564 482824 440290 378381
5705 378381 396603 464771 402204 477742 367766 306282 266720 329161 443734 390254 437112
5694 437112 435829 381601 435343 508869 394178 386792 412650 447640 438599 449398 459119 456396
5682 456396 433285 472247 422767 421641 524899 495547 625100 555389 450461 417331 490491
5671 490491 447899 495041 520286 445605 537965 556355 517691 508480 571121 580786 492944 518126
5659E18126l2512N5925l2820P7044N1338r2889J5963L5372J5982J6706M8132L0032
5647G06399n2775q2360L9957J09091j04823J3360M4701K0002N5906N1686J5652
5636H16796o172m9358P075J12869O7259M5093r4215J9234O5929L0700O7785N6485
5624A139480j638J5735J7738l5899Q161j02934n1744r1658J11788N500j06911
5613I07618n4708L8133P478r0163L1660J53990n5934J0095j01685Q2914Q0985
5602A010383j4929M1206k3261j6544N5840Q005j20004n5931R10M4810J0908p6325
5590H65068m5796l4363m4326R3746Q3689n4916k6885J24339J0213N412L3862q0056
5578I29987j1103P0451K3285J08378p9015j9619P8779j8377N9038o5348n602J33206
$$ plain form
5659 518126 485614 541539 508719 585763 637101 544212 560175 595547 611529 628235 676367 706399
5647 706399 653624 571264 611221 720312 615489 628849 673550 693552 749458 801144 816796
5636 816796 810624 761266 768341 881210 948469 993562 899347 918581 984510 1015210 1082995 1139480
5624 1139480 1137842 1153577 1171315 1135416 1143577 1040643 988899 897241 1009029 1014529 907618
5613 907618 852910 891043 898521 808358 840018 994008 938074 948169 846484 929398 1010383
5602 1010383 995454 1036660 1013399 996855 1052695 1060700 940696 884765 885675 930485 941393 865068
5590 865068 819272 784909 740583 834329 918018 863102 836217 960556 970769 976181 1010043 929987
5578 929987 918884 989335 1012620 1120998 1041983 1022364 1101143 1082766 1141804 1076456 1070854 1204060
5566A204060L8813k5525j27169O5773J3752J5002r3425J0724N1135p7347N7094
5555A132887P8759m0640M8965K2620N4825K6368K9537J8533N0646n2876j07069
5544A262555N5318m8764N5544J14918j01415o7055R7018P85j07105Q814j09617
5533A160996O4036j25861L3208o9985m8522R1179j16515p264J78339p230m1633
5522A110748j6948r91L5959k868l3033k9936q6610N8700P6030J24135o297J638
5510A230527L502m446O7371j16712K2026K4165m2066J8051J5969P557N5611J8030
5498A299585q4180M6084L7955J068L2573J22059N562P6420J5835P029m1771o026
5486A512193R1099m6922o7131l7145J04304J15833O9687q7763j0380O840j8823
$$ plain form
5566 1204060 1242873 1217348 1090179 1155952 1169704 1184706 1091281 1102005 1153140 1075793 1132887
5555 1132887 1211646 1171006 1219971 1242591 1297416 1323784 1353321 1371854 1422500 1369624 1262555
5544 1262555 1317873 1269109 1324653 1439571 1338156 1271101 1368119 1368904 1261799 1270613 1160996
5533 1160996 1225032 1099171 1132379 1062394 1013872 1105051 988536 981272 1159611 1152381 1110748
5522 1110748 1093800 1092809 1128768 1125900 1092867 1062931 976321 1035021 1111051 1235186 1228889 1230527
5510 1230527 1234029 1229583 1296954 1180242 1202268 1226433 1184367 1202418 1218387 1225944 1281555 1299585
5498 1299585 1215405 1261489 1299444 1300512 1333085 1455144 1460706 1537126 1552961 1559990 1518219 1512193
5486 1512193 1603292 1556370 1489239 1452094 1556398 1672231 1741918 1654155 1643775 1650615 1631792
5475A631792O3881l5481l9265Q70J0663O0330P3925j6414q0733n9019M2070Q9927
5463A742546Q8755N8910J42706q9586L9890J2188q6950j7221j7314Q1125j0286
5452A944763k8194L1914M3782o3092j8852o1732N1736J01478N8668L1065L6352
5441B127888J35376J00136o7148J21739K2451j01406M6767Q4143M9799P2144N6711
5430B648600J1N5123J90337M2974M6204N1530K04951J23971J69996K56197J77438
5419C967332J98078K68634K07041L19678M69059N84602L04946o8575k47772j57236
5409E845787j40446o9699M5588K90886L12334M45334J20168L279J45890L52159
5399G351280L17694J20651j73398l24745k46223l3110n743Q6448l8346r1818k50873
$$ plain form
5475 1631792 1695673 1660192 1620927 1621797 1632460 1692790 1766715 1750301 1669568 1610549 1652619 1742546
5463 1742546 1831301 1890211 2032917 1943331 1983221 1995409 1908459 1891238 1873924 1955049 1944763
5452 1944763 1916569 1948483 1992265 1929173 1910321 1848589 1900325 2001803 2060471 2091536 2127888
5441 2127888 2263264 2363400 2296252 2417991 2440442 2339036 2385803 2469946 2519745 2591889 2648600
5430 2648600 2648611 2703734 2894071 2937045 2983249 3034779 3239730 3363701 3533697 3789894 3967332
5419 3967332 4165410 4434044 4641085 4960763 5429822 6014424 6319370 6250795 6003023 5845787
5409 5845787 5705341 5635642 5681230 5972116 6284450 6729784 6849952 6853231 6999121 7351280
5399 7351280 7668974 7789625 7616227 7291482 7045259 7012149 7006406 7092854 7054508 6962690 6711817
5388F711817j15430J70213R5247K65052M94156L69079j19851m22995n32453m19619
5378F495216l68116r1721k18316j56367p2266j3004r23j05890J16455M7165J14667
5367E746900m616L1109J02766J07349J05199J45909R5681J37757J44882K55021
5357F867957K21921J51357K15618K79755J55421K94152L63375L36392M20452L78638
5347I685038M03665L83339K96069M99050O58679N86926P74776N13185M58401O48296
5337A4907424P78616P62674Q33221R13126J056845J224188J247738J247239J378257
5328B4349328J530547J777253J770004K313116K741140L460235M581055N950636
5320D8473314P646395Q129061L113815k763463m141053l376283j694762k348J691827
$$ plain form
5388 6711817 6596387 6766600 6861847 7126899 7621055 7990134 7870283 7447288 6914835 6495216
5378 6495216 6127100 6035379 5817063 5660696 5588430 5575426 5574503 5468613 5585068 5632233 5746900
5367 5746900 5742284 5773393 5876159 5983508 6088707 6234616 6330297 6468054 6612936 6867957
5357 6867957 7089878 7241235 7456853 7736608 7892029 8186181 8549556 8885948 9306400 9685038
5347 9685038 10088703 10472042 10768111 11267161 11925840 12512766 13287542 13800727 14259128 14907424
5337 14907424 15686040 16448714 17281935 18195061 19251906 20476094 21723832 22971071 24349328
5328 24349328 25879875 27657128 29427132 31740248 34481388 37941623 42522678 48473314
5320 48473314 56119709 64248770 67362585 64599122 60458069 57081786 55387024 55384676 57076503
5311E7076503L410888N109758M504444J229661K85550J834696M102275N025960
5303H2579735J508812l099527m844514l552801j249688J319282J471675k102463
5295G2030511l621980l050481j210079Q79950K971549N184046P499316N556341
5287H6239173j901402n959018n900903m041566k096218k70841J422786K131006
5279F9623017J198424r62499k825946l753827l735373l270944k458385j720054
5271E2094413j027634j96466N51892J118293J824991K445652L200837L988473
5263F4000451N209204O818432Q579331R000345O668917J01830o554752r187937
5255H4635821q766430p370960o283840n088406l987546l213554k217268j411197
$$ plain form
5311 57076503 60487391 65597149 70101593 71331254 71616804 73451500 77553775 82579735
5303 82579735 84088547 80989020 76144506 72591705 71342017 72661299 74132974 72030511
5295 72030511 68408531 65358050 64147971 65027921 67999470 73183516 80682832 86239173
5287 86239173 84337771 78378753 72477850 68436284 66340066 66069225 67492011 69623017
5279 69623017 70821441 69858942 67032996 63279169 59543796 56272852 53814467 52094413
5271 52094413 51066779 50870313 51422205 52540498 54365489 56811141 60011978 64000451
5263 64000451 69209655 76028087 84607418 93607763 100276680 100378510 93823758 84635821
5255 84635821 75869391 68498431 62214591 57126185 53138639 49925085 47707817 46296620
5247D6296620q29805l17812L35633J114720K127582L032528L827860L662097J370991
5238F0620414k061433m576968n404613n094678m495775l865652l397766l005845
5230B8717684k403894k148334j792641j398062j029056q53230q43431p43759q74125
5221A6631152q70489p87736p03338p97427p35259m47029n00285m49098k64662
5212A1075829j99088k66154j21801n7717k342J15518L10893M59164L15080P1942
5202A1701324j75518o09015p92815o48400o01710m29992l50650l95234k00233
5193G497757j45663j93843l1929j14155J1502M7512k1409R2960J50417K47564
5183G540713J58922j11689l50517m49566l74755l11939k99272p7390k70816l57850
$$ plain form
5247 46296620 45466815 45149003 45484636 46599356 48726938 51759466 55587326 59249423 60620414
5238 60620414 58558981 53982013 48577400 43482722 38986947 35121295 31723529 28717684
5230 28717684 26313790 24165456 22372815 20974753 19945697 19092467 18249036 17505277 16631152
5221 16631152 15760663 14972927 14269589 13472162 12736903 12289874 11789589 11340491 11075829
5212 11075829 10876741 10610587 10488786 10431069 10428727 10544245 10855138 11314302 11629382 11701324
5202 11701324 11525806 10916791 10123976 9475576 8873866 8443874 8093224 7697990 7497757
5193 7497757 7352094 7158251 7126322 7012167 7023669 7071181 7049772 7142732 7293149 7540713
5183 7540713 7699635 7587946 7237429 6787863 6413108 6101169 5801897 5724507 5453691 5095841
5173E095841j55046j99416j81287o5761k64626q9759n4993K7540j56536j01495
5163C854462k1768N8657m1361k7767R752r4820q9865k02776j5131L009o9449M6625
5151C409568j29357j14771j09791k4124j45625j27860N1044K2513j8392k4252
5141B788953J5166m0040r7997N601O9306J3283q4144j30253j2134K1323k418j0876
5129B535770J2373N6486l8460R95P2225p7261j2857J46333l149j3550m0570J5464
5117B653799k3914j1159J4333N6166n0948l35r2595j0007M7537J29456O788P3802
5105B792923M0316p7602j65347P021Q4887M4993m9424Q2893P460q113M4313O4670
5093B868990P8108l8086R0039K4395Q2556j25070P0060K2560l4866J23928q2428
$$ plain form
5173 5095841 4940795 4741379 4560092 4494331 4229705 4139946 4084953 4112493 3955957 3854462
5163 3854462 3832694 3891351 3849990 3822223 3831975 3737155 3647290 3444514 3429383 3432392 3362943 3409568
5151 3409568 3280211 3165440 3055649 3031525 2885900 2758040 2809084 2831597 2813205 2788953
5141 2788953 2804119 2764079 2666082 2671683 2740989 2754272 2670128 2539875 2527741 2549064 2546646 2535770
5129 2535770 2548143 2604629 2566169 2567164 2639389 2562128 2549271 2695604 2692455 2678905 2638335 2653799
5117 2653799 2629885 2618726 2633059 2689225 2638277 2637942 2545347 2535340 2582877 2712333 2719121 2792923
5105 2792923 2833239 2755637 2590290 2597311 2682198 2727191 2677767 2760660 2768120 2760007 2804320 2868990
5093 2868990 2947098 2909012 2999051 3023446 3106002 2980932 3050992 3073552 3038686 3162614 3080186
5082C080186J0085J50813o1309P3591L2728R8205N6701J0447J24277j11277M7847
5071C512294R8244j3550J19957N6509K0456R3965J25360R0941L7691J42049J28304
5060D412220k385N7450N0564j0274j5584Q6054J45887P6095O4686R6494K6344
5049D987551N2489Q9498Q4339M7634L912q5922K18792J73544J76468Q5308L2944
5038E866557n8144K3592P5828J0505J666J02082J06653Q7957O3045R9368J40570
5027F519679J29090O9577J03085P3163K11218K02931K01622N6310J21001J2322
5017G699998l4411J34645J79023J41479J79418K59893M09044J20284J35677L38743
5007I563793M25421K89587N48322N87347M92707N28597O69196N80813J89738J5022
$$ plain form
5082 3080186 3090271 3241084 3179775 3253366 3286094 3384299 3441000 3451447 3575724 3464447 3512294
5071 3512294 3610538 3596988 3716945 3773454 3793910 3887875 4013235 4104176 4141867 4283916 4412220
5060 4412220 4409835 4467285 4517849 4507575 4491991 4578045 4723932 4800027 4864713 4961207 4987551
5049 4987551 5040040 5129538 5213877 5261511 5265423 5179501 5398293 5571837 5748305 5833613 5866557
5038 5866557 5808413 5832005 5907833 5918338 5920004 6022086 6128739 6216696 6279741 6379109 6519679
5027 6519679 6648769 6718346 6821431 6894594 7105812 7308743 7510365 7566675 7687676 7699998
5017 7699998 7665587 7800232 7979255 8120734 8300152 8560045 8969089 9089373 9225050 9563793
5007 9563793 9989214 10278801 10827123 11414470 11907177 12435774 13104970 13685783 13875521 13890543
4997A3890543M7058O9155J34455L28912M41842O69728P37859M01158M31229M63742
4987A7615681O74802P27463P62283N21338P1685J26092L44047L51407P44888O25560
4977B2565246M92926N03858L90700P29398P54358Q78616J087527J512444J490045
4968C0405118J010990O14301R51182J075541J295825J482251J824164K576220
4960D1235592L327978M248479N285591N763505O076612N099653J622357k240892
4952G0418875l839985m142087l242697k218000j433642p00820P5355M56449O04230
4943E5977678J148075J744067L006879M231429N697351P536909R754816J1159893
4935A00257097O854687j700877q096101r904056q929290p199502n332395l568642
$$ plain form
4997 13890543 13937601 14006756 14141211 14470123 14911965 15581693 16319552 16720710 17151939 17615681
4987 17615681 18290483 19017946 19780229 20301567 20373252 20499344 20843391 21194798 21939686 22565246
4977 22565246 23058172 23562030 23952730 24682128 25436486 26315102 27402629 28915073 30405118
4968 30405118 31416108 32030409 32981591 34057132 35352957 36835208 38659372 41235592
4960 41235592 44563570 48812049 54097640 59861145 65937757 71037410 72659767 70418875
4952 70418875 66578890 62436803 59194106 56976106 55542464 54841644 54916999 55373448 55977678
4943 55977678 57125753 58869820 61876699 66108128 71805479 79342388 89097204 100257097
4935 100257097 107111784 105410907 97314806 87410750 78481460 71281958 65949563 62380921
4927F2380921k043097q31428L1497O72919J424395K903557K236943p55209j632323
4918F4388175o43453Q39570J510607N76168j996590m212879m905692m348398l212401
4909D7995107k337562j626060j274569p72624n06682q15946r78729q94644p99451
4900C7988840l34793j02764K46083L06060N33404P60195J044489J357350J689335
4891D3488199J858734K189087K565617K888853L199650L984148N092078O689760
4883G1956126Q714345P891116Q89999m487762n367029l868581j894121J69114
4875G4003207K187795M313227M988235J950181k33941K98561K483038M973198
4867I4963501O725908M086814j482672m269157l158515m10225J267513q07330
$$ plain form
4927 62380921 60337824 59506396 59537893 60210812 61635207 64538764 66775707 66020498 64388175
4918 64388175 63744722 64584292 66094899 66671067 64674477 60461598 55555906 51207508 47995107
4909 47995107 45657545 44031485 42756916 41984292 41477610 40661664 39682935 38788291 37988840
4900 37988840 37654047 37551283 37797366 38103426 38636830 39397025 40441514 41798864 43488199
4891 43488199 45346933 47536020 50101637 52990490 56190140 60174288 65266366 71956126
4883 71956126 80670471 88561587 89451586 84963824 79596795 75728214 73834093 74003207
4875 74003207 76191002 80504229 85492464 87442645 87208704 87507265 89990303 94963501
4867 94963501 101689409 105776223 104293551 100024394 96865879 96455654 97723167 96915837
4859I6915837k828858j889652n18248N39874J737887L507199N855923P877701
4851A11197663N277302j859836n077732m575446k701309j278892p31520K083P00636
4842A00952949Q9516q56055K7367J645576L395606M173013L958200M341885N055202
4833A22783259M743282L449896P79037k589499k743742N3863L579185M708055
4825A34763336K282602k69074l956944p780033q944041p598642n606537l533559
4817I9357108j670759k48011P45619J835693L295546N489236P600135P236966
4809A23641533L918100P85650k771703o305940o970221m992981k347225k278931
4801A02678282m812964o258829n402195l690779k199154k213446l168658l251333
$$ plain form
4859 96915837 94086979 92197327 91679079 92218953 93956840 97464039 103319962 111197663
4851 111197663 116474965 114615129 109537397 104961951 102260642 100981750 100250230 100252313 100952949
4842 100952949 101042465 100186410 100213777 101859353 105254959 109427972 113386172 117728057 122783259
4833 122783259 127526541 130976437 131755474 129165975 126422233 126476096 130055281 134763336
4825 134763336 137045938 136776864 132819920 125039887 116095846 108497204 102890667 99357108
4817 99357108 97686349 97438338 98183957 100019650 103315196 108804432 116404567 123641533
4809 123641533 127559633 128345283 125573580 119267640 112297419 107304438 104957213 102678282
4801 102678282 97865318 91606489 86204294 82513515 80314361 78100915 74932257 71680924
4793G1680924j990196n81994J81887j609849l297003l402157l223765l306249
4785E4451598k922561k102004j593779j969908k692145k775164k384459j529070
4777C6482508j150508j500860k306040k497140k404758k085966j679044j346029
4769B1512163j187340j133873q46105p21066n46880o30349m21529l67924l78518
4760A5278579l67095l25982k44150m68094l95400l58742l20670j98869j88005
4751A2411572p4205j99014j65134L548o7308n7373j77213j69037j65859k77051
4741A1062926r7764p7775Q09K6141K40469M24703L22739J79545K46318N25870
4731A2853981Q37733J088948J438128J131413l08010j533750j808463j580511
$$ plain form
4793 71680924 69690728 69108734 69290621 67680772 64383769 60981612 57757847 54451598
4785 54451598 51529037 49427033 47833254 45863346 43171201 40396037 38011578 36482508
4777 36482508 35332000 33831140 31525100 29027960 26623202 24537236 22858192 21512163
4769 21512163 20324823 19190950 18344845 17623779 17076899 16446550 16025021 15657097 15278579
4760 15278579 14911484 14585502 14341352 13873258 13477858 13119116 12798446 12599577 12411572
4751 12411572 12337367 12138353 11973219 11976767 11909459 11852086 11674873 11505836 11339977 11062926
4741 11062926 10965162 10887387 10888196 10914337 11154806 11579509 11902248 12081793 12328111 12853981
4731 12853981 13691714 14780662 16218790 17350203 17042193 15508443 13699980 12119469
4723A2119469j187214j011940p31714n37267m77031m57404m50459l09911p9041
4714F877488k00333k42369l10201j65802r3896k14488l1290j29694r4859j49293
4704E245263j31238p4575l7986p8945l5756O1282L5016k8503j1525Q1433q3572
4693D940894K3861O3244k3636q8902J09047m4044K64012J93898L55808L81419
4683F175601L29979J15772O389k84894k54604l04959k32841j56960n6244m6146
4673E291093O1143M1669l4675J61715J25467K09086M38447N91660N11296O8963
4663G465864R1216L89973O02750R55772J191892Q20961k96428r12369j074256
4654I235375r40366p54631n66491m71648m07574j53745j33818k88609p1870j50784
$$ plain form
4723 12119469 10932255 9920315 9188601 8651334 8174303 7716899 7266440 6956529 6877488
4714 6877488 6677155 6434786 6124585 5958783 5864887 5650399 5619109 5489415 5394556 5245263
4704 5245263 5114025 5039450 5001464 4922519 4886763 4948045 4983061 4954558 4943033 5024466 4940894
4693 4940894 4964755 5027999 5004363 4915461 5024508 4980464 5244476 5438374 5794182 6175601
4683 6175601 6505580 6621352 6627741 6342847 6088243 5783284 5550443 5393483 5337239 5291093
4673 5291093 5352236 5393905 5359230 5520945 5646412 5855498 6293945 6885605 7396901 7465864
4663 7465864 7557080 7947053 8549803 9505575 10697467 11518428 11222000 10309631 9235375
4654 9235375 8295009 7540378 6973887 6502239 6094665 5940920 5807102 5518493 5446623 5295839
4644E295839N7215K13181K08730J46540K76358M18198N89893O64076J125009J311519
4634A0306558R45569L1611q51570j118172j022097q87924n63224n12806l83614
4625E944331k88089l25409k57455o7626j05370l4077j04203M0921j1414L4487
4615D826096K00128K34202K36669M82181M17675L76663N8381j10510l78147l54262
4605E989076l46709l06567j10325p0313j26150K4059m6641j04837n3766l4619
4595D813208k54135q8247l4005O3193j63853M5952o2957r0325O7510l0044O972
4584D273269J0299m4828J68976J25524M9659J36450J77237N2709N8086L6601Q374
4573E052356j5743m7725j55688j10378j51556q1300j04845j07174J8370j28386
$$ plain form
4644 5295839 5353054 5566235 5774965 5921505 6197863 6616061 7205954 7870030 8995039 10306558
4634 10306558 11252127 11283738 10432168 9313996 8291899 7403975 6840751 6327945 5944331
4625 5944331 5656242 5330833 5073378 5005752 4900382 4866305 4762102 4803023 4791609 4826096
4615 4826096 5026224 5260426 5497095 5979276 6396951 6773614 6831995 6721485 6343338 5989076
4605 5989076 5642367 5335800 5225475 5155162 5029012 5053071 5006430 4901593 4847827 4813208
4595 4813208 4559073 4470826 4436821 4500014 4336161 4382113 4319156 4228831 4296341 4266297 4273269
4584 4273269 4283568 4238740 4407716 4533240 4582899 4719349 4896586 4949295 5007381 5043982 5052356
4573 5052356 5036613 4988888 4833200 4722822 4571266 4489966 4385121 4277947 4296317 4167931
4563D167931r2447q5713j13417O5659j15083Q8885r797J09684J89135J13972l0023
4552D288786L3349J10813L2131j7115k0082r2856j0788l0415j73730L2661J84661
4541D337415n2821L5143P2639M8076R0507R6317Q4456J18211J86511J23108R1152
4530E230714J10882P7009K9583J12863K27026K11676K25144J38335K57203J45255
4520F765690K34995L56466K67919M95783M54977O07151O70208J142565J423482
4511A2419236J952441K868701L754428K56535k433848k431191j890970j239205
4503A3256127q14271p6470N4817o60877n51228n76513j2686K38894P1466l43349
4493A0585910l15221k66498m21769n53248l84831l03399q3404k21184l6163j4707
$$ plain form
4563 4167931 4075484 3989771 3876354 3942013 3826930 3915815 3906018 4015702 4204837 4318809 4288786
4552 4288786 4322135 4432948 4465079 4447964 4427882 4335026 4324238 4293823 4120093 4152754 4337415
4541 4337415 4284594 4319737 4392376 4440452 4530959 4627276 4711732 4829943 5016454 5139562 5230714
4530 5230714 5341596 5418605 5448188 5561051 5788077 5999753 6224897 6363232 6620435 6765690
4520 6765690 7000685 7357151 7625070 8120853 8575830 9182981 9853189 10995754 12419236
4511 12419236 14371677 17240378 20994806 21251341 18817493 16386302 14495332 13256127
4503 13256127 12441856 12365386 12420203 11759326 11208098 10631585 10618899 10857793 10929259 10585910
4493 10585910 10270689 10004191 9582422 9029174 8644343 8340944 8257540 8036356 8000193 7985486
4483G985486J61063L9751J45332L8443J95875K67214L81888J08808J20802R0904
4473I535566J46867Q163L68383K03870M53813L95676O29789N24839Q45369O95551
4463A3807886R87533Q23425J326754R15964J532795J467084J894493J760162K377321
4454B6893417K110664L253236K126652Q59949R04589J580435J610326K243704
4446D1582972K092661K618927K253053L329533L394686M438931M320964N824675
4438F9856402O139641Q427801R973465J5720650J9811962K8438958L8892152O2812192
4430B60073223M5886200k7541141n0340323m8833778l4877081k7118449j9170499
4423I8078152j4644993j0938431q653467o434567n041738l749337l079502j958408
$$ plain form
4483 7985486 8146549 8186300 8331632 8370075 8565950 8833164 9215052 9323860 9444662 9535566
4473 9535566 9682433 9690596 10058979 10262849 10716662 11112338 11742127 12266966 13112335 13807886
4463 13807886 14795419 15618844 16945598 17861562 19394357 20861441 22755934 24516096 26893417
4454 26893417 29004081 32257317 34383969 35243918 36148507 37728942 39339268 41582972
4446 41582972 43675633 46294560 48547613 51877146 55271832 59710763 64031727 69856402
4438 69856402 75996043 84423844 94397309 110117959 129929921 158368879 197261031 260073223
4430 260073223 305959423 278418282 228077959 179244181 144367100 117248651 98078152
4423 98078152 83433159 72494728 63841261 57406694 52364956 48615619 45536117 43577709
4415D3577709j241372p36711j768709k541153k678659k558706k147708j949565
4407B7955126j591624j208769j023167j143133q21614o94742n62651q23912q04765
4398A9280749r94092p34197o75980l97224l52861q2962k53727n76926p76283o08566
4388A3827931m70974n07432m17159l43064l60046k04888k96508j52635k38496
4379A0836729p1045k47604r7729n0833j9722k81710L1244k26048N5870k20404
4369I708748P5172j20481N8438j17581M1124N7010J55611M3579K29369J21043
4359A0252032J44205Q8242j0451J73354L17211J19341L8853q138L02510L25392
4349A1742551M10718M02783P09962N07956M71204M60384R11095J097796J585561
$$ plain form
4415 43577709 42336337 41599626 39830917 37289764 34611105 32052399 29904691 27955126
4407 27955126 26363502 25154733 24131566 22988433 22166819 21472077 20909426 20085514 19280749
4398 19280749 18286657 17552460 16876480 16479256 16126395 16043433 15789706 15212780 14436497 13827931
4388 13827931 13356957 12849525 12432366 12089302 11729256 11524368 11227860 11075225 10836729
4379 10836729 10765684 10518080 10420351 10369518 10349796 10068086 10099330 9873282 9929152 9708748
4369 9708748 9783920 9663439 9721877 9604296 9645420 9702430 9858041 9901620 10130989 10252032
4359 10252032 10396237 10484479 10474028 10647382 10964593 11083934 11122787 11114649 11417159 11742551
4349 11742551 12153269 12556052 13266014 13773970 14245174 14705558 15616653 16714449 18300010
4340A8300010K231267L656337L995256L92207k384144l048187k844313j972288
4332A8326145j494228q76218p28929l47134j12691L34558M83730R31066J275993
4323A7792292K443472J625870q11746j479827j347968r71153n39921k45031q9936
4314A6376052l6438J60770K83194L37422L53071M86342N91483P15733O92426J018084
4304B0978139J051315J181639J325888J480486J779199J907284K163753K293772
4296C4161475K378227K646237K656521K653805K472543K097258J713618J433617
4288E2213301Q64036P50186L85673M81929L99569N43655P48717J148156J539395
4279E9074617K180536K699793L173508L356317L575705L587646L531644L115588
$$ plain form
4340 18300010 20531277 24187614 28182870 28575077 26190933 23142746 20298433 18326145
4332 18326145 16831917 15955699 15226770 14879636 14766945 15101503 15585233 16516299 17792292
4323 17792292 20235764 21861634 21049888 19570061 18222093 17250940 16711019 16465988 16376052
4314 16376052 16339614 16500384 16783578 17121000 17474071 17960413 18551896 19267629 19960055 20978139
4304 20978139 22029454 23211093 24536981 26017467 27796666 29703950 31867703 34161475
4296 34161475 36539702 39185939 41842460 44496265 46968808 49066066 50779684 52213301
4288 52213301 53077337 53827523 54213196 54695125 55094694 55638349 56387066 57535222 59074617
4279 59074617 61255153 63954946 67128454 70484771 74060476 77648122 81179766 84295354
4271H4295354K139051O19175n94713j216464j695719k144357k662823k968796
4263G5770708k564697j975157j389854n75441K05735Q78976J472977K252249K743535
4254G6819031L187417L540596L389231K957462K201780J024243m28308j451253
4246I1240199k422058k959203k868889k548214k091231j740298j048356o38228
4238G4923722m2648N71381J143686J932267K400593K390664K264936J967924J761172
4229H9313697J471730P56082m31344j717289k540133k969312l027634k849388
4221G8006409k807498k506169k169363j731129j540361j276230j075794q07396
4213F4092469q71446q04524j061102j081745j545267j775566k458874k912427
$$ plain form
4271 84295354 86434405 87053580 86458867 85242403 83546684 81402327 78739504 75770708
4263 75770708 73206011 71230854 69841000 69265559 69471294 70350270 71823247 74075496 76819031
4254 76819031 80006448 83547044 86936275 89893737 92095517 93119760 92691452 91240199
4246 91240199 88818141 85858938 82990049 80441835 78350604 76610306 75561950 74923722
4238 74923722 74881074 75452455 76596141 78528408 80929001 83319665 85584601 87552525 89313697
4229 89313697 90785427 91541509 91110165 89392876 86852743 83883431 80855797 78006409
4221 78006409 75198911 72692742 70523379 68792250 67251889 65975659 64899865 64092469
4213 64092469 63221023 62416499 61355397 60273652 58728385 56952819 54493945 51581518
4205E1581518l047096l099663l029861k733179k733967k507322k372497k072686
4197B9985247j909470j642222j477238j155864q80871j052428j287776j053389
4189A9525989j244588j294699j184426r41786r26361p74670p19915o46760n19038
4180A1273746m26138m83317m45254m17220k24711l39974l14209l85656l15081
4171G922186j75981k70146k52469k31936k52435l04507j98538j65220j55328k16184
4161E699442j51194k00590k95837p0275r1827j69381j18743o4340j84807j27688
4151D224760j64358q4074j05241j10971p5995m4337o7524p5045o2080k5773l2748
4140C376614n5016j88278m9322o2230j10431M1833j61626o796k3001n3916o7753
$$ plain form
4205 51581518 48534422 45434759 42404898 39671719 36937752 34430430 32057933 29985247
4197 29985247 28075777 26433555 24956317 23800453 22919582 21867154 20579378 19525989
4189 19525989 18281401 16986702 15802276 14860490 13934129 13159459 12439544 11792784 11273746
4180 11273746 10847608 10364291 9919037 9501817 9277106 8937132 8622923 8237267 7922186
4171 7922186 7746205 7476059 7223590 6991654 6739219 6434712 6236174 6070954 5915626 5699442
4161 5699442 5548248 5347658 5051821 4981546 4889719 4720338 4601595 4537255 4352448 4224760
4151 4224760 4060402 3976328 3871087 3760116 3684121 3639784 3572260 3497215 3435135 3409362 3376614
4140 3376614 3321598 3133320 3083998 3021768 2911337 2953170 2791544 2784748 2761747 2707831 2640078
4129B640078q2858L2317Q94k23714p1825J06381j34329m0868J1098M3275J6602
4118B297051o3336n0509p1681P2812m3818l0334n86l0293l5591k7281K7418j83510
4106A860342M2999J52655r4985l147p4086n8132l0971L9018M3987k9181j16457
4095A732042N679q6909m6315P7395M9967l5541K1643j8098l8822q1033J15709
4084A695717o103l0374m0744l4637m0965J10407l3937j0054j08828R9080m0192
4073A559370N4854p7542Q0023R146J09361P5741m8680j32756L2152N2667K3049
4062A737385q9125K4715q6204k0875J77765l6664Q409k8241q072R9477k4517r9671
4050A654382P9641k809p159k6873L6467J4761p5832M5220k9610N343K3092M4749
$$ plain form
4129 2640078 2557220 2589537 2590431 2366717 2294892 2401273 2266944 2226076 2237174 2280449 2297051
4118 2297051 2233715 2183206 2111525 2184337 2140519 2110185 2109599 2079306 2043715 2016434 2043852 1860342
4106 1860342 1903341 2055996 1961011 1957864 1883778 1825646 1794675 1833693 1877680 1848499 1732042
4095 1732042 1737721 1650812 1604497 1681892 1731859 1696318 1717961 1699863 1661041 1580008 1695717
4084 1695717 1689614 1659240 1618496 1583859 1542894 1653301 1619364 1609310 1500482 1599562 1559370
4073 1559370 1614224 1536682 1616705 1625851 1735212 1810953 1762273 1629517 1661669 1714336 1737385
4062 1737385 1648260 1672975 1586771 1565896 1743661 1706997 1715406 1687165 1679093 1778570 1754053 1654382
4050 1654382 1734023 1731214 1724055 1697182 1733649 1748410 1672578 1717798 1688188 1693531 1716623 1761372
4038A761372Q6990J3864j20777l1231J04085J4349Q2077O4059l4972J3457K2981
4027A976254m2849p6076P2J7491J09470j03508L7402L0955O696J6195J07125J0924
4015B090151k1552J7860Q5597J86012q5188O9678k0175O7351R9666j20234P9928
4004B449094Q6406q9768L7040p039L8511M5660M2411J4886J11580L411j0402J03697
3992B825487l6601o8925J76498p3377j08439p4037J41353J05649K2950Q1403M6
3981B992007O9004R3923J21010n9726J37178J86696q4204K68499R0104K647R9081
3970C916219p8672q615o0100m1204L9654m3392J28202L6099R3223N6917K47411
3959D285742J18750l0600J2228j9676R3922O0040O5024J9580J22720Q5113j07218
$$ plain form
4038 1761372 1848362 1862226 1741449 1710218 1814303 1828652 1910729 1974788 1939816 1953273 1976254
4027 1976254 1933405 1857329 1857401 1874892 1984362 1880854 1918256 1949211 1955907 1972102 2079227 2090151
4015 2090151 2068599 2086459 2172056 2358068 2272880 2342558 2322383 2389734 2489400 2369166 2449094
4004 2449094 2535500 2445732 2482772 2475733 2514244 2559904 2602315 2617201 2728781 2732192 2721790 2825487
3992 2825487 2788886 2719961 2896459 2823082 2714643 2640606 2781959 2887608 2910558 2991961 2992007
3981 2992007 3061011 3154934 3275944 3216218 3353396 3540092 3455888 3724387 3814491 3817138 3916219
3970 3916219 3837547 3828932 3768832 3727628 3767282 3723890 3852092 3888191 3981414 4038331 4285742
3959 4285742 4404492 4373892 4386120 4366444 4460366 4520406 4585430 4605010 4727730 4812843 4705625
3948D705625j16281r1361j30481R850R5600n5160O4932q0999O4783P3325R8765
3937D638598L9993J7676Q2373M2193J01983P1098M8728L0879M715L0342p7591
3926E030987j21578r2554j81215r0337L9748j61872j21406N8025k1876m7816n28
3915D289578k848J0013J2637l0667N027j7184n7642r6637m8940n2358j23496p0113
3903C817370m6029p8172m8613n3147R8377P200j48692L4037q5139L8317o2064
3892C473445l8303o6153l7897l6058n0846n2832L8885N5802n8509L3946n7662
3881C203818K7081J8217q6067l5789N6952K7182n669P1308n9509K7737o686n8028
3869C180547M8982O1285K2685Q905n6587Q8876k9703O2431j09646O548O2782M9661
$$ plain form
3948 4705625 4589344 4497983 4367502 4377352 4472952 4417792 4482724 4401725 4466508 4539833 4638598
3937 4638598 4678591 4696267 4778640 4820833 4922816 4993914 5042642 5073521 5078236 5108578 5030987
3926 5030987 4909409 4816855 4635640 4545303 4585051 4423179 4301773 4359798 4337922 4290106 4289578
3915 4289578 4286730 4296743 4309380 4278713 4283740 4266556 4208914 4112277 4063337 4010979 3887483 3817370
3903 3817370 3771341 3693169 3644556 3591409 3689786 3696986 3548294 3582331 3497192 3535509 3473445
3892 3473445 3435142 3368989 3331092 3295034 3244188 3191356 3230241 3286043 3227534 3261480 3203818
3881 3203818 3230899 3249116 3163049 3127260 3184212 3211394 3205725 3277033 3217524 3245261 3238575 3180547
3869 3180547 3229529 3290814 3313499 3322404 3265817 3354693 3324990 3387421 3277775 3284323 3347105 3396766
3857C396766R962N7579P2037J9516J3649R2666J44955o1939O6343O4745M0014
3846C916293o106N5757J04632N5563J6883J79566k8780J06467N6572J96685M7763
3835D701295O7865J45813m6942K7034K32509j6887L8974M3531L8246L7994L4363
3824E303795N4553J28050n355P8619J18283K0029K803J43790R5280O4090N8339
3813F062276J27280J00886J51161Q1694P5725P2440J47882J19735P6444Q1173
3803G096696Q9338J20616K36253J59744J32234J05964J39868J65464K37544J49493
3793H633214J70656K22614K34135K65648K77496L43146L98939L21413K58001L57107
3783A1482369N08933M94830N42629O33233O30751P95842P77685P02417O94235
$$ plain form
3857 3396766 3406728 3464307 3536344 3555860 3569509 3662175 3807130 3745191 3811534 3876279 3916293
3846 3916293 3910187 3965944 4070576 4126139 4143022 4322588 4293808 4400275 4456847 4653532 4701295
3835 4701295 4769160 4914973 4868031 4895065 5127574 5110687 5149661 5193192 5231438 5269432 5303795
3824 5303795 5358348 5486398 5481043 5559662 5677945 5697974 5700777 5844567 5939847 6003937 6062276
3813 6062276 6189556 6290442 6441603 6523297 6599022 6671462 6819344 6939079 7015523 7096696
3803 7096696 7186034 7306650 7542903 7702647 7834881 7940845 8080713 8246177 8483721 8633214
3793 8633214 8803870 9026484 9260619 9526267 9803763 10146909 10545848 10867261 11125262 11482369
3783 11482369 11991302 12486132 13028761 13661994 14292745 15088587 15866272 16568689 17262924
3774A7262924O03729N70273N39561N33131N11253O31221P86516R12397J143601
3765B3494606J102006J159803J062252R81158Q54877Q43318R30864R43629R44009
3756C2316522R17576J021077J021350J017546R47100R79310Q21568P39149J048226
3747D0829424J284606J630212J871235K254763K002590J418888Q26364M55829
3739E2573911L61322O21636P59225P17693N93267O08626Q44938P99864P29551
3730E8610033O19696M94382M63967N47648R54203J562583K118178K529609K459558
3721G0359857K060900J720567J398481J485992J279237J091544Q28378R07374
3713H1132330O34720L15855K32611O0454O0612K44918L61687P22076Q57352Q01630
$$ plain form
3774 17262924 17866653 18436926 18976487 19509618 20020871 20652092 21438608 22351005 23494606
3765 23494606 24596612 25756415 26818667 27799825 28654702 29498020 30428884 31372513 32316522
3756 32316522 33234098 34255175 35276525 36294071 37241171 38220481 39042049 39781198 40829424
3747 40829424 42114030 43744242 45615477 47870240 49872830 51291718 52118082 52573911
3739 52573911 52935233 53556869 54316094 55033787 55627054 56235680 57080618 57880482 58610033
3730 58610033 59229729 59724111 60188078 60735726 61689929 63252512 65370690 67900299 70359857
3721 70359857 72420757 74141324 75539805 77025797 78305034 79396578 80224956 81132330
3713 81132330 81767050 82082905 82315516 82375970 82436582 82681500 83043187 83765263 84622615 85424245
3703H5424245N57201J94787m47315o45841p25663m01727j241J03647J12644k3102
3693H4147635k50050l92763l93856n59670o49762p76078r94480j271070j146196
3684G7713710j375123k011628k544038k599948k588430j926188j294763p78928
3676F2594664m42680m90758o35948p26403r01903j039705r75098r66229q48717
3667E5567223r97576o39667l35877j97782k74149r96434j706091k045349k026900
3658D6347398j581070j235633q88432p80551p98220p95893r29721q83871q26883
3649C7627124o92905o37997l18770k77043j46486m3152J5531J4619q066L8273
3639C5571128J98867L97572N17601L58622J83697l1532l58953p19126j090784
$$ plain form
3703 85424245 85981446 86176233 85728918 85083077 84357414 83955687 83954446 84058093 84170737 84147635
3693 84147635 83897585 83504822 83110966 82551296 81901534 81125456 80130976 78859906 77713710
3684 77713710 76338587 74326959 71782921 69182973 66594543 64668355 63373592 62594664
3676 62594664 62151984 61661226 61025278 60298875 59396972 58357267 57382169 56415940 55567223
3667 55567223 54569647 53929980 53594103 53396321 53122172 52125738 50419647 48374298 46347398
3658 46347398 44766328 43530695 42642263 41861712 41063492 40267599 39337878 38454007 37627124
3649 37627124 36934219 36296222 35977452 35700409 35553923 35510771 35526302 35540921 35532855 35571128
3639 35571128 35769995 36167567 36685168 37043790 37227487 37195955 36837002 36117876 35027092
3630C5027092j441547j835305j945919k034111j956182j840837j625937j276501
3622B1070753j375452j358348j130253r25312r20438r16251q50003p50411n73257
3613A2271028n68257n88142m72603l28880l24158l84337k23018k79411k98182
3604H804040k88603k69711k08692k44448j77026k13899j43868o5186k90272j35667
3594F766668k03529r2817j09419q4034k8021j65634m2403r4442l5501j28205q0564
3583E702099j21985n2515L5748r8942m4328j47088m6487J31920o2762j69260p66
3572E125634L6221j43872m5951N956k5132l6649j62932m3951K8486r404o6692
3561D661714p1562o4563K6322K59n3998q788r0167J6252o8154m7435j03026J5456
$$ plain form
3630 35027092 33585545 31750240 29804321 27770210 25814028 23973191 22347254 21070753
3622 21070753 19695301 18336953 17206700 16281388 15360950 14444699 13594696 12844285 12271028
3613 12271028 11702771 11114629 10642026 10313146 9988988 9604651 9381633 9102222 8804040
3604 8804040 8515437 8245726 8037034 7792586 7615560 7401661 7257793 7192607 6902335 6766668
3594 6766668 6563139 6470322 6360903 6276869 6248848 6083214 6040811 5946369 5910868 5782663 5702099
3583 5702099 5580114 5527599 5563347 5464405 5420077 5272989 5226502 5358422 5295660 5126400 5125634
3572 5125634 5161855 5017983 4972032 4977988 4952856 4916207 4753275 4709324 4737810 4728406 4661714
3561 4661714 4590152 4525589 4551911 4552170 4498172 4489384 4399217 4415469 4347315 4299880 4196854 4212310
3549D212310k878k1886L1559J25875q6382k3573k9612r8480J11626p0378K5707
3538D173888P5189j30940K0979J7472J2236k3106j19496J1799J0169K6666R4140
3527D168996o1580m353J06207k4953Q1892p695j3794j533L5548J3180j944K806
3515D292777R7349l0169j25611O5654o5912o5172q6627J17283p9795N929r243
3504D116463l7666j8096j16073M8187M8087K3098n9366J0718q0511P7107N2397
3493D064345K978m0432l4801j1877m9314k6900l4535M1130o5721j1882R416J8884
3481C861291L755j89586P451J01999k7522R300N9784k6336n9088R6329m4788j93248
3469C599341P6779k3894o3998J01692o2143M7417o0497l8914m4193m5609J33420
$$ plain form
3549 4212310 4209432 4187546 4219105 4344980 4258598 4235025 4205413 4106933 4218559 4148181 4173888
3538 4173888 4249077 4118137 4139116 4156588 4168824 4145718 4026222 4038021 4048190 4074856 4168996
3527 4168996 4107416 4103063 4209270 4184317 4266209 4258514 4244720 4243187 4278735 4291915 4289971 4292777
3515 4292777 4390126 4359957 4234346 4300000 4234088 4168916 4082289 4199572 4119777 4125706 4116463
3504 4116463 4078797 4060701 3944628 3992815 4040902 4064000 4004634 4015352 3934841 4011948 4064345
3493 4064345 4067323 4026891 3992090 3980213 3930899 3903999 3869464 3910594 3844873 3832991 3842407 3861291
3481 3861291 3865046 3675460 3682911 3784910 3757388 3766688 3826472 3800136 3741048 3837377 3792589 3599341
3469 3599341 3676120 3652226 3588228 3689920 3627777 3675194 3614697 3575783 3531590 3485981 3619401
3458C619401p8313l0396Q9279l6910q4996p1222o0522J55103j24225J0708n6094
3447C331813J3891Q986j1671l4516p7633L5783j47952J3557Q6699p7005j6918
3436C125034q9027J1237k1255K8582N3093j44235o454J06619j01385o432o9445
3425B886332M6792K0404r4275J0355j1067Q1204L7333K700K8339L3314O1389r0070
3413C012750O0420n4264j34832M86J7229R8130K3791N0715o3740J8043L3983J15049
3401C177760p3669M3753O4798Q1343J32350o6037o5355k289K3354j04014m7844
3390C164150R1936J19830N1924K6416j0365N3830R1282J9260J0702K967P9976
3379C701908r101l0379J14957K14351K0054q127q6805L7591M74M4892n2647o8568
$$ plain form
3458 3619401 3541088 3510692 3599971 3563061 3478065 3406843 3346321 3501424 3377199 3387907 3331813
3447 3331813 3345704 3354690 3343019 3308503 3230870 3266653 3118701 3132258 3218957 3141952 3125034
3436 3125034 3036007 3047244 3025989 3054571 3107664 2963429 2956975 3063594 2962209 2955777 2886332
3425 2886332 2933124 2953528 2859253 2869608 2858541 2939745 2977078 2979778 3008117 3041431 3102820 3012750
3413 3012750 3073170 3018906 2884074 2884560 2901789 2999919 3023710 3074425 3010685 3028728 3062711 3177760
3401 3177760 3104091 3147844 3212642 3293985 3426335 3360298 3294943 3292654 3316008 3211994 3164150
3390 3164150 3256086 3375916 3427840 3454256 3443891 3497721 3589003 3608263 3618965 3621932 3701908
3379 3701908 3692807 3662428 3777385 3991736 4011790 4003663 3916858 3954449 3954923 3999815 3947168 3878600
3367C878600M2393J6330j12263J17750J17759N7189N4938P6250O6490j9581r701
3356D286154P6107N9458p5772J40291J26121J58441J60850Q7022N991K4241r337
3345E039567Q2079P0676N3517O0779Q3257L584J03407k2488M8465K71425R2430
3334E886698J08222K2657J38792J02220K13987J18580J56031R3561K94600J53078
3324G288426J49623K47762J74890J46755J28253K50915K01159J52534K07914L15409
3314I263640K14181K04142M80619K58704L33752L14011K86612L05213L76462N31816
3304A2569152N31189M26954L46097N16813M26105O81429N79276M88178M94515
3295A7059708O47636P62221P96523Q71082J040102J183384J273957J357439J290569
$$ plain form
3367 3878600 3920993 3937323 3825060 3942810 4060569 4117758 4172696 4248946 4315436 4295855 4286154
3356 4286154 4362261 4421719 4345947 4486238 4612359 4770800 4931650 5018672 5024663 5048904 5039567
3345 5039567 5121646 5192322 5245839 5306618 5389875 5393459 5496866 5474378 5522843 5794268 5886698
3334 5886698 5994920 6017577 6156369 6258589 6472576 6591156 6747187 6840748 7135348 7288426
3324 7288426 7438049 7685811 7860701 8007456 8135709 8386624 8587783 8740317 8948231 9263640
3314 9263640 9477821 9681963 10162582 10421286 10755038 11069049 11355661 11660874 12037336 12569152
3304 12569152 13100341 13527295 13873392 14390205 14816310 15497739 16077015 16565193 17059708
3295 17059708 17707344 18469565 19266088 20137170 21177272 22360656 23634613 24992052 26282621
3286B6282621J450963J610367J698599J655122J508485J146784O20895j3249q30045
3277C5130542j292636j653391j552678j216674j099824r61297n77968k38434K53728
3268B6791368O69240K15843p11880j378452j424144j238630j332249j077173r85797
3259A9528126p50715o05813l68284m21695l40922j40809k5457J6656J08247K62433
3249A7261767K56897N74188Q53568J172588J890497K679825J962015m19331j881284
3240B4350730k237938k408543k241321j554956j120521j004893p92989o73288
3232A2316281m50483m50608k57455k29527p9258o0356l064N1311J61516L22484
3222A1320841M42277Q01874J063401J007846r5290q09957j249969j186525j030986
$$ plain form
3286 26282621 27733584 29343951 31042550 32697672 34206157 35352941 35973836 35960587 35130542
3277 35130542 33837906 32184515 30631837 29415163 28315339 27354042 26776074 26537640 26791368
3268 26791368 27460608 27676451 26964571 25586119 24161975 22923345 21591096 20513923 19528126
3259 19528126 18777411 18171598 17803314 17381619 17040697 16899888 16874431 16891087 16999334 17261767
3249 17261767 17518664 18092852 18946420 20119008 22009505 24689330 26651345 26232014 24350730
3240 24350730 22112792 19704249 17462928 15907972 14787451 13782558 12989569 12316281
3232 12316281 11865798 11415190 11157735 10928208 10848950 10788594 10785530 10836841 10998357 11320841
3222 11320841 11763118 12564992 13628393 14636239 14540949 13730992 12481023 11294498 10263512
3213A0263512q47235o00851n21160m81509l59989k66658k43117j72623j34505
3204F635865j35649j99030j81697o8609o7471j66877j65152l3786r1360j16118
3194E410116m5890p7570j13368r8995j02635o9374o1313j11308j171j59710j71849
3183D396933M5012k0722n0225o2389o3637n3461l2996P9564j52519r0577R638
3172D004621k7466j28924j3735K2792J5826p049p5673o3877n1703p9561j443j4972
3160C578836N7938p2069r9051P769q7039P67l6867P9234k6152j08164q2812l3656
3148C178734n0161k6316K4721l478n5010o0023o7051j04951N7647j8561j373l1482
3136B842696K1491n120j9370l1991m9195j12302J651M2738n3700l5463o8289N7028
$$ plain form
3213 10263512 9416277 8815426 8294266 7812757 7452768 7186110 6942993 6770370 6635865
3204 6635865 6500216 6301186 6119489 6050880 5983409 5816532 5651380 5617594 5526234 5410116
3194 5410116 5364226 5286656 5173288 5074293 4971658 4902284 4840971 4729663 4728492 4568782 4396933
3183 4396933 4441945 4421223 4370998 4308609 4244972 4191511 4158515 4238079 4085560 3994983 4004621
3172 4004621 3977155 3848231 3834496 3857288 3873114 3866065 3790392 3726515 3674812 3595251 3593808 3578836
3160 3578836 3636774 3564705 3465654 3473423 3386384 3387151 3350284 3429518 3403366 3295202 3212390 3178734
3148 3178734 3128573 3102257 3126978 3123500 3068490 3008467 2941416 2836465 2894112 2875551 2874178 2842696
3136 2842696 2864187 2859067 2839697 2807706 2758511 2646209 2647860 2690598 2636898 2601435 2533146 2590174
3124B590174O6477k0264j13087j1039L6274m1392K4136p6383J2702l8939N6367
3113B485026L6631J9223j18499M8562K9016K3770N2185q989J57986n6201J2988
3102B681698K0295N0409K1815O6701J78915K9581Q7983K4088J15814M702J08453
3091C390454K15062J14106Q0266J24088J56081J0619O2821j10908K4089K871J52702
3080D222251J90335R0978J6234J4205J00482p402m6175l879J03649L155J54027
3069D837860j1478N8938J64011J75280L08663L52592K92683J24222M973P2061
3059F379805M0081O1363J13839J15560L48207L09878J19279M6217N7945J63549
3049G755723J64735K29944J23173J22299J00736Q2711J43190p6608K58959J93864
$$ plain form
3124 2590174 2656651 2636387 2523300 2512261 2548535 2507143 2531279 2454896 2467598 2428659 2485026
3113 2485026 2521657 2540880 2422381 2470943 2499959 2523729 2575914 2566925 2724911 2668710 2681698
3102 2681698 2701993 2752402 2774217 2840918 3019833 3049414 3137397 3161485 3277299 3282001 3390454
3091 3390454 3605516 3719622 3799888 3923976 4080057 4090676 4153497 4042589 4066678 4069549 4222251
3080 4222251 4412586 4503564 4519798 4534003 4634485 4627083 4580908 4577029 4680678 4683833 4837860
3069 4837860 4826382 4885320 5049331 5224611 5533274 5885866 6178549 6302771 6307744 6379805
3059 6379805 6419886 6481249 6595088 6710648 7058855 7368733 7488012 7534229 7592174 7755723
3049 7755723 7920458 8150402 8273575 8395874 8496610 8579321 8722511 8645903 8904862 9098726
3039I098726K17146K27425J53971J17953J49649L03902J96025K61213M53839M50625
3029A1630474M85279N85756O15745N26589M00305N1109k37637m29486n42600m39265
3019A2646269m63783l82220k12998l7898m7625j4298J70941J95605J95201J22496
3009A2171690K50716K32352J16230K33415Q1854P3081m9930l18535l37950m02162
2999A2050761o28962m76051m27418m58176l34494k30139j85281r4135r0578j50430
2989H975097j20726k3570j18933j85626j39796k84861k70081l96946m59141l94668
2979F580749l28985l23108k17675k70990k75153k25260j88220k18135q8084j99857
2969D245282m37r4486k36448q3809o0077j32492k16409j39809j2738j53751p3786
$$ plain form
3039 9098726 9315872 9543297 9697268 9815221 9964870 10268772 10464797 10726010 11179849 11630474
3029 11630474 12115753 12701509 13317254 13843843 14244148 14295257 14057620 13628134 13085534 12646269
3019 12646269 12182486 11800266 11587268 11549370 11501745 11487447 11658388 11853993 12049194 12171690
3009 12171690 12422406 12654758 12770988 13004403 13086257 13159338 13109408 12790873 12452923 12050761
2999 12050761 11421799 10945748 10518330 10060154 9725660 9495521 9310240 9216105 9125527 8975097
2989 8975097 8854371 8830801 8711868 8526242 8386446 8101585 7831504 7434558 6975417 6580749
2979 6580749 6251764 5928656 5710981 5439991 5164838 4939578 4751358 4533223 4445139 4245282
2969 4245282 4244845 4150359 3913911 3830102 3770025 3637533 3421124 3281315 3268577 3114826 3041040
2958C041040k2533j01181k50939o7811O8181r7049j44605j01404l8599K3920j72069
2947B136951l7163j49476Q929M2063m6365l7272p7687J9585p1985p1455n6104
2936A660021o2034k0760N0576L0864p0685q2561l5234j06503l5830p1554L032
2925A259332o0690k3010O6835m8669j20976K4475J5695k141l1487p361j04505
2914I67498O089R2686j02563k32131R7811K6142r548k5954m0687j01980N7065
2903G34428n7893l4943m1710J06767Q6200q4160j6978o2859n4033l742P146P229
2891E85452K8133m7455M3454J0181j13034q521m3711L8910L0121p252l7729n8820
2879D19729N2860k1825k0478P7400r4499m7254M2013j0098J05187j5045j2021
$$ plain form
2958 3041040 3018507 2917326 2666387 2598576 2666757 2569708 2425103 2323699 2285100 2309020 2136951
2947 2136951 2099788 1950312 1959241 2001304 1954939 1917667 1839980 1859565 1787580 1716125 1660021
2936 1660021 1597987 1577227 1627803 1658667 1587982 1505421 1470187 1363684 1327854 1256300 1259332
2925 1259332 1198642 1175632 1242467 1193798 1072822 1097297 1112992 1110851 1079364 1072003 967498
2914 967498 973587 1066273 963710 731579 829390 855532 845984 820030 779343 677363 734428
2903 734428 676535 641592 599882 706649 792849 708689 691711 628852 574819 571077 578223 585452
2891 585452 613585 566130 609584 619765 506731 498210 454499 493409 523530 516278 478549 419729
2879 419729 472589 450764 430286 507686 413187 365933 407946 397848 503035 487990 475969
2868D75969p6586l9801j91Q520l2300n8351j3344R2798j5219l8172k522M4690
2856C45491j69047J65413L9201r6249K6513j9742O6265k9464J2815O0383q3961
2845C17618j0625J18593k2373p2986m1902n5536M4943M2923r0439J6411q5119
2834A61508j7789M0333Q3056l0140p634q1793N1889R6507m4997n1983O1345K8748
2822B89050o4558o0270P4879k0490R7925L9012r344n1632j10687k8165P3679M3164
2810B72563m4892k1262P901J2907m2835n915M3351k4434R108L4968j24896O5719
2798A82283M5233j9210O3847P1778r8155K0802j26997L0499N0694j12191P5743
2787A84326n7485M3179m4233J3210K8657l2446j5334l7004L8136N3803N6952k4820
$$ plain form
2868 475969 399383 359582 359391 367911 335611 277260 263916 356714 341495 303323 300801 345491
2856 345491 176444 341857 381058 284809 311322 291580 357845 328381 341196 401579 317618
2845 317618 306993 425586 403213 330227 288325 232789 277732 320655 230216 246627 161508
2834 161508 143719 184052 267108 236968 229334 147541 199430 295937 250940 198957 260302 289050
2822 289050 224492 164222 239101 218611 316536 355548 346204 294572 183885 155720 229399 272563
2810 272563 227671 206409 214310 227217 184382 178467 221818 197384 206492 241460 116564 182283
2798 182283 227516 208306 272153 343931 245776 266578 139581 170080 220774 108583 184326
2787 184326 126841 170020 125787 138997 167654 135208 119874 82870 121006 174809 231761 206941
2775B06941r104L2574k8290o005n8078o5656R0654M92m543j2908l7301o3167K925
2762D8534q169L4754J7989l6448K2176M4545O7125j41940J4589N7996o0150O5350
2750A26351k4833p8294k9197N7330m4176J5639j648J2662P1057N7361p0767j0433
2738H1052l4865m2279K0472K3296m4351o3315J2880J07632L9451K9405m5066p0005
2726A4307O8557l8926l7029O1014N4303r0934j7270P98m4903j7039P7285J1703
2714D1866l5468j5885J3691M4314P312k7589j9281k6296R215M9170J9468K6872
2702H7389q3364k324p587r5663J1332J15776l4074L202j761L745J8438q364J1657
2689A8402R241l1440l7144j0613O1881L0624l9029O041L3324m0163l5472j5318
$$ plain form
2775 206941 197837 230411 202121 196116 138038 72382 163036 163528 158985 146077 108776 45609 48534
2762 48534 40365 75119 93108 56660 78836 123381 190506 48566 63155 121151 61001 126351
2750 126351 101518 23224 -5973 51357 7181 22820 21172 33834 104891 162252 91485 81052
2738 81052 46187 3908 24380 47676 3325 -59990 -47110 60522 99973 129378 84312 14307
2726 14307 82864 43938 6909 67923 122226 31292 14022 14820 -30083 -47122 30163 41866
2714 41866 6398 -9487 4204 48518 55830 28241 8960 -17336 -8121 41049 60517 87389
2702 87389 4025 1701 -5886 -101549 -90217 25559 -8515 -5313 -7074 -3329 15109 6745 18402
2689 18402 27643 -3797 -40941 -51554 10327 40951 1922 7963 41287 1124 -34348 -49666
2677d9666m1872R0036p8711r5196p668P4668K1828M1864p1897O4121P6108m6602
2665b2987J1434r12M5178l2410K6889q1880k1023J4887j9517P8551m4583K5850
2653b0523o4553K4600L6154k6934q7580Q3238J22237j18177J00662j12791k8601
2642i2268O9496K883p3502J00632m6970Q636r291J1401O4721k6020j05382j9359
2630a15023J14015K1667p5447N5980J36103m9635M4629l1138j32269L4293P850
2619A1025K3373K3350j0289M4470q7580l0085k2584K1097q0602J6047N1252M2236
2607A710k7545K7859o8306k2798O3296k0372N1516m1227J7513P8899K4834j34517
2595d9138l4933R269K6833j3312J758J69021o2604j02580p3737J50591K4817k7116
$$ plain form
2677 -49666 -91538 -1502 -80213 -175409 -183077 -108409 -86581 -44717 -116614 -52493 23615 -22987
2665 -22987 -11553 -12465 32713 303 27192 -54688 -75711 -60824 -80341 -1790 -46373 -20523
2653 -20523 -85076 -60476 -24322 -51256 -138836 -55598 66639 -51538 49124 -63667 -92268
2642 -92268 -22772 -19889 -93391 7241 -39729 -31093 -40384 -28983 35738 9718 -95664 -115023
2630 -115023 -1008 20659 -54788 1192 137295 87660 132289 101151 -31118 3175 11025
2619 11025 34398 57748 47459 91929 4349 -25736 -48320 -27223 -107825 -91778 -40526 1710
2607 1710 -25835 2024 -66282 -89080 -25784 -46156 5360 -35867 -18354 60545 85379 -49138
2595 -49138 -84071 -74802 -47969 -61281 -59523 109498 46894 -55686 -129423 21168 45985 18869
2583A8869o9498l85l7199j0256O1436N384n4168J01662O870L0153k6134n4503
2571b7769k1044N757K3638j8333o2531m967Q1209o4460K0093Q5542j8593L0482
2559B9024P581m0418j09215J3777Q2232k1961Q499k2700N9753K3955q4224N3686
2547a1n5800j0358J02477J7712k2358k2564j28636j7797Q4876P2947L8l2144J1311
2534c07j16873Q3404N2802J4071q2158O444R5839J07590j18308l1926J0809q8577
2522f7190M3326R2648j966N5018j09832j1918R64q4607N6413O6110q816j8151
2510A1999k8967P7213o2009m6379J48448K0406n2888O2966l534r3582L5318R4540
2498A63531K409j3070n0386k7135O2037m2666K5784J4048j226Q1944n0855j9773
$$ plain form
2583 18869 -50629 -51014 -88213 -98469 -37033 -31649 -85817 15845 22715 52868 26734 -27769
2571 -27769 -48813 -43056 -19418 -37751 -100282 -105249 -24040 -88500 -68407 17135 -1458 29024
2559 29024 36605 -3813 -113028 -99251 -17019 -38980 -30481 -53181 6572 30527 -53697 -11
2547 -11 -55811 -66169 36308 54020 31662 9098 -119538 -137335 -52459 20488 20526 -11618 -307
2534 -307 -117180 -33776 19026 33097 -49061 -42617 53222 160812 42504 10578 21387 -67190
2522 -67190 -23864 68784 66818 121836 12004 86 1050 -83557 -27144 38966 30150 11999
2510 11999 -16968 60245 -1764 -48143 100305 120711 67823 130789 127255 33673 68991 163531
2498 163531 165940 152870 102484 75349 137386 94720 120504 134552 133326 215270 164415 144642
2486A44642N593J3793r6405K8696J6994L4726N8980n7823P7989l5806q980M3689
2474B26088n8672M4219L3113N9712R5545q0603k8483J29122L1093N0340P1298
2463E72772j3572j282J42523M6224R2614R7010Q3554J26108P7155J60530J15135
2452A498771R9529K69377K81027J35372L3612R7726J20474J04957K15470J22268
2442B978583J62107K44959L57688L94261M00991M40559L81114J99790N36461O23367
2432F719880O95300J082378J563280K105912L126394M237063O010184J175983
2424B6716374m805808m795436l809395k619935j914296j473929j131158o58276
2416E508141o33332l53565l20140m62055m83160m02211l19271j81605k14957j76002
$$ plain form
2486 144642 150235 164028 67623 96319 113313 148039 207019 149196 227185 191379 182399 226088
2474 226088 167416 211635 244748 304460 400005 319402 290919 420041 451134 501474 572772
2463 572772 559200 557918 700441 746665 839279 936289 1019843 1145951 1223106 1383636 1498771
2452 1498771 1598300 1867677 2148704 2284076 2317688 2415414 2535888 2640845 2856315 2978583
2442 2978583 3140690 3385649 3743337 4137598 4538589 4979148 5360262 5560052 6096513 6719880
2432 6719880 7415180 8497558 10060838 12166750 15293144 19530207 25540391 26716374
2424 26716374 21910566 17115130 13305735 10685800 8771504 7297575 6166417 5508141
2416 5508141 4874809 4521244 4201104 3739049 3255889 2853678 2534407 2352802 2137845 1961843
2406A961843j55258j37588p6427p8003j26884p8461j05675r9592j24630m8792
2396I30533l28p3693l7813r2258q37K2893n6284P61L9959n5924r6795n1850P712
2383E36076o8024K5440j8141p5105k6619o3977J10917l8891l1714J123L2403j42115
2371B41373q5300R6511L0034k7324n4755L6133Q189K3015N0466j83995k2012O9094
2359A81429j1432k5509n2634p099O1453O5402q8169q7582P2768L7524n1567l840
2347I0744l6936J8923j04411M267L0107m0471L5661j0865J8108P1992j02006j0034
2335c4921Q6199q0841R133J3558L4879r7203J2323J0333Q1525q7878J3685J97968
2323A58760j12618l1530N2628P7777j24868K2312K0396p3239O341l1424N3426
$$ plain form
2406 1961843 1806585 1668997 1592570 1514567 1387683 1309222 1203547 1103955 979325 930533
2396 930533 930205 856512 818699 726441 725604 748497 692213 692974 732933 677009 580214 528364 536076
2383 536076 468052 493492 475351 400246 373627 309650 420567 381676 349962 351085 383488 241373
2371 241373 156073 252584 282618 255294 200539 236672 244861 267876 318342 134347 112335 181429
2359 181429 169997 144488 91854 84755 146208 211610 123441 35859 108627 146151 94584 90744
2347 90744 53808 72731 -31680 -27413 2694 -37777 -2116 -12981 5127 77119 -24887 -34921
2335 -34921 51278 -29563 -20430 -6872 28007 -69196 -56873 -46540 34985 -52893 -39208 158760
2323 158760 46142 14612 67240 145017 20149 42461 62857 -10382 -4041 -35465 17961
2312A7961J10655j31144P7412j11333O4395m0687k4341Q4367m1472N4853k7990
2301C2676p7874O614N0944l5347l9137J31535r5881J0965O3654p5685K6061N9116
2289E7641r5910N0287k1564L353P2235r5909R677J8926p321L2655P1382j62860
2277f7408m4315N9982N8514n5801k1732L5195Q8276K0884l7411k1311l343j06211
2265i4681j62840L5333J30834o2419N1353J8295Q0272m1893p5671L8844p101M0141
2253d9533l0564J4776R2952l0914n2608P5671j56283j5432J26825o3820M8655
2242d0275Q032r867j0806P4765r7489q742Q5547q8459m065R396l3070l9200J26353
2229b7880L7498m6380P4951L2607P0307o252m8932K5530j26763p1565N3835l3171
$$ plain form
2312 17961 128616 -2528 74884 -36449 27946 -12741 -37082 47285 5813 60666 32676
2301 32676 -45198 -38584 12360 -22987 -62124 69411 -26470 -15505 48149 -27536 -1475 57641
2289 57641 -38269 12018 -9546 -6193 66042 -29867 -20190 -1264 -8585 24070 95452 -67408
2277 -67408 -111723 -51741 6773 -49028 -70760 -35565 52711 73595 36184 14873 11530 -94681
2265 -94681 -257521 -222188 -91354 -153773 -102420 -84125 -3853 -45746 -121417 -82573 -89674 -49533
2253 -49533 -80097 -65321 27631 -3283 -55891 19780 -136503 -151935 -25110 -88930 -40275
2242 -40275 -32243 -42110 -52916 21849 -75640 -84382 1165 -87294 -91359 -81963 -115033 -154233 -27880
2229 -27880 9618 -36762 38189 70796 141103 134851 85919 111449 -15314 -86879 -33044 -66215
2217f6215L6414L1621K2705J3044j26383m3837J00223k3362j2933L0219m5927
2206h4431j13854K7880J25434M4089j07672J5797K7335m5659J5641K5382L6694
2195c3364J7030K2285n1457N526o6788O0411J7553L8334p5609K515J1271L0319
2183b1974R9972p1150j02022J9154O0769l5776k0662O3265k5223O271k2702m7791
2171i7869M3597k8444n7727l3443J01963K6166j3890j1146N5472p9002n9862R5503
2159e8682M3524J0017m3891L5882k2796j700J4498j27600J87892l1872Q7552m6617
2147D6207r3343l9789q1263Q8737J5221j9698J4932L2833l1673K6578m0016M9361
2135c1913Q4789o1815p8793J06481O3977o9325O594o6706j09886m112O8754J74118
$$ plain form
2217 -66215 -29801 1820 24525 37569 -88814 -132651 -32428 -55790 -68723 -38504 -84431
2206 -84431 -198285 -170405 -44971 -882 -108554 -92757 -65422 -111081 -95440 -70058 -33364
2195 -33364 -16334 5951 -45506 -39980 -106768 -46357 -28804 9530 -66079 -63564 -52293 -21974
2183 -21974 77998 6848 -95174 -76020 -15251 -51027 -71689 -8424 -33647 -27376 -50078 -97869
2171 -97869 -54272 -82716 -140443 -173886 -71923 -45757 -59647 -70793 -15321 -94323 -154185 -58682
2159 -58682 -15158 -5141 -49032 -13150 -35946 -37646 -23148 -150748 37144 5272 92824 46207
2147 46207 -47136 -86925 -168188 -79451 -64230 -83928 -68996 -36163 -67836 -41258 -81274 -31913
2135 -31913 52876 -8939 -87732 18749 82726 13401 19995 -46711 -156597 -160709 -91955 82163
2123H2163j02700n6978k1171J26050q9413k0297k3626K3198Q6456l7633N7795
2112B3844l236M325n9189K7383l9190k8773O0960j3634P6679l5286p1764M7633
2100a0248k358K8639N1260o8128o6441J8385K2561j8534j9373M1769j6181K7649
2088a1000L8921m7006k5460n614l1711P7540r0539N3262K6130o2317N5243k3439
2076d5990m7232J25971l0934N6525r1018k1738o905J4349n0171l354Q6029j1394
2064b5862m8667k1822J4816p3611P1766M7938o23r6894o00O4858p2201L0834J1893
2051i8175K9652R985j445m0601P8535P4099n8036j0278L3683r760p6629Q69m8533
2038a16634K3954l2727p1302J9032J13044j8131N5680L5541q7303J2599k4998
$$ plain form
2123 82163 -20537 -77515 -98686 27364 -62049 -82346 -105972 -82774 3682 -33951 23844
2112 23844 20608 24933 -34256 -6873 -46063 -74836 -13876 -27510 49169 13883 -57881 -10248
2100 -10248 -12606 16033 67293 -835 -67276 -48891 -26330 -44864 -64237 -22468 -38649 -11000
2088 -11000 27921 -19085 -44545 -50159 -81870 -4330 -94869 -41607 -15477 -77794 -22551 -45990
2076 -45990 -93222 32749 1815 58340 -32678 -54416 -61321 -46972 -97143 -100497 -14468 -25862
2064 -25862 -74529 -96351 -81535 -155146 -83380 -35442 -36065 -132959 -133559 -68701 -140902 -110068 -98175
2051 -98175 -68523 -58538 -59983 -100584 -22049 52050 -5986 -16264 17419 7659 -68970 -68101 -116634
2038 -116634 -92680 -125407 -196709 -177677 -64633 -82764 -27084 8457 -78846 -66247 -91245
2027i1245j6702k0255K3147J25566k8459o9557p6210P7088l1023n9147K2290Q2766
2015f1741L2949O4033m6598j31334l496N7193j55L7978M3319o2969j0j2767N4760
2002b8838m3045M4802J4737q991M8618j32242j0022J5904J36074q4405M9310k765
1990h63j4096J6647j0878M01M3551j45826L1857M6531K5167n0241j5229K6311
1978d6668M1670n948J2256p9397o9014J23100R3271q4944q8222L1029Q2622l7042
1966b7287Q6300j5724r7117j2375n1675R8814l6900K6124J6260j1670j0843l0861
1954f6954L51J2295j8838R2347r8530K9626j9270j4563n8539N199Q0573J501n8086
1941a12888K3702l5954L4531J10959k7354m0569j7425l211J4791j2553N2932n3993
$$ plain form
2027 -91245 -107947 -128202 -105055 20511 -7948 -77505 -153715 -76627 -107650 -166797 -144507 -61741
2015 -61741 -28792 35241 -11357 -142691 -146187 -88994 -89149 -51171 -7852 -70821 -70831 -83598 -28838
2002 -28838 -71883 -27081 -12344 -21335 27283 -104959 -114981 -99077 36997 -47408 1902 -863
1990 -863 -14959 1688 -9190 -8789 34762 -111064 -79207 -32676 -7509 -57750 -72979 -46668
1978 -46668 -4998 -10946 1310 -78087 -147101 -24001 69270 -15674 -103896 -72867 9755 -27287
1966 -27287 59013 43289 -53828 -66203 -117878 -19064 -55964 -29840 -13580 -25250 -36093 -66954
1954 -66954 -66603 -54308 -73146 19201 -79329 -49703 -68973 -83536 -142075 -136876 -56303 -54802 -112888
1941 -112888 -89186 -125140 -90609 20350 -7004 -47573 -64998 -68209 -53418 -65971 -13039 -67032
1929f7032Q4964N901k2805m6464J06283O812n1819J2472l8642j28311O9352J4050
1917e5239N1497j48530k5760M3190P215L0215K4235N8963M5000j03349n6922L0472
1905i9013K3792j387n1732Q4950K8761O5898o2637J02701j52514j54617L507M8610
1893a63681N9515O7008l4545L2302j5448o3056Q6056j0066M6770k7309j9701o026
1881d8181o130m657j2483k0690K4021M4696M2243N8878Q299q200j08748k7093
1869e8045m9286M77R6852J18245m2728o6298J5551l3759L8171k4866j25718L1265
1857a00139J30131l7121l0945j2565M9814L7653r419n1157k0315K8463K7498J5042
1845B6940j49925L6787R3847j26905O5051J0623J3724N3324j1468m5318l6310
$$ plain form
1929 -67032 17932 23833 1028 -45436 60847 67659 15840 28312 -10330 -138641 -69289 -55239
1917 -55239 -3742 -152272 -178032 -134842 -127627 -97412 -73177 -14214 30786 -72563 -129485 -99013
1905 -99013 -75221 -76608 -128340 -43390 -14629 51269 -11368 91333 -61181 -215798 -212291 -163681
1893 -163681 -104166 -37158 -71703 -39401 -54849 -117905 -31849 -41915 4855 -22454 -42155 -48181
1881 -48181 -54311 -58968 -71451 -92141 -68120 -23424 18819 77697 85996 77796 -30952 -58045
1869 -58045 -107331 -106854 -10002 108243 65515 -783 14768 -18991 19180 -5686 -131404 -100139
1857 -100139 29992 -7129 -38074 -50639 -825 36828 27409 -23748 -44063 -15600 11898 26940
1845 26940 -122985 -86198 7649 -119256 -54205 -43582 -29858 23466 11998 -33320 -69630
1834f9630j5826k1022K5641R2619K4399k162m655m7527k8645o6516M2641L7598
1822c3085R059L1416O4832j06705K4338k5491K2554J9039n4382L3447l0964j6001
1810f1943o6054O161l2916R6702L2422j3863M3662r5194j6824O5492O5196o7582
1798d4741j2878M454j28119N066L9832M8190J10954M9310m6011L2527n3599p5046
1786g0061J01134p1887Q6202j02092L3543O178O1438n3384j7729J4023K5204j2174
1774C95J1014o9096m9911J29447k1419j4137K0271j1143j9890J3141p764k0060
1762c9152j6363L947p196o24O1385o5627l7534k6833P7872M3579j0383M2070R119
1749C4260o2130p9866k9166N1300Q373j4184j4043m5035Q2128O2652K1296j9900
$$ plain form
1834 -69630 -85456 -106478 -80837 11782 36181 34019 29364 -18163 -46808 -113324 -70683 -33085
1822 -33085 -24026 7390 72222 -34483 -10145 -35636 -13082 5957 -48425 -14978 -45942 -61943
1810 -61943 -127997 -121836 -154752 -58050 -25628 -39491 4171 -91023 -107847 -42355 22841 -44741
1798 -44741 -57619 -53165 -181284 -176218 -136386 -88196 22758 72068 26057 58584 4985 -70061
1786 -70061 31073 -40814 45388 -56704 -23161 -16983 44455 -8929 -26658 -12635 12569 395
1774 395 11409 -57687 -107598 21849 430 -13707 6564 -4579 -24469 -11328 -19092 -39152
1762 -39152 -55515 -51568 -58764 -59388 1997 -63630 -101164 -127997 -50125 -6546 -16929 25141 34260
1749 34260 -27870 -107736 -136902 -85602 -77229 -91413 -105456 -150491 -68363 -5711 15585 -4315
1737d315q2611k6781O5271j1529J10665L7579m6586j40623L3044l6792N6378J7924
1725b8376l2830l8679J02836L0205q8872k0817K2511Q3184L717j3345o2594l4538
1713g7598N1306j7589L4827n7469j7883O9276l8296j9776j2518j04p077K899j5824
1700a05826J02222m1728k3759N2129j0234p3884k8316Q4556M8074n0118M856N1322
1688I294o4295j0000K6729l6124M9326O5148r1709p8230J432K1989L6096p460
1676g7804M2750K609k1860P0809k508j8202l6401N8407j13930K9074o5429J03721
1664b8764N3652n5562M8420M5291m4635r3503M5735N7347j9191k6521p8033m7834
1652a43598N3527O15k0755N8793M1082n0244R1714R75k1073p528l6778k6956l7602
$$ plain form
1737 -4315 -86926 -113707 -48436 -59965 50700 88279 41693 -98930 -65886 -102678 -46300 -28376
1725 -28376 -61206 -99885 2951 33156 -55716 -76533 -54022 29162 32879 19534 -43060 -77598
1713 -77598 -26292 -43881 -9054 -66523 -84406 -15130 -53426 -73202 -85720 -85824 -92901 -90002 -105826
1700 -105826 -3604 -45332 -69091 -16962 -27196 -101080 -129396 -44840 3234 -46884 -42028 9294
1688 9294 -55001 -65001 -38272 -74396 -25070 40078 -51631 -129861 -128429 -106440 -70344 -77804
1676 -77804 -35054 -32445 -54305 16504 13996 -4206 -40607 17800 -96130 -67056 -132485 -28764
1664 -28764 24888 -30674 17746 63037 18402 -75101 -29366 27981 8790 -17731 -95764 -143598
1652 -143598 -90071 -89456 -110211 -51418 -10336 -60580 31134 32109 11036 3508 -33270 -60226 -97828
1639i7828K3408J4880j3512K4112m5838O3640P1714L1347r4026r4034M831N4787
1627e6519n819K4619J18828p7347o51Q6446o673m7165j2640j5154O321l6915J4454
1614h215o8231j6987Q3484r7654J17261l400j38048J33010J9669R392k8687k7821
1602b6227j5339o669J7856M6932M006r8660J02843m7090q9595J7568J01786k2654
1590a5243O934n3683j04038N7489N6275q27J5081n5458L2688O4790j21742M5760
1578g1974J22063r3088M4758L6032k569n1756n0922K2479L1551l0222K9543K0121
1566F016p6873O0325M4675K7937m2811j3708o9904Q882L2727n0133J1598L8590
1554b2679n6032K2862j745J6375k1116m3266P8885K2373K0891R7821j2848M0545
$$ plain form
1639 -97828 -74420 -59540 -73052 -48940 -94778 -31138 40576 71923 -22103 -116137 -111306 -56519
1627 -56519 -62338 -37719 81109 3762 3111 89557 82884 35719 23079 7925 14246 -22669 -8215
1614 -8215 -76446 -93433 -9949 -107603 9658 6258 -131790 1220 20889 30281 1594 -26227
1602 -26227 -41566 -48235 -30379 16553 20559 -78101 24742 -22348 -111943 -94375 7411 -15243
1590 -15243 -8309 -61992 -166030 -108541 -52266 -53093 -38012 -93470 -60782 4008 -117734 -71974
1578 -71974 50089 -42999 1759 37791 35222 -16534 -67456 -44977 -13426 -43648 -14105 6016
1566 6016 -70857 -10532 34143 62080 19269 5561 -64343 -55461 -22734 -72867 -61269 -22679
1554 -22679 -78711 -55849 -57594 -41219 -62335 -105601 -26716 -4343 16548 114369 101521 142066
1542A42066o8514j27802K8276O6143M5213j81053Q5538J20421j15286L0593p4567
1531d8972p473o9049J1341l5077L6519k128p6322N6627O217J280N2551L2825o0535
1518a02196M8235O2842n0827L8147l0072n4629N7667J09059k5219l5305J2069
1507B9771n408K0919r4594K6153o0308J35651o7488Q8206J3222r864q628r0599
1495b2967K0435R0259j40014L7135P4873o9361l7923l1607M8989J20790k7266
1484F3343j18101o7551j0056J00200J0492o883P6591M343r0158n0155j4634J22236
1472A9667K4687n4927j6449J1804L7047k8124N9655K2348j6750j13574L6713J1929
1460e974L1994k5186k1615n2321j1458J2742L1684K1036l7564N8657L9522K7812
$$ plain form
1542 142066 73552 -54250 -25974 40169 85382 -95671 -10133 110288 -4998 25595 -48972
1531 -48972 -56445 -125494 -114153 -149230 -112711 -114839 -191161 -134534 -128317 -127037 -74486 -41661 -102196
1518 -102196 -53961 8881 -41946 -3799 -33871 -88500 -30833 78226 53007 17702 29771
1507 29771 24363 45282 -49312 -23159 -83467 52184 -15304 72902 86124 76260 67632 -22967
1495 -22967 -2532 87727 -52287 -15152 59721 -9640 -47563 -79170 -30181 90609 63343
1484 63343 -54758 -122309 -132365 -32165 -21673 -28556 48035 52378 -37780 -87935 -102569 19667
1472 19667 44354 -10573 -27022 -15218 21829 -6295 53360 75708 58958 -54616 -17903 -5974
1460 -5974 26020 834 -20781 -73102 -84560 -71818 -40134 -19098 -56662 1995 41517 69329
1448F9329q7065Q6210m8484p1880r9551R3069N1943k8778N570N138L721n0934
1436g1712O9985P9557p1777k4432o4573M8574n3830k3990J69086j22643n6302
1425a22057J58090M6095l1469k9669M9747q4272m0546N5540o159R301L7355l8321
1413C635r3837k4649J06050J3648q326o266m9380O7259n7169J1714M2065j1414
1401f670J03033r1087p384k2331n9315l4229K4901M0899P3654N623j6995K8481
1389C8580p16l3425j19348M2063L0491J5839N8262r1568J3013N087K9747J5768
1377C793L1887k1971o3695J6095k2803k4698J46685o3682m3005J0007O334O2203
1365C7150o3099n7106M9912K2604N8493p495p3130L9907p579N2933k8870r7323
$$ plain form
1448 69329 -17736 68474 19990 -51890 -151441 -58372 -6429 -35207 -29637 -24499 -20778 -71712
1436 -71712 -1727 77830 6053 -18379 -82952 -34378 -88208 -112198 56888 -65755 -122057
1425 -122057 36033 82128 50659 20990 70737 -13535 -54081 1459 -4700 4601 41956 3635
1413 3635 -90202 -114851 -8801 4847 -3479 -9745 -59125 8134 -49035 -37321 4744 -6670
1401 -6670 96363 5276 -2108 -24439 -83754 -117983 -93082 -52183 21471 27094 10099 38580
1389 38580 37864 4439 -114909 -72846 -42355 -26516 31746 -59822 -46809 -41722 -11975 3793
1377 3793 35680 13709 -49986 -33891 -56694 -81392 65293 1611 -41394 -31387 -25053 37150
1365 37150 -25949 -83055 -33143 -10539 47954 40459 -32671 7236 -343 52590 23720 -73603
1353g3603Q2747m3187j3276L5707O9472J1238m7751k9268l7709k6144L3752L2563
1341e459R6029k7460L514m1242L705m3065j64173K0746P1116J9625K0152O7961
1329B1449j3992K8343j68509N0707M5231l9149Q504k8926R629R6345k1240J50
1317a1458n4621P7894k136J0140N6669J2655l9899N9644j24788l110j13245N1820
1305h0435J1793J625j05805J1061J42006n5445J22969j02633K3730O5858o6486
1294c1762Q3054m7735q8480O597N4252M2390n1540q9847j5826J21791p005Q1039
$$ plain form
1353 -73603 9144 -34043 -47319 -11612 57860 69098 21347 -7921 -45630 -71774 -38022 -5459
1341 -5459 90570 63110 66624 25382 29087 -13978 -178151 -157405 -86289 -66664 -46512 21449
1329 21449 7457 35800 -132709 -82002 -36771 -75920 -67416 -96342 -86713 9632 -11608 -11458
1317 -11458 -66079 11815 9679 19819 76488 89143 49244 108888 -15900 -19010 -132255 -80435
1305 -80435 -68642 -67017 -172822 -161761 -19755 -75200 47769 -54864 -31134 34724 -31762
1294 -31762 51292 3557 -84923 -78326 -24074 18316 -33224 -123071 -138897 -17106 -24111 56928
$$ [...]
##END NTUPLES=NMR SPECTRUM
##END=
