##TITLE=1H_EC-3305(VII-1))
 CDCl3
 8 sc, 
 25.7.2024
##JCAMPDX= 6.0         $$ Bruker NMR JCAMP-DX V2.0
##DATA TYPE= NMR SPECTRUM
##DATA CLASS= NTUPLES
##ORIGIN= UXNMR, Bruker Analytische Messtechnik GmbH
##OWNER= root
$$ XWIN-NMR		Version 3.5
$$ Thu Jul 25 14:08:46 2024 Russian Standard Time (UT+4h)  she@DPX200
##.OBSERVE FREQUENCY= 200.1315
##.OBSERVE NUCLEUS= ^1H
##.ACQUISITION MODE= SIMULTANEOUS
##.ACQUISITION SCHEME= undefined
##.AVERAGES= 8
##.DIGITISER RES= 18
##SPECTROMETER/DATA SYSTEM= spect
##.PULSE SEQUENCE= zg30
##.SOLVENT NAME= D2O
##.SHIFT REFERENCE= (INTERNAL, D2O, 0, 20.4802)
##AUDIT TRAIL= $$ (NUMBER, WHEN, WHO, WHERE, WHAT)
$$ ##TITLE= Audit trail, XWIN-NMR		Version 3.5
$$ ##JCAMPDX= 5.01
$$ ##ORIGIN= Bruker BioSpin GmbH
$$ ##OWNER= she
$$ F:/spectra/data/she/nmr/H-F/1/pdata/1/auditp.txt
$$ ##AUDIT TRAIL=  $$ (NUMBER, WHEN, WHO, WHERE, WHAT)
(   1,<2024-07-25 14:07:16.53 +0400>,<she>,<DPX200>,
      <created by zg, POWCHK disabled, PULCHK disabled
       configuration hash MD5:
       00 E9 B6 7A A2 85 ED C7 34 08 36 98 17 FE 4E 26
       data hash MD5: 16K
       5B 50 3A F2 E9 DE 02 06 8D AB 3C 04 21 09 B4 2D>)
(   2,<2024-07-25 14:07:18.96 +0400>,<she>,<DPX200>,
      <Start of raw data processing
       efp BC_mod = 2 LB = 0.24 FT_mod = 6 PKNL = 1 PHC0 = -25794.26 PHC1 = 14.58749 SI = 16K 
       data hash MD5: 16K
       E7 CC 2E CE 75 B7 8A A8 A8 08 6C 5E D3 6C F5 C0>)
(   3,<2024-07-25 14:07:58.09 +0400>,<she>,<DPX200>,
      <pk PHC0 = -1.688012 PHC1 = 2 
       data hash MD5: 16K
       51 A3 E0 5C 3A 06 31 7D 0B E1 14 F3 48 3D CE 7E>)
(   4,<2024-07-25 14:08:01.65 +0400>,<she>,<DPX200>,
      <abs ABSG = 5 
       data hash MD5: 16K
       AC 6A 25 7A E3 66 41 C2 73 3E 64 F1 50 29 85 A8>)
$$ ##END=
$$ 
$$ hash MD5
$$ 88 AE 5D 62 A3 73 A7 AA 45 FE FC E7 B8 C5 92 3D
##$RELAX= 
##$RELAX= 
##$RELAX= 
##$RELAX= 
##$RELAX= 
##$RELAX= 
$$ Bruker specific parameters
$$ --------------------------
##$DU= <F:/spectra>
##$EXPNO= 1
##$NAME= <H-F>
##$PROCNO= 1
##$TYPE= <nmr>
##$USER= <she>
##$AMP= (0..31)
100 100 100 100 100 100 100 100 100 100 100 100 100 100 100 100 100 100 
100 100 100 100 100 100 100 100 100 100 100 100 100 100 
##$AQSEQ= 0
##$AQ_mod= 1
##$AUNM= <au_zg>
##$AUTOPOS= <>
##$BF1= 200.13
##$BF2= 200.13
##$BF3= 200.13
##$BF4= 200.13
##$BF5= 200.13
##$BF6= 200.13
##$BF7= 200.13
##$BF8= 200.13
##$BYTORDA= 1
##$CFDGTYP= 0
##$CFRGTYP= 5
##$CHEMSTR= <none>
##$CNST= (0..31)
1 1 145 1 1 1 1 1 1 1 1 1 1 1 1 1 1 1 1 1 1 1 1 1 1 1 1 1 1 1 1 1 
##$CPDPRG= <>
##$CPDPRG1= <>
##$CPDPRG2= <>
##$CPDPRG3= <>
##$CPDPRG4= <mlev>
##$CPDPRG5= <mlev>
##$CPDPRG6= <mlev>
##$CPDPRG7= <mlev>
##$CPDPRG8= <mlev>
##$CPDPRGB= <>
##$CPDPRGT= <>
##$D= (0..31)
0 1.2 0 0 0 0 0 0 0 0.06 0 0.03 0 0 0 0 0.0002 0 0 0 0 0 0 0 0 0 0 0 0 
0 0 0 
##$DATE= 1721902036
##$DBL= (0..7)
120 120 120 120 120 120 120 120 
##$DBP= (0..7)
150 150 150 150 150 150 150 150 
##$DBP07= 0
##$DBPNAM0= <>
##$DBPNAM1= <>
##$DBPNAM2= <>
##$DBPNAM3= <>
##$DBPNAM4= <>
$$ [...]
##$SUBNAM3= <"">
##$SUBNAM4= <"">
##$SUBNAM5= <"">
##$SUBNAM6= <"">
##$SUBNAM7= <"">
##$SUBNAM8= <"">
##$SUBNAM9= <"">
##$SW= 24.0689530833862
##$SWIBOX= (0..15)
0 0 2 0 0 0 0 0 0 0 0 0 0 0 0 0 
##$SW_h= 4816.95568400771
##$TD= 16384
##$TD0= 1
##$TE= 0
##$TE2= 300
##$TE3= 300
##$TEG= 300
##$TL= (0..7)
0 120 120 120 120 120 120 120 
##$TP= (0..7)
150 150 150 150 150 150 150 150 
##$TP07= 0
##$TPNAME0= <>
##$TPNAME1= <>
##$TPNAME2= <>
##$TPNAME3= <>
##$TPNAME4= <>
##$TPNAME5= <>
##$TPNAME6= <>
##$TPNAME7= <>
##$TPOAL= (0..7)
0.5 0.5 0.5 0.5 0.5 0.5 0.5 0.5 
##$TPOFFS= (0..7)
0 0 0 0 0 0 0 0 
##$TUNHIN= 0
##$TUNHOUT= 0
##$TUNXOUT= 0
##$USERA1= <user>
##$USERA2= <user>
##$USERA3= <user>
##$USERA4= <user>
##$USERA5= <user>
##$V9= 5
##$VALIST= <valist>
##$VCLIST= <CCCCCCCCCCCCCCC>
##$VD= 0
##$VDLIST= <DDDDDDDDDDDDDDD>
##$VPLIST= <PPPPPPPPPPPPPPP>
##$VTLIST= <TTTTTTTTTTTTTTT>
##$WBST= 1024
##$WBSW= 4
##$XGAIN= (0..3)
0 0 0 0 
##$XL= 0
##$YL= 0
##$YMAX_a= 290846
##$YMIN_a= -547641
##$ZGOPTNS= <>
##$ZL1= 120
##$ZL2= 120
##$ZL3= 120
##$ZL4= 120
##$ABSF1= 20.4861
##$ABSF2= -3.583057
##$ABSG= 5
##$ABSL= 3
##$ALPHA= 0
##$AQORDER= 0
##$ASSFAC= 0
##$ASSFACI= 0
##$ASSFACX= 0
##$ASSWID= 0
##$AUNMP= <proc_1d>
##$AZFE= 0.1
##$AZFW= 0.1
##$BCFW= 0
##$BC_mod= 2
##$BYTORDP= 0
##$COROFFS= 0
##$CY= -3
##$DATMOD= 1
##$DC= 0
##$DFILT= <>
##$DTYPP= 0
##$F1P= 0
##$F2P= 0
##$FCOR= 1
##$FTSIZE= 16384
##$FT_mod= 6
##$GAMMA= 0
##$GB= 0
##$INTBC= 1
##$INTSCL= 3.70164e-10
##$ISEN= 128
##$LB= 0.24
##$LEV0= 0
##$LPBIN= 0
##$MAXI= 10000
##$MC2= 0
##$MEAN= 0
##$ME_mod= 0
##$MI= 1.114404
##$NCOEF= 0
##$NC_proc= -6
##$NLEV= 6
##$NOISF1= 3.799351
##$NOISF2= 2.8
##$NSP= 0
##$NTH_PI= 0
##$NZP= 0
##$OFFSET= 20.48023
##$PC= 1
##$PHC0= -25795.95
##$PHC1= 16.58749
##$PH_mod= 1
##$PKNL= yes
##$PPARMOD= 0
##$PSCAL= 0
##$PSIGN= 0
##$REVERSE= no
##$SF= 200.129809772577
##$SI= 16384
##$SIGF1= 3
##$SIGF2= 2
##$SINO= 5.538805
##$SIOLD= 16384
##$SREGLST= <1H.CDCl3>
##$SSB= 0
##$STSI= 16384
##$STSR= 0
##$SW_p= 4816.95568400771
##$SYMM= 0
##$S_DEV= 0
##$TDeff= 16384
##$TDoff= 0
##$TI= <>
##$TILT= no
##$TM1= 0
##$TM2= 0
##$TOPLEV= 0
##$USERP1= <user>
##$USERP2= <user>
##$USERP3= <user>
##$USERP4= <user>
##$USERP5= <user>
##$WDW= 1
##$XDIM= 16384
##$YMAX_p= 313286941
##$YMIN_p= -354263
$$ End of Bruker specific parameters
$$ ---------------------------------
##NTUPLES= NMR SPECTRUM
##VAR_NAME=  FREQUENCY,     SPECTRUM/REAL,   SPECTRUM/IMAG
##SYMBOL=    X,             R,               I
##VAR_TYPE=  INDEPENDENT,   DEPENDENT,       DEPENDENT
##VAR_FORM=  AFFN,          ASDF,            ASDF
##VAR_DIM=   16384,         16384,           16384
##UNITS=     HZ,            ARBITRARY UNITS, ARBITRARY UNITS
##FACTOR=    0.29402158847633, 1,            1
##FIRST=     4098.70460032583, 0,            0
##LAST=      -718.251083681884, 0,           0
##MIN=       -718.251083681884, -354263,     0
##MAX=       4098.70460032583, 313286941,    0
$$ Real data points
##PAGE= N=1
##DATA TABLE= (X++(R..R)), XYDATA
$$ [...]
7426C569194P8386j26436l1869J14714J14441k3519J06033O3616L7944R4850J08197
$$ 3569194 3647580 3521144 3489275 3603989 3718430 3694911 3800944 3864560 3902504 3997354 4105551
7415D105551J03638J44625M8011J23524J21305J75434K49628J60099L13198M30511
$$ 4105551 4209189 4353814 4401825 4525349 4646654 4822088 5071716 5231815 5545013 5975524
7405E975524K43887L40141M05569K84697K55011L52493L14422K09680k7996J42731
$$ 5975524 6219411 6559552 6965121 7249818 7504829 7857322 8171744 8381424 8353428 8496159
7395H496159J56971K77472L42410M08694K99693M81503N96255N32371O48244O54926
$$ 8496159 8653130 8930602 9273012 9681706 9981399 10462902 11059157 11591528 12239772 12894698
7385A2894698N59250P77168P89082R78898J036257J250917J190345J446584J566489
$$ 12894698 13453948 14231116 15020198 15999096 17035353 18286270 19476615 20923199 22489688
7376B2489688J861666J892082K689832L252621M618710N817569P913457J1095874
$$ 22489688 24351354 26243436 28933268 32185889 36804599 42622168 50535625 61631499
7368F1631499J8555667J9876711K325974j4671625j9026704j2785075r078507
$$ 61631499 80187166 100063877 102389851 87718226 68691522 55906447 46827940
7361D6827940p158190n229199l939559l130715k201510j634613j146000q81252
$$ 46827940 39669750 34440551 30500992 27370277 25168767 23534154 22388154 21506902
7353B1506902o73552l55654j38731J47397L90437M53925O82577Q18410J008868
$$ 21506902 20833350 20477696 20338965 20486362 20876799 21330724 22013301 22831711 23840579
7344B3840579J455484J863108K550240L475667L134810J879304l53703k089071
$$ 23840579 25296063 27159171 29709411 33185078 36319888 38199192 37845489 35756418
7336C5756418k664051k089595j311318r46724m43106M5046O84930J052912J656096
$$ 35756418 33092367 31002772 29691454 28744730 28301624 28346670 29031600 30084512 31740608
7327C1740608K465871L232969K767576J205461r27114k482673k493203j820060
$$ 31740608 34206479 37439448 40207024 41412485 40485371 38002698 35509495 33689435
7319C3689435j231187o36298j23577M07782J002777J597300K321796L274453M501313
$$ 33689435 32458248 31821950 31698373 32106155 33108932 34706232 37028028 40302481 44803794
7310D4803794M470505L003709K84455k033587k845340k739368k377445k035822
$$ 44803794 49274299 52278008 52562463 50528876 47683536 44944168 42566723 40530901
7302D0530901j521447p67755J25801R81362J929439K927198L949784L615752J671903
$$ 40530901 39009454 38241699 38367500 39348862 41278301 44205499 48155283 51771035 53442938
7293E3442938q44460k695731l251713k959190k694635k423513j894984j197805
$$ 53442938 52598478 49902747 46651034 43691844 40997209 38573696 36678712 35480907
7285C5480907n59184J0103Q08796J472717K176492L249685M324244M697695L750514
$$ 35480907 34921723 34931826 35740622 37213339 39389831 42639516 46963760 51661455 55411969
7276E5411969J672961m60532j418729r99105K85982J763967K639878J601333n80008
$$ 55411969 57084930 56624398 55205669 54206564 54492546 56256513 58896391 60497724 59917716
7267E9917716k956052l771510l143165k027506j015875n59355r95934k005256
$$ 59917716 56961664 53190154 50046989 48019483 47003608 46444253 45448319 43443063
7259D3443063l034561l281320k826941k142462j449664j035123n22134j06681
$$ 43443063 40408502 37127182 34300241 32157779 30708115 29672992 29150858 29044177
7251B9044177K75722Q16133J442553K007693K926898L705398L322344K049776
$$ 29044177 29319899 30136032 31578585 33586278 36513176 40218574 43540918 45590694
7243D5590694M7584j241574j032119J57020J521475K736932K677679J069842j502485
$$ 45590694 45638278 44396704 43364585 43521605 45043080 47780012 50457691 51527533 50025048
7234E0025048l730811m446347l868957k835620k172360j689151j922983k488337
$$ 50025048 46294237 41847890 37978933 35143313 32970953 31281802 29358819 26870482
7226B6870482k612799k455579k162232j749697j618371j341152r35538r63092
$$ 26870482 24257683 21802104 19639872 17890175 16271804 14930652 13995114 13032022
7218A3032022p06379m90952m74592n10502l47619m17249k87305l76025l10680
$$ 13032022 12325643 11834691 11360099 10849597 10501978 10084729 9797424 9421399 9110719
7209I110719k06425j91606k27238l75086k50828k17964k18204k65523k20715j73377
$$ 9110719 8904294 8712688 8485450 8110364 7859536 7641572 7423368 7157845 6937130 6763753
7199F763753k40989k84538j50579j81750j99268j02240j31715j07885j65832j44186
$$ 6763753 6522764 6238226 6087647 5905897 5706629 5604389 5472674 5364789 5198957 5054771
7189E054771l1716j63933l8093m4103j31569j0643n6508n3993K3274K3822r016
$$ 5054771 5023055 4859122 4821029 4776926 4645357 4634714 4578206 4524213 4547487 4571309 4562293
7178D562293J03782k5795n8051j5824J72857M839P7865j14943Q0176K67029O4988
$$ 4562293 4666075 4640280 4582229 4566405 4739262 4744101 4821966 4707023 4787199 5054228 5119216
7167E119216P2627J93638o9692J25367j369j3444L8990J06055J10187J31996J28672
$$ 5119216 5191843 5385481 5315789 5441156 5439787 5426343 5465333 5571388 5681575 5813571 5942243
7156E942243L2151J82223J96903K08892J47606J48981L02598J83756J59579L52563
$$ 5942243 5974394 6156617 6353520 6562412 6710018 6858999 7161597 7345353 7504932 7857495
7146G857495K84287K92763L34858M45755L59990N26592N43492N75528P71732Q71491
$$ 7857495 8141782 8434545 8769403 9215158 9575148 10101740 10645232 11220760 11992492 12863983
7136A2863983J026070J360588J627067K222058K675487K768840J389530k63835
$$ 12863983 13890053 15250641 16877708 19099766 21775253 24544093 25933623 25669788
7128B5669788j063767p42499j87292N85919J056569J497227J168896L0079j202014
$$ 25669788 24606021 23863522 23676230 24262149 25318718 26815945 27984841 28014920 26812906
7119B6812906j575699j049343m02446j75191n23438o42220q19860p04136j48617
$$ 26812906 25237207 24187864 23785418 23610227 23086789 22444569 21624709 20920573 20771956
7110B0771956K63388P73237R21736J167251J027312R33776J332838K032620L023790
$$ 20771956 21035344 21808581 22730317 23897568 24924880 25858656 27191494 29224114 32247904
7101C2247904L574270L216658J864032p7426j415907j614964p77652L40756J222064
$$ 32247904 35822174 39038832 40902864 40825438 39409531 37794567 37016915 37357671 38579735
7092C8579735J535822Q49456m41685j832762k681709k359767j694216j467144
$$ 38579735 40115557 40965013 40523328 38690566 36008857 33649090 31954874 30487730
7084C0487730j421536j691219j904893j776802j183140o09176r1198L00960N2525
$$ 30487730 29066194 27374975 25470082 23693280 22510140 21900964 21809766 22110726 22163251
7075B2163251j33485l46667l48704N4613N01811J107007J100875J60962q85598
$$ 22163251 22029766 21683099 21334395 21389008 21890819 22997826 24098701 24259663 23374065
7066B3374065j441745r93853m41054k4346N91434P11249L46809p44480j582076
$$ 23374065 21932320 20938467 20497413 20473067 21064501 21775750 22122559 21378079 19796003
7057A9796003j639588j160495p18840p24998q69867j126154j103511q78245o56058
$$ 19796003 18156415 16995920 16277080 15552082 14682215 13556061 12452550 11574305 10918247
7048A0918247l04589j55666r9796k63760n41323q44067p10813o87285n99234l94352
$$ 10918247 10613658 10457992 10358196 10094436 9553113 8709046 7998233 7310948 6711714 6317362
7038F317362m13333k13634k46225j36844j21661j29731k73680j97919m0737j62748
$$ 6317362 5904029 5690395 5444170 5307326 5185665 5055934 4782254 4584335 4543598 4380850
7028D380850j64902q1943j84304n698j8102j83760n8704o1329o8798K3107j7877
$$ 4380850 4215948 4134005 3949701 3944003 3925901 3742141 3683437 3622108 3553310 3576417 3558540
7017C558540j33878o3645k1137j96824q8948p647j20046l3934J4999o7167k47168
$$ 3558540 3424662 3361017 3339880 3143056 3054108 3046461 2926415 2892481 2907480 2840313 2593145
7006B593145p7474j64448j11345P509j30485J0548K2344o4907p7707q1389n918
$$ 2593145 2515671 2351223 2239878 2247387 2116902 2127450 2149794 2084887 2007180 1925791 1919873
6995A919873K3117k5104Q1313j24506p0237j16929m5488M3828q0370l7373m3104
$$ 1919873 1942990 1917886 1999199 1874693 1804456 1687527 1642039 1685867 1605497 1568124 1525020
6984A525020L930j83593q6258m6652K644q5343K0346j7537N7219l7570m8072M4478
$$ 1525020 1528950 1345357 1259099 1212447 1215091 1129748 1150094 1132557 1189776 1152206 1104134 1148612
6972A148612k3697p3147J22915L812p846q6891p2332j0939j2357K7437j1313p057
$$ 1148612 1124915 1051768 1174683 1178495 1170649 1083758 1011426 1000487 988130 1015567 1004254 997197
6960I97197j7404j25765l959j22146q5527P6089j1361k696q5595R2027k3907L7601
$$ 997197 979793 854028 850069 727923 642396 718485 707124 704428 618833 710860 686953 724554
6948G24554k9706o7492l4129J0293j34232M164p1968O9970J4032Q50o2245j3615
$$ 724554 694848 627356 593227 603520 469288 473452 401484 471454 485486 486336 424091 410476
6936D10476O0639q815M6840o257L7355m6853J63740j18558J6029K6902N698K1093
$$ 410476 471115 462300 509140 502883 540238 493385 657125 538567 554596 581498 587196 608289
6924F08289m3185L7733m9781k9846J11060J80q0677M4769Q5720L2130M942n1695
$$ 608289 565104 602837 553056 523210 634270 634450 553773 598542 684262 716392 721334 669639
6912F69639O1731N1738n710j5912J22329Q3131O1553j0085o9629l3893K7547q665
$$ 669639 731370 783108 777398 761486 883815 966946 1028499 1018414 948785 914892 942439 933774
6900I33774R443K1016P7180j1219R5695P8621J1201j0590J09127m3902l5083N8344
$$ 933774 943217 964233 1041413 1030194 1125889 1204510 1215711 1205121 1314248 1270346 1235263 1293607
6888A293607m9036O0702Q9357r9322Q0984Q9349M9525j6327M270J5499J05167
$$ 1293607 1244571 1305273 1394630 1295308 1376292 1465641 1515166 1498839 1503109 1518608 1623775
6877A623775J20248m1606P0128o0154m8994o9907R155p3990N3424M5602J28197
$$ 1623775 1744023 1702417 1772545 1712391 1663397 1593490 1602645 1528655 1582079 1627681 1755878
6866A755878L4066M7337m0894J20638J23765o6898L8341m5481o6053n9042j1045
$$ 1755878 1789944 1837281 1796387 1917025 2040790 1973892 2012233 1966752 1900699 1841657 1830612
6855A830612L0825N070m9105j19270j8341O0911j01381m5898J06940n5696k4662
$$ 1830612 1861437 1866507 1817402 1698132 1679791 1740702 1639321 1593423 1700363 1644667 1620005
6844A620005P730M5000n5192j78719j24396r4216J8814Q8684j3019J1222n0503
$$ 1620005 1627735 1672735 1617543 1438824 1314428 1220212 1239026 1327710 1314691 1325913 1275410
6833A275410J17440K2850L4396j54708J90507L0074j09019L181J30957J46536
$$ 1275410 1392850 1415700 1450096 1295388 1485895 1515969 1406950 1410131 1541088 1687624
6823A687624l0876K9617J34073l3742J42416R6887J52835R1928J09583K25080
$$ 1687624 1656748 1686365 1820438 1786696 1929112 2025999 2178834 2270762 2380345 2605425
6813B605425R9l0262j35121r6464j30578o2418r7432L9259p5547M4335o6502L4449
$$ 2605425 2605524 2575262 2440141 2343677 2213099 2150681 2053249 2092508 2016961 2061296 1994794 2029243
6801B029243P4955O4910R299k9818K6747j01580j8504q5232j21421j63193o0267
$$ 2029243 2104198 2169108 2178407 2148589 2175336 2073756 2055252 1970020 1848599 1685406 1625139
6790A625139n1273j7109o045M5219P0030J7146j0436J01163O5113l4504r7292
$$ 1625139 1573866 1556757 1550712 1595931 1665961 1683107 1672671 1773834 1838947 1804443 1707151
6779A707151l4994m3674r1779o4017o6333J3804m5460K8587Q546j45768m9922
$$ 1707151 1672157 1628483 1536704 1472687 1406354 1420158 1374698 1403285 1411831 1266063 1216141
6768A216141Q4564m0187j15209j45352j7556r5860m5114J17036j75685n0638M2407
$$ 1216141 1300705 1260518 1145309 999957 982401 886541 841427 958463 782778 732140 774547
6757G74547j59229n837L4398M6900k0511K1538q0325K3363P0414m6602J742r3216
$$ 774547 615318 609481 643879 690779 670268 691806 611481 634844 705258 658656 660398 567182
6745E67182P233K9614r70n838m9045r7445j2364N7122J9239q5553r6141j6670
$$ 567182 574415 604029 603059 597221 548176 450731 438367 495489 514728 429175 333034 316364
6733C16364k4121j3827j6834L3174m5441o7949O4415L3746q7523m1484O8329M1238
$$ 316364 292243 278416 261582 294756 249315 181366 245781 279527 192004 150520 218849 260087
6721B60087j1004m2140q4116N7550m4465M679j5018m7509L8740k5673m5425r1897
$$ 260087 249083 206943 122827 180377 135912 140591 125573 78064 116804 91131 45706 -46191
6709d6191N8965P3908k5772M8821N9620j7030o1532l5912l4260M744J31717k6039
$$ -46191 12774 86682 60910 109731 169351 152321 90789 54877 20617 25361 157078 131039
6697A31039p453k6235k8273J9860m0735N6526k8508l505k2250P3146l6511M1763
$$ 131039 123586 97351 69078 88938 48203 104729 76221 72716 50466 123612 87101 128864
6685A28864L4405L7660O821j5827r4780l6218k8452L7498J0492r557L7994q6166
$$ 128864 163269 200929 207750 191923 97143 60925 32473 69971 80463 70906 108900 22734
6673B2734o5966J43966j3633k7345o9781Q4580J495m3963l786L8835j7087k4426
$$ 22734 -43232 100734 87101 59756 -10025 74555 76050 32087 28301 67136 50049 25623
6661B5623K5238N756M4101j27339M8362Q6646j79535o3381M2602L8395K0745K3219
$$ 25623 50861 56617 100718 -26621 21741 108387 -71148 -134529 -91927 -53532 -32787 -9568
6649i568Q4928m3068k0046j8062R9340L9535N0280Q061j2092p2492K1110p22m0770
$$ -9568 75360 32292 12246 -5816 93524 133059 183339 191400 179308 106816 127926 127204 86434
6636H6434N7520o9459M0257k9839j9396K9956j8409l6881R0886N1261L1065O2041
$$ 86434 143954 74495 114752 84913 65517 95473 77064 40183 131069 182330 213395 275436
6624B75436J2064J07770m9199m9088r8855P7828O0306J2293O0091l5498m1488
$$ 275436 287500 395270 346071 296983 198128 275956 336262 348555 408646 373148 331660
6613C31660Q0953P8019L7599M8592J8655J34932J6692O9381K6743N9267J35221
$$ 331660 412613 490632 528231 576823 595478 730410 747102 816483 843226 902493 1037714
6602A037714j2035K5578o5653j8438M5142R4357q6012q4292r2353N0002k2070
$$ 1037714 1025679 1051257 985604 967166 1012308 1106665 1020653 936361 844008 894010 871940
6591H71940j02488o0514l6791K537j5413j32863j2745R7973k5804K4134P2577
$$ 871940 769452 708938 672147 674684 659271 526408 513663 611636 585832 609966 682543
6580F82543O5075O228O387O1255P3263J32215P6188O1463j4427r1424j1695j2868
$$ 682543 747618 753846 760233 821488 894751 1026966 1103154 1164617 1150190 1058766 1047071 1034203
6568A034203J03042o7303J3994N8755j31628J00986r1178k2691j06364j46320
$$ 1034203 1137245 1069942 1083936 1142691 1011063 1112049 1020871 998180 891816 745496
6558G45496l929m3507r8765P866k3990K0656k2381k3835O789J9277M1739k2891
$$ 745496 741567 698060 599295 607161 583171 603827 581446 557611 564400 583677 625416 602525
6546F02525L3876J4738n0497j46084j20145P5550J21670J0420j39170K018N3836
$$ 602525 636401 651139 600642 454558 334413 409963 531633 542053 402883 404901 458737
6535D58737J32515k3460q4649N5470l129j17666O9473K6244l0221K4798J04980
$$ 458737 591252 567792 483143 538613 535484 417818 487291 513535 483314 508112 613092
6524F13092J23307p0005M988Q475l4945J5391j5620O2457L1895R4523M3598j36864
$$ 613092 736399 666394 671382 679857 644912 660303 644683 707140 739035 833558 877156 740292
6512G40292m0548k0040P2362j02325k8732M7289m183j31337N676M4289O736m8314
$$ 740292 699744 679704 752066 649741 621009 668298 664115 532778 538454 582743 589479 541165
6500E41165l8253o3313L7567J2980Q1390O467r0444Q6508K0277m1279L4360L4061
$$ 541165 502912 439599 477166 490146 571536 578003 487559 574067 594344 553065 587425 621486
6488F21486R00J094L3297p9123j7800n8623k4889J53876q1636M0347P7351r4583
$$ 621486 622386 623480 656777 577654 559854 501231 476342 630218 548582 588929 666280 571697
6476E71697o5075K1171o234K3751Q803o8681j6656p9753j442J21044n3027k5081
$$ 571697 506622 527793 521559 545310 554113 485432 468776 389023 387581 508625 455598 430517
6464D30517R1023l4562k7141J755j44147k0450R4451k1744L7032j1145j50051
$$ 430517 521540 486978 459837 461592 317445 296995 391446 369702 406734 395589 245538
6453B45538M6316J03586n6683M4000l1984Q3619m7767m2515n9701l9427J60095
$$ 245538 291854 395440 338757 382757 350773 434392 386625 344110 284409 244982 405077
6442D05077l710L2729M1847j14282M4102l5421J7860q8368O4427L4227n0067m9297
$$ 405077 401367 434096 475943 361661 405763 370342 388202 299834 364261 398488 348421 299124
6430B99124k979J8555J7383k9133M8115l5618k8450m7780N090k338P5355N9510
$$ 299124 296145 314700 332083 302950 351065 315447 286997 239217 244307 241969 317324 376834
6418C76834o4337p3312j1831J8776r1885j4634Q363j1209P0250J2964k592m9060
$$ 376834 312497 239185 227354 246130 154245 139611 147974 136765 207015 219979 217387 168327
6406A68327k3092P8368j8444p2627o8775N0931J15149N4431j53425K0019k2918
$$ 168327 145235 223603 205159 132532 63757 114688 229837 284268 130843 150862 127944
6395A27944J08433j16008R121J2218L3065j9171q712N8549n8815l0413N8272l301
$$ 127944 236377 120369 129490 141708 174773 155602 146890 205439 146624 116211 174483 171182
6383A71182o4015J47892O8060n4028l6070N7466L0070p4264o9381m2342P0949
$$ 171182 107167 255059 323119 269091 233021 290487 320557 246293 176912 134570 205519
6372B05519n0007M439N7530L7005L3915J6928l9642p0300R2884M7405J887o7402
$$ 205519 155512 159951 217481 254486 288401 305329 265687 195387 288271 335676 337563 270161
6360B70161J26885Q3506j039o740N1928R4444j4307o1057j8491K4440R4769n4009
$$ 270161 397046 480552 479513 472773 524701 619145 604838 543781 525290 549730 644499 590490
6348E90490l2900J54M2933l9830q8510L5329m6739J6520M6913J4233P8289q638
$$ 590490 557590 557744 600677 560847 472337 507666 460927 477447 524360 538593 616882 608244
6336F08244l2921J19340N5695n853k5422m6340J05464J26069n5109q029k7033
$$ 608244 575323 694663 750358 744505 719083 672743 778207 904276 849167 841138 814105
6325H14105k208p671Q675p0318l6854j16875L4589R615l6691o8521J0536j8190
$$ 814105 811897 804226 812901 742583 705729 588854 623443 633058 596367 527846 538382 520192
6313E20192Q7573M3061m9251J8758O3118K8942l6919K9115l1256k3588L4299j24623
$$ 520192 607765 650826 601575 620333 683451 712393 675474 704589 673333 649745 684044 559421
6301E59421K2454J11955M0912N3762j74941k4200J46622n5571P8799m688o7640
$$ 559421 581875 693830 734742 788504 613563 589363 735985 680414 759213 754525 686885
6290F86885j7265n8463M2887N4489m3777K2583m0549N5146p2036l0186J70654
$$ 686885 669620 611157 654044 708533 664756 687339 646790 701936 629900 599714 770368
6279G70368l0364j76845M7236J13210m1926Q866J17608M7949l4429m050M5865
$$ 770368 740004 563159 610395 723605 681679 690545 808153 856102 821673 817623 863488
6268H63488o163n5932K9920L1242p702o5001k4390k742J42662j46897n1843P6600
$$ 863488 857325 801393 831313 862555 854853 789852 765462 762720 905382 758485 706642 783242
6256G83242M8715O51k1586l4509M7006n458l7757j6271M6505p9635j1034Q7030
$$ 783242 831957 832608 811022 776513 823519 818061 780304 764033 810538 730903 719869 806899
6244H06899j28807k8406R5589k4786Q271n8413J4392N334r2973M083M7430j00906
$$ 806899 678092 649686 745275 720489 728760 670347 684739 690073 597100 601183 648613 547707
6232E47707j16897L0519M0524k7811j17573j6060K1893p002O7786m9696j3029
$$ 547707 430810 461329 501853 474042 356469 340409 362302 355300 423086 373390 360361
6221C60361j5503j4211n2576k0690L9958o3256r0563l0651o4765N1472R7916l2951
$$ 360361 344858 330647 278071 257381 297339 234083 143520 112869 48104 99576 197492 164541
6209A64541M2702l994K3697q1712p7015J6925k3442k9083k5201m9453J46027p5465
$$ 164541 207243 203249 226946 145234 68219 85144 61702 32619 7418 -42035 103992 28527
6197B8527o3647j1538R615O9783j6291Q3321j05414n9966J35212k2898m9394N5261
$$ 28527 -35120 -46658 -37043 32740 16449 99770 -5644 -65610 69602 46704 -2690 52571
6185E2571J4655O5258q9140m1347J6725N5533j4226M7360q0347j3138j3492K593
$$ 52571 67226 132484 43344 1997 18722 74255 60029 107389 27042 13904 412 3005
6173C005K5647n4744k3390n3585R9418m5140N4998k370o954J9481m733J6289O1715
$$ 3005 28652 -26092 -49482 -103067 -3649 -48789 6209 3839 -3115 16366 11633 27922 89637
6160H9637n3167j64004J31505j7800k8333K3932M4396j06144N6446L8O8190N1189
$$ 89637 36470 -127534 3971 -13829 -42162 -18230 26166 -79978 -23532 -23494 44696 95885
6148I5885j65414K6664J6836l8692O5445P4738q0030O6963N4762m0983n7087j2468
$$ 95885 -69529 -42865 -26029 -64721 724 75462 -4568 62395 117157 76174 19087 6619
6136F619l6805R2687L5928N3915n4710l9589J2467q7454P781J5656J9399Q211
$$ 6619 -30186 62501 98429 152344 97634 58045 70512 -16942 -9161 6495 25894 34105
6124C4105m2970n381N0935k3162j99626j0525J51151n5778O0503J962l7836O988
$$ 34105 -8865 -14246 36689 13527 -186099 -196624 -45473 -101251 -40748 -38786 -76622 -69634
6112f9634N9676o4215Q9849m8782l1105O6837K2134P577N5259m1053j84j9299
$$ -69634 -9958 -74173 15676 -33106 -64211 2626 24760 32337 87596 46543 46359 27060
6100B7060q448N6765j01522L9497o5038J01530p972k3820L6910l8088j4737J25507
$$ 27060 18612 75377 -26145 13352 -51686 49844 41872 18052 54962 16874 2137 127644
6088A27644j25621R505r091q78j6372m9119M412J05009p4700n0696L8632N415
$$ 127644 2023 11528 2437 1559 -14813 -63932 -59520 45489 -29211 -79907 -41275 -35860
6076c5860n3255l131J31642O3168o2271q5378j6968J02464l2347m0265N0043L0306
$$ -35860 -89115 -92246 39396 102564 40293 -45085 -62053 40411 8064 -32201 17842 48148
6064D8148m0781O380k6305k5364K1231K5326L6695m4861L751k2774M6306k7533
$$ 48148 7367 13747 -12558 -37922 -16691 8635 45330 469 4220 -18554 27752 219
6052B19r5250O1783K0452N9q538L9942M5878j19659j7726n5296Q4031m9862N8916
$$ 219 -95031 -33248 -12796 -12737 -21275 18667 64545 -55114 -72840 -128136 -44105 -93967 -35051
6039c5051L2087p6419J0830k5618m1855J17289m0278P4262k0563N6425k7861p3623
$$ -35051 -2964 -79383 -68553 -94171 -136026 -18737 -59015 15247 -5316 51109 23248 -50375
6027e0375R0595l3579P8219J2589k5129J47993L459N373m8940l6202n5238N2521
$$ -50375 40220 6641 84860 97449 72320 220313 223772 229145 180205 144003 88765 141286
6015A41286J3101m0164o8619j5558J33246L6733j6733p6182P345n7499R6230J010
$$ 141286 154387 114223 45604 30046 163292 200025 183292 107110 114455 56956 153186 154196
6003A54196j20700n1835J6024J6258R1324m5043K2453k1479o6513J6979p8204
$$ 154196 33496 -18339 -2315 13943 105267 60224 82677 61198 -5315 11664 -66540
5992f6540J0266M1553m3k6382n1370J16060m8668j8725p8093j0122O5486P6470
$$ -66540 -56274 -14721 -14764 -41146 -92516 23544 -25124 -43849 -121942 -132064 -66578 9892
5980I892N5P2056j3023R870m6176j8966L7215O518O743J1245k9237J1161j5830
$$ 9892 9947 82003 68980 78850 32674 13708 50923 57441 64184 75429 46192 57353 41523
5967D1523P938J7161j9721m667M1868L4653j15012J74114O525r8222J429j3148
$$ 41523 49461 66622 46901 42234 84102 118755 3743 177857 184382 86160 87589 74441
5955G4441K5262J6398j3146l7309M5325J1617r4359J4794K2635p343q964R0361
$$ 74441 99703 116101 102955 65646 110971 122588 28229 43023 65658 58315 49351 139712
5943A39712K3112j46521P0764m8187o867K7030Q5324O32n8099J88956M2798L8304
$$ 139712 162824 16303 87067 38880 32013 59043 144367 144999 86900 275856 318654 356958
5931C56958p2264k9884o4327m48j7975J216j20288O9595k9954N8908K9285l0900
$$ 356958 284694 254810 190483 190035 172060 173276 52988 122583 92629 151537 180822 149922
5919A49922m3298j7683l8275M090q1486M7707R4321k0715j07319N0355K1663p367
$$ 149922 106624 88941 50666 54756 -26730 20977 115298 94583 -12736 37619 59282 51915
5907E1915P9518j57493R0437K2253M690o1119p8930l3097M0974J17765j17603
$$ 51915 131433 -26060 64377 86630 91320 30201 -48729 -81826 -40852 76913 -40690
5896d0690l8336Q4421L2606N1832p6929k88K0375K3337K1335P1224k9805L0384
$$ -40690 -79026 5395 38001 89833 12904 12616 32991 56328 77663 148887 119082 149466
5884A49466j21658k3181Q7777R6504p9463o5919N6872j7943N9856j2324o6239
$$ 149466 27808 4627 92404 188908 109445 43526 100398 82455 142311 129987 63748
5873F3748J296j6973M2649K3913l8763M1998j13061R513j3156O5852M376p0070
$$ 63748 65044 48071 90720 114633 75870 117868 4807 14320 1164 67016 71392 1322
5861A322r378O6818r2998j6312Q7898Q2017j16454M639L6932m5840R5569K2181
$$ 1322 -8056 58762 -34236 -50548 37350 119367 2913 7552 44484 -1356 94213 116394
5849A16394m8195K945o1448k4705Q5551j5303j0916m7966M3270j0898L112L705
$$ 116394 68199 71144 9696 -15009 70542 55239 44323 -3643 39627 28729 31841 35546
5837C5546N8957R015j22220N6339R6286p6322O1679o9188q3599P7380K4946L7070
$$ 35546 94503 103518 -18702 37637 133923 57601 119280 50092 -33507 43873 68819 105889
5825A05889j9681l5864M8379P0085r2121m059o0649L4334r3084j7538J44440j5877
$$ 105889 86208 50344 98723 168808 76687 72628 11979 46313 -46771 -64309 80131 64254
5813F4254j8543r1295K510N1411P7914n3979Q332M1516J0183M1198q5854r4770
$$ 64254 45711 -45584 -43074 8337 86251 32272 40604 82120 92303 133501 47647 -47123
5801d7123J5337J35944O8185j33587j060k3322J37987q4196k5082O6138q954k0306
$$ -47123 -31786 104158 172343 38756 37696 14374 152361 68165 43083 109221 100267 79961
5789G9961l8216L6929n4432J5968K4971o0844L1249n0703O1745J2460L5869n5532
$$ 79961 41745 78674 24242 40210 65181 4337 35586 -15117 46628 59088 94957 39425
5777C9425P66J45250q3566N1624k463P046r682j0049j435m5202J0291k1785L9787
$$ 39425 40191 185441 101875 153499 151036 158082 148400 138351 136916 91714 102005 80220 120007
5764A20007k7712J14229j620j60832J8113L1596M5471r9299j3975o3286J37242
$$ 120007 92295 206524 204904 44072 62185 93781 139252 39953 25978 -37308 99934
5753I9934L3642l8423m862j7686M7971N837k904l4048J9356N7568L2073n3076
$$ 99934 133576 95153 90291 72605 120576 126413 123509 89461 108817 166385 198458 145382
5741A45382m9326J8855N2861J5000M6300l8108j7037l6113N7093n511p0588n930
$$ 145382 96056 114911 167772 182772 229072 190964 173927 137814 194907 189396 118808 112878
5729A12878J14355N601m9557L2415p481q6196k3522J00554R8034q5489j14435
$$ 112878 227233 232834 183277 215692 208211 122015 98493 199047 297081 211592 97157
5718I7157l3855O3473R6542K3491p4057J8834Q7014n7095o4853J5533J02659K826
$$ 97157 63302 126775 223317 246808 172751 191585 278599 221504 156651 172184 274843 277669
5706B77669l0117q7784M4921R8671j00149j7951J51098j54833N2767P857r0305
$$ 277669 247552 159768 204689 303360 203211 185260 336358 181525 234292 242149 151844
5695A51844J5883Q5909m0985j6273J02348n6174K5132q4049J28114k8270O096
$$ 151844 167727 253636 212651 196378 298726 242552 267684 183635 311749 283479 289575
5684B89575J00936P0307o9756l0975J4593j7619k5853r0371J15273L25m1229J9207
$$ 289575 390511 460818 391062 360087 374680 357061 331208 240837 356110 356435 315206 334413
5672C34413j9541l1682m9734N3972K283J22841M3331r0930J2337P240k7105J6653
$$ 334413 314872 283190 233456 287428 289711 412552 455883 364953 377290 384530 357425 374078
5660C74078J2521o688J08502O587J3417M4734q205J4046J864j5290J63337L8109
$$ 374078 386599 379911 488413 495000 508417 553151 544946 558992 560856 545566 708903 747012
5648G47012r490P4305O0669k02577P6958P4416M7511m2250J23081J06638o2619
$$ 747012 737522 811827 872496 669919 746877 821293 868804 826554 949635 1056273 993654
5637I93654j4055j32168j03674q4937P3593l3494J7675M0692j25768Q9691J8946
$$ 993654 979599 847431 743757 658820 732413 698919 716594 757286 631518 721209 740155
5626G40155l2504p4599k1918n5649q8389P8916O1291k5791O1719n0137L5130l3155
$$ 740155 707651 633052 611134 555485 467096 546012 607303 581512 643231 593094 628224 595069
5614E95069m117K5460k0866P4539j15836o7580m0469K11320K2976j23125J5317
$$ 595069 590952 616412 595546 670085 554249 486669 446200 657520 680496 557371 572688
5603E72688K2048n246k1180O1873O695N9439J3003j13509R9367J9635J3465M2233
$$ 572688 594736 589490 568310 630183 636878 696317 709320 595811 695178 714813 728278 770511
5591G70511p2674n5936J48422j0025j16023M3562J02734J19201O6485J2555L6581
$$ 770511 697837 641901 790323 780298 664275 707837 810571 929772 996257 1008812 1045393
5580A045393J2233r4267K8621m5150O4295J8878l8677R3432R0886n4813K882L0751
$$ 1045393 1057626 963359 991980 946830 1011125 1030003 991326 1084758 1175644 1120831 1123713 1154464
5568A154464j3131R6687K9669n0583n80R2204J09004m6672j27496O5801j28054
$$ 1154464 1141333 1238020 1267689 1217106 1216526 1308730 1417734 1371062 1243566 1309367 1181313
5557A181313j03951M6353P3540P0504m7292j0081L0064k0497k5302k7595M5579
$$ 1181313 1077362 1123715 1197255 1267759 1220467 1210386 1240450 1219953 1194651 1167056 1212635
5546A212635m2195k2154J741m1668o9630k4307r7341O2110j2358K3794O1690j95861
$$ 1212635 1170440 1148286 1150027 1108359 1038729 1014422 917081 979191 966833 990627 1052317 856456
5534H56456R754L1971P3180K0126m4550j2260P5167J4354n1867J00266m8337m9069
$$ 856456 866210 898181 971361 991487 946937 934677 1009844 1024198 972331 1072597 1024260 975191
5522I75191n388J02443M8098J843k7162L081j0415L4401K4717J09760p8769L4858
$$ 975191 969803 1072246 1120344 1122187 1095025 1098106 1087691 1122092 1146809 1256569 1177800 1212658
5510A212658O3743n9040m4392L3240l909N5145N8852R9804l8628r447P1251k826
$$ 1212658 1276401 1217361 1172969 1206209 1202300 1257445 1316297 1416101 1377473 1368026 1439277 1436451
5498A436451k3087j07005K7847K1077Q6737o960m6374J26280p6712j02178K29078
$$ 1436451 1413364 1306359 1334206 1355283 1442020 1435060 1388686 1514966 1438254 1336076 1565154
5487A565154m4604l4417P6828J00199N606l1995P271l1514L0607l9182J0335M1655
$$ 1565154 1520550 1486133 1562961 1663160 1668766 1636771 1644042 1612528 1643135 1603953 1614288 1655943
5475A655943j45752J32710O5607m8154N2903J68153j7274Q719K2750P364K9080
$$ 1655943 1510191 1642901 1708508 1660354 1713257 1881410 1864136 1872855 1895605 1902969 1932049
5464A932049l5425q7232l2154P0569j5094J4760K196p6219N9209J18074K0433
$$ 1932049 1896624 1809392 1777238 1847807 1832713 1847473 1849669 1773450 1832659 1950733 1971166
5453A971166O8734R3523o233R9004R0518P8875o8776R2827j3691l5018N3740K7372
$$ 1971166 2039900 2133423 2127190 2226194 2316712 2395587 2326811 2419638 2405947 2370929 2424669 2452041
5441B452041k6075M0884K01553k2514Q0847J29274P1615K0536M0132O0112J75503
$$ 2452041 2425966 2466850 2668403 2645889 2726736 2856010 2927625 2948161 2988293 3048405 3223908
5430C223908K88609K22495M1401J41440P6949K80632K19925M8568k2524j48461
$$ 3223908 3512517 3735012 3776413 3917853 3994802 4275434 4495359 4543927 4521403 4372942
5420D372942r4488n5688N2615J02963K39595K47021J05818P4288N275K19333J34417
$$ 4372942 4278454 4222766 4275381 4378344 4617939 4864960 4970778 5045066 5050341 5269674 5404091
5409E404091L7492M0300j25731k03524o0614r8384N7623N3952O274l8690j00503
$$ 5404091 5441583 5481883 5356152 5152628 5092014 4993630 5051253 5105205 5111479 5072789 4972286
5398D972286l1144L0005J65659K08657K39223J24904m7554k41875j65211j78759
$$ 4972286 4941142 4971147 5136806 5345463 5584686 5709590 5662036 5420161 5254950 5076191
5388E076191M227r9508L5523P3687O7502P4005P2207O4438J03902N6877J67142
$$ 5076191 5080418 4980910 5016433 5090120 5157622 5231627 5303834 5368272 5472174 5529051 5696193
5377E696193P6326K8589J70613K35307K14434J96221K28802K67637L30275L45972
$$ 5696193 5772519 5801108 5971721 6207028 6421462 6617683 6846485 7114122 7444397 7790369
5367G790369M15251L37642M32877K93331L03922L67047L10958L86056L28420M60940
$$ 7790369 8205620 8543262 8976139 9269470 9573392 9940439 10251397 10637453 10965873 11426813
5357A1426813L80054L24023M36534M66905N85799O17915O38365O28724P93195
$$ 11426813 11806867 12130890 12567424 13034329 13620128 14238043 14876408 15505132 16298327
5348A6298327P50357P59576R30651Q81969J013246J072624J119455J481366J400419
$$ 16298327 17048684 17808260 18738911 19620880 20634126 21706750 22826205 24307571 25707990
5339B5707990J526095J679717K104207K531726L134174M003647M925631O289868
$$ 25707990 27234085 28913802 31018009 33549735 36683909 40687556 45613187 51903055
5331E1903055Q094075P709467L168718k119314m259529l202737j418464O1337
$$ 51903055 59997130 67706597 70875315 68756001 64496472 61293735 59875271 59936608
5323E9936608J717181L691372N417308M636646J930484N29404J798899M298394
$$ 59936608 61653789 65345161 70762469 75399115 77329599 77859003 79657902 83956296
5315H3956296M575938J303439k948194m500027l194197n91024J423091J020349
$$ 83956296 88532234 89835673 86887479 82387452 79193255 78602231 80025322 81045671
5307H1045671j715893l311550k726546p93782R47836K956016N315683P222574
$$ 81045671 79329778 76018228 73291682 72497900 73445736 76401752 81717435 88940009
5299H8940009M748753j455391n946716o296559m140704k148495m34432J019252
$$ 88940009 93688762 92233371 86286655 79990096 75849392 73700897 73266465 74285717
5291G4285717K162192J706873k70491k620986l740123m018781l621516k834117
$$ 74285717 76447909 78154782 77884291 75263305 71523182 67504401 63882885 61048768
5283F1048768j943177j239409m53331M63904J295533K082018K908793L623631
$$ 61048768 59105591 57866182 57412851 57876755 59172288 61254306 64163099 67786730
5275F7786730M568517N684037O920729Q629805R249369O520958N40194n545810
$$ 67786730 72355247 78039284 84960013 93589818 102839187 109360145 109900339 104354529
5267A04354529q812881r041405q141219o944982n673470m600159l447296k423323
$$ 104354529 95541648 86500243 78359024 71414042 65740572 61140413 57693117 55269794
5259E5269794j681675p59176J0781O54608J274671K114349L243774L983515L492612
$$ 55269794 53588119 52828943 52839724 53494332 54769003 56883352 60127126 64110641 67603253
5250F7603253J518183j588972m354507n243093n127818m659305m032864l524993
$$ 67603253 69121436 67532464 63177957 57934864 52807046 48147741 44114877 40589884
5242D0589884l048849k348474j861208j373838q41991m33918q0695k34176o97393
$$ 40589884 37541035 35192561 33331353 31957515 31115524 30681606 30600911 30366735 29669342
5233B9669342j023662j462688j375745j240786j190279q79712o48902n02631j87898
$$ 29669342 28645680 27182992 25807247 24566461 23376182 22496470 21847568 21344937 21157039
5224B1157039k25328P8884K40165O59504R18849J122517J674120K035247K278340
$$ 21157039 20931711 21010595 21250760 21910264 22829113 23951630 25625750 27660997 29939337
5215B9939337J629355M83279j256907k502582k603704k353853j965720j508035
$$ 29939337 31568692 32051971 30795064 28292482 25688778 23334925 21369205 19861170
5207A9861170j206508j033657o98506l66273l33647r2974J03365K56918M52468
$$ 19861170 18654662 17621005 16922499 16556226 16222579 16129605 16232970 16489888 16942356
5198A6942356Q20420R16122R86312M76871k96217q91313j369891j513103j391186
$$ 16942356 17762776 18678898 19665210 20142081 19845864 18954551 17584660 16071557 14680371
5189A4680371j116021j171734j029076p12660n44573n87840m16721l99689l69130
$$ 14680371 13564350 12392616 11363540 10650880 10106307 9518467 9101746 8702057 8332927
5180H332927k88332l93158k23388k21592j69249k55464k04777j38223k79988j74381
$$ 8332927 8044595 7651437 7428049 7206457 7037208 6781744 6576967 6438744 6158756 5984375
5170E984375m0354j05422r9105j21046n2594j30810j89001j31780l1829k25434
$$ 5984375 5944021 5838599 5739494 5618448 5565854 5435044 5246043 5114263 5082434 4857000
5160D857000j60180j73846r9519J7422k55609m6217O7639j11376m3981p4408j35440
$$ 4857000 4696820 4522974 4423455 4440877 4185268 4139051 4206690 4095314 4051333 3976925 3841485
5149C841485r54l5934q6912P9667l4644p0508P5012j57528J9335j8917o4335j27866
$$ 3841485 3840531 3804597 3717685 3797352 3762708 3692200 3767212 3609684 3629019 3610102 3545767 3417901
5137C417901K6517Q4598R2640l9477p4156J21920r0984M2359o9165q9745K0593
$$ 3417901 3444418 3529016 3621656 3582179 3508023 3629943 3538959 3581318 3512153 3422408 3443001
5126C443001q308K6263L3893K2926k3413l8665p3682Q9332l6911N7273L6996l2891
$$ 3443001 3434693 3460956 3494849 3517775 3494362 3455697 3382015 3471347 3434436 3491709 3528705 3495814
5114C495814j03590p2281J17448L4096r0421l8541M5876N2901p4681J11499K6287
$$ 3495814 3392224 3319943 3437391 3471487 3381066 3342525 3388401 3441302 3366621 3478120 3504407
5103C504407M9754M4761p0621Q7775l0636K3489n3696K0796J9045N0059J1938
$$ 3504407 3554161 3598922 3528301 3616076 3585440 3608929 3555233 3576029 3595074 3645133 3657071
5092C657071J16082Q1025M7498P3513o8164J48532p6424N2248J02765k9045N6001
$$ 3657071 3773153 3854178 3901676 3975189 3907025 4055557 3979133 4031381 4134146 4105101 4161102
5081D161102K6146P1731N3110k7376O8525J88798O4750J03439K17912P2858R4416
$$ 4161102 4187248 4258979 4312089 4284713 4353238 4542036 4606786 4710225 4928137 5000995 5095411
5070E095411P3801l3403R3466J6996J2677J2711J34070N8688M8564L6931M5410
$$ 5095411 5169212 5135809 5229275 5246271 5258948 5271659 5405729 5464417 5512981 5549912 5595322
5059E595322R2583J42641M1147N5133J2853J66689K10787J65341N7913k0987J04206
$$ 5595322 5687905 5830546 5871693 5926826 5939679 6106368 6317155 6482496 6540409 6519422 6623628
5048F623628n7898R6861k3483J8454J00760J31888O9059Q3542Q2485L0881K23133
$$ 6623628 6565730 6662591 6639108 6657562 6758322 6890210 6959269 7042811 7125296 7156177 7379310
5037G379310Q5954R3823P4422J89624K05802J35544J23074Q2467J25265J24026
$$ 7379310 7465264 7559087 7633509 7823133 8028935 8164479 8287553 8370020 8495285 8619311
5027H619311O0511J16850J40400J66527K62867K95317M10217K76644J55055L94178
$$ 8619311 8679822 8796672 8937072 9103599 9366466 9661783 10072000 10348644 10503699 10897877
5017A0897877L80876L38323M49867L65036M29722N50954M23363O64183N51807
$$ 10897877 11278753 11617076 12066943 12431979 12861701 13412655 13836018 14500201 15052008
5008A5052008M63684L61375L97494M12705M78947M46483N33041N08769N77533
$$ 15052008 15515692 15877067 16274561 16687266 17166213 17612696 18145737 18654506 19232039
4999A9232039N82097N02743P04154O50251N49796N40395N19604N00000O46148
$$ 19232039 19814136 20316879 21021033 21671284 22221080 22761475 23281079 23781079 24427227
4990B4427227P96859Q96901J226754J246792J344531J166538Q90890O89322O25445
$$ 24427227 25224086 26120987 27347741 28594533 29939064 31105602 31996492 32685814 33311259
4981C3311259Q96764R64094J077116J075168J246724J286175J455635J940143
$$ 33311259 34208023 35172117 36249233 37324401 38571125 39857300 41312935 43253078
4973D3253078K691411L292547M360117N473554O432070O883781N148288J492596
$$ 43253078 45944489 49237036 53597153 59070707 65502777 72386558 77534846 79027442
4965G9027442j984438l892424l893618l228621k271759j476249p32003k40546
$$ 79027442 77043004 73150580 69256962 66028341 63756582 62280333 61548330 61307784
4957F1307784L2330K61636Q82715J932891K885484M246502N998175Q015632J0557523
$$ 61307784 61340114 61601750 62484465 64417356 67302840 71549342 77547517 85563149 96120672
4948I6120672J0723704O073434j919069p980846r830997q806908p073783n358102
$$ 96120672 106844376 112917810 110998741 103017895 93186898 84379990 77306207 71948105
4940G1948105l677385k589186j968413j765952j476269p93186L04682J172774
$$ 71948105 68270720 65681534 63713121 61947169 60470900 59677714 59982396 61155170
4932F1155170J265016R20070J221469K004929K195534O93615j773522l870445
$$ 61155170 62420186 63340256 64561725 66566654 68762188 69455803 67682281 63811836
4924F3811836m711787m180529l147639k327162j603939j256504r74805r28832
$$ 63811836 59100049 54919520 51771881 49444719 47840780 46584276 45609471 44680639
4916D4680639q85035p40855n82956j87974O0297J80789L15041M42045O10663P89658
$$ 44680639 43795604 43054749 42471793 42283819 42344116 42524905 42839946 43281991 43892654 44682312
4906D4682312J159044J533712J862734K204030K575140L060366L538519M071231
$$ 44682312 45841356 47375068 49237802 51441832 54016972 57077338 60615857 64687088
4898F4687088M417815M587602M840049N696765P545973Q157233L508111k472957
$$ 64687088 69104903 73692505 78532554 84229319 91775292 99932525 103440636 100967679
4890A00967679n479274m115296j976026l2312K043940M318569N625091L979800
$$ 100967679 95488405 91373109 89397083 89364771 91408711 95727280 101352371 105332171
4882A05332171J845468J802639M324504P840999Q844738N317219j069874n436857
$$ 105332171 107177639 108980278 113304782 121145781 129990519 135307738 134237864 128801007
4874A28801007n479748k421141J36499n19846k149212k976758k272892o26952
$$ 128801007 123321259 120900118 121036617 120516771 118367559 115390801 113117909 112490957
4866A12490957J337853L966750O796122Q632372O409101N44748l504108l593243
$$ 112490957 113828810 117795560 124591682 133224054 139633155 140177903 136673795 133080552
4858A33080552k140144j493232o25934l05465o48952o89055N75269L336097N702760
$$ 133080552 130940408 129447176 128821242 128515777 127866825 127177770 127753039 131089136 136791896
4849A36791896N801497K803372o00245k199567j015670Q51422M34955j098606
$$ 136791896 142593393 145396765 144796520 142596953 141581283 142432705 142867660 141769054
4841A41769054j482413Q03141L861315M502800K946806j42339m194723p597277
$$ 141769054 140286641 141089782 144951097 149453897 152400703 152258364 148063641 140466364
4833A40466364q728616p421083n342202l656868k560003j441544j96407J650211
$$ 140466364 131737748 124316665 118974463 115317595 112757592 111316048 111119641 112769852
4825A12769852L813045O502269Q264045P157529L924076L0835m063540o714092
$$ 112769852 116582897 123085166 131349211 138506740 142430816 142461651 138398111 131684019
4817A31684019p004955m391821k165805l060418n617065o915192n852790l773461
$$ 131684019 124679064 120287243 118121438 115061020 109443955 102528763 96675973 92902512
4809I2902512k719389l027263l656071l111247k004493n72350n19052k123776
$$ 92902512 90183123 87155860 83499789 80388542 78384049 77811699 77292647 75168871
4801G5168871l385129l533318l440027l184066k821657k118740j958124k491443
$$ 75168871 71783742 68250424 64810397 61626331 58804674 56685934 54727810 52236367
4793E2236367l008867k998420k198133j495880j571956j842195k535458k533757
$$ 52236367 49227500 46229080 44030947 42535067 40963111 39120916 36585458 34051701
4785C4051701k399812k024383j673430j389067j065808q85744q07511n14876m34817
$$ 34051701 31651889 29627506 27954076 26565009 25499201 24613457 23805946 23291070 22856253
4776B2856253l01999l28038k98436l05491l55154k04818k83909k82441k06008
$$ 22856253 22554254 22226216 21927780 21622289 21267135 21062317 20778408 20495967 20289959
4767B0289959j93376o5025j4744j46161L7033Q1356M3395l265l706o9060l6557
$$ 20289959 20096583 20031558 20016814 19870653 19907686 19989042 20032437 20029172 20025466 19956406 19919849
4756A9919849q7633K32836J61225L68462N59240P03609R26063J199057J488785
$$ 19919849 19832216 20065052 20226277 20594739 21153979 21857588 22783651 23982708 25471493
4747B5471493J831984K220219L092065L926697N224014O669601O642259K416048
$$ 25471493 27303477 29523696 32615761 36542458 41766472 48436073 55078332 57494380
4739E7494380l482535o919992o867315n573068m529378l595016k886935k478612
$$ 57494380 54011845 47091853 40224538 34651470 30122092 26527076 23640141 21161529
4731B1161529j936557j607093j308234r71137r30189p21648p03749n97067m68713
$$ 21161529 19224972 17617879 16309645 15338508 14408319 13686671 12982922 12385855 11917142
4722A1917142n04826m52597m16581m02123l65270k86485k32407k32530j31490
$$ 11917142 11412316 10959719 10543138 10141015 9775745 9489260 9256853 9024323 8892833
4713H892833j01357j84162r9755j30558q2076j45988l4844j3046j40874K9570
$$ 8892833 8791476 8607314 8507559 8377001 8294925 8148937 8114093 8101047 7960173 7989743
4703G989743m2601l286Q0113o1687R1538K00458L78909M44892M07739K62473j02699
$$ 7989743 7947142 7943856 8023969 7962282 8053820 8254278 8633187 9078079 9485818 9748291 9645592
4692I645592l21918m49368m83873k93053r6968j68663r8043P0215J4251O2957
$$ 9645592 9323674 8874306 8390433 8097380 8000412 7831749 7733706 7803921 7818172 7881129
4682G881129R8074K66540K09597L40187L82531M70985P01759P24330O75216P68820
$$ 7881129 7979203 8245743 8455340 8795527 9178058 9649043 10350802 11075132 11750348 12519168
4672A2519168J128586J506730R89464O0906r90975j503118j353726j167090q39348
$$ 12519168 13647754 15154484 16143948 16204854 15213879 13710761 12357035 11189945 10350597
4663A0350597o47401n64097m30164k93027k01650p5404o0332r2315J66623K11403
$$ 10350597 9703196 9139099 8708935 8415908 8214258 8138854 8078522 7986207 8152830 8364233
4653H364233K92623L55915N22802O68627J017794J326918J678142J319576K32605
$$ 8364233 8656856 9012771 9535573 10204200 11221994 12548912 14227054 15546630 15779235
4644A5779235p14122j462757j386493j320935j060858o57212o63026m28231m89479
$$ 15779235 15065113 13602356 12215863 10894928 9834070 9176858 8513832 8085601 7596122
4635G596122k71621j01649j35297j11661j12066Q2390J01170J03078K24000J99920
$$ 7596122 7324501 7222852 7087555 6975894 6863828 6946218 7047388 7150466 7374466 7574386
4625G574386K99997M02890M94862L64158K42168j55048l91590l84513l94984k64325
$$ 7574386 7874383 8277273 8772135 9136293 9378461 9223413 8831823 8447310 8052326 7788001
4615G788001j72292o4017q7409j86076k03608k40579k00112j85024j51090j3119
$$ 7788001 7615709 7551692 7464283 7278207 7074599 6834020 6633908 6448884 6297794 6284675
4605F284675j34778m5791O7896l4450l0720M6135q3696j25045j4953k8512L7783
$$ 6284675 6149897 6104106 6172002 6137552 6106832 6152967 6069271 5944226 5929273 5900761 5938544
4594E938544J31961J15417J88726K27054K12148J76834J54715j4783k8370j96150
$$ 5938544 6070505 6185922 6374648 6601702 6813850 6990684 7145399 7130616 7102246 6906096
4584F906096j62075k00482j89756j55397k07014j06995p6161k30652j27070j15655
$$ 6906096 6744021 6543539 6353783 6198386 5991372 5884377 5808216 5577564 5450494 5334839
4574E334839l2548j3399Q1643k8099J67830K04346J65281r586J41013L0248R4573
$$ 5334839 5302291 5288892 5370535 5342436 5510266 5714612 5879893 5870307 6011320 6041568 6136141
4563F136141J01737J95699m9494r6338k24309k4655j00811j00986j21480M9020
$$ 6136141 6237878 6433577 6384083 6287745 6063436 6038781 5937970 5836984 5715504 5764524
4553E764524J1054l2881j0850l7203m6108N846m1369k5677p4680O4622M2281N6308
$$ 5764524 5775578 5742697 5731847 5694644 5648536 5654382 5613013 5587336 5512656 5577278 5619559 5675867
4541E675867K6562j5620L5317K87315N9268J03344L9120p492P6660R8158J4264
$$ 5675867 5702429 5686809 5722126 6009441 6068709 6172053 6211173 6203681 6280341 6378499 6392763
4530F392763J16521K19932P0479J87569K37213J22874L92157L55240P71120R93371
$$ 6392763 6509284 6729216 6799695 6987264 7224477 7347351 7739508 8094748 8865868 9859239
4520I859239J458968Q74020l73697r44311q12963n38265k73056J6413L74745J08679
$$ 9859239 11318207 12192227 11818530 10874219 10061256 9522991 9249935 9266348 9641093 9749772
4510I749772l18300n22461l69827j90607l403J95005J48057K22336p4932k04956
$$ 9749772 9431472 8909011 8539184 8348577 8345174 8540179 8688236 8910572 8835640 8630684
4500H630684k96420j30969m2968n0299l482R6733J30459K24639J16479K22084
$$ 8630684 8334264 8203295 8160327 8110028 8106546 8203279 8333738 8558377 8674856 8896940
4490H896940J66005K97583L75244M27960K57615L83167L36160M44628M99635N74768
$$ 8896940 9062945 9360528 9735772 10163732 10421347 10804514 11140674 11585302 12084937 12659705
4480A2659705O87994J062330J063625R37898R02933R07152Q12732P61768Q61624
$$ 12659705 13347699 14410029 15473654 16411552 17314485 18221637 19034369 19796137 20657761
4471B0657761P40825L16365N91361P01959J129472J203060J263756J264124J586165
$$ 20657761 21398586 21714951 22306312 23008271 24137743 25340803 26604559 27868683 29454848
4462B9454848J569797J753793J879050K065703J950774K320715K314048K802940
$$ 29454848 31024645 32778438 34657488 36723191 38673965 40994680 43308728 46111668
4454D6111668K955817L645198L743281M718607N111018O326918P010230R265162
$$ 46111668 49067485 52712683 56455964 61174571 66285589 72612507 79622737 88887899
4446H8887899J1312113J6364021K0851287K8839157M1833344O2190994M3008126
$$ 88887899 100200012 116564033 137415320 166254477 208087821 270278815 313286941
4439C13286941j1742419n0295776n3186550l6005749k7966012k1662825j6555633
$$ 313286941 301544522 251248746 198062196 162056447 134090435 112427610 95871977
4432I5871977j2733571j0228921p334275n808582m151347l344888k048122j120988
$$ 95871977 83138406 72909485 65575210 59766628 55615281 52270393 50222271 49101283
4424D9101283p87456j984332k712029l452395k858783k608702k149497k000207
$$ 49101283 48313827 46329495 43617466 40165071 37306288 34697586 32548089 30547882
4416C0547882j433933j237835r36569p78176l91070p53174q11112j137503j027652
$$ 30547882 29113949 27876114 26939545 26161369 25770299 25017125 24206013 23068510 22040858
4407B2040858r19290o62950o81743l96862l39443l13229n50327n56575n98529
$$ 22040858 21121568 20458618 19776875 19380013 19040570 18727341 18177014 17620439 17021910
4398A7021910l54915n62441l86348k97073k15146l00557m2179k34275j36335j73167
$$ 17021910 16666995 16104554 15718206 15421133 15205987 14905430 14863251 14628976 14492641 14319474
4388A4319474p5059n0195j15760j98782p0137j73000r3623j2971L0310q4012p4363
$$ 14319474 14244415 14194220 14078460 13879678 13809541 13636541 13542918 13529947 13560257 13476245 13401882
4377A3401882r6509R9762J27626J37877J13402R1248J13897K45004J67546K44699
$$ 13401882 13305373 13405135 13532761 13670638 13784040 13875288 13989185 14234189 14401735 14646434
4367A4646434K58547L03703J64617J37032J62094K41911M06598M04538P75488
$$ 14646434 14904981 15208684 15373301 15510333 15672427 15914338 16320936 16725474 17500962
4358A7500962Q17681N61286N42711O38839R03763J407817J765035K636227M106622
$$ 17500962 18318643 18879929 19422640 20061479 20965242 22373059 24138094 26774321 30880943
4349C0880943N643537L419567q67561m094083m329393l097747k244774j640263
$$ 30880943 36524480 39944047 39076486 34982403 30653010 27555263 25310489 23670226
4341B3670226j139690p05207k75884j05902N48312P04854J080797J801008K778462
$$ 23670226 22530536 21825329 21549445 21443543 21991855 22696709 23777506 25578514 28356976
4332B8356976K960487P13775j637066k463597j584418j029334p83042k95014l1414
$$ 28356976 31317463 32031238 30394172 27930575 26346157 25316823 24533781 24238767 24207353
4323B4207353Q8035K94273N91142P13253R23262J002241J196516J277861J493337
$$ 24207353 24295388 24589661 25180803 25894056 26817318 27819559 29016075 30293936 31787273
4314C1787273J683759J889104K208895K287996K416720K762313K890800K980627
$$ 31787273 33471032 35360136 37569031 39857027 42273747 45036060 47926860 50907487
4306E0907487K855806K549145K124977J775374J435403J191188J033038P78642
$$ 50907487 53763293 56312438 58437415 60212789 61648192 62839380 63872418 64651060
4298F4651060O86196P85769Q41195J354253J770715K236075K780114L173826L519627
$$ 64651060 65337256 66123025 66964220 68318473 70089188 72325263 75105377 78279203 81798830
4289H1798830L874515M003416M089793L791751L141120J939314O96755k89698
$$ 81798830 85673345 89676761 93766554 97558305 100699425 102638739 103335494 103045796
4281A03045796r42783j486085j942594k332179k200051j698957j111672m49940
$$ 103045796 102103013 100616928 98674334 96342155 94142104 92443147 91331475 90881535
4273I0881535L81464J167298J759086K460284L025612L492336L863152L785162
$$ 90881535 91262999 92430297 94189383 96649667 99675279 103167615 107030767 110815929
4265A10815929L574451K933206J793588M30571p67191j440890j886990j770148
$$ 110815929 114390380 117323586 119117174 119547745 118780554 117339664 115452674 113682526
4257A13682526j604730j133489o68070m97251P3522L03289N96657J005477J365569
$$ 113682526 112077796 110944307 110276237 109778986 109852508 110155797 110752454 111757931 113123500
4248A13123500J644904J837528J640841J335524J301054J133614K73995p17315
$$ 113123500 114768404 116605932 118246773 119582297 120883351 122016965 122290960 121573645
4240A21573645j703510k193065k324827k187457k156874k000078j941408j871849
$$ 121573645 119870135 117677070 115352243 113164786 111007912 109007834 107066426 105194577
4232A05194577j816101j850208k148051k252806k223302k185064k296480k352884
$$ 105194577 103378476 101528268 99380217 97127411 94904109 92719045 90422565 88069681
4224H8069681k437923k613070k879315l236820l791025l754549l577791l318333
$$ 88069681 85631758 83018688 80139373 76902553 73111528 69356979 65779188 62460855
4216F2460855l279150l321404l170135l165460k906295k811464k706238k550936
$$ 62460855 59181705 55860301 52690166 49524706 46618411 43806947 41100709 38549773
4208C8549773k213953k243386j915040j550492j360269j147300j037233j174752
$$ 38549773 36335820 34092434 32177394 30626902 29266633 28119333 27082100 25907348
4200B5907348j134305j165269j239074j344129j192546j094112j089285p71632
$$ 25907348 24773043 23607774 22368700 21024571 19832025 18737913 17648628 16876996
4192A6876996o06720p41646o58034n86430m73416l98915m40665o02186n79726
$$ 16876996 16270276 15528630 14870596 14284166 13810750 13411835 12971170 12368984 11789258
4183A1789258l72804l41620m22438l67393l22026k20943l14916l08086k57054
$$ 11789258 11416454 11074834 10652396 10285003 9962977 9742034 9427118 9119032 8861978
4174H861978k25879j89863k74787k55667j12847k91132k54608l05141j30893j69119
$$ 8861978 8636099 8446236 8171449 7915782 7802935 7511803 7257195 6952054 6821161 6652042
4164F652042o8456j21109k24793k5994p7191r7055j84663q4623k92318j33667
$$ 6652042 6583586 6462477 6237684 6211690 6134499 6037444 5852781 5768158 5475840 5342173
4154E342173j07312j06345j32713j08708j00543r2913j38932j6661K649j14934
$$ 5342173 5234861 5128516 4995803 4887095 4786552 4693639 4554707 4538046 4540695 4425761
4144D425761K44j01751r5357j00236j17537j1736r5191p0607O2769j26435j21597
$$ 4425761 4426005 4324254 4228897 4128661 4011124 3999388 3904197 3833590 3896359 3769924 3648327
4133C648327n1283Q4565O187k4175j08109j22122M0768l2823l5182j0251k3094
$$ 3648327 3597044 3681609 3687796 3663621 3555512 3433390 3474158 3441335 3406153 3395902 3372808
4122C372808J0750j28882k020P029R548l4588o4338K7465R858j0208K357j3398
$$ 3372808 3383558 3254676 3252656 3259685 3269233 3234645 3170307 3197772 3207630 3197422 3199779 3186381
4110C186381K0428n9580q7944p9701p5940O0309J0189l125J4512l6576l2020j20504
$$ 3186381 3206809 3147229 3059285 2979584 2903644 2963953 2974142 2971017 2985529 2948953 2916933 2796429
4098B796429j5735K560Q8835O4628J9613q0054j03328k7897m664O1338P226k9698
$$ 2796429 2780694 2783254 2872089 2936717 2956330 2876276 2772948 2745051 2740387 2801725 2808951 2779253
4086B779253L6516j4479L9727J1770r7006r39J04574q9592p73N6174j01114K980
$$ 2779253 2815769 2801290 2841017 2852787 2755781 2754842 2859416 2769824 2769051 2825225 2724111 2727091
4074B727091J11955r9836M0052n008O1172J3766q6059L786J28210L1063L8350
$$ 2727091 2839046 2739210 2779262 2774254 2835426 2849192 2763133 2766919 2895129 2926192 2964542
4063B964542k0957j12116J0323L0527q2043j1813l2396M2749K5062l6636L6684
$$ 2964542 2943585 2831469 2841792 2872319 2790276 2778463 2746067 2788816 2813878 2777242 2813926
4052B813926m2060J05631r0315Q1122L287L147L93J17457l2390K9450J7349o9705
$$ 2813926 2771866 2877497 2787182 2868304 2871591 2874738 2875131 2992588 2960198 2989648 3006997 2937292
4040B937292J3531M7431O7814o3676k5479R1973P686O1473j5206O997J05206j3591
$$ 2937292 2950823 2998254 3066068 3002392 2976913 3068886 3076572 3138045 3122839 3129836 3235042 3221451
4028C221451q8050k353J73734P3361L404N1931p3525L7448q684K6637q170J738
$$ 3221451 3133401 3131048 3304782 3378143 3381547 3433478 3359953 3397401 3388717 3415354 3407184 3408922
4016C408922J9317R1703j924O4533l4425J21684J46360j10423j39243J16388J16978
$$ 3408922 3428239 3519942 3518018 3582551 3548126 3669810 3816170 3705747 3566504 3682892 3799870
4005C799870M1097K1876k6094k1967r323N479p8306J32523j0329J6803j5636R3706
$$ 3799870 3840967 3862843 3836749 3814782 3805459 3810938 3732632 3865155 3854826 3871629 3855993 3949699
3993C949699Q7572m0356Q452J11658L8676R3298J25760Q3358L3618M6032J02733
$$ 3949699 4037271 3996915 4005367 4117025 4155701 4248999 4374759 4458117 4491735 4537767 4640500
3982D640500M3537R029J7166K360J11048Q2212R2610J25997P8211J2657M1776
$$ 4640500 4684037 4693066 4710232 4712592 4823640 4905852 4998462 5124459 5202670 5215327 5257103
3971E257103k1605J27938P0395p8936J31602M3021j0422j9845M3350R1833J14854
$$ 5257103 5235498 5363436 5433831 5354895 5486497 5529518 5519096 5499251 5542601 5634434 5749288
3960E749288o5941l7354q3866Q1104L3329J02330L9382P0335p7043M2081K08720
$$ 5749288 5683347 5645993 5562127 5643231 5676560 5778890 5818272 5888607 5811564 5853645 6062365
3949F062365J02869L3503L100J29633L8342l4836k5584J3586p8831O1018J0561
$$ 6062365 6165234 6198737 6201837 6331470 6369812 6334976 6309392 6322978 6244147 6305165 6315726
3938F315726j71426m5342k7886m0588m8922m747l0337j1112O3257M095M547k1092
$$ 6315726 6144300 6098958 6071072 6030484 5981562 5976815 5946478 5935366 5998623 6002718 6007265 5986173
3926E986173O4367j32943j08629l3447o9283j7811m7926M664m9042j55413r7103
$$ 5986173 6050540 5917597 5808968 5775521 5706238 5688427 5640501 5645165 5596123 5440710 5343607
3915E343607N477K3751j08645k6375O949o00k3029o8072N4832N2211j24087p4938
$$ 5343607 5349084 5372835 5264190 5237815 5244764 5244164 5221135 5153063 5207895 5260106 5136019 5061081
3903E061081k0296p1362O1799J4074q9663m3175k8281n9252Q4044O3320j19611
$$ 5061081 5040785 4969423 5031222 5045296 4955633 4912458 4884177 4824925 4908969 4972289 4852678
3892D852678n4789L4302k0467K6806N9012O3747j17229P5038j8782q9517j6305
$$ 4852678 4797889 4832191 4811724 4838530 4897542 4961289 4844060 4919098 4900316 4810799 4794494
3881D794494J2871R7620n5710M1322N5591M964J6083Q7489k0929J9064J56663
$$ 4794494 4807365 4904985 4849275 4890597 4946188 4951152 4967235 5054724 5033795 5052859 5209522
3870E209522Q5932j07584J11664N7501Q4268K973N1840J15445J4487J23613J95520
$$ 5209522 5295454 5187870 5299534 5357035 5441303 5444276 5496116 5611561 5626048 5749661 5945181
3859E945181N2613j1635O8335J14028Q3945l1230J29053L1503P5047R0548J58742
$$ 5945181 5997794 5986159 6054494 6168522 6252467 6221237 6350290 6381793 6456840 6547388 6706130
3848F706130J48766M0194K0525J45544O0832J30519N6282J64080J49359J39460
$$ 6706130 6854896 6895090 6915615 7061159 7121991 7252510 7308792 7472872 7622231 7761691
3838G761691J24712P0134P4074K0166J59550j7636J24366J09652J47874K15427
$$ 7761691 7886403 7956537 8030611 8050777 8210327 8192691 8317057 8426709 8574583 8790010
3828H790010J30274L8917K56645L0764Q7065J63078J94128L6448J56165K66329
$$ 8790010 8920284 8959201 9215846 9246610 9333675 9496753 9690881 9727329 9883494 10149823
3818A0149823R5934J36738J44374J25482L00911J63551R6645K70895K44741J65314
$$ 10149823 10245757 10382495 10526869 10652351 10953262 11116813 11213458 11484353 11729094 11894408
3808A1894408K92214J18432K32163L57487K56870K79987M61446L79450M45461
$$ 11894408 12186622 12305054 12537217 12894704 13151574 13431561 13893007 14272457 14717918
3799A4717918M08821N33509O04127N86331O49284P04057P55492P98783Q31204
$$ 14717918 15126739 15660248 16264375 16850706 17499990 18204047 18959539 19758322 20589526
3790B0589526Q60060P01158O30323P21458O63193O68253P84296Q39679R23156
$$ 20589526 21449586 22150744 22781067 23502525 24165718 24833971 25618267 26457946 27381102
3781B7381102J168249J199213J393666J421730J259375J137280J136273J169890
$$ 27381102 28549351 29748564 31142230 32563960 33823335 34960615 36096888 37266778
3773C7266778J167119J301489J349729J275629J213679J214891J332324J227852
$$ 37266778 38433897 39735386 41085115 42360744 43574423 44789314 46121638 47349490
3765D7349490J116870J048352J277838J433706J703894K133920K483815K498189
$$ 47349490 48466360 49514712 50792550 52226256 53930150 56064070 58547885 61046074
3757F1046074K126641J378483J065127P51525Q00445J002892R02728R33290R75318
$$ 61046074 63172715 64551198 65616325 66367850 67168295 68171187 69073915 70007205 70982523
3748G0982523R93192J125089J165445J035879R19189R31691J012285J185995J823618
$$ 70982523 71975715 73100804 74266249 75302128 76221317 77153008 78165293 79351288 81174906
3739H1174906K362770K690366L025207K807488K375006J853484J837430J752196
$$ 81174906 83537676 86228042 89253249 92060737 94435743 96289227 98126657 99878853
3731I9878853J641196J381670J181672J147540R98876O79810N28341M82845O35952
$$ 99878853 101520049 102901719 104083391 105230931 106229807 106909617 107437958 107920803 108556755
3722A08556755R39874J275805J802510J933230J736800J167087L42513j11621
$$ 108556755 109496629 110772434 112574944 114508174 116244974 117412061 117754574 117642953
3714A17642953l94146j87695K0397M08838L88093L01517N0432l08378o56539q14833
$$ 117642953 117248807 117061112 117081509 117490347 117878440 118179957 118230389 117922011 117265472 116450639
3704A16450639p81609q75513j092816j315529j234565j181039j406321j893199
$$ 116450639 115669030 114793517 113700701 112385172 111150607 109969568 108563247 106670048
3696A06670048k204521k400177k583752k466117j940312j505170j346040j227368
$$ 106670048 104465527 102065350 99481598 97015481 95075169 93569999 92223959 90996591
3688I0996591j467761j665986j809966j825596j845570j852116j793149j620074
$$ 90996591 89528830 87862844 86052878 84227282 82381712 80529596 78736447 77116373
3680G7116373j270714r34474p91758j170746j695239k162618k289927k164573
$$ 77116373 75845659 74911185 74119427 72948681 71253442 69090824 66800897 64636324
3672F4636324j806896j620688j494551j508321j429040j412412j405400j383593
$$ 64636324 62829428 61208740 59714189 58205868 56776828 55364416 53959016 52575423
3664E2575423j283913j287163j186485j075086q19583o33844n13384n01497n21902
$$ 52575423 51291510 50004347 48817862 47742776 46923193 46289349 45775965 45274468 44752566
3655D4752566m84928j74646J48137L25357O23759N64207o9430j070330j945882
$$ 44752566 44267638 44092992 44241129 44566486 45190245 45754452 45685022 44614692 42668810
3646D2668810k515752k617205k526163k489765k270680k183121j816577j520067
$$ 42668810 40153058 37535853 35009690 32519925 30249245 28066124 26249547 24729480
3638B4729480j465923j287460j159512q72384r33799q89317p45778p07805o26862
$$ 24729480 23263557 21976097 20816585 19944201 19010402 18121085 17375307 16667502 16040640
3629A6040640o02093n10171n13817m69364k96285l33904l43547l92640k52819
$$ 16040640 15438547 14928376 14414559 13945195 13648910 13315006 12971459 12578819 12326000
3620A2326000k70200l63036k42654p8279k11654k39586k38268k02298j04327k44449
$$ 12326000 12055800 11692764 11450110 11371831 11160177 10920591 10682323 10480025 10375698 10131249
3610A0131249j02596j19437j76989j83086j61989j89879K854r2246j66192m2468
$$ 10131249 10028653 9909216 9732227 9549141 9387152 9197273 9200127 9107881 8941689 8899221
3600H899221j457n9294j37452j14525k9721j28989L3474n9512j97990K6184L3180
$$ 8899221 8897764 8838470 8701018 8586493 8556772 8427783 8461257 8401745 8203755 8229939 8263119
3589H263119k5549m8521j31424O9010J945j6095m4049o7486m7272J0520j40854
$$ 8263119 8237570 8189049 8057625 8126635 8128580 8112485 8068436 8000950 7953678 7964198 7823344
3578G823344n1757L793L0563j05195r9341j9608k6046j23516K6661N0277j32171
$$ 7823344 7771587 7775380 7805943 7700748 7601407 7581799 7555753 7432237 7458898 7509175 7377004
3567G377004q7910P1742N3187j17517n2516l2795M4675m7090R8315k9166k2904
$$ 7377004 7289094 7360836 7414023 7296506 7243990 7211195 7255870 7208780 7307095 7277929 7255025
3556G255025j4939j40623L2401q272q4706k8491R5912j8877j32199P1376M1172
$$ 7255025 7240086 7099463 7131864 7123592 7038886 7010395 7106307 7087430 6955231 7026607 7067779
3545G067779J919m1194n6815Q3679r1665L8890J41123M4021M6664O8402j8498
$$ 7067779 7069698 7028504 6971689 7055368 6963703 7002593 7143716 7187737 7234401 7302803 7284305
3534G284305m2333J09322M6588j23724j001O7451o4894J03929O0606m6167n1941
$$ 7284305 7241972 7351294 7397882 7274158 7273157 7340608 7275714 7379643 7440249 7394082 7342141
3523G342141k1767j53037l6665l5816N5667o7735L465O5372K2777L2511j62633
$$ 7342141 7320374 7167337 7130672 7094856 7150523 7082788 7086253 7151625 7174402 7206913 7044280
3512G044280K4604n9764l4403J32697j05107J05439L3377k18540J0253p7129N5389
$$ 7044280 7068884 7009120 6974717 7107414 7002307 7107746 7141123 6922583 6932836 6855707 6911096
3501F911096l3776n2110P0218j84062l792k1087j5336J5360q6780k4284j8405
$$ 6911096 6877320 6825210 6895428 6711366 6707574 6686487 6671151 6686511 6599731 6575447 6557042
3490F557042q1729J69351Q903P493L9939r9869M5454K1405j20048j5385j29141
$$ 6557042 6475313 6644664 6653567 6661060 6700999 6601130 6646584 6667989 6547941 6532556 6403415
3479F403415k7560J3584p093j4959j13785K9598o7032q5501O8878j33873q5015
$$ 6403415 6375855 6389439 6382346 6367387 6253602 6283200 6216168 6130667 6199545 6065672 5980657
3468E980657M6596O901k885j30055j13849L6825L8096Q6944K1304n1661j22466
$$ 5980657 6027253 6034154 6031269 5901214 5787365 5824190 5862286 5949230 5970534 5918873 5796407
3457E796407J06708m7776j27183K4894p4782J6861l5264m3280j12990k2727l547
$$ 5796407 5903115 5855339 5728156 5753050 5678268 5695129 5659865 5616585 5503595 5480868 5477321
3446E477321P908n4175M8503n3127n6466o8117N5623k8485R713M8771o047p2224
$$ 5477321 5485229 5431054 5479557 5426430 5369964 5301847 5357470 5328985 5338698 5387469 5381422 5309198
3434E309198J7866Q1173J7556J5253k1677k4838N6918O3067j06867k9018O3350
$$ 5309198 5327064 5408237 5425793 5441046 5419369 5394531 5451449 5514516 5407649 5378631 5441981
3423E441981L1017K6971J18974m5004M3535J43668K494q9187J53226Q0659R5423
$$ 5441981 5472998 5499969 5618943 5573939 5617474 5761142 5763636 5674449 5827675 5908334 6003757
3412F003757J08006N1492J53792o9385J2455k850o0285n6079O3134Q8387L0491
$$ 6003757 6111763 6163255 6317047 6247662 6260117 6257267 6196982 6140903 6204037 6292424 6322915
3401F322915o9982J27799R7737k0260J39523J38911O9013k607R9186J45895J08956
$$ 6322915 6252933 6380732 6478469 6458209 6597732 6736643 6805656 6803049 6902235 7048130 7157086
3390G157086N7245J24980J02158k730k03984j4029o9251O0351K5661M5125K7751
$$ 7157086 7214331 7339311 7441469 7438739 7234755 7220726 7151475 7211826 7237487 7282612 7310363
3379G310363P0479P4659J7017J11706K8741O9639J94771N9681R6964J11660K35611
$$ 7310363 7380842 7455501 7472518 7584224 7612965 7682604 7877375 7937056 8034020 8145680 8381291
3368H381291J27539J5023K23587P4138J52317Q8814J71232J83748J03033l4013
$$ 8381291 8508830 8523853 8747440 8821578 8973895 9062709 9233941 9417689 9520722 9486709
3358I486709K1299Q9654O3496K28685Q6573K04318J14448J61487K20104J44717
$$ 9486709 9508008 9597662 9661158 9889843 9976416 10180734 10295182 10456669 10676773 10821490
3348A0821490K38409L01235K93432K94693L41049K91166M45069L33069M59928
$$ 10821490 11059899 11361134 11654566 11949259 12290308 12581474 13026543 13359612 13819540
3339A3819540L92606L21116L26439L40925L25110L42625M11680K33292L85661
$$ 13819540 14212146 14533262 14859701 15200626 15525736 15868361 16280041 16513333 16898994
3330A6898994M17576L52626L48706L56121N65996M58193M05656O29090O81831
$$ 16898994 17316570 17669196 18017902 18374023 18940019 19398212 19803868 20432958 21114789
3321B1114789N50105O93487P35966P96918P74721Q73817Q80938R91668J130134
$$ 21114789 21664894 22358381 23094347 23891265 24665986 25539803 26420741 27412409 28542543
3312B8542543J251226J235986J206526J444672J701054J805193J982492K258722
$$ 28542543 29793769 31029755 32236281 33680953 35382007 37187200 39169692 41428414
3304D1428414K520678K575117K797744K817723K934129K659725K209863J412514
$$ 41428414 43949092 46524209 49321953 52139676 55073805 57733530 59943393 61355907
3296F1355907j9443j351139k415074k894565k875814k734616k303515j940231
$$ 61355907 61336464 59985325 57570251 54675686 51799872 49065256 46761741 44821510
3288D4821510j538119j446899j337344q71391n23252J71041O72001Q15471M5219
$$ 44821510 43283391 41836492 40499148 39627757 39104505 39275546 39947547 40763018 40808237
3279D0808237j138886j774370j822864j658445j594741j454247j328953j034973
$$ 40808237 39669351 37894981 36072117 34413672 32818931 31364684 30035731 29000758
3271B9000758q68044p34993n98007m13165m87213j89963P0716J58927K80487M21984
$$ 29000758 28132714 27397721 26799714 26386549 25899336 25709373 25780089 25939016 26219503 26641487
3261B6641487P72672J018458J878438K907588L131925J703749p04222k589809
$$ 26641487 27414159 28432617 30311055 33218643 36350568 38054317 37350095 34760286
3253C4760286l079765k965917k681555k143524j780722j308294j028166r35510
$$ 34760286 31680521 28714604 26033049 23889525 22108803 20800509 19772343 18836833
3245A8836833o17303m72100m79956l21813j52111r1430L4130J63760K75755M31426
$$ 18836833 18219530 17747430 17267474 16945661 16793550 16702120 16736250 16900010 17175765 17607191
3235A7607191O64940J112248J437808Q82839j33917j303582j606469j590884j269654
$$ 17607191 18272131 19384379 20822187 21705026 21571109 20267527 18661058 17070174 15800520
3226A5800520j025348r06795p42146o26164m46095m41082l88045k08266k88667
$$ 15800520 14775172 13868377 13126231 12500067 12053972 11612890 11224845 11016579 10727912
3217A0727912k50788l31394j04774j37743j52706j48003j28369j88295j57782
$$ 10727912 10477124 10145730 10040956 9903213 9750507 9602504 9474135 9285840 9128058
3208I128058j07325j46667k13309O498p3768k65210o1700j81688r0493j54568
$$ 9128058 9020733 8874066 8660757 8667255 8593487 8328277 8266577 8084889 7994396 7839828
3198G839828j48925J5988r4145j83425j2783r794J070m3958r3537l9913q4241
$$ 7839828 7690903 7706891 7612746 7429321 7416538 7406744 7407814 7363856 7270319 7230406 7146165
3187G146165j43286q3820M7646o8628j59924m0732o0149P7770j3670j44845M0006
$$ 7146165 7002879 6919059 6966705 6898077 6738153 6697421 6637272 6715042 6701372 6556527 6596533
3176F596533o3405n4245j22004j51018N5402m5298K5830l4793l8671j58207j2956
$$ 6596533 6533128 6478883 6356879 6205861 6261263 6215965 6241795 6207002 6168331 6010124 5997168
3165E997168k2672q7714j1837j64052K3171P5737N131r6792j19384j5747l2310
$$ 5997168 5974496 5886782 5874945 5710893 5734064 5809801 5814932 5718140 5598756 5583009 5550699
3154E550699q4578N3154j26049L0989L639o4306O223q3662n224j31075L6290n3023
$$ 5550699 5466121 5519275 5393226 5424215 5427854 5363548 5369771 5286109 5280885 5149810 5186100 5133077
3142E133077j82449Q2860L440p069L1972j22576K8662N6515m1282j3503q1590
$$ 5133077 4950628 5033488 5036928 5029859 5061831 4939255 4967917 5024432 4983150 4969647 4888057
3131D888057J182p2852J9790J45033j254j5945J10563o5700K8424K2940L7364
$$ 4888057 4889239 4816387 4836177 4981210 4979956 4964011 5074574 5008874 5037298 5060238 5097602
3120E097602Q6777M3180Q6733M2133R9376R7973M9570m0756J85066J21710J72854
$$ 5097602 5184379 5227559 5314292 5356425 5455801 5553774 5603344 5562588 5747654 5869364 6042218
3109F042218J23246J73375K56658J42317K68669K62488O4726J63420J64453j696
$$ 6042218 6165464 6338839 6595497 6737814 7006483 7268971 7333697 7497117 7661570 7659874
3099G659874n7730K2391O9131J27767Q0609K13687K98987J50473P7613p9279n731
$$ 7659874 7602144 7624535 7693666 7821433 7902042 8115729 8414716 8565189 8642802 8563523 8557792
3088H557792o1029K9925K34812J83016K23609K46310J96022K78938O14024N10412
$$ 8557792 8496763 8526688 8761500 8944516 9168125 9414435 9610457 9889395 10503419 11013831
3078A1013831M63868J46645j7654Q700Q4741K66402K88576L59206L91999M82439
$$ 11013831 11477699 11624344 11606690 11615390 11700131 11966533 12255109 12614315 13006314 13488753
3068A3488753L60210K29593P5982J45127J56148K96689K13479J66268K25177J93596
$$ 13488753 13848963 14078556 14154538 14299665 14455813 14752502 14965981 15132249 15357426 15551022
3058A5551022J84856L70047K34798J75799M47931L17916K66187L68928M56509
$$ 15551022 15735878 16105925 16340723 16516522 16964453 17282369 17548556 17917484 18373993
3049A8373993M17726O56031O47329Q16499R40769J084770J038709Q48261L90486
$$ 18373993 18791719 19447750 20095079 20911578 21852347 22937117 23975826 24824087 25214573
3040B5214573m8513n58874q33730r82160o41818n57644l95342k26646r2586o9047
$$ 25214573 25166060 24607186 23773456 22791296 22149478 21591834 21196492 20969846 20877260 20808213
3030B0808213J80355K61996K49809M15005L87846L68709L00100L54981J99410
$$ 20808213 20988568 21250564 21500373 21915378 22303224 22671933 22972033 23327014 23526424
3021B3526424L8705j53214l25561m76539p34301p91664q35576q26527o55874p10067
$$ 23526424 23565129 23411915 23086354 22609815 21875514 21083850 20248274 19421747 18765873 18055806
3011A8055806m34781l18247k93978j51252j72166k04727j59789k47615l01803
$$ 18055806 17621025 17302778 17008800 16857548 16685382 16480655 16320866 16073251 15771448
3002A5771448m06051l73102m66266p35825p70334n79051n56096o36349o30180
$$ 15771448 15365397 14992295 14526029 13790204 13019870 12440819 11884723 11248374 10618194
2993A0618194m41754k97982l66921l82352l01605l04793k60099k94202j84125
$$ 10618194 10176440 9878458 9511537 9129185 8827580 8522787 8262688 7968486 7784361
2984G784361j89138j93208j92244j56395k47454j96090k34697k33393l01190j33502
$$ 7784361 7595223 7402015 7209771 7053376 6805922 6609832 6375135 6141742 5840552 5707050
2974E707050k21656q7141k04542j65268K8419j36787j80886k49821q8772L5585
$$ 5707050 5485394 5398253 5193711 5028443 5056862 4920075 4739189 4489368 4400596 4436181
2964D436181k29864j55207o2048r8597q5413K9888j21544l3545p9493p1123k9414
$$ 4436181 4206317 4051110 3989062 3890465 3805052 3834940 3713396 3679851 3600358 3529235 3499821
2953C499821k6756j37479j10773p9497m2980m9797o4482O3842k93980k6725j9535
$$ 3499821 3473065 3335586 3224813 3145316 3102336 3052539 2988057 3051899 2757919 2731194 2711659
2942B711659R75p9343j06394L4l0448n4060R671r0699n8583l0816n7252r7696
$$ 2711659 2712634 2633291 2526897 2526931 2496483 2442423 2452094 2361395 2302812 2271996 2214744 2117048
2930B117048n1992J21851j05710r4475n5513o577J0502o1905l9405n0627p5847
$$ 2117048 2065056 2186907 2081197 1986722 1931209 1924632 1935134 1873229 1833824 1783197 1707350
2919A707350K7962J2338m6596K2620q3183j51369l978M809L6273q2411J3667p7060
$$ 1707350 1735312 1747650 1701054 1723674 1640491 1489122 1485144 1489953 1526226 1443815 1457482 1380422
2907A380422j24596K8156M8275K3365l7444k9907m9787m331p486N0590q6266j5392
$$ 1380422 1255826 1283982 1332257 1355622 1318178 1288271 1238484 1234153 1226667 1277257 1190991 1175599
2895A175599N1330m4236l18m7966N4447k5785m6741j0428J3308K5149q4403N0594
$$ 1175599 1226929 1182693 1182375 1134409 1188856 1163071 1116330 1105902 1119210 1144359 1059956 1110550
2883A110550o203K403J9742k4811n4230k8978q9409K4455l0385M9014j0105N4066
$$ 1110550 1104347 1106750 1126492 1101681 1047451 1018473 929064 953519 923134 972148 962043 1016109
2871A016109p4069k9679N0746m918r9211P6737q0420O9358m3396j03486l9823
$$ 1016109 942040 912361 963107 958189 858978 935715 855295 924653 881257 777771 737948
2860G37948J6634Q4817k803L3886n8063p2L6713r6380K2153k9247P6489O9883
$$ 737948 754582 839399 836596 870482 812419 812347 849060 752680 774833 745586 822075 891958
2848H91958j12600K3677j3234J2617l7286l0751P67P75O386M7621J0061M3058
$$ 891958 779358 803035 789801 802418 765132 734381 735148 735923 742309 789930 799991 843049
2836H43049o6416l9824m7988q323r2691J9241N0684j1961k894P5805k4599j1826
$$ 843049 776633 736809 688821 680498 587807 607048 657732 645771 642877 718682 694083 682257
2824F82257m8726m0523R857m1715m6208M7583N991O8292k491M364K4595q9801
$$ 682257 633531 593008 602865 561150 514942 562525 568516 636808 634317 638681 663276 573475
2812E73475J4675L6201q217o0822k0252P5526o665q141L8281q4047j7437P9445
$$ 573475 588150 624351 616134 555312 535060 610586 603921 595780 634061 550014 532577 612022
2800F12022j03104q092k8468N2598P7123r8080j6678l8279j0538R9381l8073K6620
$$ 612022 508918 500826 472358 524956 602079 503999 487321 449042 438504 537885 499812 526432
2788E26432J7596p2401l3660j20840M7863J6979k0229J33905M2449q5709L989
$$ 526432 544028 471627 437967 317127 364990 381969 361740 495645 538094 452385 456374
2777D56374J9846M6003m5961K24n5775l2065k4217L527L3605O757l3304k8938
$$ 456374 476220 522223 476262 476486 420711 388646 364429 367956 401561 408318 375014 346076
2765C46076O9121l7034k1353l3101j118R428L8997o1786n8841o965P6986n061
$$ 346076 415197 378163 356810 323709 322591 332019 371016 309230 250389 243424 320410 315349
2753C15349J6949M859q781M9153m3226n2229j1460J6955j5176M8486l0275k2865
$$ 315349 332298 337157 328376 377529 334303 282074 270614 287569 272393 320879 290604 267739
2741B67739N8259l3298K2326k7493j6416p1971K1007j4284K2694K7110L033Q4408
$$ 267739 325998 292700 315026 287533 271117 199146 220153 205869 228563 255673 258706 343114
2729C43114j4539O0230j31999p3208N2211L7530j21770J4667j1151J16785J7275
$$ 343114 328575 388805 256806 183598 235809 273339 151569 166236 155085 271870 289145
2718B89145M9698j44964J6509k0212J38947N6244j02282k7943M6279k478k8677
$$ 289145 338843 193879 210388 190176 329123 385367 283085 255142 301421 298943 270266
2707B70266m0307k6866K394K239m8327M2224M5167L7159q2381j32341J52315L47
$$ 270266 229959 203093 205487 207726 159399 201623 246790 283949 201568 69227 221542 221889
2695B21889Q276p6973Q4639o0329K0715l8773O0457N2860r4660j6848O8219p3987
$$ 221889 230165 153192 237831 177502 198217 159444 219901 272761 178101 161253 229472 155485
2683A55485Q3675p8531J6816m3048J9811J52068j16269n1430k8492m3551N1747
$$ 155485 239160 160629 177445 134397 154208 306276 190007 138577 110085 66534 118281
2672A18281P4789K3123q4537J06794r0359n6685J3624n4566L082L9220P6205L783
$$ 118281 193070 216193 131656 238450 148091 91406 105030 50464 53546 92766 168971 172754
2660A72754R095N1l1738J2631p0245N140j0039N0754p98R5902L2178p9290n220
$$ 172754 181849 181900 150162 162793 92548 97688 87649 138403 137605 233507 265685 186395 181175
2647A81175j35380R9496J5299o781J677N0563l3452q4094J17304j2092j35066
$$ 181175 45795 145291 160590 153809 155486 206049 172597 88503 205807 193715 58649
2636E8649j3150M6303J43854M413m8863q4414n3385J06358n1986Q2278N332r1773
$$ 58649 45499 91802 235656 240069 191206 106792 53407 159765 107779 190057 195389 103616
2624A03616R841o6855J07821m1173J34845r8854l503j69893K140Q0022K5008l8420
$$ 103616 113457 46602 154423 113250 248095 149241 145738 -24155 -22015 58007 83015 44595
2612D4595P0528O0173j18910P6274j31953Q6160Q0340m1651j00744J20947L3184
$$ 44595 115123 175296 56386 132660 707 86867 167207 125556 24812 145759 178943
2601A78943m5033Q867n8557r662L1616J6692J7089L1716l1746q4369J9226J52691
$$ 178943 133910 142777 84220 74558 106174 122866 139955 171671 139925 55556 74782 227473
2589B27473n80j00938J213N7614J6580l3813J9292n3998n8754o8045J09361K727
$$ 227473 226893 125955 127168 184782 201362 167549 186841 132843 74089 6044 115405 118132
2577A18132k9884L692m7903M1554J20226k0822o2119l8486K5043M1742J2815q8950
$$ 118132 88248 91940 44037 85591 205817 184995 122876 84390 109433 151175 163990 75040
2565G5040k2577L1469n381k2904j0520K1494K1989L2484p6174L1645J57527j16358
$$ 75040 52463 83932 78551 55647 45127 66621 88610 121094 44920 76565 234092 117734
2553A17734l3800m1010J30971K8119j8849j2781j56601L4641P314Q2831j7630
$$ 117734 83934 42924 173895 202014 183165 170384 13783 48424 55738 138569 120939
2542A20939L0063l6223l4072Q0359r4014n245K7557O0019N5682j38226l3581P9569
$$ 120939 151002 114779 80707 161066 67052 61807 89364 149383 205065 66839 33258 112827
2530A12827O9651M0882l589l6454L8743q7473R4700n0590K7656K711m0141j0394
$$ 112827 182478 223360 219771 183317 222060 134587 229287 178697 206353 209064 168923 158529
2518A58529o076l7878o7786M8136L6603j1935O0401o8395K2540m070l0873J03746
$$ 158529 152453 114575 46789 94925 131528 119593 179994 111599 134139 130069 99196 202942
2506B02942K1198j3953l665L1618N2592r7637Q8593p4030N3527R5486l6129j3940
$$ 202942 224140 210187 206522 238140 290732 193095 281688 207658 261185 356671 320542 306602
2494C06602p626q200L3573Q7256M3600k1488J1763J02513O1460o0141J0256J13631
$$ 306602 298976 290776 324349 411605 455205 433717 445480 547993 609453 549312 559568 673199
2482F73199P0054J16852Q9532N8990l94l8527K17514O9082N7306L7391P445o6367
$$ 673199 743253 860105 949637 1008627 1008233 969706 1187220 1256302 1313608 1350999 1358444 1292077
2470A292077P9443K24779P7149J16360j4709J18286J82861J12091J63908J71026
$$ 1292077 1371520 1596299 1673448 1789808 1775099 1893385 2076246 2188337 2352245 2523271
2460B523271J72775J99244K32511L00183L23907M12306M18917L68378M47798N22467
$$ 2523271 2696046 2895290 3127801 3427984 3751891 4164197 4583114 4951492 5399290 5921757
2450E921757N08068P35085J133049J611596K024737K833237M721126N185385N58648
$$ 5921757 6429825 7164910 8297959 9909555 11934292 14767529 19488655 24674040 25232688
2441B5232688l911685m719053l272229k505520j941842j391992j092483q90994
$$ 25232688 21321003 16601950 13329721 10824201 8882359 7490367 6397884 5506890
2433E506890o15342l72661l19714n35002n08736k80362k34985k55525j57567j61493
$$ 5506890 4891548 4518887 4199173 3664171 3155435 2875073 2640088 2384563 2226996 2065503
2423B065503j79334p0754p1669j82199j3190j75014j64765p8889r2793j6106P816
$$ 2065503 1886169 1815415 1743746 1561547 1548357 1373343 1208578 1129689 1036896 1020790 1028606
2412A028606r6592r9875O4299j25919L8721j02352o2777K5669O513m7449m4204
$$ 1028606 932014 832139 896438 770519 809240 706888 644111 669780 676293 628844 584640
2401E84640n2619j3196Q941M6687j0598j41306p5098M9019N9231l7962L6243q8329
$$ 584640 532021 518825 527766 574453 563855 422549 347451 396470 455701 417739 453982 365653
2389C65653M5061l3619q4514K5625q5776k624L6487k3239O260J3489j0742L2665
$$ 365653 410714 377095 292581 318206 232430 229806 266293 243054 249314 262803 252061 284726
2377B84726l0803k2398j9475J5245O11j9526N636m0262K084O4485k1960k0079
$$ 284726 253923 231525 212050 227295 227906 208380 214016 173754 175838 240323 218363 198284
2365A98284l3178o2725q3871L2169N6557p7490R8507K0517j8559K9080K3920P624
$$ 198284 165106 102381 18510 50679 107236 29746 128253 148770 130211 159291 183211 190835
2353A90835j23904K4301M6082K4040m2862J4606O9943j10728j13834M215L3011
$$ 190835 66931 91232 137314 161354 118492 133098 203041 92313 -21521 -17306 15705
2342A5705Q8610j39679q286k1663R4786Q8922O991k8172J1143k3782K6669p0025
$$ 15705 104315 -35364 -43650 -65313 29473 118395 125386 97214 108357 84575 111244 41219
2330D1219K4164n6642J5777P4724O927k9302n3990p867L8442j8247J7491Q2897
$$ 41219 65383 8741 24518 99242 106169 76867 22877 15010 53452 35205 52696 135593
2318A35593M0893n3047j05485N4811J36695q1687j00296q250j145M1654L8446
$$ 135593 176486 123439 17954 72765 209460 127773 27477 19227 18082 59736 98182
2307I8182m9890R0902m0048k6443Q9756j49713J02710o9334q419J1692p0749l4929
$$ 98182 48292 139194 99146 72703 162459 12746 115456 46122 37703 49395 -21354 -56283
2295e6283Q882J06152k7955J5379o1654o1132Q3963K3803M4170o66K9225j28430
$$ -56283 -47401 58751 30796 46175 -15479 -76611 7352 31155 75325 74659 103884 -24546
2283b4546j0047K0312K483p0602J369N8319N3384K5523o8849k2053L0143M3792
$$ -24546 -34593 -14281 -11798 -82400 -81031 -22712 30672 56195 -12654 -34707 -4564 39228
2271C9228q9504K5461N7843j768k8585L3336Q9038l8545n7119J08827q0382n1949
$$ 39228 -50276 -24815 33028 31260 2675 36011 125049 86504 29385 138212 57830 5881
2259E881O4646l4246J7822r0476J20887n4817N5085r2133k5723K5035O962L5209
$$ 5881 70527 36281 54103 -36373 84514 29697 84782 -7351 -33074 -8039 -1077 34132
2247C4132n613O7873l0485J6396k2908Q6474r0745R4900Q2249j02739m9149m8580
$$ 34132 28519 96392 65907 82303 59395 145869 55124 150024 232273 129534 80385 31805
2235C1805M9694n6848M1823n3938m4509R8017r7268R500P0720L1873m6044l7122
$$ 31805 81499 24651 66474 12536 -31973 66044 -31224 -21724 48996 80869 34825 -2297
2223b297L7819J39191o9836m9702N132q7022q713L0665J8047M5120M4260l4651
$$ -2297 35522 174713 104877 55175 60307 -26715 -35428 -4763 13284 58404 102664 68013
2211F8013J0258o7504j03834k8876J95984j8095o9729k3677K4984M1650l0653
$$ 68013 78271 10767 -93067 -121943 74041 55946 -13783 -37460 -12476 29174 -1479
2200a479n3614L1362m5860L5194N1968j13791O3583N4134M3130o1872L4099P1626
$$ -1479 -55093 -23731 -69591 -34397 17571 -96220 -32637 21497 64627 2755 36854 108480
2188A08480m6796j2684q9127P269m6704m7941l4410J44119K4452M189M6678q8797
$$ 108480 61684 49000 -40127 -32858 -79562 -127503 -161913 -17794 6658 10847 57525 -31272
2176c1272N5374P3177r7313L350J8685m4610M4262k1857o3694k0484o6986O6625
$$ -31272 24102 97279 -34 3316 22001 -22609 21653 -204 -63898 -84382 -151368 -84743
2164h4743M3035N121N6303p2530k2712N2169M4490m3732N574K867J09499p6687
$$ -84743 -41708 -36587 19716 -52814 -75526 -23357 21133 -22599 -17025 -14158 95341 18654
2152A8654Q4701p9006L0108n7880k8788J02706l4590k0399M9197P934j3191j2533
$$ 18654 103355 24349 54457 -3423 -32211 70495 35905 15506 64703 72637 59446 46913
2140D6913k8877k234m3930m6578J5171J03642q4567j5607M1564M3472n5830j3925
$$ 46913 18036 15802 -28128 -74706 -59535 44107 -40460 -56067 -14503 28969 -26861 -40786
2128d0786P0292q9343J5173K2122j013K5097r812n790o844M7066Q1957m8726j3609
$$ -40786 29506 -59837 -44664 -22542 -23555 1542 -8270 -14060 -20904 26162 108119 59393 45784
2115D5784j5829J097q7633P1882N414K3497j8513J1522n9434k0209J05081r983
$$ 45784 29955 31052 -56581 15301 20715 44212 25699 37221 -22213 -42422 62659 52676
2103E2676q1353M1241l9221n7821Q7980n1562m1801J8074K6045M2305O532k7730
$$ 52676 -28677 12564 -26657 -84478 3502 -48060 -89861 -71787 -45742 -3437 3095 -24635
2091b4635k5269K7402M3750k7761q8314o9805R2420J5787J8148M7513M9391l0003
$$ -24635 -49904 -22502 21248 -6513 -94827 -164632 -72212 -56425 -38277 9236 58627 28624
2079B8624m7626m1771k1129R5Q3906j08888M0619l6194J7486m1140P5299K3075
$$ 28624 -19002 -60773 -81902 -81807 2099 -106789 -66170 -102364 -84878 -126018 -50719 -27644
2067b7644j01744P3750j0451K8781L6315n0266m796R942K2613m1009J21821m8247
$$ -27644 -129388 -55638 -66089 -37308 -993 -51259 -56055 -46113 -23500 -64509 57312 9065
2055I065Q789j34297l5633Q8633J06999j7965J6885K7705L369N200j47577L4649
$$ 9065 17854 -116443 -152076 -63443 43556 25591 42476 70181 73550 78750 -68827 -34178
2043c4178O15J5448k1094N8364o4258l4965R0606q9015m403m1906J9519R8040
$$ -34178 -33563 -18115 -39209 19155 -45103 -80068 10538 -78477 -82880 -124786 -105267 -7227
2031g227k8672K2792M8713p8053k7098j7023P3496O2026j7091L3997J4620q7835
$$ -7227 -35899 -13107 35606 -42447 -69545 -86568 -13072 48954 31863 65860 80480 -7355
2019g355k5268K7780r1078O4764N5313n3108j01550K6564K0926l0682N0835Q0127
$$ -7355 -32623 -4843 -95921 -31157 24156 -28952 -130502 -103938 -83012 -113694 -62859 17268
2007A7268K4237J5676q1980n7791L4521k9605m6940P2766m5316K5009J09083j9275
$$ 17268 41505 57181 -24799 -82590 -48069 -77674 -124614 -51848 -97164 -72155 36928 17653
1995A7653l3150j2671m2345J45026q6656J6659l8940j6066P7922r0908P8479K6860
$$ 17653 -15497 -28168 -70513 74513 -12143 4516 -34424 -50490 27432 -63476 15003 41863
1983D1863j1994l2239J6257R648o8411K8451q3645R5572m8004R145N0573p372
$$ 41863 29869 -2370 13887 23535 -44876 -16425 -100070 -4498 -52502 -43357 7216 -156
1971a56l5033k746N6789l9320L3109j1698K0161k3551k7962l5306L526J3972N8425
$$ -156 -35189 -37935 18854 -20466 12643 945 21106 -2445 -30407 -65713 -62187 -48215 10210
1958A0210q884M703p341l8472J14911N6784o2849p6346k3769k9627J12252j8254
$$ 10210 1326 6029 -1312 -39784 75127 131911 69062 -7284 -31053 -60680 51572 33318
1946C3318K6070m3887M0594r7227L0669K0150j28191M315Q9994L0796Q378m3734
$$ 33318 59388 15501 56095 -41132 -10463 9687 -118504 -114189 -24195 6601 14979 -28755
1934b8755N6030m5788L0792j9985p1232M7525n7576N7020k5577k6289K4623R6298
$$ -28755 27275 -18513 12279 -7706 -78938 -31413 -88989 -31969 -57546 -83835 -59212 37086
1922C7086k2684N7068L9653Q407p3130O791j63483K8282L3478n2106l051L7656
$$ 37086 14402 71470 111123 119530 46400 53191 -110292 -82010 -48532 -100638 -103689 -66033
1910f6033M1301O3592j7660p9134N682O7746L5286n4017k1809m0387J1933N271
$$ -66033 -24732 38860 21200 -57934 -52252 15494 50780 -3237 -25046 -65433 -53500 -48229
1898d8229P3003M6918j11769N8891q0489n93J458J22641p7232j16954P3863Q3950
$$ -48229 24774 71692 -40077 18814 -61675 -62268 -60810 61831 -15401 -132355 -58492 25458
1886B5458N8613j61921k3271P9515Q880P4450o7261l5284J4149q9152M2777N5462
$$ 25458 84071 -77850 -101121 -21606 -12726 61724 -5537 -40821 -26672 -115824 -73047 -17585
1874a7585r0322N5794l4405L8590Q9398n9639q1233J3652k3525J01374n8201R286
$$ -17585 -107907 -52113 -86518 -47928 41470 -18169 -99402 -85750 -109275 -7901 -66102 -56816
1862e6816J16776j28421l6871j9950J3580L8481p435J5632P0241o6404J02250
$$ -56816 59960 -68461 -105332 -125282 -111702 -73221 -80656 -65024 5217 -61187 41063
1851D1063J276l9095L8430l9781n6889j0975l4822J09584J8787N0938P315n2193
$$ 41063 42339 3244 41674 1893 -54996 -65971 -100793 8791 27578 78516 85831 33638
1839C3638l8098n975j7407n5350L7586J7621l7730J4984k4010n5577r392R2811
$$ 33638 -4460 -10435 -27842 -83192 -45606 -27985 -65715 -50731 -74741 -130318 -139710 -46899
1827d6899K5209M4516k4098l8327P7211L1094m8929n5969K4135k9328K7221Q9752
$$ -46899 -21690 22826 -1272 -39599 37612 68706 19777 -36192 -12057 -41385 -14164 75588
1815G5588j16821m671J1425J2847K1066L019l1036j7002J01567o2328n7806k5679
$$ 75588 -41233 -45904 -34479 -21632 -566 2453 -28583 -45585 55982 -6346 -64152 -89831
1803h9831K8796M298q116N3579L3816q6463p2675J1873J39659j1030k4809m7607
$$ -89831 -61035 -56737 -64853 -11274 22542 -63921 -136596 -124723 14936 3906 -20903 -68510
1791f8510J6975O772l7529M270K9204m8746r618L8288J148R1240J919P2533o9625
$$ -68510 -51535 -44763 -82292 -78022 -48818 -97564 -107182 -68894 -67746 23494 25413 97946 28321
1778B8321n6529m8483P368Q2162p7180J02884M3314q5967j4236l2465m500J05961
$$ 28321 -28208 -76691 -69323 12839 -64341 38543 81857 -4110 -18346 -50811 -55311 50650
1766E0650q2794m1595K7764J8846k7878p2472M8985J9466P4412j3266J01853j15122
$$ 50650 -32144 -73739 -45975 -27129 -55007 -127479 -78494 -59028 15384 2118 103971 -11151
1754a1151M272J3226j2772m6049J7053n0813N4320K3269p2463j366N6962O188
$$ -11151 -6879 6347 -6425 -52474 -35421 -86234 -31914 -8645 -81108 -82474 -25512 -19324
1742a9324j571j1778n3779M8743L3700K8713p1335r0633Q6543J5690k1403M291
$$ -19324 -20895 -32673 -86452 -37709 -4009 24704 -46631 -137264 -50721 -35031 -56434 -52143
1730e2143m7379M5687m6938K1980K2280M3551q2793M1k4432P202N6207M6506m5636
$$ -52143 -99522 -53835 -100773 -78793 -56513 -12962 -95755 -95714 -120146 -112944 -56737 -10231 -55867
1717e5867Q5444k0583L793N9598r5639k6688K9218l755l901l021k7742o0605Q6494
$$ -55867 29577 8994 12787 72385 -23254 -49942 -20724 -24479 -28380 -31401 -59143 -119748 -33254
1704c3254r197q7868M4351n6735J41012M4174o7969O240K0978K8386j21993j02382
$$ -33254 -42451 -130319 -85968 -142703 -1691 42483 -25486 -19246 1732 30118 -91875 -194257
1692a94257l0662R1860N6713N1003q9728O5401l1191N2162J02808q3738j85916
$$ -194257 -224919 -133059 -76346 -25343 -115071 -49670 -80861 -28699 74109 -9629 -195545
1681a95545O7080J28901j5043Q3321l6685p6860O6549L0865k805J2464j40777
$$ -195545 -128465 436 -14607 68714 32029 -44831 21718 52583 49778 62242 -78535
1670g8535K3054Q0684j6753n2777n5277q163P4197L287J8743n3472P7623L2057
$$ -78535 -55481 25203 8450 -44327 -99604 -107767 -33570 -30283 -11540 -65012 12611 44668
1658D4668l9619M9746j05815n904k3765J7096O2085m1905l1532n0262R0795N4883
$$ 44668 5049 54795 -51020 -56924 -80689 -63593 -1508 -43413 -74945 -125207 -34412 20471
1646B0471J09924j16872p3823J9469K4990k1502R2414k0169r1550Q0399M3469
$$ 20471 130395 13523 -60300 -40831 -15841 -37343 55071 34902 -56648 23751 67220
1635F7220o7680m7681N0794n0610R0568O2253q5372j4698M2271L8145r2871j7296
$$ 67220 -460 -48141 2653 -47957 42611 104864 19492 4794 47065 85210 -7661 -24957
1623b4957p0449Q306m7581J00164L5098j8370K7049K4882K1978k6452p1820j1856
$$ -24957 -95406 -87100 -134681 -34517 581 -17789 9260 34142 56120 29668 -42152 -54008
1611e4008k2537Q827J7755k2687p815N5177N0198K3500M7932q7760n6655j4377
$$ -54008 -76545 -67718 -49963 -72650 -80465 -25288 24910 48410 96342 8582 -48073 -62450
1599f2450R4048J5149r099l021n8339l2104L4127l6717J8084l2229Q917L6369
$$ -62450 31598 46747 37648 34627 -23712 -55816 -21689 -58406 -40322 -72551 -63634 -27265
1587b7265Q1146j4911l6036J919j9633M278k929K8567P0962N0152r7604o5916
$$ -27265 53881 38970 2934 4853 -14780 -10502 -13431 15136 86098 136250 38646 -27270
1575b7270L7484M709N3399L0705j00178k1064j9764m0267P2480o7727k3490K7398
$$ -27270 10214 14923 68322 99027 -1151 -22215 -41979 -82246 -9766 -77493 -100983 -73585
1563g3585K4545N0747K6369l1688M0274k8452L4926n7270K63J4771l5128l0108
$$ -73585 -49040 1707 28076 -3612 36662 8210 43136 -14134 -13871 900 -34228 -64336
1551f4336L0827l4174L0366L8211O259m35L5325q1496M9498k7806p0475N6985
$$ -64336 -33509 -67683 -37317 894 7153 6718 42043 -39453 10045 -17761 -88236 -31251
1539c1251Q3023M4831q9053m9229O4313M2384q7411M9568r522k3485L3802L665
$$ -31251 51772 96603 7550 -41679 22634 65018 -22393 27175 17653 -5832 27970 31635
1527C1635k8109m6159l3127O4991l1972q1458o4904K17500M8088l8339J01984
$$ 31635 3526 -42633 -75760 -10769 -42741 -124199 -189103 28397 76485 38146 140130
1516A40130n1521q2428p1365N8633q449M6774L7894q7393Q6113k0545q6082J3529
$$ 140130 88609 6181 -65184 -6551 -15000 31774 69668 -17725 68388 47843 -38239 -24710
1504b4710q552j04628R4726Q5461m2140o9436N3585n8278O8181k289p5614R0449
$$ -24710 -33262 -137890 -43164 42297 157 -69279 -15694 -73972 -5791 -8080 -83694 6755
1492F755q712r5614K9845l0241k3923J94563r7588k5173K8865p061k9954R3653
$$ 6755 -1957 -97571 -67726 -97967 -121890 72673 -24915 -50088 -21223 -28284 -58238 35415
1480C5415j4686J4144j19463K9657L8581j7912K0286P45J5584m6952R2675n0988
$$ 35415 20729 34873 -84590 -54933 -16352 -34264 -13978 -13233 2351 -44601 48074 -2914
1468b914m0316J12942L8378j16154O7173j1465m2591r0869Q8653O361k5736N5891
$$ -2914 -43230 69712 108090 -8064 59109 47644 5053 -85816 2837 9198 -16538 39353
1456C9353j20175m4114P4822L4471n308p5884J28537L9735l0491p4632J04020
$$ 39353 -80822 -124936 -50114 -15643 -20951 -96835 31702 71437 40946 -33686 70334
1445G0334J1213m0133Q172n932O7108m1179j1824q5743k4901k6349n5420L3004
$$ 70334 81547 41414 49586 43654 110762 69583 57759 -27984 -52885 -79234 -134654 -101650
1433a01650M5004m2909L3107N280M5297R9927k8073k6112J51064p0291n7470m0512
$$ -101650 -56646 -99555 -66448 -61168 -15871 84056 55983 29871 180935 110644 53174 12662
1421A2662R1025k0704p5800n5774l0800K9786l4807J34445r7132k134o9019l0925
$$ 12662 103687 82983 7183 -48591 -79391 -49605 -84412 50033 -47099 -49233 -118252 -149177
1409a49177J68373j2982k4925m0412Q38P1167m2135l800j5313R4489N1767n1039
$$ -149177 19196 6214 -18711 -59123 -58285 12882 -29253 -33053 -48366 46123 97890 46851
1397D6851r674P7394m4059J8132r4492j7976J44806j23611K1053M553o0804M567
$$ 46851 37177 114571 70512 88644 -5848 -23824 120982 -2629 18424 22977 -37827 -33260
1385c3260k5417J26470q5976o6983Q5989J12047o3545k5677J8856k4004K592M2323
$$ -33260 -58677 67793 -18183 -85166 823 112870 49325 23648 42504 18500 21092 63415
1373F3415j6002m6576O2892n7688K409m1597J3211M3812R227N5707q1053M2681
$$ 63415 47413 837 63729 6041 8450 -33147 -19936 23876 33103 88810 7757 50438
1361E0438n946q5584j6741J3357P7135j11206J631K364M2189m7768O6337j8882
$$ 50438 44492 -41092 -57833 -44476 32659 -78547 -76916 -74552 -32363 -80131 -13794 -32676
1349c2676O7335O9583l1796o8323L6609m4524k366r8785J18929O4892j72775j4628
$$ -32676 34659 104242 72446 4123 40732 -3792 -6158 -104943 13986 78878 -93897 -108525
$$ [...]
##END NTUPLES=NMR SPECTRUM
##END=
