##TITLE=1H_EC-3305(VI-23)
 CDCl3
 8 sc, 
 4.7.2024
##JCAMPDX= 6.0         $$ Bruker NMR JCAMP-DX V2.0
##DATA TYPE= NMR SPECTRUM
##DATA CLASS= NTUPLES
##ORIGIN= UXNMR, Bruker Analytische Messtechnik GmbH
##OWNER= root
$$ XWIN-NMR		Version 3.5
$$ Thu Jul  4 13:41:42 2024 Russian Standard Time (UT+4h)  she@DPX200
##.OBSERVE FREQUENCY= 200.1314
##.OBSERVE NUCLEUS= ^1H
##.ACQUISITION MODE= SIMULTANEOUS
##.ACQUISITION SCHEME= undefined
##.AVERAGES= 8
##.DIGITISER RES= 18
##SPECTROMETER/DATA SYSTEM= spect
##.PULSE SEQUENCE= zg30
##.SOLVENT NAME= DMSO
##.SHIFT REFERENCE= (INTERNAL, DMSO, 0, 21.419)
##AUDIT TRAIL= $$ (NUMBER, WHEN, WHO, WHERE, WHAT)
$$ ##TITLE= Audit trail, XWIN-NMR		Version 3.5
$$ ##JCAMPDX= 5.01
$$ ##ORIGIN= Bruker BioSpin GmbH
$$ ##OWNER= she
$$ F:/spectra/data/she/nmr/H-F/1/pdata/1/auditp.txt
$$ ##AUDIT TRAIL=  $$ (NUMBER, WHEN, WHO, WHERE, WHAT)
(   1,<2024-07-04 13:40:26.87 +0400>,<she>,<DPX200>,
      <created by zg, POWCHK disabled, PULCHK disabled
       configuration hash MD5:
       00 E9 B6 7A A2 85 ED C7 34 08 36 98 17 FE 4E 26
       data hash MD5: 16K
       D0 06 71 4D 6A 18 69 03 94 C5 63 03 2E 34 B1 DC>)
(   2,<2024-07-04 13:40:32.37 +0400>,<she>,<DPX200>,
      <Start of raw data processing
       efp BC_mod = 2 LB = 0.24 FT_mod = 6 PKNL = 1 PHC0 = -25501.26 PHC1 = 4.787481 SI = 16K 
       data hash MD5: 16K
       94 84 FB FB 65 8E 0C 4D B4 EE E5 3E 44 33 3C DC>)
(   3,<2024-07-04 13:40:52.71 +0400>,<she>,<DPX200>,
      <pk PHC0 = -21.66741 PHC1 = 31.2 
       data hash MD5: 16K
       66 64 95 8B 91 E4 4A 5B 93 CF C4 5E 3F 80 C2 DF>)
(   4,<2024-07-04 13:40:58.17 +0400>,<she>,<DPX200>,
      <abs ABSG = 5 
       data hash MD5: 16K
       91 38 6D 32 11 A2 B5 F1 50 5E 6C A8 78 F7 43 A0>)
$$ ##END=
$$ 
$$ hash MD5
$$ 10 D1 D6 60 82 8A 89 38 65 AB 5E D8 C1 F7 79 67
##$RELAX= 
##$RELAX= 
##$RELAX= 
##$RELAX= 
##$RELAX= 
##$RELAX= 
$$ Bruker specific parameters
$$ --------------------------
##$DU= <F:/spectra>
##$EXPNO= 1
##$NAME= <H-F>
##$PROCNO= 1
##$TYPE= <nmr>
##$USER= <she>
##$AMP= (0..31)
100 100 100 100 100 100 100 100 100 100 100 100 100 100 100 100 100 100 
100 100 100 100 100 100 100 100 100 100 100 100 100 100 
##$AQSEQ= 0
##$AQ_mod= 1
##$AUNM= <au_zg>
##$AUTOPOS= <>
##$BF1= 200.13
##$BF2= 200.13
##$BF3= 200.13
##$BF4= 200.13
##$BF5= 200.13
##$BF6= 200.13
##$BF7= 200.13
##$BF8= 200.13
##$BYTORDA= 1
##$CFDGTYP= 0
##$CFRGTYP= 5
##$CHEMSTR= <none>
##$CNST= (0..31)
1 1 145 1 1 1 1 1 1 1 1 1 1 1 1 1 1 1 1 1 1 1 1 1 1 1 1 1 1 1 1 1 
##$CPDPRG= <>
##$CPDPRG1= <>
##$CPDPRG2= <>
##$CPDPRG3= <>
##$CPDPRG4= <mlev>
##$CPDPRG5= <mlev>
##$CPDPRG6= <mlev>
##$CPDPRG7= <mlev>
##$CPDPRG8= <mlev>
##$CPDPRGB= <>
##$CPDPRGT= <>
##$D= (0..31)
0 1.2 0 0 0 0 0 0 0 0.06 0 0.03 0 0 0 0 0.0002 0 0 0 0 0 0 0 0 0 0 0 0 
0 0 0 
##$DATE= 1720086026
##$DBL= (0..7)
120 120 120 120 120 120 120 120 
##$DBP= (0..7)
150 150 150 150 150 150 150 150 
##$DBP07= 0
##$DBPNAM0= <>
##$DBPNAM1= <>
##$DBPNAM2= <>
##$DBPNAM3= <>
##$DBPNAM4= <>
$$ [...]
##$SUBNAM3= <"">
##$SUBNAM4= <"">
##$SUBNAM5= <"">
##$SUBNAM6= <"">
##$SUBNAM7= <"">
##$SUBNAM8= <"">
##$SUBNAM9= <"">
##$SW= 24.0689651099613
##$SWIBOX= (0..15)
0 0 2 0 0 0 0 0 0 0 0 0 0 0 0 0 
##$SW_h= 4816.95568400771
##$TD= 16384
##$TD0= 1
##$TE= 0
##$TE2= 300
##$TE3= 300
##$TEG= 300
##$TL= (0..7)
0 120 120 120 120 120 120 120 
##$TP= (0..7)
150 150 150 150 150 150 150 150 
##$TP07= 0
##$TPNAME0= <>
##$TPNAME1= <>
##$TPNAME2= <>
##$TPNAME3= <>
##$TPNAME4= <>
##$TPNAME5= <>
##$TPNAME6= <>
##$TPNAME7= <>
##$TPOAL= (0..7)
0.5 0.5 0.5 0.5 0.5 0.5 0.5 0.5 
##$TPOFFS= (0..7)
0 0 0 0 0 0 0 0 
##$TUNHIN= 0
##$TUNHOUT= 0
##$TUNXOUT= 0
##$USERA1= <user>
##$USERA2= <user>
##$USERA3= <user>
##$USERA4= <user>
##$USERA5= <user>
##$V9= 5
##$VALIST= <valist>
##$VCLIST= <CCCCCCCCCCCCCCC>
##$VD= 0
##$VDLIST= <DDDDDDDDDDDDDDD>
##$VPLIST= <PPPPPPPPPPPPPPP>
##$VTLIST= <TTTTTTTTTTTTTTT>
##$WBST= 1024
##$WBSW= 4
##$XGAIN= (0..3)
0 0 0 0 
##$XL= 0
##$YL= 0
##$YMAX_a= 260409
##$YMIN_a= -335961
##$ZGOPTNS= <>
##$ZL1= 120
##$ZL2= 120
##$ZL3= 120
##$ZL4= 120
##$ABSF1= 21.43221
##$ABSF2= -2.63698
##$ABSG= 5
##$ABSL= 3
##$ALPHA= 0
##$AQORDER= 0
##$ASSFAC= 0
##$ASSFACI= 0
##$ASSFACX= 0
##$ASSWID= 0
##$AUNMP= <proc_1d>
##$AZFE= 0.1
##$AZFW= 0.1
##$BCFW= 0
##$BC_mod= 2
##$BYTORDP= 0
##$COROFFS= 0
##$CY= -3
##$DATMOD= 1
##$DC= 0
##$DFILT= <>
##$DTYPP= 0
##$F1P= 0
##$F2P= 0
##$FCOR= 1
##$FTSIZE= 16384
##$FT_mod= 6
##$GAMMA= 0
##$GB= 0
##$INTBC= 1
##$INTSCL= 3.70164e-10
##$ISEN= 128
##$LB= 0.24
##$LEV0= 0
##$LPBIN= 0
##$MAXI= 10000
##$MC2= 0
##$MEAN= 0
##$ME_mod= 0
##$MI= 1.114404
##$NCOEF= 0
##$NC_proc= -7
##$NLEV= 6
##$NOISF1= 3.799351
##$NOISF2= 2.8
##$NSP= 0
##$NTH_PI= 0
##$NZP= 0
##$OFFSET= 21.41899
##$PC= 1
##$PHC0= -25522.93
##$PHC1= 35.98748
##$PH_mod= 1
##$PKNL= yes
##$PPARMOD= 0
##$PSCAL= 0
##$PSIGN= 0
##$REVERSE= no
##$SF= 200.129521904432
##$SI= 16384
##$SIGF1= 3
##$SIGF2= 2
##$SINO= 5.538805
##$SIOLD= 16384
##$SREGLST= <1H.CDCl3>
##$SSB= 0
##$STSI= 16384
##$STSR= 0
##$SW_p= 4816.95568400771
##$SYMM= 0
##$S_DEV= 0
##$TDeff= 16384
##$TDoff= 0
##$TI= <>
##$TILT= no
##$TM1= 0
##$TM2= 0
##$TOPLEV= 0
##$USERP1= <user>
##$USERP2= <user>
##$USERP3= <user>
##$USERP4= <user>
##$USERP5= <user>
##$WDW= 1
##$XDIM= 16384
##$YMAX_p= 491920639
##$YMIN_p= -2938235
$$ End of Bruker specific parameters
$$ ---------------------------------
##NTUPLES= NMR SPECTRUM
##VAR_NAME=  FREQUENCY,     SPECTRUM/REAL,   SPECTRUM/IMAG
##SYMBOL=    X,             R,               I
##VAR_TYPE=  INDEPENDENT,   DEPENDENT,       DEPENDENT
##VAR_FORM=  AFFN,          ASDF,            ASDF
##VAR_DIM=   16384,         16384,           16384
##UNITS=     HZ,            ARBITRARY UNITS, ARBITRARY UNITS
##FACTOR=    0.29402158847633, 1,            1
##FIRST=     4286.57206457351, 0,            0
##LAST=      -530.3836194342, 0,             0
##MIN=       -530.3836194342, -2938235,      0
##MAX=       4286.57206457351, 491920639,    0
$$ Real data points
##PAGE= N=1
##DATA TABLE= (X++(R..R)), XYDATA
$$ [...]
6679C3786849k153215j303086n214J10894P06807R18614R42532J264150J972507
6670C6240838K214040K216286K327440J666814M59862k80984j77320Q51512J934254
6661D7452742K052566R13428k87863m73523J328986K524157K921302L067389J829873
6652F1329057j562788n594857p020724n767386m006194k187352j267320O8418
6644C3990854J117050K029362K516489L143194L399673L270035J960002J93027
6636E1619686r20859k095709l044537l667122l459557j914429q25629J87518J370215
6627C7249577Q41943o06608k890228m337856m073056l207312k300831j786010
6619A8889619j672131p54019k03662p9824o8409M12917L61177o4477K22008K45048
$$ y = [33786849, 31633634, 30330548, 30325334, 30436228, 31143035, 32061649, 33004181, 34268331, 36240838, 38454878, 40671164, 42998604, 44665418, 45125280, 44844296, 44666976, 45518488, 47452742, 49505308, 50418736, 50130873, 49657350, 50986336, 53510493, 56431795, 59499184, 61329057, 59766269, 54171412, 47150688, 41383302, 37377108, 35189756, 33922436, 33990854, 35107904, 37137266, 39653755, 42796949, 46196622, 49466657, 51426659, 51619686, 50698827, 48603118, 45558581, 41891459, 38431902, 36517473, 35691844, 35879362, 37249577, 38091520, 37484912, 34594684, 30256828, 26183772, 22976460, 20675629, 18889619, 17217488, 16463469, 16259807, 16179983, 16111574, 16524491, 16885668, 16821191, 17043199, 17288247]
6609A7288247k66449k49588l06506m51064j54187n3252L40584M39364L3755L56126
6599A6977030N09780m05128n11394n53541p72329o93764l53947k37720o70414
6590A3288573k04077K25027k30402L01437M89236L75789M35978K26398l47543
6581A4560416k67460L33345K22802Q4002O06485K28884J6637L26158P20092J52568
6571A6983929P28095J304082J025466J164992J363988J188792J638157J594044
6563B6991545O75684j586368k277969j653741q26529M83260J125403R26985L88894
6554B4247164n9532o68384j912719j870251j327892j017654n83528l06977P326
6545A6507553j95108l29924L02186J236005J078213O78591J313318J697910J724109
$$ y = [17288247, 17021798, 16772210, 16465704, 16014640, 15860453, 15807201, 16147785, 16587149, 16620904, 16977030, 17486810, 17081682, 16570288, 16016747, 15244418, 14550654, 14196707, 13958987, 13288573, 13084496, 13309523, 13079121, 13380558, 13869794, 14245583, 14681561, 14907959, 14560416, 14292956, 14626301, 14849103, 14933105, 15539590, 15768474, 15785111, 16111269, 16831361, 16983929, 17712024, 19016106, 20041572, 21206564, 22570552, 23759344, 25397501, 26991545, 27667229, 26080861, 23802892, 22149151, 21322622, 21805882, 22931285, 23858270, 24247164, 24187632, 23519248, 21606529, 19736278, 18408386, 17390732, 16807204, 16500227, 16507553, 16312445, 15982521, 16284707, 17520712, 18598925, 19277516, 20590834, 22288744, 24012853]
6536B4012853K484616K068162P03479N87752K44412j261890k008953j046449j58774
6527B5625208O73988J179675M18353l96903j172783k271703l222618k876620j974291
6518A5982306r36719j128509n13379n05932j30043J60811j23539P7047N28996
6509A3411039M35069L51123Q94249O92415P56678J039792n8254j188855q81814
6500A5451442m59919j41311O75096R44297O07174P21775r25718j296297j495512
6491A4081027j055186j331498j272334l06276j32250k52520o35063o610m07418
6482H681872p7481l69314m27535m24973k52937k36096k001p13637j36856Q6998
6472F128040K08321M25855o6456K52143K95230l47993O19995M06875K79568o32060
$$ y = [24012853, 26497469, 28565631, 29269110, 29856862, 30101274, 28839384, 26830431, 25783982, 25625208, 26299196, 27478871, 27897224, 27500321, 26327538, 24055835, 20833217, 17956597, 15982306, 15045587, 13917078, 13403699, 12897767, 12767724, 12928535, 12804996, 12882043, 13411039, 13846108, 14197231, 15091480, 15783895, 16540573, 17580365, 17522111, 16333256, 15451442, 14991523, 14850212, 15525308, 16469605, 17076779, 17798554, 16872836, 15576539, 14081027, 13025841, 11694343, 10422009, 10115733, 9983483, 9730963, 9095900, 9089290, 8681872, 8604391, 8235077, 7807542, 7382569, 7129632, 6893536, 6891535, 6177898, 6041042, 6128040, 6336361, 6762216, 6695760, 6947903, 7243133, 6895140, 7515135, 7922010, 8201578, 7569518]
6462G569518k46114Q772p4683m37151j5383j21226j32597k83687J2176m30825
6452E848800j30347K43910p22375n7410k21221m4013l67436j5649l181j15427
6442D415651O375K08378J79208p0660K92780N95220J10173L17512l50030k36305
6432E468302L10548m67710m50667J43871p08667j73654M72392q9571k44007J55795
6422D416632K25245q6148j55362j10404j27132j10061J11620m45017k19603k50703
6412C249067o8574K34465n3589j70133K86141P02423J85021j24815J1066N04989
6402D756061o9644M8911k72104n01822n52813o43118o1831k46859J91492J98051
6392B846324L70602L77754k91492J1594k91055j05294l15670j12639l89969K67984
$$ y = [7569518, 7323404, 7332176, 7257493, 6820342, 6804959, 6683733, 6551136, 6267449, 6279625, 5848800, 5718453, 5962363, 5239988, 5182578, 4961357, 4917344, 4549908, 4534259, 4531078, 4415651, 4422026, 4630404, 4809612, 4738952, 5031732, 5626952, 5737125, 6054637, 5704607, 5468302, 5778850, 5311140, 4860473, 5004344, 4295677, 4122023, 4594415, 4504844, 4260837, 4416632, 4641877, 4555729, 4400367, 4289963, 4162831, 4052770, 4164390, 3719373, 3499770, 3249067, 3180493, 3414958, 3361369, 3191236, 3477377, 4179800, 4364821, 4240006, 4251072, 4756061, 4686417, 4735328, 4463224, 3961402, 3408589, 2765471, 2703640, 2456781, 2648273, 2846324, 3216926, 3594680, 3303188, 3314782, 3023727, 2918433, 2602763, 2490124, 2100155, 2368139]
6382B368139k89697k45021M2455K314J25075l6050L15126J12979m2907K28817
6372B581230P5846r28449r4169k89929l08389j29943J16349K45310J69214L53887
6362A790957K0276K26858J08932J3354l39109m980o23728J39774J13531m27447
6352A018418j05786K49938L44998J69938O265K61446J94812k64900l58898l10870
6342A205361l67420k79591j08741l36968N48968k8002L43099R7624K15004L20087
6332A609421J01751L05588l18704j41445k51464n3037l93552K88203K65871k77496
6322A135136k20832L35092M68018o4632R4457O43656p6735j77655m02906J86032
6312A919631k64297J77079M70457l76459J81800m0701l12554J0159K32227M8400
$$ y = [2368139, 2078442, 1833421, 1875876, 1878190, 2003265, 1967215, 2282341, 2395320, 2352413, 2581230, 2657076, 1728627, 1634458, 1344529, 1036140, 906197, 1022546, 1267856, 1437070, 1790957, 1811233, 2038091, 2147023, 2160377, 1821268, 1816288, 1192560, 1332334, 1445865, 1018418, 912632, 1162570, 1507568, 1677506, 1683771, 1945217, 2140029, 1875129, 1516231, 1205361, 837941, 558350, 449609, 112641, 661609, 633607, 976706, 1074330, 1289334, 1609421, 1711172, 2016760, 1698056, 1556611, 1305147, 1252110, 858558, 1146761, 1412632, 1135136, 914304, 1249396, 1717414, 1652782, 1747239, 2390895, 2314160, 2136505, 1733599, 1919631, 1655334, 1832413, 2302870, 1926411, 2108211, 2067510, 1754956, 1765115, 1997342, 2045742]
6302B045742j33103j89145j02802J52248l37371l0610k53372R9268L64890k55906
6292A359839J70171k10113L39467J17137j01699l117M51889K77395k79156m56708
6282A665105j06818l17104K02255J81967j34629j86466K61092L46571L47772r8432
6272B161313L53149k95207o10838r3325j11515j64943J38519N6594k78032K57531
6262A413246L73798r185N6165K02886K41522O6440o86431o35508N0835N0469j15945
6251A008292l76053K6798K07507M20340K19200N31393L19563L61754o5694n09653
6241B143447k45328k62755k52976k57481k48652J72246J7458L10014L14470J60995
6231A851438K99419J59223R5070j52815j84017m57210k14654Q9273k94480M2071
$$ y = [2045742, 1912639, 1723494, 1620692, 1772940, 1435569, 1404959, 1151587, 1250855, 1615745, 1359839, 1530010, 1319897, 1659364, 1776501, 1674802, 1671685, 2123574, 2400969, 2121813, 1665105, 1558287, 1241183, 1443438, 1625405, 1490776, 1304310, 1565402, 1911973, 2259745, 2161313, 2514462, 2219255, 1608417, 1515092, 1403577, 1238634, 1377153, 1433747, 1155715, 1413246, 1787044, 1777859, 1834024, 2036910, 2278432, 2344872, 1658441, 1022933, 1073768, 1124237, 1008292, 632239, 659037, 866544, 1286884, 1506084, 2037477, 2357040, 2718794, 2653100, 2143447, 1898119, 1635364, 1382388, 1124907, 876255, 1048501, 1065959, 1375973, 1690443, 1851438, 2150857, 2310080, 2405150, 2252335, 2068318, 1611108, 1396454, 1485727, 1191247, 1233318]
6221A233318N39891K9332P77429j40900k55119M8229o261j26344l07683l32361
6211A459531o10003j60715o4268k14671L65639K62263n1460J93890L62034j03033
6201A439207M9446L09351p85527l76899L90293n04574j79023N7891M06141K73787
6191A080093L18984P7534K57550j51650j94827q7005n7744j88774m34510J01064
6181G20715p1105Q4681K4733J40196K74212L65715J24276r1794l32069j14733
6171A124827K25369l81627n88559l14579J49762k30917K03521J42729J41913N20249
6161I92688J09828J77568Q4208j80436k62092M2542j54522j90190k5178j74973
6151D19443L9068O06488J34577m7922M78089j50868k64877L5554n10157J2647
$$ y = [1233318, 1773209, 1802541, 2579970, 2439070, 2183951, 2232180, 2225919, 2099575, 1791892, 1459531, 849528, 688813, 624545, 409874, 775513, 1037776, 986316, 1180206, 1542240, 1439207, 1488653, 1798004, 1012477, 635578, 1025871, 521297, 342274, 400165, 806306, 1080093, 1399077, 1476611, 1734161, 1582511, 1387684, 1300679, 1242935, 1054161, 619651, 720715, 649610, 734291, 759024, 899220, 1173432, 1539147, 1663423, 1571629, 1239560, 1124827, 1350196, 968569, 380010, 65431, 215193, -15724, 187797, 330526, 472439, 992688, 1102516, 1280084, 1364292, 1183856, 921764, 964306, 809784, 619594, 594416, 419443, 458511, 1064999, 1199576, 1151654, 1629743, 1478875, 1213998, 1249552, 739395, 752042]
6141G52042o6565n43860l27042N0984l43172L31369J52171L30702K06399j03827
6131D39201K98877j01586K31907q867l43304j76137q2760k29100j84700l06495
6121d62964R7128M08063M40496K37211p6327J86880M72215m43288l18100k9951
6111E11363k10817k36627L1949j7029k49944R6240L341N27360j22376K82977K76957
6100H93394J13096Q0303m65114k29770J26357K72930l46104k37445K82090M1088
6090E30825j03218J58070L9070J72867j9717J62357l88554m7982k70354j03829
6080A29535L86808j84087Q4774J85845K2374K48047m1478m9574r1450k88884j94635
6069B07275j745p1429J60196j5078q3032M03007n3792l05897K09955k16877k9398
$$ y = [752042, 685477, 141617, -185425, -134441, -477613, -146244, 5927, 336629, 543028, 439201, 738078, 636492, 868399, 859532, 516228, 340091, 257331, 28231, -156469, -462964, -365836, 42227, 482723, 719934, 643607, 830487, 1302702, 859414, 541314, 511363, 300546, 63919, 95868, 78839, -171105, -74865, -71524, 455836, 333460, 616437, 893394, 1006490, 1086793, 621679, 391909, 518266, 791196, 445092, 207647, 489737, 530825, 427607, 585677, 624747, 797614, 777897, 940254, 551700, 503718, 233364, 129535, 516343, 332256, 417030, 602875, 625249, 873296, 831818, 782244, 690794, 401910, 207275, 205530, 134101, 294297, 279219, 196187, 599194, 545402, 239505, 449460, 232583, 203185]
6058B03185L70606j73212Q7533l33491k62185j65086N7041k45946K79039J29083
6048e3433K08533Q7079K86030J90740k76167J22719K04866m34605l98297k63667
6038c26202m1067k4553r1878K6570K11935Q6529m736K04902K0079J06462p7494
6027I0547l7490j67643k68280J66541k83659j17405J86040j38477L4799L29330
6017b05697K41297j51821J40917m6323L0462J815k51608k56642K04190l34225
6007f27635J74081J41752j62573L1953M58989N4201Q9807L63093K15353l8037
5997G00984n51586j97536q2057n46989j0351J26236M04823J52728k636L22510
5987C16126R8052J50123J26911K88297o82298j97657J0323j69457K71699j32145
$$ y = [203185, 573791, 400579, 488112, 154621, -107564, -272650, -215609, -461555, -182516, -53433, 155100, 242179, 528209, 718949, 442782, 565501, 770367, 335762, -62535, -326202, -367269, -391822, -483700, -457130, -245195, -158666, -163402, 41500, 61579, 168041, 90547, 53057, -114586, -382866, -216325, -499984, -617389, -431349, -569826, -535027, -205697, 35600, -116221, 24696, -21627, 8835, 10650, -240958, -497600, -293410, -627635, -453554, -311802, -474375, -442422, 16567, 70768, 160575, 523668, 739021, 700984, 149398, -48138, -130195, -677184, -687535, -561299, -156476, -3748, -6384, 316126, 414178, 564301, 691212, 979509, 297211, 99554, 109877, -59580, 212119, 79974]
5977G9974K38552J79755K51134j41572K617N01616j76210j42909l9584k11347
5967E42026m05373L689R0025o3610K01019J88528J24937K36546M97473l58491
5957A056769n72376P1999j81055k3292j41863m22129j94653L22294J24686J39711
5947A80091L27918J50604M27760j41105k39056j22156j04474j92075l98402J9456
5937i1439r0503L67076L92727j85315M09684M85838J53393L7453M0367l36020
5927A183261q22729n16494m4132k28697K11065K47442J84404K26157L3461r8870
5917C74868Q76359M6264q45272j75990j78334m06075l73415R3082J96531K26222
5907a65760l93998M62153L31577M56321L89750m89435l35231M8548J2797m19866
$$ y = [79974, 318526, 498281, 749415, 607843, 610460, 1112076, 935866, 792957, 753373, 542026, 136653, 140342, 230367, 166757, 367776, 556304, 681241, 917787, 1415260, 1056769, 484393, 556392, 375337, 352045, 210182, -211947, -406600, -84306, 40380, 180091, 508009, 658613, 1086373, 945268, 706212, 584056, 479582, 287507, -110895, -91439, -181942, 185134, 577861, 392546, 802230, 1288068, 1441461, 1478914, 1519281, 1183261, 360532, -155962, -200094, -428791, -217726, 29716, 214120, 440277, 473738, 374868, 1251227, 1297491, 452219, 276229, 97895, -308180, -681595, -588513, -391982, -165760, -559758, -97605, 233972, 690293, 1080043, 590608, 255377, 303925, 316722, -103144]
5897a03144n24682J04684K66493J30492k62122L60675K05429R5877N22973K99335
5887A096010k41583j50363n14644o3124n03757j97969k08607M87491K79535K39279
5877B22268K17296M0695N58664k74418j81905l31540k40803j11587n43555j30721
5867g75606J37280M99513M40163P8895M55651m4595k28346R2599n0148l37136
5857B68270k80922m57216Q2739o349j05573L07272K6773Q59479L40903k66741
5847G68635K7398m20242J95050n79266k23856k07657m77279K39314K12912J55429
5837c09562N60117N95250K97752r6790k76923p2982L2112l39975p23829o22120
5827i56950n8235J91943J10155M83038M40017M66525K87752k29590o0494k1157
$$ y = [-103144, -627826, -523142, -256649, -126157, -388279, -27604, 177825, 273702, 796675, 1096010, 854427, 704064, 189420, 126296, -377461, -575430, -784037, -296546, -17011, 222268, 439564, 480259, 1038923, 764505, 582600, 251060, 10257, -101330, -644885, -775606, -638326, -138813, 301350, 380245, 835896, 791301, 562955, 655554, 605406, 268270, -12652, -469868, -387129, -393478, -499051, -191779, -165006, 694473, 1035376, 768635, 796033, 375791, 570841, -8425, -232281, -439938, -917217, -677903, -464991, -309562, 250555, 845805, 1143557, 1046767, 769844, 696862, 728974, 388999, -334830, -956950, -1015185, -823242, -713087, -230049, 209968, 676493, 964245, 734655, 674161, 653004]
5817F53004k53085j52904l54910o23132j02808l41027N98825R7257K69290P73274
5807E63784N070L60616j31483k27959j43042n02978k02051j38847k04853O3884
5797e57859L32691K12075K81796K68101K5540L96987m54992j64994r5826m39775
5787a96256m24172m88353K74644J60865J25051N77100L09434l58131K24387M51486
5777F56055k22989n41567O43410m92495m37140r646K4761J69306M1796K53209
5767H4700m3271l44480N50860O35318m13649l00548r1988k11410K25971l16630
5757b25127k82033r6136M39314j5504K82660j2052p1824l04015K92007l2356j75848
5746b00914K12211l22271J37138P9978k7433M3544K26742K05097j50644k7421
$$ y = [653004, 399919, 247015, -107895, -731027, -833835, -1174862, -576037, -478780, -209490, 563784, 568854, 929470, 797987, 570028, 426986, -75992, -278043, -416890, -621743, -557859, -225168, -13093, 268703, 536804, 562344, 959331, 504339, 339345, 243519, -196256, -620428, -1108781, -834137, -673272, -548221, 28879, 338313, -19818, 204569, 656055, 433066, -108501, 534909, 42414, -394726, -404372, -379611, -210305, -168509, 84700, 41429, -303051, 247809, 883127, 469478, 168930, 76942, -134468, 91503, -225127, -507160, -603296, -163982, -179486, 103174, 91122, 19298, -284717, 7290, -25066, -200914, 11297, -310974, -173836, -93858, -121291, -77747, 148995, 354092, 203448, 176027]
5736A76027Q2041p4044K6992m44854k3894j65633K50148L23717M8913J75960J97179
5725E72552k42810J62863J63197J2841l37943K29378j13047N2879j73600k02549
5715A23761N5658Q5707J67659m117J71974j63625l8958L70469J56767L01588k86456
5704I40427n04446J78368J64070j65237M08889J23031M41926J46445L35555p4101
5694A994927M05880j85890k02485j79403m49061J90559o66591k33943K16585j39473
5684G51105J91013K3599l6134L44233k24896k57950k18987Q8132j97555Q1358
5674E43918l35637o67469q616J28030L30216K73629L86045L23991Q8438m96210
5664E66335k02759l10953j33290j81483P4743k58401J50302L63583M24360K50730
$$ y = [176027, 258068, 184024, 211016, -233838, -257732, -423365, -173217, 150500, 199413, 375373, 572552, 329742, 492605, 655802, 668643, 330700, 560078, 447031, 499910, 326310, 123761, 179419, 265126, 432785, 428668, 600642, 437017, 398059, 768528, 925295, 1226883, 940427, 435981, 614349, 778419, 613182, 1022071, 1145102, 1587028, 1733473, 2069028, 1994927, 2400807, 2214917, 2012432, 1833029, 1383968, 1574527, 907936, 673993, 890578, 751105, 942118, 965717, 929583, 1273816, 1048920, 790970, 571983, 660115, 462560, 543918, 208281, -459188, -467804, -339774, -9558, 264071, 650116, 974107, 1062545, 566335, 363576, 52623, -80667, -262150, -187407, -445808, -295506, 68077, 492437, 743167]
5654G43167j39013L36488K85244j85853l98152r4523o2670l74786j65911J99803
5644A43794k0326R9743L44137K93430N8959R2783o982k09562n2369l54186l51960
5633C7461l08176k2671N11200J00126p1422N23607N91608k00228m4531m7186k14163
5622H55625l67058l58283l31415m23162l8712J57013O39696K83937l6344M79993
5612H61290L86038j4090l94887k20068o12676p43317O9189P3989L18182O8293
5602b08057N10012M38721n9049K17178n00303o2612k11866m68402k52891L35097
5592b62172m66414j43510L61349O33708R4756L80416K06508j553j85611m86408
5582A31069l09339O3184m98798m72851K17103M05012K67144M08425J96329N33481
$$ y = [743167, 604154, 940642, 1225886, 1040033, 641881, 547358, 484688, 109902, -56009, 143794, 123468, 223211, 567348, 860778, 919737, 1012520, 1005538, 795976, 743607, 389421, 37461, -270715, -293386, 217814, 317940, 246518, 770125, 1361733, 1161505, 1116974, 1069788, 855625, 488567, 130284, -201131, -624293, -663005, -505992, 133704, 417641, 381297, 861290, 1247328, 1233238, 838351, 618283, 5607, -737710, -668521, -594532, -276350, -208057, 301955, 740676, 681627, 898805, 398502, 335890, 124024, -344378, -597269, -262172, -728586, -872096, -510747, 122961, 217717, 598133, 804641, 803088, 617477, 131069, -178270, -115086, -613884, -1086735, -869632, -464620, -197476, 210949, 407278, 940759]
5572I40759k73467l32177k92500j88466o03084m9074l31605R270O60515P8254
5562c81575N33528M69143Q5315o3865J98279o67417n40815O7030k72358k17614
5552g90349j5220l6798K02477O29481K9961K08876O12469p3978m82965j2416m32485
5541a60947k83843l64432N762L09881k2694N63201J22808K59909J34380k03447
5531C60578k21932l78975m49042k86442j55677J21832J7800N24806N32450M41847
5521E07245J18925R6435j35947K38290q55135l45625J81854j77741k76390K3786
5511f24303j22091J85569J9097N32272J22219N8796r3238j59412L329j0945j85774
5500b74481k10579J8469M1377J76390q9140K83400L88090o5715m75197j33858
$$ y = [940759, 667292, 335115, 42615, -145851, -748935, -798009, -1129614, -1120344, -459829, -381575, 151953, 621096, 706411, 642546, 840825, 173408, -367407, -300377, -572735, -790349, -805569, -842367, -639890, -10409, 19552, 228428, 840897, 766919, 283954, 271538, -160947, -444790, -809222, -803460, -493579, -516273, 46928, 169736, 429645, 564025, 360578, 138646, -240329, -689371, -975813, -1131490, -1009658, -991858, -467052, 65398, 507245, 626170, 722605, 586658, 824948, -30187, -375812, -193958, -371699, -648089, -624303, -746394, -560825, -541728, -9456, 112763, 171559, 78321, -81091, -77762, -88707, -274481, -485060, -466591, -425214, -248824, -337964, -54564, 333526, 267811, -207386, -341244]
5490c41244L48201J56191j79921R5751j80830k36153l00302K16511J88175j83084
5480d16705K61890J02143n7945L5562J59703k8109k55356l0609J74672j38884
5470a93638k34273K72792n6137N7539K50827K9063j29054J18992j13693j8986
5460a6568l54539m9689J81784L2691j68406L5227L88178L6595k37041K40933J78542
5449B67707m82014n7177L21049j02112j93904M5134L1469J54801j89857J1350
5439a93554m6296l6072J72760M3783M7327J07713j32357j27807k97376J00701
5429c61178k4977K30800j6999J92850K11963L39988K01435l12478l37671j43383
5419a9650R7810n20155l28312n8924K47788K22019L26178J43543J60950J2033
$$ y = [-341244, 6957, 163148, -16773, 78978, -101852, -338005, -638307, -421796, -233621, -416705, -154815, -52672, -110617, -75055, 84648, 56539, -198817, -229426, -54754, -193638, -427911, -155119, -211256, -153717, 97110, 126173, -2881, 116111, 2418, -16568, -371107, -420796, -239012, -206321, -374727, -339500, 48678, 85273, -151768, 89165, 267707, -214307, -271484, 49565, -52547, -246451, -201317, -169848, -15047, -204904, -193554, -239850, -275922, -103162, -59379, -12052, 95661, -36696, -164503, -461879, -361178, -386155, -155355, -172354, 20496, 232459, 572447, 773882, 461404, 123733, -19650, 78160, -441995, -770307, -829231, -581443, -359424, -33246, 110297, 271247, 283280]
5409B83280Q5052K74421k71983k65189k07284n67202p5185L81492N8444k01473
5399e05627N32681M41292K60961n658j06275K2854m57260q40952k03776K34537
5389f27223k62702K53629O28052M46557J93557K59386M0498J13127n71245m60609
5379A3027l70937l60963O5728J33825K86458M64545O02234O0470K19800p6055
5369A038132m93158k12732l62134l35109k0053n5407n1698N58271N71630J52825
5359G90567J22259p1404j27185N9239j75407n46360p92797R4155J94051J1054
5349d41828L34429M97227J53366Q9774L08035k04269J15299l51633m38587j10878
5339d9065K81015k27464L8117K35075k60437M64067J79757M69164J19171k49287
$$ y = [283280, 368332, 642753, 370770, 105581, -101703, -668905, -744090, -362598, -304154, -505627, 27054, 468346, 729307, 723649, 617374, 640228, 182968, -657984, -861760, -627223, -889925, -636296, -8244, 438313, 631870, 891256, 931754, 1044881, 473636, 13027, -357910, -718873, -653145, -519320, -232862, 231683, 833917, 894387, 1114187, 1038132, 544974, 332242, -29892, -365001, -385054, -440461, -492159, 66112, 637742, 790567, 912826, 841422, 714237, 773476, 598069, 51709, -741088, -646933, -452882, -441828, -107399, 389828, 543194, 632968, 941003, 736734, 852033, 500400, 61813, -49065, 231950, 4486, 42603, 277678, 17241, 481308, 661065, 1130229, 1249400, 1000113]
5329A000113n10975l10799j71482L5445p1398k1392O95114L87025O06796M26035
5319B064482j02047l71531k16186k24350o14000m86352j3143J16332R4042K59883
5309E07130L19197L65262K93728L37261k2875n61209O6183l68388J2897j96007
5299G53179K21746J84817l46747Q71642O22240k80789j15621k01191l65405n18318
5289H25553l65107K8161p1348k63924O11520k44753J06526J75828L4634m1657
5279G95433l7193j63512Q3413l72439n0779p7798L24779l79419N888K03485J16079
5268D47937O41599R0820o7216m63640j36490J05700j77629l87715k51295R1316
5258a06613M36922j51401J04129N6747L93293J90933k3048l18687J18822Q9874
$$ y = [1000113, 489138, 178339, 6857, 42302, -29096, -50488, 644626, 1031651, 1638447, 2064482, 1962435, 1590904, 1374718, 1150368, 536368, 50016, 36873, 153205, 247247, 507130, 826327, 1191589, 1485317, 1822578, 1799703, 1238494, 1304677, 936289, 949186, 753179, 974925, 1159742, 812995, 1684637, 2306877, 2026088, 1910467, 1709276, 1343871, 825553, 460446, 488607, 417259, 153335, 764855, 520102, 626628, 802456, 837090, 795433, 758240, 594728, 678141, 305702, 254923, 177125, 501904, 122485, 128373, 331858, 447937, 1089536, 1180356, 1113140, 649500, 513010, 618710, 441081, 53366, -197929, -106613, 330309, 178908, 283037, 339784, 733077, 924010, 900962, 582275, 701097, 790971]
5248G90971J40339k41666m01433k09593J57233q1457J77035N61683p1391J99392
5238A021113r7181J99785l44297k39147r1783j19208J86254o4348J60739k41894
5228C70033K16780O741J83680l50120L26306k64098N33201m24548N1702j01598
5218E48079j01414K16045k03332Q820k14562L56004J26836K06992j86847m65492
5208B91129K83371k23609o3877j25081J43238J95848J74088L19334J26999J08635
5198A230075m97348r8895m91811m67334q5862K12717J53793L89920K55199L61538
5188I61992L39968K96248l16503l82651n49370l56518J26874N957j47677l9713
5178f1393M80980M64100N67697K02268o0016l95798l86885j77964l49124l96756
$$ y = [790971, 931310, 689644, 288211, 78618, 235851, 154394, 331429, 893112, 821721, 1021113, 923932, 1123717, 779420, 540273, 448490, 329282, 515536, 451188, 611927, 370033, 586813, 593554, 777234, 427114, 753420, 489322, 1022523, 597975, 649677, 548079, 446665, 662710, 459378, 468198, 253636, 609640, 736476, 943468, 756621, 291129, 574500, 350891, 287014, 161933, 305171, 501019, 675107, 994441, 1121440, 1230075, 732727, 633832, 142021, -325313, -411175, -198458, -44665, 345255, 600454, 961992, 1301960, 1598208, 1281705, 899054, 349684, -6834, 120040, 125997, -21680, -61393, 419587, 883687, 1451384, 1653652, 1593636, 1197838, 810953, 632989, 283865, -112891]
5168a12891J4430L78871L73006M90085N86636K49161K8052n4460k54699j60053
5158A538138n43000k70440k92849q4775n3462L61962L90739L90271j12507J60586
5148A484663K46528k54217j09197o34756J04694r382p7970K59020M28990J5796
5138A454169L72580M56915j3747o4795Q801Q8966l21763l86367n13524M00776
5128A482011K85267J56544L41607M88111l55797Q8237k39341m50628j55945l18492
5118A321574Q7394p0764L91927K56923J47666O02123j96736p5652m55382n11881
5108A497192p1976o0873O9251p9347L10089P60883L05089n78764o9554j30638
5098A951352N3137M3598o14415q6372M63814k89600l84091k40466k09649J26696
$$ y = [-112891, -98461, 280410, 653416, 1143501, 1730137, 1979298, 2007350, 1952890, 1698191, 1538138, 995138, 724698, 431849, 347074, 293612, 655574, 1046313, 1436584, 1324077, 1484663, 1731191, 1476974, 1367777, 733021, 837715, 828333, 750363, 1009383, 1438373, 1454169, 1826749, 2283664, 2269917, 2205122, 2213923, 2302889, 1981126, 1594759, 1081235, 1482011, 1767278, 1923822, 2265429, 2753540, 2397743, 2485980, 2246639, 1796011, 1640066, 1321574, 1408968, 1338204, 1730131, 1987054, 2134720, 2736843, 2540107, 2464455, 2009073, 1497192, 1425216, 1364343, 1433594, 1354247, 1664336, 2425219, 2730308, 2151544, 2081990, 1951352, 2004489, 2048087, 1433672, 1347300, 1811114, 1521514, 1137423, 896957, 687308, 814004]
5088H14004L86588J29960j89957k28121K18563q4921J16972J47263k23404P3751
5078A160698m7705P9513o5985K46060N16750J0760k22279j20146j4150k51418
5068A292098j28208m24444J84193K75789K58990J91616R061K18333k65588j21188
5058A490652K06302k29740j7659M42527k7114N6570j81681L9033k658J30031N31591
5047B437854O6724J81898J86094o4964R8217n06697L7485l63228M3225j12822
5037B003786J71606Q52242M78174Q17485K28976l67096k64987j99882r97483l60257
5027B362564L37539L40829j46114M49317O56261r7341R4257k50035L4788O112
5017C788177n35953J59558M56124k65683N93728Q64046K39620M58925J00299j46649
$$ y = [814004, 1200592, 1330552, 1140595, 912474, 1131037, 1046116, 1163088, 1310351, 1086947, 1160698, 1112993, 1192506, 1126521, 1372581, 1889331, 1900091, 1677812, 1557666, 1543516, 1292098, 1163890, 739446, 923639, 1199428, 1458418, 1650034, 1659095, 1877428, 1611840, 1490652, 1696954, 1467214, 1449555, 1892082, 1864968, 1921538, 1739857, 1778890, 1776232, 1906263, 2437854, 2504578, 2686476, 2872570, 2807606, 2905823, 2399126, 2436611, 2073383, 2116608, 2003786, 2175392, 3027634, 3505808, 4323293, 4552269, 4185173, 3920186, 3720304, 2722821, 2362564, 2700103, 3040932, 2894818, 3344135, 4000396, 3903055, 3997312, 3747277, 3782065, 3788177, 3252224, 3411782, 3867906, 3602223, 4195951, 5059997, 5299617, 5758542, 5858841, 5712192]
5007E712192l52002o48143o58309l94326p0543M2329j87189j01609L27417L28343
4997C998160M09275R3593m30584k57977j78196n56271n06767p35321N79968N21004
4987B936884Q56059L87723J73540J04247k94423j10528m31092j82121l85847J88406
4977C242848K44074K61611K7327K91194j77836K50981m76195m59501n3304l95969
4967B755230l91400J64349M99397K68008L27058K02160K99374k30668j58079j99386
4957C536043k78336J45583m89241K9262J50731K50509L93718N0509m17293N25383
4947C896868L11953j61574k53874L709J30033j55341k2868L3665K39946N6354
4937D078871K97526L10353J96724n80824K79834M49494l84426M71640J15801j01656
$$ y = [5712192, 5360190, 4712047, 4053738, 3659412, 3588869, 3631198, 3444009, 3342400, 3669817, 3998160, 4407435, 4501028, 4070444, 3812467, 3634271, 3078000, 2571233, 1835912, 2415880, 2936884, 3792943, 4180666, 4354206, 4458453, 4164030, 4053502, 3622410, 3440289, 3054442, 3242848, 3486922, 3748533, 3775860, 4067054, 3889218, 4140199, 3664004, 3204503, 3151199, 2755230, 2363830, 2528179, 3027576, 3295584, 3622642, 3824802, 4124176, 3893508, 3735429, 3536043, 3257707, 3403290, 2914049, 2943311, 3094042, 3344551, 3738269, 3788778, 3371485, 3896868, 4208821, 4047247, 3793373, 3797082, 3927115, 3771774, 3748906, 3782571, 4022517, 4078871, 4376397, 4686750, 4883474, 4302650, 4582484, 5031978, 4647552, 5119192, 5234993, 5133337]
4927E133337J3002j48859l48252L22606L40984o3925K29820P3698K21709k11269
4917E562851j22460m35547r684K44743j61468K83053M44098L74777M80421l00967
4907F359817K31403Q9729l35829k70391J6077N6599M08651M01168M86334M74472
4897G918030K52951K98312l13542M65456j1376k82804k04366L84891j2132M79799
4887H975219R04721P45765O41637P17914P80610L67401O68309N65807N74085P03491
4877A5644959R10101J480789J944748K554764K355596J244313q3211p43931j991496
4868B3316632j549445L22506J94733J047311J653158K319299J963657J341063
4860C0608914J063388P48045M51803L74992k87945q83484j336925k40670n982
$$ y = [5133337, 5146339, 4997480, 4649228, 4971834, 5312818, 5248893, 5478713, 5552411, 5774120, 5562851, 5440391, 5004844, 4995160, 5239903, 5078435, 5361488, 5805586, 6180363, 6660784, 6359817, 6591220, 6680949, 6345120, 6074729, 6090806, 6147405, 6556056, 6957224, 7443558, 7918030, 8170981, 8469293, 8155751, 8621207, 8609831, 8327027, 8122661, 8507552, 8495420, 8975219, 9879940, 10625705, 11267342, 11985256, 12765866, 13133267, 13801576, 14367383, 14941468, 15644959, 16555060, 18035849, 19980597, 22535361, 24890957, 26135270, 26052059, 25308128, 23316632, 21767187, 22089693, 22284426, 23331737, 24984895, 27304194, 29267851, 30608914, 31672302, 32420347, 32872150, 33247142, 32959197, 32075713, 30738788, 30498118, 30492136]
4851C0492136j02423m49415l24620j301209p53946m66866l39739O60527R41831
4842B8356276J594807J733732L13564j072616j702896j670721j730666j709942
4834B4111538q10198q24916O2641K19892M64546l3115J08158l7669K64118P62514
4824B4287509M78358N71682J60441O3539O65318O00882L48816P11577J546604
4815B9434726J223980J178482Q04881N82358J103670J683137J539511J845724
4807C9396469J649345J783291K288006K747087L132574L936662M436727N119677
4799F4489838N972717O943844P686876Q924274J0568938R798490L194788n639262
4791A11940503p094852m078973q35714L132389N002704P648384R344294Q206198
$$ y = [30492136, 30389713, 29940298, 29615678, 28314469, 27560523, 27093657, 26753918, 27414445, 28356276, 29951083, 31684815, 31998379, 30925763, 29222867, 27552146, 25821480, 24111538, 23301340, 22476424, 22539065, 22758957, 23223503, 23190388, 23298546, 23260877, 23524995, 24287509, 24765867, 25337549, 25497990, 25561529, 26226847, 26827729, 27176545, 27888122, 29434726, 30658706, 31837188, 32642069, 33224427, 34328097, 36011234, 37550745, 39396469, 41045814, 42829105, 45117111, 47864198, 50996772, 54933434, 59370161, 64489838, 70462555, 77406399, 85093275, 94017549, 104586487, 114384977, 117579765, 111940503, 104845651, 100766678, 99930964, 103063353, 108066057, 115714441, 125058735, 133264933]
4783A33264933L303508j024902N00226L311763M386221j11345o876066p497830
4775A29256508m015896o88417J871411O34647l253370o103688l834931j135106
4767A12731158L66962J489778M330579N531544K307298p021223j5906765j5534577
4759H8294754j2051575q825142o315877l910189j990677j218861o03108k062706
4751E1316619m270745m670566m392368l698438k672111k423630j446458j061115
4743B6681188n48070p09831l77037o15476o23043j210864j078728q93680m68402
4734B0156057p85202l19932J19848l43937J13458k99040q2695l11436n52212j86764
4724A7508145k94578k76985q505j43241k4516o25488m52198Q7848j45627J47836
$$ y = [133264933, 136568441, 135543539, 136043765, 139355528, 143741749, 143630404, 136754338, 129256508, 125240612, 124552195, 126423606, 127058253, 123804883, 117701195, 113866264, 112731158, 113098120, 114587898, 118918477, 124450021, 126757319, 119736096, 103829331, 88294754, 76243179, 67418037, 61102160, 57191971, 55201294, 53982433, 53379325, 51316619, 47045874, 42375308, 37982940, 34284502, 31612391, 29188761, 27742303, 26681188, 26133118, 25423287, 25046250, 24430774, 23807731, 22596867, 21518139, 20624459, 20156057, 19370855, 19050923, 19170771, 18826834, 18940292, 18641252, 18558557, 18247121, 17694909, 17508145, 17213567, 16936582, 16928077, 16784836, 16760320, 16134832, 15682634, 15770482, 15624855, 15772691]
4714A5772691l76587m20719j87673j73170k69606l99914j50751R2060L86574k21910
4704A4050995m6799j68386J28860m47450k17444l08858k51599M1853j23002j52038
4694A2506132J44391M21261K89398k17647j53250l48130k22534o51012n039k7602
4684A1735968p6550m4804r3445K55004L63814L61994p0352j09643J40952l92881
4674A2070057r1336o4378N402Q38181M85210Q0903n62026k18742n29770n90423
4664A1423078m95260j55923r3492k86900J85285L21176J09921P17511P89004J70739
4654A2685139N31356L04805M83134M51452j31969j74458m28237o29079l48145
4645A2743998l36964l11604m17113j17763l83331o02442j48745n621M82554J151823
$$ y = [15772691, 15396104, 14975385, 14787712, 14614542, 14344936, 13945022, 13794271, 13886331, 14272905, 14050995, 14004196, 13835810, 13964670, 13517220, 13299776, 12990918, 12739319, 12781172, 12658170, 12506132, 12650523, 13071784, 13361182, 13143535, 12990285, 12642155, 12419621, 11768609, 11763570, 11735968, 11659418, 11614614, 11521169, 11776173, 12139987, 12501981, 12431629, 12321986, 12462938, 12070057, 11978721, 11914343, 11919745, 12757926, 13243136, 13324039, 12762013, 12543271, 12013501, 11423078, 10927818, 10771895, 10678403, 10391503, 10576788, 10897964, 11007885, 11725396, 12514400, 12685139, 13216495, 13521300, 14004434, 14455886, 14323917, 14149459, 13721222, 13092143, 12743998, 12407034, 12095430, 11678317, 11560554, 11177223, 10574781, 10426036, 10420415, 10902969, 12054792]
4635A2054792j09183k07217M05856J6198o2912o4791m12493q1350n24538m83074
4625A0531288P1728l60604P58959m62591o89516p62113n91999J36435m46466j5952
4615H169169J03210L97723L27518l03029l40139n07005k00771m65572j48455j05701
4605F926948l75583j47639j7952k06826j5531k57194n6118R1541J56251K33271
4595F331168k00526j91502j08965l45180k13276o1980m59177J60430P7566L50625
4585E339183m1168j4573R742o37134j4306j57178l08514K58345K67397J31586
4575D833380N99368P9051j64938n15717k94850m08679j3257K10415J93014Q40293
4565E358080P05630K32695k6811j65944o59645o85779R1499q8002j30804Q11573
$$ y = [12054792, 11945609, 11738392, 12144248, 12160446, 12097534, 12032743, 11620250, 11538900, 11014362, 10531288, 10603016, 10242412, 11001371, 10538780, 9849264, 9087151, 8495152, 8631587, 8185121, 8169169, 8272379, 8670102, 8997620, 8694591, 8354452, 7847447, 7646676, 7181104, 7032649, 6926948, 6551365, 6403726, 6385774, 6178948, 6163417, 5906223, 5850105, 5941646, 6097897, 6331168, 6130642, 5939140, 5830175, 5484995, 5271719, 5209739, 4750562, 4910992, 4988558, 5339183, 5298015, 5283442, 5293184, 4656050, 4641744, 4484566, 4176052, 4434397, 4701794, 4833380, 5432748, 5511799, 5346861, 4831144, 4536294, 4127615, 4114358, 4324773, 4517787, 5358080, 6063710, 6296405, 6269594, 6103650, 5444005, 4758226, 4849725, 4761723, 4630919, 5442492]
4555E442492N16969L23827k3305m0716k24699M3525k12202J33373j77051L09317
4545F091530N22743K73079p797J8754n966l27078j67356M96559N43581P4330j22899
4534G389480J28257L7139p47921K74198K70876J75673L63926N48441j63071n6326
4524H220672l42115l92735K22542p2730l2528N53860J40820M22736n5309m28029
4514H237184l71762m75405o9829K98483K35391N44088L22587O98419L26673l76506
4504I369323j37645k39211j51194o4954l8004J61139L39009R67076K23319j33609
4494A0295249l18299J24854K6410j25322L25289J58998M6646O25690L35355J51464
4484A1646334M7072K16420J32673J0586K19791K25814N51838k6918L06712L64055
$$ y = [5442492, 5959461, 6283288, 6259983, 6219267, 5994568, 6038093, 5825891, 5959264, 5782213, 6091530, 6614273, 6887352, 6879555, 6898309, 6892343, 6565265, 6397909, 6894468, 7438049, 7512379, 7389480, 7517737, 7554876, 6806955, 7081153, 7352029, 7527702, 7891628, 8440069, 8276998, 8220672, 7878557, 7485822, 7708364, 7635634, 7603106, 8156966, 8297786, 8720522, 8665213, 8237184, 7865422, 7390017, 7320188, 7618671, 7854062, 8398150, 8720737, 9419156, 9745829, 9369323, 9231678, 8992467, 8841273, 8776319, 8738315, 8899454, 9238463, 10205539, 10428858, 10295249, 9976950, 10101804, 10128214, 10002892, 10328181, 10487179, 10533825, 11159515, 11494870, 11646334, 11693406, 11909826, 12042499, 12053085, 12272876, 12498690, 13050528, 13023610, 13330322, 13694377]
4474A3694377N20229j8920K78492N67437Q42442J83122R2860O70945N82486M91220
4464A7904690R72421J163355J866850J693133J473571J978274K080127J664424
4456C0796845P51801p61085r05881j038491j51075N54252R63476P85944Q96663
4447C1892449R92631N73067O54092Q69877J591988J904005J369526P52877o14905
4438C9985607j618043j072435j60663j045758n98688q83516o26251p34452k39028
4429C3006773L54128J109051J736058J390904Q70976n92446j550440j892227j292252
4420C3140525j024871o38770K10341m5715j1300j91725k93967K64416O9230N61915
4410C2040079O74777J168966R47696J425040J565176J022237J591865J046924
$$ y = [13694377, 14214606, 14195686, 14474178, 15041615, 15884057, 16067179, 16160039, 16830984, 17413470, 17904690, 18877111, 20040466, 21907316, 23600449, 25074020, 27052294, 29132421, 30796845, 31548646, 30787561, 29881680, 28843189, 28692114, 29246366, 30209842, 30995786, 31892449, 32885080, 33458147, 34112239, 34982116, 36574104, 38478109, 39847635, 40600512, 39985607, 38367564, 37295129, 37134466, 36088708, 35490020, 34606504, 33980253, 33245801, 33006773, 33360901, 34469952, 36206010, 37596914, 38467890, 37875444, 36325004, 34432777, 33140525, 32115654, 31476884, 31687225, 31641510, 31630210, 31438485, 31144518, 31408934, 31478164, 32040079, 32714856, 33883822, 34831518, 36256558, 37821734, 38843971, 40435836, 41482760]
4402D1482760J244934K139474J771625K066744J875623J399449J280777J662268
4394E4923654K202127J762760L121473M278482M475158M864067M940701O329546
4386H6897968P616057J0688029J3397322J5611667J4131426O657085n573347j0944928
4378A38481279r413706n454178o01932L900809P034811Q029890M958576R08916
4370A47844465K58816K798988O014966Q168700O158472j080972p242016q056211
4362A54865208m584471j640961k151523o286662p680446n244531k046661J508115
4354A26738068M927737Q301093R624946O096720l356903j1490789j2406036j0635935
4346A17798901p129265m279518j769137K77513J551016K067232J003307N95789
$$ y = [41482760, 42727694, 44867168, 46638793, 48705537, 50581160, 51980609, 53261386, 54923654, 57125781, 58888541, 62010014, 66288496, 70763654, 75627721, 80568422, 86897968, 94514025, 105202054, 118599376, 134211043, 148342469, 154999554, 149426207, 138481279, 129067573, 123613395, 123011463, 126912272, 133947083, 141976973, 146935549, 147844465, 148103281, 150902269, 156917235, 165085935, 171244407, 170163435, 162921419, 154865208, 150280737, 148639776, 146488253, 140201591, 132521145, 127276614, 125229953, 126738068, 131665805, 139966898, 149591844, 155688564, 152331661, 140840872, 128434836, 117798901, 110669636, 106390118, 104620981, 104898494, 106449510, 108516742, 109520049, 110115838]
4338A10115838J213872K121809J599472L49117j419565n05384J17012K77876p38368
4329A13131679k333809k728121j702138j892120j673492j915624p06151O54929
4321A00835153J744564J220771Q48743O40752J802124L977902O383089Q439485
4313A25892583R285319R937949J2200482J6194917K2961992K9781020L7275997
4306B63530259M1925660L1215979r643463n0899595m8662398l6747217k6000961
4299A64718264j9054327j4453024j1039507p788828n949697n196906l697046l202499
4291I4336430l424365k464554k130214j998333j904133j777276j765730j552680
4283G7319145q42407j221786m30706P4152q2123R3052j083801j262989j786471
$$ y = [110115838, 111329710, 113451519, 115050991, 115400108, 113980543, 113475159, 113592171, 113870047, 113131679, 110797870, 108069749, 106367611, 104475491, 102801999, 100886375, 100180224, 100835153, 102579717, 103800488, 104649231, 105289983, 107092107, 111070009, 117453098, 125892583, 135177902, 145115851, 157316333, 173511250, 196473242, 226254262, 263530259, 305455919, 336671898, 327028435, 276128840, 227466442, 190719225, 164718264, 145663937, 131210913, 120171406, 112382578, 106432881, 101235975, 97538929, 94336430, 90912065, 88447511, 86317297, 84318964, 82414831, 80637555, 78871825, 77319145, 76476738, 75254952, 74824246, 74898398, 74816275, 74909327, 73825526, 72562537, 70776066]
4274G0776066j945232j807370j820369q25173m08632n17397O4068J80226n64412
4265F3131775n05547j081524j130116m52557m14767k13308P58361R08283J566209
4256F2566809J911511J312093J143032P4087k039731k838950k223198k120245
4248E7785408j033855j215901n10576l56699q90707l45088l65838j56544q180
4239E2902020l65640l89817k15881m07572K72230j58144L73777J24666K45576
4230E2381215N85854J052199J227013J576315R80245n47112j138092j586630j360160
4221E3170847j401264j375197q19592n99145r47976l64426Q7825m27892o34221
4212D6688959j232421o75602m18842K92472J84086J37243J53521J07428l6711
$$ y = [70776066, 68830834, 67023464, 65203095, 64377922, 63969290, 63451893, 63515961, 63696187, 63131775, 62626228, 61544704, 60414588, 59962031, 59547264, 59333956, 60092317, 61000600, 62566809, 64478320, 65790413, 66933445, 67007532, 64967801, 62128851, 59905653, 57785408, 56751553, 55535652, 55025076, 54668377, 53777670, 53432582, 53066744, 52910200, 52902020, 52536380, 52146563, 51930682, 51523110, 51795340, 51637196, 52010973, 52135639, 52381215, 52967069, 54019268, 55246281, 56822596, 57802841, 57255729, 56117637, 54531007, 53170847, 51769583, 50394386, 49574794, 48975649, 48027673, 47663247, 47751072, 47323180, 46688959, 45456538, 44780936, 44362094, 44654566, 44838652, 44975895, 45129416, 45236844, 45200133]
4203D5200133J27295K79203R41909O14027n27438j095204j628489j316225q84335
4194D1710876j037288j358756j549465j190551j040185o25807m93682m17276J90407
4185C4188273o8556n93791q01376j688358j323882j190327q80151q20611n03461
4176B6317760J89063l48487q15361q48215o86133j158482j219551n89160p29573
4167B0111861l75933n25955l37957k18649k19354j107840p15084j121581m47687
4158A5041821m33753k64668K42852j66273k79556m228m13842n36743n06072m74788
4148A2204750J91964O14368L69110J89780l24579j48818j97549k65120j30786
4139A2503120j62720L34651O80427L10746M80392k40210l15047O753m20138L90650
$$ y = [45200133, 45327428, 45606631, 46548540, 47162567, 46635129, 45539925, 43911436, 42595211, 41710876, 40673588, 39314832, 37765367, 36574816, 35534631, 34908824, 34415142, 33997866, 34188273, 34119717, 33525926, 32724550, 31036192, 29712310, 28521983, 27641832, 26821221, 26317760, 26506823, 26158336, 25342975, 24494760, 23808627, 22650145, 21430594, 20841434, 20111861, 19735928, 19209973, 18872016, 18653367, 18434013, 17326173, 16611089, 15489508, 15041821, 14608068, 14343400, 14586252, 14419979, 14140423, 14136195, 13722353, 13185610, 12679538, 12204750, 12396714, 13011082, 13380192, 13569972, 13245393, 13096575, 12899026, 12633906, 12503120, 12340400, 12675051, 13355478, 13666224, 14146616, 13906406, 13591359, 13598112, 13177974, 13568624]
4129A3568624j55080k54554K16921L87009k89925M23888k92958o87500o81064
4120A2235361j3780J98150K70803M8817j0914k89215k37130j003484p63884n73536
4110I861188o11487p68995L88139R10278j0596l28858k03223m93402Q3120n13332
4100H312832j3330N09343M41486M28718l32134k61718q40421n76077n88739n88419
4090F491541J94962L88766M49729M19274L7990o79460k03416n36434l45375j04253
4080F113324M70386N51161O95097l064k05201o24664o93277m39713k10694N86047
4070F239402P51238L37356M10502p0806J34140o52674m85632l51190J47467N51406
4060G011209N85802J35804l6920k22739l24539k77261l72330K32923L49523N23758
$$ y = [13568624, 13413544, 13158990, 13375911, 13762920, 13472995, 13896883, 13603925, 12916425, 12235361, 12221581, 12419731, 12690534, 12739351, 12728437, 12439222, 12202092, 11198608, 10434724, 9861188, 9249701, 8480706, 8868845, 9779123, 9768527, 9439669, 9236446, 8743044, 8826164, 8312832, 8299502, 8808845, 9250331, 9679049, 9346915, 9085197, 8244776, 7668699, 7079960, 6491541, 6686503, 7075269, 7524998, 7944272, 7982262, 7302802, 7099386, 6562952, 6217577, 6113324, 6583710, 7134871, 7829968, 7826904, 7621703, 6997039, 6303762, 5864049, 5653355, 6239402, 6990640, 7327996, 7738498, 7667692, 7801832, 7149158, 6663526, 6312336, 6459803, 7011209, 7597011, 7732815, 7695895, 7473156, 7148617, 6871356, 6499026, 6731949, 7081472, 7605230]
4050G605230N07406q0667L89022N8889o66480n04522P7989Q88425P65334P43619
4040I784245J21468K53948L48190l29503m9805L66986R38260J151999J287222
4031A3873010J548763J026761J498682O88619N90922O50561j38940o00883n80136
4022A8557359p58025j198200j335116o07937p38445l40239o988Q18761Q96538
4013A5287708R34324O15242j39859K54594N86989J036929J765035J877053L229710
4004B5447725K807058K192881J582864m99421j459410k084024k647567j789229
3996B3550877j565308j341733j704153j545267j566275p02544m2258j14310N43985
3987A5513014L16408L20978k10750j54221J20143L85033J800324J664479K098775
$$ y = [7605230, 8112636, 8031969, 8420991, 8479880, 7813400, 7308878, 7386867, 8275292, 9040626, 9784245, 9905713, 10159661, 10507851, 10178348, 10128543, 10495529, 11433789, 12585788, 13873010, 15421773, 16448534, 17947216, 18635835, 19226757, 19877318, 19738378, 19137495, 18557359, 17799334, 16601134, 15266018, 14658081, 13919636, 13579397, 13572409, 14391170, 15287708, 16222032, 16837274, 16697415, 16952009, 17538998, 18575927, 20340962, 22218015, 25447725, 28254783, 30447664, 32030528, 31531107, 30071697, 27987673, 25340106, 23550877, 21985569, 20643836, 18939683, 17394416, 15828141, 15125597, 15083339, 14969029, 15513014, 15829422, 16150400, 15939650, 15785429, 15905572, 16290605, 18090929, 19755408, 21854183]
3978B1854183J421317M32790n47230j326720j983368j232595o58186o30654n89378
3969A6740159n34647j039051q63086n24262n4710K31407O02088M62177L97125
3960A5417200o23752p137k33967M22457O16835Q94878M58566O41856k5792j60966
3950A7400178l9409K95498Q14747J477084O86157j80408L2482M16020L12747J084594
3940B2299690R48180J260157R37926P14521J90805K36375Q87148J648880J250358
3931C0374040J464984Q41960P86807K59518N16675J592106K078839J977661J376899
3922D1269489Q96602N76669J299291J918356K948989L030490L040034K130367
3914E7110287J597431K105118L672177N542117O521236O413075O515904P076757
$$ y = [21854183, 23275500, 23708290, 23161060, 21834340, 19850972, 18618377, 17960191, 17329537, 16740159, 16205512, 15166461, 14303375, 13779113, 13724403, 13955810, 14557898, 15020075, 15417200, 14793448, 14786311, 14552344, 14974801, 15591636, 16486514, 16945080, 17586936, 17561144, 17400178, 17360769, 17656267, 18471014, 19948098, 20634255, 20453847, 20486329, 20902349, 21215096, 22299690, 23247870, 24508027, 25445953, 26160474, 26351279, 26587654, 27474802, 29123682, 30374040, 31839024, 32680984, 33467791, 33727309, 34243984, 35836090, 37914929, 39892590, 41269489, 42166091, 42742760, 44042051, 45960407, 48909396, 51939886, 54979920, 57110287, 58707718, 60812836, 64485013, 70027130, 76548366, 82961441, 89477345, 96554102]
3906I6554102Q888094J2769436J5377535J7491516J7626963J7721340K2009657
3899B08438643L0705612M3945084N5089747P1217310O6438484J6085759o8873031
3892D23047608q0819667n9867125m6767771l8993869l1062073k1740904j5469655
3885A28326544r639632o445951l979983l326253k312209j695524l90012k55257
3877A00281723j686103l483132k530017k204778j549327k82644K981932N892104
3869I7419758Q560507J1868779J3694119P526304j0566372k0807573j6316723
3862I1378799j3000671q914172o450813l107032j866233j082858j951243j916088
3854E3089689k245384j402005k132051j264538j884103k375558k632755k199092
$$ y = [96554102, 105442196, 118211632, 133589167, 151080683, 168707646, 186428986, 208438643, 239144255, 283089339, 338179086, 409396396, 475834880, 491920639, 423047608, 342227941, 282360816, 235593045, 196599176, 165537103, 143796199, 128326544, 118686912, 112240961, 108260978, 104934725, 102622516, 100926992, 100536980, 100281723, 98595620, 95112488, 92582471, 90377693, 88828366, 88545722, 91527654, 97419758, 105980265, 117849044, 131543163, 139069467, 128503095, 107695522, 91378799, 78378128, 69463956, 63013143, 59906111, 58039878, 56957020, 55005777, 53089689, 50844305, 49442300, 47310249, 46045711, 44161608, 41786050, 39153295, 36954203]
3846C6954203k230249j859601j355798j082088j121245n45532j053504j95629
3838B7510557k81275M33530J35708J67889n42263p36166j610161j013652m88139
3829B3576028m85121n16934o08844k80896J20021o35137m78269k69091q7077m55062
3819A9879618n33940k2013j28059j30619K18245l11138K01196k66664J55598L4802
3809A9097026J13133N75774k49856J02471j77958k48207q8619j28487j35411n2511
3799A8807355K56655k86565K79809K87395L13563M2480L00625J87779L91228n4242
3789B0526082L08772P03047J59283M75190O6429L16320K10190L01914K71003L44354
3779B3682584K91285j54483M69562P33361K50427P46897J100268j46169o79360
$$ y = [36954203, 34723954, 32864353, 31508555, 30426467, 29305222, 28759690, 27706186, 27510557, 27229282, 27662812, 27798520, 27966409, 27424146, 26687980, 25077819, 24064167, 23576028, 23090907, 22573973, 21965129, 21684233, 21804254, 21169117, 20690848, 20421757, 20334680, 19879618, 19345678, 19323665, 19195606, 19064987, 19283232, 18972094, 19173290, 18906626, 19062224, 19097026, 19210159, 19785933, 19536077, 19638548, 19460590, 19212383, 19123764, 18995277, 18859866, 18807355, 19064010, 18777445, 19057254, 19344649, 19658212, 19700692, 20001317, 20189096, 20580324, 20526082, 20834854, 21537901, 21697184, 22172374, 22238803, 22555123, 22765313, 23067227, 23338230, 23682584, 23973869, 23819386, 24288948, 25022309, 25272736, 26019633, 27119901, 26973732, 26294372]
3770B6294372l43520j033178n23373j7278Q4692m0199m88761l07469J32267R7648
3760B3855201n85201k15176k01120l30779J73309k53788j92316j86580k37716
3751B1825834N121o58208l25756j41904l58093r2006o21777k75419k23912k66831
3741A8867049r9006l9914o53362n85122k98743j34412j22832o74616n41277n8036
3731A5659729o61369r4377m35931k08975l74918k6703l80346J08408k55882m02382
3721A2927254j94212J56773J50054O905k17819K31157k60557q3291R0280k44820
3711A2561724o7524o9889K47461n5141m6508j90961J95344q7164j05429J75492
3701A2557405o82962M0309L19484K15860l69965M3968m1602l57209K10498Q0329
$$ y = [26294372, 25950852, 24917674, 24394301, 24377023, 24461715, 24421516, 23932755, 23625286, 23757553, 23855201, 23270000, 23054824, 22853704, 22522925, 22696234, 22442446, 22250130, 22063550, 21825834, 21830955, 21172747, 20846991, 20705087, 20346994, 20254988, 19633211, 19357792, 19133880, 18867049, 18768043, 18728129, 18074767, 17489645, 17190902, 17056490, 16933658, 16259042, 15717765, 15659729, 14998360, 14903983, 14468052, 14259077, 13884159, 13857456, 13477110, 13585518, 13329636, 12927254, 12733042, 12889815, 13039869, 13046774, 12828955, 13060112, 12799555, 12716264, 12806544, 12561724, 12494200, 12424311, 12671772, 12616631, 12570123, 12379162, 12574506, 12487342, 12381913, 12557405, 11874443, 11914752, 12234236, 12450096, 12080131, 12124099, 12082497, 11725288, 11935786, 12016115]
3691A2016115J37176M79645J46069M4316J0771M70579P9940j9474M34721K36430
3681A4036288N44236J35164M70037K49517M68207K32279J38201J62895n3886j56286
3671A6226652J0876M77937O3155K7997N26001L66524M37266L60573J73648N51885
3661A9222514R47332O70856O71595O77489K39171l8061Q8138m67621m32496j4851
3651B1564066m46950k9333K77122j9687o00734J83644j66494p94915j37510p3063
3641A9756146J10656l75568L82667N23133P7701N84076P89406O96923K06121N12222
3631B3263483L79417M41975P6007l39125k12166n84006j41136n38479l65982M03170
3621B2383158j67044j30609N06715L80762M02216O17018L66229P62190Q22904
$$ y = [12016115, 12153291, 12632936, 12779005, 12823321, 12834092, 13304671, 13384611, 13365137, 13799858, 14036288, 14580524, 14715688, 15185725, 15435242, 15903449, 16135728, 16273929, 16436824, 16382938, 16226652, 16237528, 16715465, 16778620, 16806617, 17332618, 17699142, 18136408, 18496981, 18670629, 19222514, 20169846, 20840702, 21512297, 22189786, 22428957, 22390896, 22479034, 22011413, 21578917, 21564066, 21117116, 21087783, 21364905, 21345218, 20744484, 20928128, 20761634, 19966719, 19829209, 19756146, 19866802, 19491234, 19873901, 20397034, 20474735, 21058811, 21848217, 22545140, 22751261, 23263483, 23642900, 24084875, 24160882, 23821757, 23609591, 23025585, 22884449, 22345970, 21979988, 22383158, 22216114, 22085505, 22592220, 22972982, 23375198, 23992216, 24358445, 25120635, 25943539]
3612B5943539Q53800M91699O81041R56389J231768J319434J043570J120895K71263
3603C3913398k73645r98249j243976j327604j175687j254498m17413l60598k15418
3594B6646310K54900j621j19788J8929P76123L35145J121235R51790M85686J22425
3584C0591134j074742j089970j385868j417261j335716j439788p29551o00082
3576B1518156n42840r16887p21539o67670K69927L61102r8041Q90762O6673K93348
3566B0452991M26833J434350J194655J208159J051554Q39623P4623p20244p09065
3557B5253479q35963j173382n40876k43281l43434l3170m11512K59540P81974
3548B2713375L52919O66563R44669J098999J235391J335823J031168R12372l34057
$$ y = [25943539, 26797339, 27289038, 27970079, 28926468, 30158236, 31477670, 32521240, 33642135, 33913398, 33639753, 32641504, 31397528, 30069924, 28894237, 27639739, 27222326, 26861728, 26646310, 26901210, 26899589, 26779801, 26798730, 27574853, 27909998, 29031233, 29983023, 30468709, 30591134, 29516392, 28426422, 27040554, 25623293, 24287577, 22847789, 22118238, 21518156, 20975316, 20058429, 19336890, 18669220, 18939147, 19300249, 19202208, 20092970, 20159643, 20452991, 20879824, 22314174, 23508829, 24716988, 25768542, 26608165, 26682788, 25962544, 25253479, 24417516, 23244134, 22703258, 22459977, 22116543, 22083373, 21671861, 21931401, 22713375, 23066294, 23732857, 24677526, 25776525, 27011916, 28347739, 29378907, 30291279, 29957222]
3539B9957222m68269m6436K48508P8642N09875N86742J038567J014958J061113
3530C3980922J182162J288024J129388J438891J721440J527176J054654J22345
3522D3445002j47805l63696m79860k89476K81295M34261L20575m6595o09497q00990
3512D1743214p99053j138447j589327j328111p90144o52476j019253j300126j811870
3503C1314407j445309j411835j969351j293735j701147o92165o87645o98870l89624
3494B1024726l97641k68053P63509M10750L90869Q92166R30031O04311Q71387
3485B5222055R82209O60320L34996N76055R96414J146878J125879O37837O09422
3476C2292065K11764l02213j87361q29091m99863k70391K0457K96843Q3590n57699
$$ y = [29957222, 29488953, 29442517, 29691025, 29769667, 30279542, 30866284, 31904851, 32919809, 33980922, 35163084, 36451108, 37580496, 39019387, 40740827, 42268003, 43322657, 43445002, 43297197, 42933501, 42453641, 42164165, 42445460, 42879721, 43200296, 43153701, 42544204, 41743214, 40944161, 39805714, 38216387, 36888276, 36098132, 35445656, 34426403, 33126277, 31314407, 29869098, 28457263, 26487912, 25194177, 23493030, 22800865, 22113220, 21414350, 21024726, 20627085, 20359032, 21122541, 21533291, 21924160, 22816326, 23746357, 24350668, 25222055, 26204264, 26864584, 27199580, 27775635, 28772049, 29918927, 31044806, 31682643, 32292065, 32503829, 32201616, 32014255, 31185164, 30685301, 30414910, 30435367, 30732210, 30815800, 30258101]
3466C0258101r08701n79038j737905j971642j118188j220342p24063r42347j003829
3457B0052046r86123j116842j066551j010595j303336q47483r23333o26973n70398
3448A1600412o10325k83612j10448j19919m1948m99427K7950k28034k8339k592
3438I703718l3695o37443k01255J41437N3396J17230k54741r6650R4697l79494
3428H507200r1657K68336o5808K39757n3198K61496m76934L2157l9958k62555
3418H318836m8823K30824j22007O5937J14763l64993M19760J73305k7026k16905
3408H543671q783r6783P2485K47088k96820J70040K7463N02273N7616L2391k16783
3397I033858n99912J19204O16473K8061M8078L82380j6684j44354L21670J67417
$$ y = [30258101, 29349400, 28770362, 27032457, 25060815, 23942627, 22722285, 21998222, 21055875, 20052046, 19065923, 17949081, 16882530, 15871935, 14568599, 13721116, 12797783, 12170810, 11600412, 10990087, 10706475, 10596027, 10476108, 10434160, 9934733, 9962683, 9734649, 9706310, 9703718, 9670023, 9032580, 8831325, 8972762, 9026158, 9143388, 8888647, 8791997, 8886694, 8507200, 8415543, 8683879, 8618071, 8857828, 8804630, 9066126, 8589192, 8621349, 8581391, 8318836, 8270013, 8500837, 8378830, 8444767, 8559530, 8194537, 8614297, 8787602, 8760576, 8543671, 8534888, 8438105, 8510590, 8757678, 8460858, 8630898, 8658361, 9160634, 9218250, 9250641, 9033858, 8433946, 8553150, 9169623, 9197684, 9245762, 9628142, 9611458, 9467104, 9788774, 9956191]
3387I956191Q483K54915O37072r5394L01945j66023J24300J97653J4058L74109
3377A1607309L29081o8967K61959k0834K71307L55302j56529J46682n1215J39425
3367A2813520J29320K23116J44785K40127K72923J69924M70727J38083k23035
3358A4379490O32383O36265O7423J47390M14985L62058J33802K82465N57620N69160
3348A8183041n554N30278R79642J12035K98645M64029O48045M25750L04703J074208
3338B3014822P48633J201633O85890N59382Q00243R55903L56547K43107O0468
3329B8626628l78204L76852j43265M96535M48933K51495L65737R44507N22774
3320C1511992P49122L56904J73374O53497J019521P50741J080021J375477J012900
$$ y = [9956191, 9964674, 10219589, 10856661, 10761267, 11063212, 10897189, 11021489, 11219142, 11233200, 11607309, 11936390, 11867423, 12129382, 12108548, 12379855, 12735157, 12578628, 12725310, 12674095, 12813520, 12942840, 13165956, 13310741, 13550868, 13823791, 13993715, 14464442, 14602525, 14379490, 15011873, 15648138, 15715561, 15862951, 16277936, 16639994, 16773796, 17056261, 17613881, 18183041, 18177487, 18707765, 19687407, 19799442, 20098087, 20562116, 21210161, 21635911, 21940614, 23014822, 23763455, 24965088, 25650978, 26210360, 27010603, 27966506, 28323053, 28566160, 28626628, 28248424, 28625276, 28482011, 28978546, 29427479, 29678974, 30044711, 30989218, 31511992, 32261114, 32618018, 32791392, 33444889, 34464410, 35215151, 36295172, 37670649, 38683549]
3311C8683549J356540J500539J810921J474997N21336L8069p36924j219729j192472
3302D2236826j440933p58747m59128l0411j3732n4936L11864J24139k88257J40893
3292C9767578L32138L54728N10638R72133R30837P35638J403677J509865J314902
3283D7832134J214256L35133O69088n91055k087114k215364j834355j632389j363817
3274D0326517j444768j165280l35051n44731j84665j38802J26505M3473o9977
3265C6613221l96984j21335L8653K95511M78585O42439P86583J231600R43544
3256D0511817M17885k66375j115538r49591j113343j277234r53690q42215l79045
3247C4032671o35693j63966J0886M74013L83183J5921l8233l41906K6440J91003
$$ y = [38683549, 40040089, 41540628, 43351549, 44826546, 45347882, 45385951, 44649027, 43429298, 42236826, 40795893, 40037146, 39578018, 39547607, 39533875, 39478939, 39790803, 39914942, 39626685, 39767578, 40099716, 40454444, 40965082, 41937215, 42868052, 43603690, 45007367, 46517232, 47832134, 49046390, 49381523, 50050611, 49459556, 47372442, 45157078, 43322723, 41690334, 40326517, 38881749, 37716469, 37381418, 36836687, 36652022, 36513220, 36639725, 36683198, 36613221, 36216237, 36094902, 36133555, 36429066, 36907651, 37550090, 38336673, 39568273, 40511817, 40929702, 40663327, 39547789, 38598198, 37484855, 36207621, 35253931, 34411716, 34032671, 33396978, 33233012, 33243898, 33717911, 34101094, 34117015, 34078782, 33736876, 33763316, 33954319]
3237C3954319J6174J24889M75744N93587M96954J59685K83924J73426k8088k96669
3227C5953945l98237o44679o53825k33703k37615k66103l71964j71753m19008
3218C2557058n38106r29375o87485n76163n67074o61183q41413m61060p02499
3209B6592700n06396k7411k50020k39031O4496K31095M7010m54295k35836L83813
3199B5606125M33838J2931K20070K73605Q87553L34132P71571J096866N35167
3190C0171858P93529M73322K66055L18095k84465k702k42028K84061L2452K78809
3180C2088986O75997M23360Q68548J022421K0882o06950l35756q56793p14300
3171C2586395o52758q90390k33100K54445L13108L4741k02395k55735K33849j13730
$$ y = [33954319, 33970493, 34095382, 34571126, 35164713, 35661667, 35821352, 36105276, 36278702, 36250614, 35953945, 35555708, 34911029, 34257204, 34023501, 33785886, 33519783, 33147819, 32976066, 32557058, 32018952, 31089577, 30402092, 29825929, 29258855, 28597672, 27756259, 27295199, 26592700, 26086304, 26058893, 25808873, 25569842, 25634338, 25865433, 25912443, 25458148, 25222312, 25606125, 26039963, 26052894, 26272964, 26546569, 27434122, 27768254, 28539825, 29636691, 30171858, 30965387, 31438709, 31704764, 32022859, 31738394, 31735692, 31493664, 31777725, 31810177, 32088986, 32764983, 33188343, 34056891, 35079312, 35100194, 34493244, 34157488, 33300695, 32586395, 31933637, 31043247, 30810147, 31064592, 31377700, 31412441, 31210046, 30954311, 31188160, 31074430]
3161C1074430p29040n18447M7562M52551j76123m639L1660N54601L62483K80801
3151C1375839O11980N66766O74126L26088Q87444J121082J174878Q13633N73722
3142C8125558O19808K60131P6957k74670L62976J87423P52826O93672J076756
3133D1881437Q09344J039753P71921k30179j06232q05777q63356r18323n58746
3124D1019842j87905m55113L4174M60235M86573l16022j87370m68165o9478m85019
3114C9831752o96327j74648k61596k09744J60223L21100j78564J19202K07089
3105C9118487k9681O31055O98572N44506L07813P23351R00810J094437J008743
3096D4998093R7283N99274L72630P95707M66376L90962Q60040J097878J271930
$$ y = [31074430, 30345390, 29826943, 29874505, 30327056, 30150933, 30146294, 30177954, 30732555, 31095038, 31375839, 31987819, 32554585, 33228711, 33554799, 34442243, 35563325, 36738203, 37551836, 38125558, 38745366, 39005497, 39082454, 38807784, 39170760, 39358183, 40111009, 40804681, 41881437, 42690781, 43730534, 44502455, 44272276, 44166044, 43360267, 42496911, 41578588, 41019842, 40831937, 40376824, 40410998, 40871233, 41357806, 41041784, 40854414, 40386249, 40316771, 39831752, 39135425, 38960777, 38699181, 38489437, 38649660, 38970760, 38792196, 38911398, 39118487, 39088806, 39719861, 40418433, 40962939, 41270752, 41994103, 42894913, 43989350, 44998093, 45095376, 45694650, 46067280, 46862987, 47329363, 47720325, 48580365, 49678243, 50950173]
3087E0950173J235991J034184R25188J83882L83892j45503J50654k74507M61431
3078E4905385M93038M283L73403O00217L35278n3526J81637J04434j62168n86810
3068E6195171p48273n80743l63158l03477o33433n71219o46249q22200p81609
3059E0744810o55642l60307j065651r13419p65271p11995p78518j114045q28432
3050D3551530o08857o85308p56267j102897j243361j130968n48869q73157j344781
3041C5257065r99020p36441p00433j027091o33350p69180p38561o74369p15610
3032B8263010p43547o70622q54754n71541n83968m11575k32446n25497l42489
3023B3326571k31899q3370k45353n86187m15548K4929n93245j85916n68677l32525
$$ y = [50950173, 52186164, 53220348, 54145536, 54329418, 54713310, 54567807, 54718461, 54443954, 54905385, 55398423, 55402706, 55776109, 56376326, 56711604, 56658078, 56839715, 56944149, 56781981, 56195171, 55446898, 54866155, 54502997, 54199520, 53566087, 52994868, 52348619, 51526419, 50744810, 50089168, 49728861, 48663210, 47749791, 46984520, 46272525, 45494007, 44379962, 43551530, 42942673, 42257365, 41501098, 40398201, 39154840, 38023872, 37475003, 36601846, 35257065, 34258045, 33521604, 32821171, 31794080, 31160730, 30391550, 29652989, 28978620, 28263010, 27519463, 26848841, 25994087, 25422546, 24838578, 24427003, 24194557, 23669060, 23326571, 23094672, 23011302, 22765949, 22179762, 21764214, 21789143, 21195898, 21009982, 20441305, 20108780]
3013B0108780l3603p12051l68115L40555k9666l16686p1783K51427j17788l14315
3003A8736755l02383k55317L21220j33626j79652K7694n01863Q3953k62547k62223
2993A7272011R1567j73843l41627r4973j09123J25366k00113j13375M47378L01797
2983A7205065q4428J52351K03467M71820K02001m4259O45337M17342q3649J05448
2973A9190495M2863j91066L04559N21718J82850K13326O19855J68431L25165n8916
2963B1319280r256J049266O73147K83643M71368M81213O86668O48017J88785K22089
2953B6014220N52078k89789M83622O63645L38219M60317K78649M58065L41337
2944B9300363J79546k13184k40639K52559n43488q7067l96696n31598P1042k61924
$$ y = [20108780, 20075177, 19363126, 18995011, 19335566, 19305900, 18989214, 18917431, 19168858, 19051070, 18736755, 18434372, 18179055, 18500275, 18366649, 18186997, 18214691, 17712828, 17796781, 17534234, 17272011, 17363578, 17189735, 16848108, 16753135, 16644012, 16769378, 16569265, 16455890, 16903268, 17205065, 17120637, 17272988, 17476455, 17948275, 18150276, 18106017, 18751354, 19168696, 19085047, 19190495, 19233358, 19042292, 19346851, 19868569, 20051419, 20264745, 20884600, 21053031, 21378196, 21319280, 21310024, 22359290, 23032437, 23316080, 23787448, 24268661, 24955329, 25603346, 25792131, 26014220, 26566298, 26276509, 26760131, 27423776, 27761995, 28222312, 28500961, 28959026, 29300363, 29479909, 29266725, 29026086, 29278645, 28735157, 28648090, 28251394, 27719796, 27790838, 27528914]
2934B7528914j34601m32013J01114l98184m65979o77942o04895l80098n05027
2925B4031289m76901p67131j87767n0746j05812j2391J64523l25668n16794M8863
2915B1801465L8625p86410m47837M81645J08994j1446J39539L03236K12014K40070
2905B2079895l15395k38603O3487k832K06930l112L52657K42273k62332J51990
2895B2274958J17698n38523j51093m44980r38052P5748j11653q27467l52359l9229
2885A9065048l57279q6928l41245q32642p30054j34969n73950o20433k39977k56211
2875A4891360m19801q2507L8595m60950l11382l05083J06804k46214m66386k62831
2865A2481605k24625l42745N6653j3650l51357j02445K85008j71728j60284r8835
$$ y = [27528914, 27394313, 26962300, 27063414, 26665230, 26199251, 25521309, 24916414, 24536316, 24031289, 23554388, 22787257, 22599490, 22548744, 22442932, 22430541, 22595064, 22269396, 21752602, 21801465, 21840090, 21053680, 20605843, 21087488, 21196482, 21185036, 21324575, 21627811, 21839825, 22079895, 21764500, 21525897, 21589384, 21586552, 21793482, 21790370, 22143027, 22385300, 22122968, 22274958, 22392656, 21854133, 21703040, 21258060, 20320008, 20395756, 20284103, 19456636, 19104277, 19065048, 18707769, 18620841, 18279596, 17446954, 16716900, 16581931, 16007981, 15387548, 15147571, 14891360, 14471559, 14389052, 14427647, 13966697, 13655315, 13350232, 13457036, 13210822, 12744436, 12481605, 12256980, 11914235, 11970888, 11957238, 11605881, 11503436, 11788444, 11616716, 11456432, 11357597]
2855A1357597n5487M91848l52527j74519N8266N961J19869r3473k51133K21000
2845A1327402m8799O0820K54614j08106l63924p6160N3644j14748J93405l05487
2835A0872661K17330k49583L79663J55939N8894O2821L76435k39021J20519J38855
2825A1894513k02618J9217n77499J95445J27186p2304J52659J59955J44860K88655
2815A2130069l48464J1178K36050m1897J5511k11652L23962N86489K48134j96501
2805A2752879K47983O348l0978J07280k14975L7410j32424J21027j32051j97196
2795A2565303J80367P7595p2254L28201M31328o0555J02855O69313K55530L64909
2785A4842592j0317j91760n94332m59159k08256k69617l4589k81544Q8978l54989
$$ y = [11357597, 11302110, 11793958, 11441431, 11266912, 11325178, 11331139, 11451008, 11357535, 11106402, 11327402, 11278603, 11339423, 11594037, 11485931, 11122007, 11045847, 11099491, 10984743, 11178148, 10872661, 11089991, 10840408, 11220071, 11376010, 11434904, 11497725, 11874160, 11635139, 11755658, 11894513, 11691895, 11711112, 11133613, 11329058, 11456244, 11383940, 11536599, 11696554, 11841414, 12130069, 11781605, 11792783, 12028833, 11986936, 12002447, 11790795, 12114757, 12701246, 12949380, 12752879, 13000862, 13007210, 12976232, 13083512, 12868537, 12905947, 12773523, 12894550, 12762499, 12565303, 12745670, 12823265, 12751011, 13079212, 13510540, 13449985, 13552840, 14222153, 14477683, 14842592, 14832275, 14640515, 14046183, 13587024, 13378768, 13109151, 13074562, 12793018, 12881996, 12527007]
2775A2527007K03459J82182j20641K33927K84451O2303j55073q3878q8735J73326
2765A3218328J19123J90250L20886P95908P19174N67512P09172M16936J90120
2756A7247409L75574l71109n69921j18566k72075r5739q5058M37882K86171M81338
2746A7315906R55753M52061Q86785L27614J26578o61675L7298n16391o47534l93013
2736A7883382o47171p10978j47453l9495M201K19849k16358p9764J65665o2684
2726A6369194q93259l04801k25562n66390j3515l8291J99012j41507L40199L57816
2716A5082896N28505M79259L86975O59482k19908n27243n46983R1569k92540k67991
2706A5374021J90644K18401O88172R67625M75569L52430P77895N17811j37444
$$ y = [12527007, 12730466, 12912648, 12792007, 13025934, 13310385, 13372688, 13217615, 13133737, 13045002, 13218328, 13337451, 13527701, 13848587, 14644495, 15363669, 15931181, 16640353, 17057289, 17247409, 17622983, 17251874, 16681953, 16563387, 16291312, 16195573, 16110515, 16548397, 16834568, 17315906, 18271659, 18723720, 19610505, 19938119, 20064697, 19403022, 19440320, 18923929, 18276395, 17883382, 17236211, 16525233, 16377780, 16338285, 16342486, 16562335, 16345977, 16266213, 16431878, 16369194, 15475935, 15171134, 14945572, 14379182, 14365667, 14327376, 14526388, 14384881, 14725080, 15082896, 15611401, 16090660, 16477635, 17137117, 16917209, 16389966, 15842983, 15934552, 15642012, 15374021, 15564665, 15783066, 16471238, 17438863, 17914432, 18266862, 19044757, 19562568, 19425124]
2697A9425124n621q99228p08801r73986p00166m43865n46533p2477L58442j84961
2687A5247928K57932O22201M14042L9237k38423o90756o98194n09682k89865m67207
2677A3687213j19911J25252R8965M54546M62462K23320M80813R67394M26015L72200
2667A7178269M27525k2321L84942k6709P00641J412617Q29783O35861L74953P88495
2657B2684056P09447q6578M56850O29184L75837O8683q01826j145616j429191
2648B1460846j413199r25114o21252o64709L05298k70400N25602N43481N71069
2639A9511622O93035L45464k41480j290102j202813j423465j236140p50320r54048
2630A3451753n29754l80712o03416k15869j21n0318J27125J36609l397j81037
$$ y = [19425124, 19419503, 18520275, 17811474, 16837488, 16137322, 15693457, 15146924, 15074447, 15432889, 15247928, 15505860, 16128061, 16542103, 16581340, 16342917, 15652161, 14953967, 14444285, 14154420, 13687213, 13567302, 13692554, 13791519, 14246065, 14708527, 14931847, 15412660, 16380054, 16806069, 17178269, 17605794, 17583473, 17968415, 17941706, 18642347, 20054964, 20884747, 21520608, 21895561, 22684056, 23393503, 23306925, 23763775, 24392959, 24768796, 24837479, 24035653, 22890037, 21460846, 20047647, 19122533, 18501281, 17836572, 18141870, 17871470, 18397072, 18940553, 19511622, 20204657, 20550121, 20308641, 19018539, 17815726, 16392261, 15156121, 14405801, 13451753, 12921999, 12541287, 11937871, 11722002, 11721881, 11671563, 11798688, 11935297, 11931900, 11750863]
2620A1750863j45834M8314k41505O63850O12236O23047P61349Q22115P45722O48763
2610A6288920J191985J612911J638098J822960J479144N10882p05626j384788
2602B2454486j534618j290172p92925q09461n19005j64689N77261J024529J156328
2593B0101734N11113L41949n20477r99085j490351j475496j360231j289054q35974
2584A2984128p97017q88145o51007n25331l39849m70052j55952j50529l79885
2575H626361j91533m4807j79046J45084j55698p5692N12895M6805L27973J49995
2565I162337M46548M08098O11978P87575M89805R16818O84460j58799n44256m50791
2555A2353773r71568q29764m55464n35235j93874j20427M96269J68971L86808
$$ y = [11750863, 11605029, 11653343, 11411838, 12075688, 12687924, 13310971, 14072320, 14894435, 15640157, 16288920, 17480905, 19093816, 20731914, 22554874, 24034018, 24544900, 23839274, 22454486, 20919868, 19629696, 18836771, 18027310, 17508305, 17343616, 17920877, 18945406, 20101734, 20612847, 20954796, 20434319, 19435234, 17944883, 16469387, 15109156, 13820102, 12984128, 12187111, 11298966, 10647959, 10122628, 9782779, 9312727, 9156775, 9006246, 8626361, 8434828, 8390021, 8210975, 8356059, 8200361, 8124669, 8637564, 8684369, 9012342, 9162337, 9608885, 10016983, 10628961, 11416536, 11906341, 12823159, 13507619, 13348820, 12804564, 12353773, 11382205, 10552441, 10096977, 9561742, 9367868, 9247441, 9743710, 9912681, 10299489]
2546A0299489N65466m6469j97001o92388j234291m02284p83662l33901J8611o61327
2536F532243l85853m00832j98524p1733j24545J71043n51350j97736k16628j11913
2526D444172R6917O8787l80807j07823j17993K18613M20921l33094K40921l47761
2516D202853m98519k78081J37142J61431m57271k66199p6161k2762J64030J51231
2506C217694j64955L6475k42482l35104L67401L47409q2875n02602J12319M01551
2496C154831j1430l32306j19463l8121L57610n48888L7165q8378j88742K53848
2486B476126J42831r7380P3835j23510Q1309k94834q747K03637k67742K88895
2476B474420J37737j79934j02492J57059k24469L5577K05061J14551m0278n11546
$$ y = [10299489, 10864955, 10818486, 10621485, 9929097, 8694806, 8292522, 7508860, 7174959, 7193570, 6532243, 6146390, 5745558, 5547034, 5475301, 5350756, 5521799, 4970449, 4772713, 4556085, 4444172, 4541089, 4609876, 4229069, 4121246, 4003253, 4221866, 4642787, 4309693, 4550614, 4202853, 3704334, 3426253, 3563395, 3724826, 3267555, 3001356, 2925195, 2902433, 3066463, 3217694, 3052739, 3089214, 2846732, 2511628, 2879029, 3226438, 3143563, 2640961, 2753280, 3154831, 3143401, 2811095, 2691632, 2653511, 3011121, 2462233, 2499398, 2411020, 2222278, 2476126, 2618957, 2521577, 2595412, 2471902, 2553211, 2258377, 2249630, 2453267, 2185525, 2474420, 2612157, 2432223, 2329731, 2486790, 2262321, 2297898, 2502959, 2617510, 2577232, 2065686]
2466B065686L02132o5282j04484Q237j49748j54445L13167K1964M2915k89072
2456A991070l53795K83116j56712M38607j92507N1057J06093L2444l9269j3515
2446B146589j09364j57957L06407k01110L39035L8812r0598M14480r6143K43360
2436B833511k96731K29453k68637o3464q3037K04490n4783j91218K42616j91209
2426B360991J85379Q4838K7142q242j04105L1971k08165J64289L4221l30486J94749
2415B432582K55157O577Q8083l9672L02322l36592m17305J06023P4709R8742K44704
2404B815330J73383k47390k25883l7271j83238j59479R24j04653J5043j97215
2394A849551J37310K3847j19380l92976l3621J41074j53459M9042N2432L38509
$$ y = [2065686, 2367818, 2302536, 2198052, 2206289, 2056541, 1902096, 2215263, 2237227, 2280142, 1991070, 1637275, 1920391, 1763679, 2202286, 2009779, 2060836, 2166929, 2199373, 2160104, 2146589, 2037225, 1879268, 2185675, 1984565, 2323600, 2362412, 2271814, 2686294, 2590151, 2833511, 2536780, 2766233, 2497596, 2434132, 2351095, 2555585, 2500802, 2309584, 2552200, 2360991, 2546370, 2631208, 2658350, 2650108, 2546003, 2577974, 2369809, 2534098, 2568319, 2237833, 2432582, 2687739, 2694316, 2782399, 2742727, 3045049, 2708457, 2291152, 2397175, 2471884, 2570626, 2815330, 2988713, 2741323, 2515440, 2478169, 2294931, 2135452, 2136376, 2031723, 2046766, 1849551, 1986861, 2010708, 1891328, 1498352, 1464731, 1605805, 1452346, 1501388, 1553820, 1892329]
2384A892329J56959K28147n2506k62250J08767k30340l04725Q9803L9479l18149
2374A347514Q6525L03010j23044j37657k72347q7162K25550m6619k88790L6824
2364A043804J76255J46010M86096l47968j63937J88676m76711P8443O5699k38609
2354I57758m55565J28232K25878j52961L22060M7401m35j21059j60656j29677
2344F60976k8254N143n1137J13807K07620J85263M3884j73797J02839j0116m82737
2333E73491k8882o5336k26581J26861R1393J30343j52563M6012J07576j1908j27060
2322D63346L58196k53117n54244J05235J62393o3783K16500K64738j93287k97005
2312B08972k96124R3550o3979L89341K81052j17424K5136j06518J56151J8339
$$ y = [1892329, 2049288, 2277435, 2224929, 1962679, 2071446, 1841106, 1536381, 1626184, 1665663, 1347514, 1434039, 1737049, 1614005, 1476348, 1204001, 1116839, 1342389, 1295770, 1006980, 1043804, 1220059, 1366069, 1852165, 1504197, 1340260, 1528936, 1052225, 1130668, 1196367, 957758, 502193, 630425, 856303, 703342, 1025402, 1072803, 1072368, 951309, 790653, 660976, 632722, 637865, 586728, 700535, 908155, 1093418, 1137302, 963505, 1066344, 1056228, 573491, 544609, 479273, 252692, 379553, 470946, 601289, 448726, 494738, 602314, 590406, 463346, 821542, 568425, 14181, 119416, 281809, 218026, 434526, 699264, 505977, 208972, -87152, 6398, -57581, 331760, 612812, 495388, 520524, 414006, 570157, 588496]
2302E88496j8638k09480j08134J84774m14001j54734L63063M6683N11888m58100
2292C31817K00626j03504K47483j12577l36569J3859N3599R114j3807L98470R541
2281F98052l54996j40992j1806M8342j31605K8892P3359k39140N70510k23683
2271C16933l4365j95408k60628m9458o9846k72200N04192J95636L25845k69287
2261A91414k15815L9670o7101J95229J15810N8091j73662Q7179K10127m5292N3363
2250D49013O6747k47900j01804p6893l57950J37219K70844l0128J06702R7982
2240C13832J63681M4218k14686q1062J45315m2703j62009K62461j64858j9662
2230B44527R8716k07337M4853J49703q7140J91537j66099j86389L55266l20854
$$ y = [588496, 569858, 360378, 252244, 437018, 23017, -131717, 231346, 278029, 789917, 331817, 532443, 428939, 676422, 563845, 227276, 241135, 294734, 303848, 290041, 688511, 698052, 343056, 202064, 190258, 238600, 106995, 135887, 209246, -29894, 540616, 316933, 282568, 87160, -173468, -222926, -292772, -564972, -60780, 134856, 460701, 191414, -24401, 15269, -51832, 143397, 259207, 317298, 143636, 230815, 440942, 395650, 449013, 515760, 267860, 166056, 89163, -268787, -131568, 139276, 109148, 215850, 313832, 477513, 521731, 307045, 225983, 371298, 328595, 166586, 429047, 264189, 244527, 343243, 135906, 180759, 330462, 243322, 434859, 268760, 82371, 437637, 116783]
2220A16783k79841L55011k9559K49873k07747j74222k21788J06642L68996j77202
2210A06946K3409K23939j0360l9922j1655j11617k56202p5560q7638J37915K42752
2199A42007R4655O1342l49968K37540j69161M8831N2810n8210o9000K23066L7995
2188B51907N0775k28344j09324L91804J47699k38057k46340k59337R7690r9353
2178b40880L33569K23776k7399j30587J65041N79k64596p114O3255m779j36954
2167b6089L41983p4382O5821J99844k85779l70976r538J14415J92520l89757J8164
2156b23774L16365j3996k13704L19269l41983j11137j35846K55280J24043j37545
2146a63028J263J14093L92831j79160q1555O1592l15900P2357J52614j57945K26115
$$ y = [116783, -163058, 191953, 162394, 412267, 204520, 30298, -191490, -84848, 284148, 106946, 130355, 354294, 343934, 304012, 292357, 180740, -75462, -151022, -238660, -100745, 142007, 236662, 298004, -51964, 185576, 16415, 65246, 118056, 59846, -9154, 213912, 251907, 302682, 74338, -34986, 356818, 504517, 266460, 20120, -239217, -141527, -240880, 92689, 316465, 289066, 158479, 323520, 324099, 59503, 52389, 115644, 110865, -26089, 315894, 241512, 307333, 507177, 221398, -149578, -159116, -44701, 147819, -241938, -223774, 92591, 78595, -135109, 184160, -157823, -268960, -404806, -149526, -25483, -163028, -161765, -47672, 345159, 165999, 84444, 146036, -169864, -97507, 55107, -102838, 123277]
2135A23277q1891j0721J45896q7494l57572K13971j33237K03268Q2748J10086
2125B08331l17107L02006J76732m18037n1920q3391P6541K3181J6791J80904j63662
2114d9631K95887k19503j42277l90052O4946L34462j1634K33229m6758K34723
2104C03392j50727k26659r9917L6521P9742k44811n045M40050r3612j12721K73706
2093A99919k49573p1060j11962k26128J77018o2384R0581M45922J92035K930l6358
2082C50940j50238k20508j43122p965R1030K96436n35026L90608N6950j44916
2072a5811q8223P5985J4810j94558K97649K93142n61640n1378J8736m8360J84270
2061g5378n2498k4254l86681J19988O06739k9722j25176J00297j39187j47987
$$ y = [123277, 41386, 30665, 176561, 89067, -268505, -54534, -187771, 15497, 98245, 208331, -108776, 193230, 369962, -48075, -99995, -183386, -106845, -83664, -66873, 114031, -49631, 246256, 26753, -115524, -505576, -440630, -106168, -117802, 115427, 68669, 303392, 152665, -73994, -173911, -137390, -57648, -302459, -307504, 132546, 38934, -73787, 199919, -49654, -120714, -232676, -458804, -281786, -344170, -253589, 192333, 384368, 387298, 350940, 200702, -19806, -162928, -170893, -79863, 216573, -318453, 72155, 129105, -15811, -104034, -28049, -13239, -207797, 89852, 382994, -178646, -230024, -211288, -259648, -75378, -127876, -152130, -538811, -418823, 187916, 158194, 33018, 133315, -5872, -153859]
2051a53859K54284m1869k24347n5269J47601R2103p1458P0090K86306K4818l9856
2040B88544l93066m9587k55921K53133O63525l69319q321j01829p4226k82048
2030c29115J74610j49733N98028J67880j71940j13456j18722J5104J09649j36908
2020D5397o9769P8766J48109K92278J71369m19375J21799q7391o5710J38611l4639
2009C19445k1024J90652K4669L5946q2015k03347J54082n16151k9676o015Q2991
1998e0443M52058j19374n0221M7681m51352n4448J4183J58789j6874J75996k4544
1987H1451J017J8337r2731k3599n122j53835j35543K58375N41131J6668l34109
1976A72040k69566j44274K58282k4283j80986K40980k87304K80347J25366k67316
$$ y = [-153859, 100425, 58556, -165791, -221060, -73459, 18644, -52814, 17276, 303582, 328400, 288544, -104522, -154109, -410030, -156897, 506628, 137309, 128988, 27159, -47067, -329115, -154505, -304238, 293790, 461670, 289730, 176274, 57552, 72656, 182305, 45397, -24372, 54394, 202503, 494781, 666150, 246775, 368574, 281183, 215473, 354084, 319445, 298421, 489073, 513742, 549688, 467673, 264326, 418408, -97743, -127419, -133434, -50443, 401615, 282241, 232020, 279701, -171651, -226099, -211916, -53127, -70001, 105995, 81451, 82468, 100805, 8074, -15525, -20647, -174482, -310025, -51650, 489481, 506149, 172040, -97526, -241800, 16482, -7801, -188787, 52193, -235111, 45236, 170602, -96714]
1966i6714L32688J88488m07333j06106k23075J61337M04714k14405k5964j22163
1956a08533P0147j08515p3804J39302J9376J98650K3589l08608J57979r0671l6760
1945a17848k8912j78461L15678J95470j70630l5337N6152j67589j54299J25979
1935a59797M6920p7425j57535L31240K26618j99346K65349j85891k95579J13522
1925i1924p1737L01214L37593l64348m14369K00349N6307j87606r5465l6798O77990
1914C11206j43381J51809N788l18541m44599M87017k9528K44019O10323q4920
1904G89193n18407j72785j12130R8065j4237J29666j40562O736K78223l45499
1894a737L04136q7968k04648K74387K15520j53069K1110P9185J05556l66998J53232
$$ y = [-96714, 235974, 424462, 17129, -88977, -312052, -150715, 253999, 39594, 13630, -108533, -38386, -146901, -220705, -81403, -62027, 136623, 160212, -148396, 9583, -81088, -117848, -146760, -325221, -9543, 185927, 15297, -20040, 36112, -131477, -285776, -159797, -112877, -190302, -347837, -16597, 210021, 10675, 276024, 90133, -205446, -91924, -163661, 137553, 475146, 110798, -303571, -103222, -46915, -234521, -329986, -366784, 311206, 167825, 319634, 325422, 6881, -437718, 49299, 19771, 263790, 874113, 789193, 270786, 98001, -14129, 83936, 69699, 199365, 58803, 65539, 343762, -1737, 302399, 214431, 9783, 284170, 499690, 346621, 367731, 446916, 552472, 185474, 338706]
1883C38706r7728J67269K35209K88029N2843m43755j81459J88708k87959M77103
1873G36966P7529k06236J66129N9937j05371K24991j09533p3263M39042K99589
1863A509780L2628K3048l05475M16461Q8396J47802K10428o238J41075R1113k41326
1852B107692m25423J64332p7116R41239K05201K13301k32704l36532J91842k2247
1842B729585O44001M15178L24960L68651k77586m41268K86790M17572O91847L46259
1832E505989j19747l80279J21333J97639K11140M25969M42088M67034O99318k43280
1822G327204O20742J153864P41831J096812Q42505R84283J589768J502782J744928
1813A7604719K240538K805142K279898L251820N618679Q718776J0467583J4198992
$$ y = [338706, 240978, 408247, 643456, 931485, 984328, 540573, 359114, 547822, 259863, 736966, 814495, 608259, 774388, 834325, 728954, 953945, 844412, 771149, 1210191, 1509780, 1542408, 1565456, 1259981, 1676442, 1764838, 1912640, 2123068, 2116830, 2257905, 2349018, 2107692, 1682269, 1846601, 1769485, 2710724, 2915925, 3129226, 2896522, 2559990, 2751832, 2729585, 3373586, 3788764, 4113724, 4482375, 4204789, 3763521, 4050311, 4467883, 5159730, 5505989, 5386242, 5005963, 5127296, 5324935, 5536075, 5962044, 6404132, 6871166, 7570484, 7327204, 7947946, 9101810, 9843641, 10940453, 11782958, 12767241, 14357009, 15859791, 17604719, 19845257, 22650399, 24930297, 28182117, 33800796, 42519572, 52987155, 67186147]
1805F7186147J5763705R251969j0606252j9411349j4225368j1270079o875406
1798B9813367n908888l764907k407446j767204j304746n60144j417693j464702
1790A1217637j667991p45926j258658r40045l66637k00333l52591N1884l48475
1781E388865l45321k26240n67354n49957K79258j26420o43326J81340k5015k15962
1771C149868j68930j09912k96248j04019l88585L5593K74131k62440o4658K71951
1761B336751j74548l89263q2944J01735J61852o10440J34633k05072L42214j5960
1751A598958k67665M66459j67966K7639m00375J35706M5799m96192J16045o5697
1741I92711J57010M7168k74480p9144J79524p772k94879j87723K38313j4335q13
$$ y = [67186147, 82949852, 92201821, 81595569, 62184220, 47958852, 36688773, 29813367, 23904479, 20139572, 17732126, 15964922, 14660176, 14100032, 12682339, 11217637, 9549646, 8803720, 7545062, 6605017, 6238380, 6038047, 5685456, 5737340, 5388865, 5043544, 4817304, 4249950, 3699993, 3979251, 3852831, 3209505, 3390845, 3365830, 3149868, 2980938, 2871026, 2574778, 2470759, 2082174, 2117767, 2391898, 2129458, 2064800, 2336751, 2162203, 1772940, 1689996, 1791731, 1953583, 1343143, 1477776, 1272704, 1614918, 1598958, 1331293, 1797752, 1629786, 1657425, 1257050, 1392756, 1438555, 942363, 1058408, 992711, 1149721, 1196889, 922409, 843265, 1022789, 1015017, 720138, 532415, 770728, 756393, 755580]
1730G55580l9625o5543J56398Q4311l36834K84716k75349L09272p1659k5189m15525
1719C60553j90946K62929J30020p9312L6063R9044K0153J95948r816k19578j3442
1708E91616J42962j52219Q7229j18395q5373l69321J75327J93153k46100j72185
1698D6694M24464k74450O3975l259M11781m23325m06412K98433k47109L64785
1688B55577K81330k73722j9382m53040J93645N62980j89512j04163O1675r9559
1678B15829J8208l11037R5738m5986K93622K07488l41667J44902l1172j67681
1668G8244k2486k33334N2656r3701L9396j19160O40227l85569j8953o0481L06724
1657A83563J55816L6428k64686M12502l7769m16268J39010m8683p7204P7027J34593
$$ y = [755580, 715955, 650412, 806810, 891121, 554287, 839003, 563654, 872926, 801267, 776078, 360553, 169607, 432536, 562556, 483244, 519307, 618351, 638504, 834452, 824636, 605058, 591616, 734578, 582359, 669588, 551193, 465820, 96499, 271826, 464979, 218879, 46694, 471158, 196708, 260683, 257424, 669205, 245880, -160532, 137901, -109208, 255577, 536907, 263185, 243803, -209237, -15592, 547388, 357876, 253713, 315388, 215829, 234037, -77000, 18738, -27248, 266374, 473862, 132195, 277097, 245925, 78244, 55758, -177576, -124920, -218621, -179225, -298385, 341842, -43727, -62680, -123161, 183563, 339379, 375807, 111121, 523623, 485854, 69586, 208596, 159913, 82709, 159736, 294329]
1646B94329M6880N6992N2835r7472l49252M22539k82112j46391J35703M03753
1636E37804j58884j88418k09579k22014M16475j87461J03658J72949j24692L7321
1626A77159j89067j69658k451N48777n7742k12463J68576k12619J10352J71878
1616C32742j28775p4640j8376J71803m18311J88731L7338M11118o4377L234k63398
1605A77089K44868k15268p4544M14931j5280J5036p0875J30364k17106J62279
1595E51494j64238l15136m31972J91674J63286Q3238O8834J03886k383j90034
1585E8649l54115L52742k13346j0685K01022J90812l35709J08999K0748m89641
1575d70524M39158j16470R6752O3229J46947j82887k0406j02081k71214K18478
$$ y = [294329, 341209, 398201, 451036, 353564, 4312, 426851, 144739, -1652, 134051, 537804, 378920, 190502, -19077, -241091, 175384, -12077, 91581, 264530, 139838, 177159, -11908, -181566, -184017, 364760, 307018, 94555, 263131, 50512, 160864, 332742, 203967, 129327, 110951, 282754, -135557, 53174, 90512, 501630, 437253, 440487, 177089, 421957, 206689, 132145, 547076, 531796, 546832, 475957, 606321, 389215, 551494, 387256, 72120, -359852, -168178, -4892, 78346, 147180, 251066, 248683, 58649, -295466, 57276, -156070, -166755, 34267, 225079, -110630, -1631, 19117, -470524, -31366, -147836, -51084, 12145, 159092, -23795, -44201, -146282, -417496, -199018]
1565a99018J57332O0124J6511J97270l18703p9898P6259l82509L07172N88938
1555D23478k89381J24360J52143l49180l65886n1049K87620M7447K52470j58692
1545G3330J31823k78457J16817r3597Q8999J69468k89124j86904J50866K86494
1535A69715k853n8076P2109j95524J18776q9847J95227L6346J67162k27406J01643
1524B87272j01001m0322J68392J67855l39413k54197J82022r3597N5724j22007
1514h9272J47402n596l6034R4568J65809Q1291n0827k46018J53622K948j79112
1503C8781k53722K06915J04413l41541M5839K94543m48534Q0532J23394k57890
1493d07270L04126L28628l21912j98785n9572L29152K72596k47162j83155J73379
$$ y = [-199018, -41686, 18438, 34949, 232219, -86484, -166382, -90123, -472632, -165460, 423478, 134097, 258457, 410600, 61420, -304466, -355515, -67895, -20448, 232022, 73330, 205153, -73304, 43513, -50084, 38915, 208383, -80741, -267645, -116779, 169715, 166862, 108786, 180895, -14629, 104147, 14300, 209527, 245873, 413035, 185629, 287272, 186271, 145949, 314341, 482196, 142783, -111414, 70608, -22989, 32735, -89272, 58130, 52534, 16500, 111068, 276877, 358168, 307341, 61323, 214945, 217893, 38781, -214941, -8026, 96387, -245154, -199315, 95228, -353306, -272774, -149380, -407270, -103144, 225484, -96428, -295213, -354785, -25633, 246963, -199, -183354, -9975]
1483i975Q9165l3416o1293l67548L87826l7021J6183n6209j06702j65745l1571
1472c76306J77733M8955k09312Q6856L9283L70686j17230k6339K04850l57633
1462a58457j22682K29592m9315L1469l9724L3412J29047o4979P5538Q7334l97837
1451b46602O9625j87960M2554N0464N4965M11799J19788m43k08252K99063n23008
1440a18007J89295K71264j39914P5397j45472l36261M21254j34145l23551L6002
1430b04138L02085m33840O0545r0295K08616J40264J83387o966j80662Q79N6938
1419C6813Q5683j64992N0173L6369m19627K07316J34753m11687M06537O6083l27515
1408c00094J03143k09885L25918P6744k0913J77064M06043j08471k89872k35619
$$ y = [-9975, 79190, 45774, -15519, -383067, 4759, -32262, -16079, -72288, -178990, -344735, -376306, -198573, -149618, -358930, -272074, -232791, 137895, 20665, -5674, 199176, -158457, -281139, -51547, -100862, -69393, -109117, -75705, 53342, -11637, 63901, 151235, -246602, -176977, -364937, -322383, -271919, -216954, 194845, 314633, 314190, 105938, 405001, -118007, 71288, 342552, 202638, 278035, 132563, -203698, 217556, 83411, -240140, -204138, 97947, -335893, -275348, -365643, -157027, -16763, 166624, 159658, -21004, -20125, 36813, 122496, -42496, 7677, 44046, -375581, -168265, -33512, -445199, -38662, 27421, -300094, -196951, -406836, -80918, -4174, -25087, 151977, 558020, 449549, 159677, -75942]
1398g5942m70989M57930J83219L84144l29791n35248k09640J45969M17576K60486
1388B27714N0846k82862j86594r2812L75149j77532o4199K53731L88253l52889
1378A38805N6521k10505m6002J78318J51970j88395J9516J56631J82220n67799
1368a28720j02146K82460o6629K28088k8461k581j89133J12490q9710j0970n8775
1357e4087K06743J43156j54648m4882P1959n0190j35051m3716k33365Q1531j57519
1346c70069j16747K68794K55219j38546p0796M7156p4525O2875J34444N8979k1805
1335C4979p4829K75343k84021k98438N67945l98925K25916j28569K88105k52203
1325d4697j13153k1499l1561J14877N7718O1425j32608k95513K05063j10687J52486
$$ y = [-75942, -546931, -89001, 94218, 478362, 148571, -386677, -596317, -450348, -32772, 227714, 278560, -4302, -190896, -283708, 91441, -86091, -150290, 103441, 491694, 138805, 195326, -15179, -61181, 117137, 269107, 80712, 100228, 256859, 439079, -128720, -230866, 51594, -15035, 213053, 184592, 182011, -7122, 105368, 15658, 4688, -54087, 152656, 295812, 141164, 96282, 168241, 118051, -17000, -60716, -294081, -212550, -370069, -486816, -218022, 37197, -101349, -172145, -124989, -199514, -136639, -2195, 56784, 34979, -39850, 235493, -48528, -346966, 220979, -177946, 47970, -80599, 207506, -44697, -157850, -179349, -210910, -96033, -38315, 23110, -109498, -405011, -199948, -310635, -158149]
1314a58149K0794r6954J65220K97508O028l65582k40643L24366L29281j06615
1304A75254n39235l9880K21408M06913n59919J37757N2130J44598N988K86039
1294B91053j658l7839j27200k73794j47029N64794J30812l45478K7979O8741j45458
1283D923j02617P884l52768L02430L34566k14801L0398o3021n6965J79340m4215
1272B5154K34749j97449j50504r9740o1788l7495K6000J23005K02982j33729J23505
1261E4690j09995K23795q3020j77010R2581L21277l68660J49297k9138k9092j04459
1250e9734j71585J42789P3014j8202Q1260j47999P5439p4363n8821M25903N6954
1239C24655j1052j82884j03779J09013p761k3125j2852l78540k23600L06274J10855
$$ y = [-158149, -137355, -234309, -69089, 228419, 234447, -131135, -371778, -47412, 281869, 175254, -363981, -403861, -182453, 224460, -335459, -197702, -145572, -974, 5014, 291053, 289395, 251556, 124356, -149438, -296467, 268327, 399139, 53661, 81640, 150381, 4923, -97694, -89810, -442578, -140148, 194418, -20383, 10015, -53006, -109971, 69369, 25154, 259903, 62454, -88050, -187790, -249578, -287073, -261073, -138068, 64914, -68815, 54690, -55305, 168490, 85470, -91540, 1041, 322318, -46342, 102955, 73817, 44725, -59734, -231319, -88530, -15516, -33718, 47542, -100457, -25018, -99381, -158202, 267701, 324655, 313603, 130719, 26940, 135953, 128192, 105067, 92215, -286325, -509925, -203651, -92796]
1228i2796O6060K4455q8768j8444K73102k08365K7354K82992k92058J06883Q3752
1217A64167k69376J52768P9242P9601j4373o3494n42098Q2565K75785j48402J05630
1206i7985r0095M5078O7379K57874k20934k11258K03109o5067J27577k61429K74492
1195B8741M8638l59238J37701K0165l93580N76090L931L8299p6164j05068L00775
1184B20290j67222k49159j14589K81644J14556L8041L6128j65401j1282k38662
1174b55656K2080n14430M73035L52334l81598K17362Q3304q4139L11943k07702
1164A6533l03311O84544j82510j91549k41547O653K24280L34707j63722j94987
1154a0909j4608N4483l56706M04079j48346k16465K10932j90551J64851j1599
$$ y = [-92796, -26736, -2281, -91049, -109493, 163609, -44756, -17402, 265590, -26468, 80415, 164167, -105209, 47559, 126801, 206402, 192029, 128535, -413563, -330998, -55213, -203615, -97985, -188080, -143002, -75623, 182251, -38683, -249941, -46832, -111899, 15678, -245751, 28741, 77379, -281859, -144158, -123993, -517573, 58517, 62448, 100747, 24583, -80485, 220290, 53068, -196091, -310680, -29036, 85520, 123561, 159689, -5712, -16994, -255656, -233576, -748006, -274971, 77363, -304235, -86873, -3569, -87708, 224235, 16533, -286778, 397766, 215256, 23707, -217840, -211187, 13093, 347800, 184078, -10909, -25517, 28966, -327740, 76339, -72007, -288472, -77540, -268091, -103240, -114839]
1144a14839l78485J45601O8206N9315M07607r4059J82059l1447M3847j45574Q9713
1133B31944j06596m85260L51417p9311o2177J99722K04703m14721j97445J24312
1123b33412j7575Q780K77289r2687j28166j23884R0917L11084j1447r0558J16556
1112A06897j28334l19752L90166k32542q2968L13620M164j53692J84438J30095
1102B12092m0176j50526k42540K1178L42967k04475q8642j85938K68226k92970
1092c60804k91081P7230K80813J14570J00962O496k69057K59635M6881J35268
1082A00913P4191Q3381m97063K38129j87747J49013k4348j63712l803K01206o8845
1071i8685j12316N2920M13441q6326m0825L0588n88688J38866J01768j27435L79646
$$ y = [-114839, -493324, -347723, -279517, -220202, 187405, 93346, 275405, 243958, 287805, 142231, 231944, 125348, -359912, -8495, -87806, -149983, 49739, 254442, -160279, -357724, -233412, -250987, -242207, 35082, -57605, -185771, -309655, -218738, 92346, 80899, -9659, 106897, -21437, -341189, 48977, -183565, -266533, 47087, 51251, -102441, 81997, 212092, 171916, 21390, -221150, -199972, 142995, -61480, -150122, -336060, -67834, -360804, -651885, -574655, -293842, -179272, -78310, -71814, -340871, -81236, -34355, 100913, 175104, 258485, -238578, -449, -188196, -39183, -63531, -227243, -231046, -29840, -98685, -211001, -158081, 255360, 169034, 128209, 158797, -429891, -291025, -189257, -316692, 62954]
1060F2954L67387k91197m09714k04207J37884N4034K55461L20750J4176k13243
1050I4285q3353L7591k52831L81631k52350J26717l43182R6704o0605l3807L64968
1039G5768N04881j81935j14157J88127l72439N4682L2328j87117j87281J33142
1029e4001j81571M57451k40310K06404J34420k68697J23339j75771K38401K43443
1019D83108k43792j42429q4435J7213n5382j2516J94177j39229n8964K6385M8391
1008C2527j5099K0031m5889K6085N1300k73144K18757m20100O6247R570K20310
$$ y = [62954, 430341, 139144, -270570, -474777, -336893, -282859, -27398, 293352, 307528, 94285, 10932, 48523, -204308, 177323, -75027, 51690, -291492, -194788, -255393, -289200, 75768, 580649, 398714, 284557, 472684, 100245, 154927, 187255, 138, -187143, -54001, -235572, 221879, -18431, 187973, 322393, 53696, 177035, 1264, 239665, 483108, 239316, 96887, 12452, 29665, -25717, -38233, 155944, 16715, -42249, -15864, 32527, 17428, 37459, -8430, 17655, 68955, -204189, 14568, -405532, -339285, -329715, -109405]
$$ [...]
##END NTUPLES=NMR SPECTRUM
##END=
