##TITLE=1H_EC-3305(VI-22)
 CDCl3
 8 sc, 
 4.7.2024
##JCAMPDX= 6.0         $$ Bruker NMR JCAMP-DX V2.0
##DATA TYPE= NMR SPECTRUM
##DATA CLASS= NTUPLES
##ORIGIN= UXNMR, Bruker Analytische Messtechnik GmbH
##OWNER= root
$$ XWIN-NMR		Version 3.5
$$ Thu Jul  4 13:46:22 2024 Russian Standard Time (UT+4h)  she@DPX200
##.OBSERVE FREQUENCY= 200.1314
##.OBSERVE NUCLEUS= ^1H
##.ACQUISITION MODE= SIMULTANEOUS
##.ACQUISITION SCHEME= undefined
##.AVERAGES= 8
##.DIGITISER RES= 18
##SPECTROMETER/DATA SYSTEM= spect
##.PULSE SEQUENCE= zg30
##.SOLVENT NAME= DMSO
##.SHIFT REFERENCE= (INTERNAL, DMSO, 0, 21.4322)
##AUDIT TRAIL= $$ (NUMBER, WHEN, WHO, WHERE, WHAT)
$$ ##TITLE= Audit trail, XWIN-NMR		Version 3.5
$$ ##JCAMPDX= 5.01
$$ ##ORIGIN= Bruker BioSpin GmbH
$$ ##OWNER= she
$$ F:/spectra/data/she/nmr/H-F/1/pdata/1/auditp.txt
$$ ##AUDIT TRAIL=  $$ (NUMBER, WHEN, WHO, WHERE, WHAT)
(   1,<2024-07-04 13:45:11.95 +0400>,<she>,<DPX200>,
      <created by zg, POWCHK disabled, PULCHK disabled
       configuration hash MD5:
       00 E9 B6 7A A2 85 ED C7 34 08 36 98 17 FE 4E 26
       data hash MD5: 16K
       46 1F 20 DE 56 16 BB 75 9B 17 D1 49 98 35 2F 17>)
(   2,<2024-07-04 13:45:15.70 +0400>,<she>,<DPX200>,
      <Start of raw data processing
       efp BC_mod = 2 LB = 0.24 FT_mod = 6 PKNL = 1 PHC0 = -25522.93 PHC1 = 35.98748 SI = 16K 
       data hash MD5: 16K
       72 56 25 63 08 FC F7 B5 EB 43 6B 42 31 5D 6C 97>)
(   3,<2024-07-04 13:45:36.53 +0400>,<she>,<DPX200>,
      <pk PHC0 = 8.292254 PHC1 = -14.8 
       data hash MD5: 16K
       1B 4C 59 21 7C 6F 1C 49 B3 94 E4 A0 E3 9B C5 B7>)
(   4,<2024-07-04 13:45:40.04 +0400>,<she>,<DPX200>,
      <abs ABSG = 5 
       data hash MD5: 16K
       20 8D 54 D6 9A B4 A7 8A 30 81 7F 7C 9B 6D B0 30>)
$$ ##END=
$$ 
$$ hash MD5
$$ 59 05 EB 06 94 C2 1E 3A 8B 95 C7 D9 11 08 65 1C
##$RELAX= 
##$RELAX= 
##$RELAX= 
##$RELAX= 
##$RELAX= 
##$RELAX= 
$$ Bruker specific parameters
$$ --------------------------
##$DU= <F:/spectra>
##$EXPNO= 1
##$NAME= <H-F>
##$PROCNO= 1
##$TYPE= <nmr>
##$USER= <she>
##$AMP= (0..31)
100 100 100 100 100 100 100 100 100 100 100 100 100 100 100 100 100 100 
100 100 100 100 100 100 100 100 100 100 100 100 100 100 
##$AQSEQ= 0
##$AQ_mod= 1
##$AUNM= <au_zg>
##$AUTOPOS= <>
##$BF1= 200.13
##$BF2= 200.13
##$BF3= 200.13
##$BF4= 200.13
##$BF5= 200.13
##$BF6= 200.13
##$BF7= 200.13
##$BF8= 200.13
##$BYTORDA= 1
##$CFDGTYP= 0
##$CFRGTYP= 5
##$CHEMSTR= <none>
##$CNST= (0..31)
1 1 145 1 1 1 1 1 1 1 1 1 1 1 1 1 1 1 1 1 1 1 1 1 1 1 1 1 1 1 1 1 
##$CPDPRG= <>
##$CPDPRG1= <>
##$CPDPRG2= <>
##$CPDPRG3= <>
##$CPDPRG4= <mlev>
##$CPDPRG5= <mlev>
##$CPDPRG6= <mlev>
##$CPDPRG7= <mlev>
##$CPDPRG8= <mlev>
##$CPDPRGB= <>
##$CPDPRGT= <>
##$D= (0..31)
0 1.2 0 0 0 0 0 0 0 0.06 0 0.03 0 0 0 0 0.0002 0 0 0 0 0 0 0 0 0 0 0 0 
0 0 0 
##$DATE= 1720086311
##$DBL= (0..7)
120 120 120 120 120 120 120 120 
##$DBP= (0..7)
150 150 150 150 150 150 150 150 
##$DBP07= 0
##$DBPNAM0= <>
##$DBPNAM1= <>
##$DBPNAM2= <>
##$DBPNAM3= <>
##$DBPNAM4= <>
$$ [...]
##$SUBNAM3= <"">
##$SUBNAM4= <"">
##$SUBNAM5= <"">
##$SUBNAM6= <"">
##$SUBNAM7= <"">
##$SUBNAM8= <"">
##$SUBNAM9= <"">
##$SW= 24.0689651099613
##$SWIBOX= (0..15)
0 0 2 0 0 0 0 0 0 0 0 0 0 0 0 0 
##$SW_h= 4816.95568400771
##$TD= 16384
##$TD0= 1
##$TE= 0
##$TE2= 300
##$TE3= 300
##$TEG= 300
##$TL= (0..7)
0 120 120 120 120 120 120 120 
##$TP= (0..7)
150 150 150 150 150 150 150 150 
##$TP07= 0
##$TPNAME0= <>
##$TPNAME1= <>
##$TPNAME2= <>
##$TPNAME3= <>
##$TPNAME4= <>
##$TPNAME5= <>
##$TPNAME6= <>
##$TPNAME7= <>
##$TPOAL= (0..7)
0.5 0.5 0.5 0.5 0.5 0.5 0.5 0.5 
##$TPOFFS= (0..7)
0 0 0 0 0 0 0 0 
##$TUNHIN= 0
##$TUNHOUT= 0
##$TUNXOUT= 0
##$USERA1= <user>
##$USERA2= <user>
##$USERA3= <user>
##$USERA4= <user>
##$USERA5= <user>
##$V9= 5
##$VALIST= <valist>
##$VCLIST= <CCCCCCCCCCCCCCC>
##$VD= 0
##$VDLIST= <DDDDDDDDDDDDDDD>
##$VPLIST= <PPPPPPPPPPPPPPP>
##$VTLIST= <TTTTTTTTTTTTTTT>
##$WBST= 1024
##$WBSW= 4
##$XGAIN= (0..3)
0 0 0 0 
##$XL= 0
##$YL= 0
##$YMAX_a= 246222
##$YMIN_a= -325721
##$ZGOPTNS= <>
##$ZL1= 120
##$ZL2= 120
##$ZL3= 120
##$ZL4= 120
##$ABSF1= 21.419
##$ABSF2= -2.65019
##$ABSG= 5
##$ABSL= 3
##$ALPHA= 0
##$AQORDER= 0
##$ASSFAC= 0
##$ASSFACI= 0
##$ASSFACX= 0
##$ASSWID= 0
##$AUNMP= <proc_1d>
##$AZFE= 0.1
##$AZFW= 0.1
##$BCFW= 0
##$BC_mod= 2
##$BYTORDP= 0
##$COROFFS= 0
##$CY= -3
##$DATMOD= 1
##$DC= 0
##$DFILT= <>
##$DTYPP= 0
##$F1P= 0
##$F2P= 0
##$FCOR= 1
##$FTSIZE= 16384
##$FT_mod= 6
##$GAMMA= 0
##$GB= 0
##$INTBC= 1
##$INTSCL= 3.70164e-10
##$ISEN= 128
##$LB= 0.24
##$LEV0= 0
##$LPBIN= 0
##$MAXI= 10000
##$MC2= 0
##$MEAN= 0
##$ME_mod= 0
##$MI= 1.114404
##$NCOEF= 0
##$NC_proc= -8
##$NLEV= 6
##$NOISF1= 3.799351
##$NOISF2= 2.8
##$NSP= 0
##$NTH_PI= 0
##$NZP= 0
##$OFFSET= 21.43222
##$PC= 1
##$PHC0= -25514.64
##$PHC1= 21.18748
##$PH_mod= 1
##$PKNL= yes
##$PPARMOD= 0
##$PSCAL= 0
##$PSIGN= 0
##$REVERSE= no
##$SF= 200.129519259642
##$SI= 16384
##$SIGF1= 3
##$SIGF2= 2
##$SINO= 5.538805
##$SIOLD= 16384
##$SREGLST= <1H.CDCl3>
##$SSB= 0
##$STSI= 16384
##$STSR= 0
##$SW_p= 4816.95568400771
##$SYMM= 0
##$S_DEV= 0
##$TDeff= 16384
##$TDoff= 0
##$TI= <>
##$TILT= no
##$TM1= 0
##$TM2= 0
##$TOPLEV= 0
##$USERP1= <user>
##$USERP2= <user>
##$USERP3= <user>
##$USERP4= <user>
##$USERP5= <user>
##$WDW= 1
##$XDIM= 16384
##$YMAX_p= 510455186
##$YMIN_p= -1876674
$$ End of Bruker specific parameters
$$ ---------------------------------
##NTUPLES= NMR SPECTRUM
##VAR_NAME=  FREQUENCY,     SPECTRUM/REAL,   SPECTRUM/IMAG
##SYMBOL=    X,             R,               I
##VAR_TYPE=  INDEPENDENT,   DEPENDENT,       DEPENDENT
##VAR_FORM=  AFFN,          ASDF,            ASDF
##VAR_DIM=   16384,         16384,           16384
##UNITS=     HZ,            ARBITRARY UNITS, ARBITRARY UNITS
##FACTOR=    0.29402158847633, 1,            1
##FIRST=     4289.21997712321, 0,            0
##LAST=      -527.735706884504, 0,           0
##MIN=       -527.735706884504, -1876674,    0
##MAX=       4289.21997712321, 510455186,    0
$$ Real data points
##PAGE= N=1
##DATA TABLE= (X++(R..R)), XYDATA
$$ [...]
6487D1121718k053885N32984J057291J515847K259268L32989r74086l461980k383738
6478C7946408j896097l99363k82119J164447J396579J239010r1744k73818q74792
6469C7928511R46340J135559J150662L241294L770869L581699L461216L365524
6461E8581674L402383J711441J9966l822957l518189j991294o80419J059003K015555
6452E6777163J688038O48431k457637m435737m702358l538380j285872n06012
6444D2187636o33430J375887J176714o22917j186577j329790k15977O59096J012032
6435D2422674L304255K385790K014221O59622M61485n0418j355969l025408m135013
6426D2681239k113753j403751O52446J498216K949936K135416j03435k751506
$$ y = [41121718, 39067833, 39600817, 40658108, 42173955, 44433223, 44766212, 43792126, 40330146, 37946408, 36050311, 35650948, 35368829, 36533276, 37929855, 39168865, 39077121, 38803303, 37928511, 38874851, 40010410, 41161072, 44402366, 48173235, 51754934, 55216150, 58581674, 61984057, 63695498, 63715464, 59892507, 56374318, 54383024, 53702605, 54761608, 56777163, 58465201, 59113632, 56655995, 52220258, 47517900, 43979520, 42693648, 42187636, 41554206, 42930093, 44106807, 43483890, 42297313, 40967523, 40751546, 41410642, 42422674, 45726929, 48112719, 50126940, 50786562, 51248047, 51197629, 49841660, 46816252, 42681239, 40567486, 39163735, 39816181, 41314397, 44264333, 46399749, 46296314, 43544808]
6418D3544808k462400l990315k895233j854103j492997l33431O69828K0963j024997
6409C0182123j051938j024072j80671l25435L57717J065935P78062q62165k420253
6400B6519303j677790k498233j262893l25312m56296j446066M29874R26191M01184
6391B0609962J404421Q05375k54444l36596j148744q51467r32649j285096q35900
6382A7174862p37338l62791k73565J73613J81041j24337j621414j033876j169661
6373A2206534q55567q0377o03662k7401L82110j021935q41582m62439m31925P51686
6363I015442l5669m39281J43811m58795j16058Q15930k70075j1302L95241r04626
6353H134618l68393L70431l91913O6186r7817M38334r13236J8810K2590r19120
$$ y = [43544808, 41082408, 37092093, 34196860, 32342757, 30849760, 30516329, 31186157, 31207120, 30182123, 29130185, 28106113, 27925442, 27600007, 27957724, 29023659, 29801721, 28939556, 26519303, 24841513, 22343280, 21080387, 20755075, 20298779, 18852713, 19282587, 20208778, 20609962, 22014383, 22819758, 22565314, 22228718, 21079974, 20228507, 19295858, 18010762, 17174862, 16437524, 16074733, 15801168, 15974781, 16155822, 16031485, 14410071, 13376195, 12206534, 11350967, 11270590, 10666928, 10639527, 11021637, 9999702, 9158120, 8695681, 8263756, 9015442, 8979773, 8540492, 8684303, 8225508, 8109450, 8925380, 8655305, 8644003, 9039244, 8134618, 7766225, 8136656, 7744743, 7810929, 7713112, 8151446, 7238210, 7257020, 7279610, 6360490]
6343F360490j79791k11752k27166J5557j120326j7658O34950p69579M55893o64481
6333D276137k87283K790J0754M09730k09008R5731k51676l01740P08650j39420
6323D314665j73697J60628M4934l42719L16629k42430k4757j70578J95475M38354
6313D516504K56928m77848L8237P9999k35187m97683o52092K08508Q68047o83628
6303C421785J52340P03120o146L09177J60439q9296p86887J45647J00935J42393
6293D253507J04807l17071J94153k05809j37470K62395k50824L77956O98284L90021
6283E369949j56155r22141J2982J7996P73731j30976K37060L27800j97038l67901
6273D965307l25251R54594L42534J42626K11788J14897o10178M95484Q1580K94003
$$ y = [6360490, 6180699, 5968947, 5741781, 5757338, 4637012, 4619354, 5254304, 4484725, 4940618, 4276137, 3988854, 3991644, 4002398, 4412128, 4203120, 4298851, 4047175, 3745435, 4454085, 4314665, 4140968, 4301596, 4346530, 4003811, 4320440, 4078010, 4053253, 3882675, 4078150, 4516504, 4773432, 4295584, 4333821, 4413820, 4178633, 3680950, 3028858, 3237366, 4105413, 3421785, 3574125, 4277245, 4271099, 4580276, 4740715, 4651419, 3864532, 4010179, 4111114, 4253507, 4358314, 4041243, 4235396, 4029587, 3892117, 4154512, 3903688, 4281644, 4979928, 5369949, 5213794, 4291653, 4304635, 4322631, 5096362, 4965386, 5202446, 5530246, 5333208, 4965307, 4640056, 5594650, 5937184, 6079810, 6291598, 6406495, 5796317, 6291801, 6373381, 6667384]
6263F667384L62345N30324P10769M66428k63841j38976J75371q9981k10766J12013
6253H321070J64987p73462L77636l22959K01514R58043L23127N93779K00316O28249
6243A0672300k67236O16199j58613r8633o79758O3295L88188q8793Q92079l02203
6233A1036825Q2523N51052O10312L60453J13799r9333l9169o32022j170482n56135
6223A0257823K63446O42873o26297L76522M74289K02229l7863J139626N26874
6214A3219522p6014K02118m87798k24764j026177o78621j079389l59592P5927
6205I565212m11498r88705l99651J79656o71945j136742j42919n595J080772J20554
6195G189139m9386L492j53749l22623J51195L8444j094455J012220M93352q1101
$$ y = [6667384, 7029729, 7560053, 8270822, 8737250, 8473409, 8334433, 8509804, 8419823, 8209057, 8321070, 8486057, 7712595, 8090231, 7767272, 7968786, 8926829, 9249956, 9843735, 10044051, 10672300, 10405064, 11021263, 10862650, 10764017, 10084259, 10147554, 10535742, 10446949, 11339028, 11036825, 11119348, 11670400, 12280712, 12641165, 12754964, 12655631, 12616462, 11984440, 10813958, 10257823, 10521269, 11164142, 10537845, 10914367, 11388656, 11590885, 11553022, 12692648, 13219522, 13143508, 13345626, 12857828, 12633064, 11606887, 10928266, 9848877, 9489285, 9565212, 9153714, 8165009, 7765358, 7945014, 7273069, 6136327, 5993408, 5987813, 7068585, 7189139, 7139753, 7143245, 6989496, 6666873, 6818068, 6856512, 5762057, 6774277, 7267629, 7186528]
6185G186528q623l63149k93394m36257P16255O47584M8081J59533q41797J139408
6175G954169N75456L18033J194183K54709M69786m2617L64046l88183m21199j61127
6165A0117256k60440m41313l99328M85177p87499L50838Q462p06619j63832j66247
6155H036455J346750j522802p37031N38001o05073j65425L20291J124092m37492
6146G897766j29751L21618J06814P68469P51136O85491j90092J95562l50814q68918
6136I187281l76403j59287j73338M89662N05762m09948o31766n21005m37831K97382
6126G770509n15095r54912p2269j10530j174827K82869k14382n89237K15381j76115
6116D461392J41092m4119N27499l11635L24546J3039k54290J15172q157K39954
$$ y = [7186528, 7177905, 6814756, 6521362, 6085105, 6801360, 7448944, 7497025, 7656558, 6814761, 7954169, 8529625, 8847658, 10041841, 10296550, 10766336, 10723719, 11087765, 10699582, 10278383, 10117256, 9856816, 9415503, 9016175, 9501352, 8713853, 9064691, 9073153, 8366534, 8202702, 8036455, 9383205, 7860403, 7123372, 7661373, 7056300, 6890875, 7211166, 8335258, 7897766, 7768015, 8089633, 8196447, 8964916, 9716052, 10401543, 10211451, 10407013, 10056199, 9187281, 8810878, 8651591, 8478253, 8967915, 9473677, 9063729, 8431963, 7910958, 7473127, 7770509, 7255414, 6300502, 6228233, 6117703, 4942876, 5225745, 5011363, 4422126, 4637507, 4461392, 4602484, 4558365, 5085864, 4774229, 5098775, 5111814, 4857524, 4972696, 4964539, 5204493]
6106E204493l45378N2697q3372J094021q53964j209072L51564j4961J47553m03522
6096C940059K87024k52742N84957j279103p13368J50894J48135j98988J40768
6087B807636L25758k73237n92207m97472P16601R8989O89608n33238k48925l76979
6077B116534j3660j68786N55253k73590L41123J07578k81912K75583l78049R0346
6067B370420k57936N60214j51115M33137l83450j8956L45180j128655L68068L35570
6057B472477r1774j60255m98581L4803N9616Q79537j063024J70587K20692l70113
6047A653965L7666k2948K18079l01122k41278O0624O53026L95422k44834J37744
6037B346344k07102m18669Q90733p40480j109791J60469N97495p2080L53803J00956
$$ y = [5204493, 4859115, 4911812, 4828440, 5922461, 5068497, 3859425, 4210989, 4196028, 4343581, 3940059, 4227083, 3974341, 4559298, 3280195, 2566827, 2717721, 2865856, 2666868, 2807636, 3133394, 2860157, 2267950, 1770478, 2487079, 2586068, 3275676, 2742438, 2493513, 2116534, 2102874, 1934088, 2489341, 2215751, 2556874, 2664452, 2382540, 2658123, 2280074, 2370420, 2112484, 2672698, 2521583, 2954720, 2571270, 2552314, 2897494, 1768839, 2136907, 2472477, 2380703, 2220448, 1721867, 1756670, 1816286, 2695823, 1632799, 1803386, 2024078, 1653965, 1691631, 1668683, 1886762, 1585640, 1344362, 1404986, 2058012, 2453434, 2208600, 2346344, 2139242, 1720573, 2611306, 1870826, 761035, 921504, 1518999, 1446919, 1800722, 1901678]
6027A901678l94336K9495N79833K33741l65361J56772n28081l08114J8812j56997
6017A167442m9481K69571J08603k25760l4423J121015j81207m59267Q5329K88228
6007B090050K59762k05268j5725N44725M45806L62968l25950n10935k084l6285
5997B607064j20417m15143L70701m60360J35525Q43772j03335K65397k44385O9011
5987B947830L79282J40561O4470J50117O93944l51591r2462M02427j15167n80750
5977C638661J53889P21466K04418k60047M10240N43814Q02326Q19907N15117K3351
5967G573142L05577J539185N67898j58074k17633M0622m90602J34488R1741j69721
5957I216623o5281N3268o30436k28668p01544j214649n5235k8753O0561o4786
$$ y = [1901678, 1507342, 1536837, 2116670, 2350411, 1985050, 2141822, 1613741, 1305627, 1324439, 1167442, 1117961, 1387532, 1496135, 1270375, 1235952, 2356967, 2175760, 1716493, 1801822, 2090050, 2349812, 2144544, 2128819, 2673544, 3119350, 3482318, 3156368, 2645433, 2643349, 2607064, 2486647, 2071504, 2442205, 1981845, 2117370, 2961142, 2857807, 3123204, 2878819, 2947830, 3327112, 3467673, 3532143, 3682260, 4376204, 4024613, 3932151, 4334578, 4219411, 3638661, 3792550, 4514016, 4718434, 4458387, 4868627, 5412441, 6214767, 7034674, 7549791, 7573142, 7878719, 9417904, 9985802, 9827728, 9610095, 9650717, 9160115, 9294603, 9386344, 9216623, 9151342, 9204610, 8574174, 8345506, 7643962, 6429313, 6374078, 6345325, 6405886, 6341100]
5947F341100j28574J39259n7649j179521O32135J519896p7733k31801K83777l8342
5937G202547q4681Q49013J042325N73572N41114m56949l44292l19244j192068
5928G811337l05513J534949L90344m40358r5463l31621m74499k70127r86903p86644
5918F045502j69229k29642m9815m6282l89832p09040m57035K87629j19195J50058
5908D313119J15566j19624m73831Q0283p2965k92047j92710O29976n81958n66066
5898B839743J083946K62316l98907K77454N9267k29248J21815J65869J82797n72570
5888C792482N69739r6427k20035K47222M87756P68901r1077l68388J37368J62087
5878E389628p212L38619j05694j60049J13757j19721o15686j85487O7991L18432
$$ y = [6341100, 6212526, 6351785, 6294136, 5114615, 5746750, 7266646, 7188913, 6957112, 7240889, 7202547, 7117866, 7966879, 9009204, 9582776, 10123890, 9666941, 9322649, 9003405, 7811337, 7505824, 9040773, 9431117, 8990759, 8895296, 8563675, 8089176, 7819049, 6832146, 6045502, 5876273, 5646631, 5596816, 5550534, 5160702, 4451662, 3994627, 4282256, 4163061, 4313119, 4428685, 4309061, 3835230, 3915513, 3842548, 3550501, 3357791, 3987767, 3405809, 2839743, 3923689, 4186005, 3787098, 4064552, 4123819, 3894571, 4016386, 4182255, 4365052, 3792482, 4362221, 4265794, 4045759, 4292981, 4780737, 5549638, 5458561, 5090173, 5227541, 5389628, 5382416, 5721035, 5615341, 5455292, 5569049, 5449328, 4833642, 4648155, 4716146, 5034578]
5868E034578j50083k7611K37260l70429m83243q83098L06798O7109L73891J60292
5858D265464J7494n62744m9585O6036J40234M87054R1004P17103o28209J96661
5848D740512o3502n5120O26382Q3919m0999n2785o6401K54240K30972Q75899l1179
5837F501938j097959o80005P02633n50918q40151Q62778K24459l50771l65693
5828D406311j90367k97967R54658m03211j51244j57451J99875p64347j28431P09002
5818D176828j86550N07263J08161l95301N4480N75803k3723o75892j24812O223
5808D022480m72440Q52655l22789k1084k46108m37495J065556j88990j0750n66490
5798C674545k12238M25327M43779r7184l19532o00812J37405j40049K05875n3917
$$ y = [5034578, 4884495, 4856884, 5094144, 4723715, 4240472, 3357374, 3664172, 3731281, 4105172, 4265464, 4282958, 3720214, 3670629, 3736665, 3876899, 4363953, 4454957, 5172060, 4543851, 4740512, 4677010, 4621890, 5248272, 5332191, 5291192, 5238407, 5172006, 5426246, 5657218, 6533117, 6501938, 5403979, 4723974, 5426607, 4875689, 4035538, 4898316, 5122775, 4772004, 4406311, 4215944, 3917977, 4872635, 4469424, 4318180, 4160729, 4360604, 3596257, 3467826, 4176828, 3990278, 4497541, 4605702, 4210401, 4264881, 4840684, 4816961, 4141069, 4016257, 4022480, 3550040, 4402695, 4079906, 4058822, 3812714, 3375219, 4440775, 4251785, 4241035, 3674545, 3462307, 3887634, 4331413, 4234229, 3914697, 3313885, 3451290, 3311241, 3517116, 3463199]
5788C463199L20606j112575P3684N79576j019042M80503O52314o6948q91p81998
5778B588428p65415J049857j52544q26894J35816L38374O5428L45456m0423K79049
5768C017132K65831p87276J4208m96620l02578P39011L41149k21236m8552j15811
5758B405258n087p6815k3675m2777l01328l05122J18471P41019K21419J97799
5748B929162p79468J85194J43325n97385K11555J90213o14590N40179j34809o03399
5738A469977M49710l54182M38551k33542L66546K92654o13782J14038j96373R05598
5728B639195J9051p21994K27344P2978J78347m58203n92084Q43376N60346k24890
5718B543466p11720N64898L52778j53501M3708Q22671j28739o63008N0916J228350
$$ y = [3463199, 3783805, 2671230, 2744914, 3324490, 2305448, 2785951, 3438265, 3371317, 3370426, 2588428, 1823013, 2872870, 2720326, 1893432, 2029248, 2367622, 2433050, 2778506, 2738083, 3017132, 3282963, 2495687, 2509895, 2013275, 1710697, 2449708, 2790857, 2569621, 2521069, 2405258, 2400171, 2323356, 2299681, 2256904, 1955576, 1650454, 1768925, 2509944, 2731363, 2929162, 2149694, 2334888, 2478213, 1880828, 2092383, 2282596, 1668006, 2208185, 2073376, 1469977, 1919687, 1565505, 2004056, 1770514, 2137060, 2429714, 1815932, 1929970, 1733597, 2639195, 2658246, 1936252, 2163596, 2236574, 2414921, 1956718, 1364634, 2208010, 2768356, 2543466, 1831746, 2396644, 2749422, 2595921, 2639629, 3462300, 3333561, 2670553, 2721469, 3949819]
5708C949819k11959p18034M33908M95711n47836o17503l62513M21430O27324l77217
5698C093130p80543P76977P84071p70530J80159M07980n66112K43365K97466L29887
5688C995850M84604L29432m52558L81386j69116o2609L74904N2892L78873q76800
5678D436858n51628O16529k22921J77445K61963k19687K04934l81460k03445J37397
5668D255985O3996k45109J11650P79750J71584m96210m72024O41085M71559N37691
5658E819957J84418P7207n34260N43835n5438o32354N28985R0657P25288k79199
5648F469096R8949l99053k94372N31664J93128m64331J118672O6833j55640m48664
5638F716282R30471j262263L10036M26671L7616o7830N392l82685N91291J564764
$$ y = [3949819, 3737860, 3019826, 3453734, 3949445, 3401609, 2784106, 2421593, 2843023, 3470347, 3093130, 2312587, 3089564, 3873635, 3103105, 3283264, 3691244, 3125132, 3368497, 3665963, 3995850, 4480454, 4809886, 4357328, 4738714, 4569598, 4506989, 4881893, 4934785, 5313658, 4436858, 3885230, 4501759, 4278838, 4456283, 4718246, 4498559, 4703493, 4322033, 4118588, 4255985, 4319981, 4074872, 4186522, 4966272, 5137856, 4641646, 4169622, 4810707, 5282266, 5819957, 6004375, 6081582, 5547322, 6091157, 6035719, 5403365, 5932350, 6023007, 6748295, 6469096, 6568045, 6168992, 5874620, 6406284, 6599412, 6135081, 7253753, 7320586, 7164946, 6716282, 7646753, 6384490, 6694526, 7121197, 7158813, 7090983, 7096375, 6713690, 7304981, 8869745]
5628H869745m80123O53724N77379m12879m79539l7299J98924q85058o65636Q01017
5618H140255j051539O46759n30022n26249M03097Q56345K5100r30616P3576q6423
5608G020283k15254l42424L08813l46011l49567R87931k27950j679333L97339
5599E553827P7110L93275l29861j85633r3815l05852J17768M90762N1772j181337
5589D588016k11511L56709l29270n98370n32237L28957L73764K96809r20296r37136
5579B415435l66925J32247K98862l19913l998L44283p1711j1126J50099k63988
5569B303265j08233M26397O10551l51182n14452o46622m1389M04183k56185l39340
5559A486993K47096K13642M76248l20693m8290K384m1895L590m61885J92465n02509
$$ y = [8869745, 8389622, 9043346, 9620725, 9207846, 8728307, 8691008, 8889932, 8004874, 7339238, 8140255, 7088716, 7735475, 7205453, 6679204, 7082301, 7938646, 7963746, 7033130, 7106706, 7020283, 6805029, 6462605, 6771418, 6425407, 6075840, 7063771, 6835821, 5156488, 5553827, 5630937, 6024212, 5694351, 5508718, 5414903, 5109051, 5226819, 5717581, 5769353, 4588016, 4376505, 4733214, 4403944, 3805574, 3273337, 3602294, 3976058, 4272867, 3352571, 2415435, 2048510, 2180757, 2479619, 2159706, 2155708, 2499991, 2428280, 2417154, 2567253, 2303265, 2195032, 2621429, 3231980, 2880798, 2366346, 1719724, 1678335, 2082518, 1826333, 1486993, 1734089, 1947731, 2423979, 2103286, 2054996, 2057380, 2015485, 2019075, 1557190, 1749655, 1247146]
5548A247146L62491M34576j21791J83452p10098L88723m19829r370M38713m91405
5538A302608O251M72415m25960K16436r6557L46985K44470p80413L75277n88516
5528A072996m05709J017364N3234p7955j05785o853O26611o16721j08699k57118
5518A191365j52541L13618m01946l5199l0348j44069J07965M99749J68410K33001
5508A750005m58691k97462j89682K41221k68265J008323o4197J2419k88702o04302
5498H40667M25239P16109L36064j18867l9021m91375R7480k9937o76886M17059
5488A476532N94978j001748M72269o9785n79411k27861Q5923N47228Q00762P5545
5478B174432j52878N3245l86754r32308M62334Q66529J17617k25777l63449m11480
$$ y = [1247146, 1609637, 2044213, 1922422, 2105874, 1395776, 1784499, 1364670, 1355300, 1794013, 1302608, 1308859, 1781274, 1355314, 1571750, 1475193, 1822178, 2066648, 1286235, 1661512, 1072996, 667287, 1684651, 1737885, 1659930, 1554145, 1547292, 2173903, 1557182, 1448483, 1191365, 1038824, 1352442, 950496, 915297, 884949, 740880, 848845, 1348594, 1517004, 1750005, 1291314, 993852, 804170, 1045391, 777126, 1785449, 1721252, 1733671, 1444969, 840667, 1265906, 1982015, 2318079, 2199212, 2160191, 1668816, 1766296, 1736359, 1059473, 1476532, 2071510, 1069762, 1542031, 1472246, 892835, 664974, 750897, 1298125, 2098887, 2174432, 2021554, 2074799, 1688045, 755737, 1218071, 2084600, 2202217, 1976440, 1612991, 1201511]
5468A201511l86385J32362O43177P31578m9907o34613n13207o32043k15556Q75210
5458A152127j51344Q53922J43207p36990p6190M78747L55081j38531M36127P77501
5448C093657m13869j014443o05713p9156P50502k79942l16075O22649N00655L36023
5438B594288n56731p87359N86913n5596K43142l43047N36729k36030j059855M420
5428I26874L32653j02760J027828J06590p56705P38111m12427l96206K57362O80278
5418B401598o46226k516l94866j97964P11760j4124K84767J86763n47669R57635
5408B739158o81130L0849l94614J40443J258972k22125r61417k13707L00878n86519
5398A410788l16499n79253K29906O67150N0332q89777M59753L63941k05136O24553
$$ y = [1201511, 815126, 947488, 1590665, 2322243, 2272336, 1637723, 1124516, 492473, 276917, 1152127, 1000783, 1854705, 1997912, 1260922, 1184732, 1663479, 2018560, 1880029, 2316156, 3093657, 2679788, 1665345, 1059632, 980476, 1730978, 1451036, 1134961, 1757610, 2258265, 2594288, 2037557, 1250198, 1837111, 1781515, 2024657, 1681610, 2218339, 1982309, 922454, 926874, 1259527, 1156767, 2184595, 2291185, 1534480, 2272591, 1860164, 1463958, 1721320, 2401598, 1755372, 1752856, 1357990, 1160026, 1871786, 1857662, 2142429, 2329192, 1781523, 2739158, 2058028, 2088877, 1694263, 1834706, 3093678, 2871553, 1910136, 1696429, 1997307, 1410788, 1094289, 515036, 744942, 1412092, 1462424, 572647, 1032400, 1396341, 1191205, 1815758]
5388A815758O50308J81884o81383M0504J39778j059055N56358m11659J893j35725
5378A098661Q04212k4881O0872m7597l67407k91957L32837P56244P4021p72217
5368A622788L79262p13403k96901P36902N55467l73182M33079J04698o73489K55999
5358B031220K90122K3154R9208L78486r72459p1257q7419J85891L98334m01786
5348A873494L1076L170L63335N2160l99956O73723n28896M80478L93k38307l39746
5337A970924r7034P2039K30613L62696j86509L05565N4652j95405j79438J73798
5327B511901j52920l49259k4046l56460O83809K98818J12356L5516n07366L11258
5317B563607q74225K0033O40975k01408J14958l84152O12007O48470n93779J44497
$$ y = [1815758, 2466066, 2647950, 1966567, 2007071, 2146849, 1087794, 1644152, 1232493, 1234386, 1098661, 1902873, 1877992, 1938864, 1891267, 1523860, 1231903, 1564740, 2320984, 2395005, 1622788, 2002050, 1288647, 991746, 1728648, 2284115, 1910933, 2344012, 2448710, 1775221, 2031220, 2321342, 2344496, 2443704, 2822190, 1849731, 1778474, 1691055, 1876946, 2275280, 1873494, 1904570, 1907740, 2271075, 2323235, 1923279, 2597002, 2068106, 2548584, 2548977, 2310670, 1970924, 1873890, 1945929, 2176542, 2539238, 2352729, 2658294, 2712946, 2517541, 2338103, 2511901, 2358981, 2009722, 1985676, 1629216, 2313025, 2611843, 2724199, 2759715, 2252349, 2563607, 1689382, 1709415, 2350390, 2148982, 2263940, 1879788, 2491795, 3140265, 2546486, 2690983]
5307B690983j45167l4407J13144P08741L31342l30946J49392j38284q37261l56551
5297B150986L27377J14156M45879o83151o31067l67849R13338O42670l54751r82963
5287A574625J48870O31944O11076p20205Q41467N64162j071015l18061J67238
5278B430101l48219j14442O52994M73776m17054n06593K11934m89011Q72702L04535
5268C070723o85415k74539M40091O14355o80626Q4305J49827j72969q0889N9862
5258B524725L77469r48985K50531M70640k33412J69382j58961N84960M2866q85359
5248B193856k10953Q79102K89528J44619m64445k94952k44453P02098o55600m05117
5238A933683N41856N37471J31951m56166p14714j41479L04234J84998P07675N03707
$$ y = [2690983, 2545816, 2511409, 2624553, 3333294, 3664636, 3333690, 3483082, 3344798, 2507537, 2150986, 2478363, 2592519, 3038398, 2355247, 1724180, 1356331, 2269669, 2912339, 2557588, 1574625, 1723495, 2355439, 2966515, 2246310, 3087777, 3651939, 2580924, 2262863, 2430101, 2081882, 1967440, 2620434, 3094210, 2677156, 2170563, 2382497, 1893486, 2766188, 3070723, 2385308, 2110769, 2550860, 3165215, 2484589, 2568894, 2718721, 2545752, 2464863, 2524725, 2902194, 1953209, 2203740, 2674380, 2440968, 2610350, 2451389, 3036349, 3079215, 2193856, 1982903, 2862005, 3151533, 3296152, 2831707, 2536755, 2292302, 2994400, 2338800, 1933683, 2475539, 3013010, 3144961, 2688795, 1974081, 1832602, 2136836, 2321834, 3029509, 3533216]
5228C533216j67479n49902l94571n73944R15699k71314N51834k69396J6528K12922
5218C003593j01933k55490p55294Q00692K46948J33692J45690l32447k54969m85742
5208B144740J90120N77289Q79928n82859r56630m32763k82830N62428P95452Q31005
5198C725880j83034m72738j270186n9677L14188K32131M22916j18083p9245K60985
5188B773137k98865p89735M64283L06662J078612m55628m0315K40035l17439o396
5178B954351R96998l55849q59934k2695N8119K80685m63254k63886J291296n51869
5168C063962k41748K38533K02332J75541j023716J86117Q69205k22322k94865
5159B953039m60345K67587Q6191j180469L51543K49120M74490k37077K04553M91545
$$ y = [3533216, 3365737, 2815835, 2421264, 1847320, 2763019, 2491705, 3043539, 2774143, 2790671, 3003593, 2901660, 2646170, 1890876, 2691568, 2938516, 3072208, 3217898, 2885451, 2630482, 2144740, 2334860, 2912149, 3792077, 3209218, 2252588, 1819825, 1536995, 2099423, 2894875, 3725880, 3542846, 3070108, 1799922, 1740245, 2054433, 2286564, 2709480, 2591397, 2512152, 2773137, 2474272, 1684537, 2148820, 2455482, 3534094, 3078466, 3038151, 3278186, 2960747, 2954351, 3951349, 3595500, 2735566, 2712871, 2770990, 3051675, 2588421, 2324535, 3615831, 3063962, 2822214, 3060747, 3263079, 3438620, 2414904, 2601021, 3470226, 3247904, 2953039, 2492694, 2760281, 2846472, 1666003, 2017546, 2266666, 2741156, 2504079, 2708632, 3200177]
5149C200177k63781n9677J26577L11142J47209k13616m31078L59683M43278m62246
5139C157668K57187o7527l8585K5930P62754l8989j240951P07981m8055L82216
5129C859629j08080m00682o27991l39362O60777k73862J20163L08620L96356l85964
5119C209604M1040J43031K06233o26752L89613L00226k44685j66832n49620K46280
5109B948138o84308p2947O48009J125566O61611j244255M07101k42838q3444o25501
5099B837132k01746J309693j81850K12599O84657L14911j084107k38990M6942
5090C699241J214446k02006L3785l54842k84596o37668J17694Q3357L5108O36123
5080D340642p92693j58391N57043j82139q9685M3303P18585M49448r23876j39726
$$ y = [3200177, 2936396, 2876719, 3003296, 3314438, 3461647, 3248031, 2816953, 3176636, 3619914, 3157668, 3414855, 3347328, 3308743, 3334673, 4097427, 4058438, 2817487, 3525468, 3477413, 3859629, 3751549, 3350867, 2722876, 2383514, 3044291, 2770429, 2890592, 3199212, 3595568, 3209604, 3250644, 3393675, 3599908, 2973156, 3362769, 3662995, 3418310, 3251478, 2701858, 2948138, 2263830, 2190883, 2838892, 3964458, 4626069, 3381814, 3788915, 3546077, 3462633, 2837132, 2635386, 3945079, 3763229, 3975828, 4660485, 4975396, 3891289, 3652299, 3699241, 4913687, 4711681, 4745466, 4390624, 4106028, 3468360, 3586054, 3669411, 3704519, 4340642, 3547949, 3389558, 3946601, 3764462, 3674777, 3718080, 4436665, 4886113, 3962237, 3822511]
5070C822511l00111R40294l64542m22673O32383O3444j67274J67880k09905o66267
5060C495740M49509K8919J43789M69499j09950n7148q3970l47518L51323O79087
5050E019280p02204L75416J74458k77628O25426K78563M3857J06285m8832m04657
5040E189964o34872M53098K980L46961J29749N55990j14742j96391j048495M27352
5030E111594Q36772K14075m6735M62152J98626p25461J16095p1769j29654J376695
5020G342390N24284n95772k52524k03259q1111m04632J074638L61616l03929N8029
5010G519730K56843R18975l48738R35199P22354l60852K50348l73123O13929J92985
5000A0327650k03023Q57087K30230P55518L39034J75014j51542K90538J207117
$$ y = [3822511, 3522400, 4462694, 4098152, 3675479, 4307862, 4371306, 4204032, 4371912, 4162007, 3495740, 3945249, 3974168, 4117957, 4587456, 4477506, 4420358, 4336388, 3988870, 4340193, 5019280, 4317076, 4692492, 4866950, 4589322, 5214748, 5493311, 5537168, 5643453, 5594621, 5189964, 4555092, 5008190, 5011170, 5358131, 5487880, 6043870, 5929128, 5732737, 4684242, 5111594, 5948366, 6162441, 6115706, 6577858, 6776484, 6051023, 6167118, 6095349, 5965695, 7342390, 7866674, 7270902, 7018378, 6815119, 6734008, 6329376, 7404014, 7765630, 7461701, 7519730, 7776573, 8695548, 8346810, 9282009, 10004363, 9643511, 9893859, 9520736, 10134665, 10327650, 10124627, 10981714, 11211944, 11967462, 12306496, 12481510, 12329968, 12620506, 13827623]
4991A3827623N80977R46889K12217o42932l89979j2983p66597q4412J388291J147728
4981A6206822p19162j018649q2709M37426j94211K137R96556J219218n22658q28181
4971A5496589n70938r11928j464968m95201L24883k01708j249042q25275k49003
4962I853409k41476M49214l7686M51366m05371m60130N6283J13950p94537j66551
4952H818471N11543Q8560j56578o25784J42577k56709o21806Q42072n77232R4174
4942H259288r55651n52167M95872r8507O43878l45562P28753J7240k78057q60454
4932G054633j32994m6284L11141l7757J90512j45493n35430j0102L46130j87115
4922F807241Q43843K74048K13144p09056k14801j02215M56549n89557K53053o2616
$$ y = [13827623, 14408600, 15355489, 15567706, 14924774, 14534795, 14521812, 13755215, 13670803, 15059094, 16206822, 15487660, 14469011, 14386302, 14823728, 14629517, 14631654, 15628210, 16847428, 16324770, 15496589, 14925651, 14013723, 12548755, 12053554, 12378437, 12176729, 10927687, 10102412, 9853409, 9611933, 10061147, 10023461, 10474827, 10069456, 9609326, 9665609, 9779559, 8985022, 8818471, 9330014, 9418574, 9261996, 8636212, 8778789, 8522080, 7900274, 8742346, 8165114, 8259288, 7303637, 6751470, 7247342, 7148835, 7792713, 7447151, 8175904, 8193144, 7915087, 7054633, 6921639, 6875355, 7186496, 7148739, 7339251, 7193758, 6658328, 6648226, 6994356, 6807241, 7651084, 7925132, 8138276, 7429220, 7214419, 7112204, 7568753, 6979196, 7232249, 7169633]
4912G169633q1794Q99119p05287O9926m32637r1473N16774q2389j80906l55752
4902F725214o6576j47874L03144J81591P5746K12201K9134Q0585P42380l15940
4892G819605l14029M46015O88707k92764l98349j69745K64378M3481l07929J75396
4882G954766O17666L3740j061774P43854M64768j40629J94872N93812N05216J455
4872I907746q21287P7666O74515P16467L69568k72885K79198N86753r482O08831
4862A2117090L17651P55278n57263j57781Q39342Q63813j072133n28239k83798
4853A2293960J74512J05152Q29508m4374q74419J340090l42720J286477O98176
4844A5466362J178895L47791O34489J039881K39065p3830n04019l05047j794099
$$ y = [7169633, 7087839, 7986958, 7281671, 7351597, 6918960, 6827487, 7344261, 7261872, 7080966, 6725214, 6658638, 6510764, 6813908, 6995499, 7071245, 7283446, 7312580, 7393165, 8135545, 7819605, 7505576, 7951591, 8640298, 8347534, 7949185, 7779440, 8043818, 8087299, 7779370, 7954766, 8572432, 8606172, 7544398, 8288252, 8753020, 8612391, 8807263, 9401075, 9906291, 9907746, 9086459, 9164125, 9838640, 10555107, 10924675, 10651790, 10930988, 11517741, 11508259, 12117090, 12434741, 13190019, 12632756, 12474975, 13314317, 14178130, 13105997, 12577758, 12293960, 12468472, 12573624, 13403132, 13358758, 12484339, 13824429, 13481709, 14768186, 15466362, 16645257, 16993048, 17627537, 18667418, 18906483, 18832653, 18328634, 18023587, 16229488]
4835A6229488n26546r46526J17814q4449L76400R50286k68157l2491k1048l78160
4825A5416611J021584R15222M70341O98143j98587N40254j049020j402825P06638
4816A7118361k21583j13683k20871P30692K9381P51685l45362N80897J062455
4807A9371972j03162o60806j74432K68280J310934O56160J307837J370464J497085
4798B4844332M53408J139522J394840J988517K715467L126841L212545M315967
4790D3191439L205439J86355k387761k895978j127091o52283Q36879J780494K399129
4781D4536622K460847K096082N79182J330184J354710L059920J411720j93417
4773E6635850l361938l490106j731826L24856R97171Q97448j893720k843182q01782
$$ y = [16229488, 15702942, 14756416, 14874230, 14789781, 15166181, 16116467, 15848310, 15815819, 15794771, 15416611, 16438195, 17353417, 17823758, 18521901, 18323314, 18863568, 17814548, 16411723, 17118361, 16896778, 16783095, 16562224, 17292916, 17322297, 18073982, 17728620, 18309517, 19371972, 19268810, 18608004, 18433572, 18701852, 20012786, 20668946, 21976783, 23347247, 24844332, 25297740, 26437262, 27832102, 29820619, 32536086, 35662927, 38875472, 43191439, 46396878, 46583233, 44195472, 41299494, 40172403, 39520120, 40356999, 42137493, 44536622, 46997469, 49093551, 49672733, 51002917, 52357627, 55417547, 56829267, 56635850, 53273912, 49783806, 48051980, 48376836, 49374007, 50271455, 48377735, 45534553, 44732771]
4764D4732771L37997J750146K195280L622070L038948j67119l713609n418655
4756D6377829l986718k942125k513223j706699j860039j222214j6810n65849K43612
4747C1807764R69775k67834n26597k41849l35780R47318K62287N38636R33433
4738C4087153J169659L68455O23050P41400Q41328K200933R18124O02931O17863
4729D2170896J479951R73796K110206J250729J594721J130589m8749J415621Q18668
4720E2896428K091175J180251R95971J653410O61592J792690K566027J579389
4712F5416933J576659L332013K853639K010340K829925L200645K346915K455916
4704H6022985M756053L002575K171101L748816N745390N906171Q682340R168434
$$ y = [44732771, 45070768, 46820914, 49016194, 52638264, 55677212, 55510093, 51796484, 46377829, 42391111, 39448986, 36935763, 35229064, 33369025, 32146811, 32130001, 31564152, 31807764, 32777539, 32509705, 31983108, 31741259, 31405479, 32352797, 32615084, 33153720, 34087153, 35256812, 35625267, 36248317, 36989717, 37831045, 40031978, 40950102, 41553033, 42170896, 43650847, 44624643, 46734849, 47985578, 49580299, 50710888, 50662139, 52077760, 52896428, 54987603, 56167854, 57163825, 58817235, 59478827, 61271517, 63837544, 65416933, 66993592, 70325605, 73179244, 75189584, 78019509, 81220154, 83567069, 86022985, 90779038, 93781613, 95952714, 99701530, 105446920, 111353091, 120035431, 129203865]
4696A29203865J1517063R582229M73248o765869q676036m848397j797578J910482
4688A30599007M373466N822270P781290N833944J326179q71186L437135O886757
4680A65188862M978696k161355q739826j0255962o808166j209478J530521l06176
4672A42217116m563086o442745l612121o88513K467213N187344J0143402R817895
4664A54526505K289318p044442j3235745j2572846p684600k355477N83338J758918
4656A16264969Q76830k39122m322954p187271o255171n457809n043453l725117
4648H4910902l382873k40063N33708R63679K761214L175516L352610M387364P334777
4639A03796834J0263690J3125663J4914339J3911379O246213o593826j6286372
$$ y = [129203865, 140720928, 150303157, 150776405, 144010536, 135334500, 130486103, 128688525, 130599007, 134972473, 140794743, 148576033, 154409977, 155736156, 154864970, 158302105, 165188862, 170167558, 168006203, 159266377, 149010415, 142202249, 140992771, 142523292, 142217116, 137654030, 131211285, 127599164, 126910651, 129377864, 134565208, 144708610, 154526505, 156815823, 149771381, 136535636, 123962790, 116278190, 113922713, 114506051, 116264969, 117141799, 116902677, 112579723, 105392452, 99137281, 93679472, 88636019, 84910902, 81528029, 81287966, 81821674, 82785353, 85546567, 88722083, 92074693, 96462057, 103796834, 114060524, 127186187, 142100526, 156011905, 162258118, 155664292, 139377920]
4632A39377920j7880451j5102765j1275666p606737n489199l308496l380127k689630
4624G2644849j465019j175271L9148J932198K870218N215013O985663P289501
4616I4336300M640809l29363n204583r590952j0406027r139880p839005o015187
4608E0452112m858406l984198l284584j453011k407530k259206k609165j563880
4600B8032132r88530j71882j085009k41156j077896k460638j364449q32108r81821
4591A8828643J51279o98662j604502p09389k8580j170016P37640J90047l68128
4582A5328332p53309k77267j174267q07720J293498N84369l29628j331421n66746
4573A1965841L51764j34464m49179J027478m10555l92475n20901q4021P02801
$$ y = [139377920, 121497469, 106394704, 95119038, 87512301, 82023102, 78714606, 75334479, 72644849, 71179830, 70004559, 70043707, 71975905, 74846123, 80061136, 87046799, 94336300, 98977109, 98647746, 93443163, 83852211, 73446184, 64306304, 56467299, 50452112, 45593706, 41609508, 38324924, 36871913, 34464383, 32205177, 29596012, 28032132, 27043602, 26871720, 25786711, 25545555, 24467659, 22007021, 20642572, 19810464, 18828643, 18979922, 18281260, 16676758, 15967369, 15938789, 14768773, 15506413, 15696460, 15328332, 14575023, 14297756, 13123489, 12315769, 13609267, 14193636, 13864008, 12532587, 11965841, 12317605, 12183141, 11733962, 12761440, 12350885, 11958410, 11437509, 11353488, 12056289]
4564A2056289k63827j017306M53000N82189N2427j05282J45218M8865L86189J56922
4554A2494684j099609n10821K27488k46035L71663m80537J26895j56334p3430
4545A0653964p5418l12968o85841N17513N85460p2984J027303L13121j132853
4536A0817297m12907J37629L05206P45375M77739J55012r25894o86523m97440
4527A0115494Q70064R28508P61879j398856k07395k70090j015462J433826J083542
4518A2301510P2430r40884p42590k52716N15989J12176O53165N25971r29586k46182
4508A1069283K15720r52817M56830M31565K32004n5065K82681m53734k06419N76100
4498A1596148Q51779r8648j00809l3108J67117o45090Q87345J80688o1186L63064
$$ y = [12056289, 11792462, 10775156, 11228156, 11810345, 11862772, 11757490, 11902708, 11951573, 12337762, 12494684, 11395075, 10884254, 11111742, 10865707, 11237370, 10756833, 10883728, 10727394, 10653964, 10578546, 10265578, 9579737, 10097250, 10682710, 10609726, 11637029, 11950150, 10817297, 10404390, 10542019, 10847225, 11592600, 12070339, 12225351, 11299457, 10612934, 10115494, 10985558, 11914066, 12675945, 11277089, 11069694, 10799604, 9784142, 11217968, 12301510, 12373940, 11433056, 10690466, 10437750, 10953739, 11065915, 11719080, 12245051, 11315465, 11069283, 11285003, 10332186, 10789016, 11220581, 11452585, 11397520, 11680201, 11226467, 11020048, 11596148, 12447927, 12349279, 12248470, 12215362, 12382479, 11737389, 12624734, 12805422, 12744236, 13107300]
4488A3107300j93041K38534m90711k49932P89934M77805k9117j52229m76623j07828
4478A2914092N2244M86977L62267p2688l99967M89460N72059j116128N48494J415464
4468A5252274J59699J09685q5116k08169J34380n90198J041124l8196L67957l78469
4458A5764971K82736J022187R1016j96552j0607M72185j28859P20738N68661N94182
4448A9180658K77544L02785J001939M96785q33128N07126J171898M77736Q85745
4439B3469088K25573R62040Q17844P7958J97359M956l45064J65216P33860n78130
4429B5730700K29641k22187O69583P67741J144654O93596o5008O7595O10121J637596
4419C1264032K583073Q89294r38714m10904L48452j355835K09799P12398M56306
$$ y = [13107300, 12914259, 13152793, 12662082, 12412150, 13202084, 13679889, 13650772, 13498543, 13021920, 12914092, 12966336, 13453313, 13815580, 13742892, 13342925, 13832385, 14404444, 13288316, 13836810, 15252274, 15411973, 15521658, 15436542, 15228373, 15362753, 14772555, 15813679, 15775483, 16143440, 15764971, 16047707, 17069894, 17160910, 16964358, 16953751, 17425936, 17297077, 18017815, 18586476, 19180658, 19458202, 19760987, 20762926, 21259711, 20426583, 20933709, 22105607, 22583343, 23469088, 23694661, 24656701, 25474545, 25552503, 25749862, 25754818, 25409754, 25574970, 26308830, 25730700, 25960341, 25738154, 26407737, 27175478, 28320132, 29013728, 28948720, 29016315, 29626436, 31264032, 33847105, 34736399, 33797685, 33386781, 33735233, 32379398, 32589197, 33301595, 33757901]
4410C3757901l9236j40169o795l36815Q33130J937660N35867R28865J072351L63139
4400C8905898Q94817J645030J558008J005283J176212j28107n86673N66111P68137
4391D5804716J604031J045957J681996K656032K417224J903694L071225L676415
4383F3861290L563980M147355L688682L972364M061122M812426K729430j691083
4375H9145566k888717j847356k89536J601194L267701M289526N772810N180408
4367A04231596M234045K997546J645486K833842M873771L733485N82099k736743
4359A22395127m778409k639633n53213k901431j709167j659978q47455J310631
4351A08616472K459212N435916N597584O273554M108981J376731o69604j589489
$$ y = [33757901, 33718665, 33578496, 33571701, 33234886, 34068016, 36005676, 36541543, 37470408, 38542759, 38905898, 39800715, 41445745, 43003753, 44009036, 45185248, 45057141, 44470468, 45036579, 45804716, 47408747, 48454704, 50136700, 52792732, 55209956, 57113650, 60184875, 63861290, 67425270, 71572625, 75261307, 79233671, 83294793, 88107219, 90836649, 89145566, 86256849, 84409493, 84119957, 85721151, 88988852, 93278378, 99051188, 104231596, 108465641, 111463187, 113108673, 115942515, 120816286, 124549771, 125131870, 122395127, 117616718, 114977085, 114423872, 111522441, 109813274, 108153296, 107305841, 108616472, 111075684, 116511600, 122109184, 128382738, 132491719, 133868450, 133198846, 131609357]
4343A31609357k558980j744416j226358j569592j378657l69481r78587J762068
4335A23545354M412379M605066O492671Q521514J0936352J0145991N280315o91841
4327A73247801n242427q350277o802140m828860o817531o824228l442531m41876
4319A30497931Q40570J971480M335137M572173Q025609R864838J2580979J8589124
4311A91277841K0250990J1777000n18367j1597060j5503149j1515183p616600
4304A76555472m688309l38446N079235R359930J7482453K4936685L3750722K6025190
4296B88162932j88049k6800685l0847607k1005933j2158283o674786n438490q303109
4288A76745990j0099191q698508o802339l996138k972180J252189Q16345q85326
$$ y = [131609357, 129050377, 127305961, 126079603, 124510011, 123131354, 122761873, 121783286, 123545354, 127957733, 132562799, 139055470, 147576984, 158513336, 168659327, 173939642, 173247801, 168005374, 159655097, 152852957, 148024097, 141206566, 134382338, 130939807, 130497931, 131338501, 133309981, 137645118, 142217291, 150242900, 160107738, 172688717, 191277841, 211528831, 223305831, 222787464, 211190404, 195687255, 184172072, 176555472, 171867163, 171528717, 176607952, 185967882, 203450335, 228387020, 262137742, 288162932, 287974883, 261174198, 230326591, 209320658, 197162375, 190487589, 185049099, 176745990, 166646799, 157948291, 151145952, 147149814, 144177634, 145429823, 146246168, 145360842]
4280A45360842j502961n46136k113791m012147m078886l286003j367811j174207
4272A27278900o66001R86903K394472L248181N251628N680851O205365O122955
4264A56503254P659612P178265Q811552Q030556Q990900J0413155M567316o343567
4256B05811043j3538907j1208158p830938l224397J090456O133203P783709M986539
4248A90002550J717592K61946L218960P403287Q265825O163317n97527q334542
4240B08101408p905460l265337j775112j999805m865284n473742k050673J613748
4232A82379743M326696P051726O550513Q801482R378755J58886o951625r936276
4224B01759900p944964o140582m474932j100817R86554L01744J646030J338018
$$ y = [145360842, 143857881, 143311745, 141197954, 137185807, 133106921, 129820918, 128453107, 127278900, 126612899, 127599802, 129994274, 133242455, 138494083, 144174934, 150380299, 156503254, 164162866, 171341131, 180152683, 188183239, 197174139, 207587294, 212154610, 205811043, 192272136, 181063978, 173233040, 170008643, 171099099, 177232302, 185016011, 190002550, 191720142, 191982088, 195201048, 202604335, 210870160, 217033477, 216435950, 208101408, 200195948, 196930611, 195155499, 193155694, 188290410, 182816668, 180765995, 182379743, 186706439, 193758165, 200308678, 209110160, 218488915, 218647801, 211696176, 201759900, 193814936, 187674354, 183199422, 182098605, 183085159, 183386903, 185032933, 186370951]
4216A86370951p91171k741523j804898J451486K711372L265490J887708K515207
4208A92864622M375521Q051518J0178098O197635K373077J320392M260591P382925
4200B37004379N157611J121882l057395j0460783j5846950j4221158j1433912
4193A88263674q067880m147988j225671K691512M047591L283649N251023P497741
4185A97593651J0659740R807052M591229j042424o653616j0883196j2601164q310938
4177A83160334l185586m057402p445765r894856q167776m073033j002898L74119
4169A45707137j121891l23580R60981R29763k569419p934869r541159r141369
4161A16965594p354221p601828p518768m547604l354076m310830m871165m442533
$$ y = [186370951, 185579780, 182838257, 181033359, 182484845, 185196217, 188461707, 190349415, 192864622, 197240143, 205291661, 215469759, 221667394, 224040471, 225360863, 229621454, 237004379, 242161990, 243283872, 240226477, 229765694, 213918744, 199697586, 188263674, 180195794, 176047806, 174822135, 177513647, 181561238, 184844887, 190095910, 197593651, 208253391, 218060443, 222651672, 221609248, 214955632, 204072436, 191471272, 183160334, 179974748, 175917346, 168471581, 158576725, 150408949, 146335916, 145333018, 145707137, 144585246, 144261666, 145222647, 146152410, 143582991, 135648122, 126106963, 116965594, 109611373, 102009545, 94490777, 89943173, 86589097, 82278267, 77407102, 72964569]
4153G2964569m138721l176568j428969j951650l778735m686495l545146l761680
4145D6496605l385133l067393j892299j500829k042442j298081p13008r86812
4137C1610608j010202o46376K63152m72199p84183k03161j494823j773494m9686
4128B5439636J31557o22651m68788K75979l98773l74773P05244J488605R49820
4119B7125856l38307J57013p41479o38464l56384n8120N2685m37940P91660J167699
4109B6724219R31404o03519k480488p34644j059964k042933K04802N88649k55424
4100B1272102j314284r99148n88216o26348m22771R25080N73293m91168k41104
4091A8087436N63429n07360j09745J27793J17771j054389j279005M85675q56783
$$ y = [72964569, 68825848, 65649280, 64220311, 62268661, 58489926, 53803431, 50258285, 46496605, 43111472, 40044079, 38151780, 36650951, 34608509, 33310428, 32597420, 31610608, 30600406, 29954030, 30217182, 29744983, 28960800, 28757639, 27262816, 25489322, 25439636, 25571193, 24948542, 24479754, 24755733, 24356960, 23982187, 24687431, 26176036, 27125856, 26787549, 26944562, 26203083, 25564619, 25208235, 25150115, 25202800, 24764860, 25556520, 26724219, 27655623, 27052104, 24571616, 23836972, 22777008, 20734075, 20938877, 21527526, 21272102, 19957818, 18958670, 18370454, 17744106, 17321335, 18246415, 18819708, 18328540, 18087436, 18650865, 18143505, 18033760, 18161553, 18279324, 17224935, 15945930, 16431605, 15574822]
4082A5574822n79865J437465J47361m13170p69678M595N16740Q99107N59467O05545
4072A7982389k76479m71878Q39496J234110K079288P55957l56991n60351K86957
4063B1512498J248861K975042J927419J108084J358415P48750j046233j130443
4055B8702393j485840j852354j541479j369882n74787R20304K83083j31969R80983
4046B3930452N92966J791301J666567K492122J891138P29229J454609K400353
4038C6948737L782411O208044Q114926O559591J631836m143830o653840p211602
4030D5236273n038451m174049k791382l258949k510843p9045K9970l65771O7173
4021B7114926K74635K48457j2380K756492K589263J917887K456945L356187N029310
$$ y = [15574822, 14994957, 16432422, 16579783, 16166613, 15396935, 15401530, 15918270, 16817377, 17376844, 17982389, 17705910, 17234032, 18073528, 19307638, 21386926, 22142883, 21785892, 21225541, 21512498, 22761359, 25736401, 27663820, 28771904, 30130319, 30879069, 29832836, 28702393, 27216553, 25364199, 23822720, 22452838, 21878051, 22798355, 23081438, 22949469, 23930452, 24523418, 26314719, 27981286, 30473408, 32364546, 33093775, 34548384, 36948737, 40731148, 46939192, 55054118, 61613709, 63245545, 59101715, 52447875, 45236273, 40197822, 36023773, 33232391, 29973442, 27462599, 27383554, 27413524, 27047753, 27114926, 27389561, 27638018, 27625638, 30382130, 32971393, 34889280, 37346225, 40702412, 45731722]
4012D5731722O878879P084674M236762k781944o996481n747240o243144n437589
4004C6725639k963129l054554k807305k702328p04600M44859j38313o42884K64295
3995B4421680m20430P7421N79635M49659J28534J353569K691291J339715J037569
3986C1658643K160600p9038j086033j963859j540503k516159j948214k10987K22153
3977B4696603j30713r04606p23636j508225J81194N19436N99269j183764o84415
3968B0861143p19929o2021N45793J147027n15299o13106r54985M53679O58271
3959B0800573K21729N97177K67652q40189R56432K107175K042222o15061n85009
3950B4952701L8935n88633N53629J185231K92395k166232j013500P30855m37378
$$ y = [45731722, 52610601, 59695275, 63932037, 61150093, 54153612, 48406372, 42163228, 36725639, 33762510, 30707956, 27900651, 25198323, 24493723, 24938582, 24800269, 24157385, 24421680, 24001250, 24078671, 24658306, 25107965, 25236499, 26590068, 29281359, 30621074, 31658643, 33819243, 33740205, 32654172, 30690313, 29149810, 26633651, 24685437, 24474450, 24696603, 24565890, 23661284, 22937648, 21429423, 21610617, 22130053, 22729322, 21545558, 20861143, 20141214, 20079193, 20624986, 21772013, 21256714, 20643608, 19688623, 20142302, 20800573, 21022302, 21619479, 21887131, 21046942, 22003374, 24110549, 26152771, 25537710, 24952701, 24991636, 24403003, 24956632, 26141863, 26434258, 24268026, 23254526, 23985381, 23548003]
3941B3548003M19851M94200q09287n39626K62336K15887M81630J43307M124J79479
3931B4399904m23535J584087J357886J118596n82788K77433J089582J579128M27236
3922C0827529j08875l41502j678957Q8734Q71539L19837n76987L88095o63904
3913B9125509m33668J184452J235687M90586L82068K205132n23351J38798J892890
3904C5698103J417330J70390N71306R03759J560595K813485K482094K82361K92313
3895D6191736L311113N306295M808491M313409M212110O964128R238577J1879064
3887I6224923J7330361K1142076K9163482J9598691o116221k8233455k5383987
3880A23725870j7839388j3556825q033235n906802n401468m872571k285540k196278
$$ y = [23548003, 23967854, 24462054, 23652767, 23113141, 23375477, 23591364, 24072994, 24216301, 24220425, 24399904, 23976369, 25560456, 26918342, 28036938, 27454150, 27731583, 28821165, 30400293, 30827529, 30718654, 30377152, 28698195, 28786929, 29658468, 29978305, 29401318, 29789413, 29125509, 28691841, 29876293, 31111980, 31602566, 31984634, 34189766, 33666415, 33805213, 35698103, 37115433, 37285823, 37857129, 38760888, 40321483, 43134968, 45617062, 45899423, 46191736, 49502849, 54809144, 59617635, 63931044, 68143154, 75107282, 84345859, 96224923, 113555284, 134697360, 163860842, 183459533, 177343312, 149109857, 123725870, 105886482, 92329657, 84296422, 78389620, 72988152, 68115581, 65830041, 63633763]
3872F3633763j696402j7370k203238k747585j178944n7349j742845j132323K47372
3863E3105079j878544j467462o11497n60083j496088M83039J008190j77128J097148
3854D9502654J894487J352686O90947Q24293J275657K5242K113831K144761j353757
3845E8470801j303430J457700J691178K257244L164520L90022j603542J273560
3837F5798053M184544J302229J078601J553525K410239J547754M241153K723393
3829H4839491K003254L224812M490311M694080M317104L218639J915086O737588
3821A15440365P715118M449247K666502N292446P574944J2923514J2807547J1542096
3813A80411779J6525843K4417130K8582717M2427158N4893230Q5375548P6463392
$$ y = [63633763, 61937361, 61919991, 59716753, 56969168, 55790224, 55732875, 53990030, 52857707, 53105079, 51226535, 49759073, 49147576, 48587493, 47091405, 47574444, 48582634, 48405506, 49502654, 51397141, 52749827, 53440774, 54265067, 55540724, 55565966, 57679797, 59824558, 58470801, 57167371, 58625071, 60316249, 62573493, 65738013, 66128035, 64524493, 65798053, 69982597, 71284826, 72363427, 73916952, 76327191, 77874945, 82116098, 84839491, 86842745, 90067557, 94557868, 99251948, 103569052, 106787691, 108702777, 115440365, 123155483, 127604730, 130271232, 135563678, 143138622, 156062136, 168869683, 180411779, 196937622, 221354752, 249937469, 292364627, 347257857, 432633405, 509096797]
3806E09096797J358389p7524705r0977094o6398373m7962094l0400601k3235032
3799A73957287j5182020j1150793o230252l618213p14671M58529L036853M925976
3791A45482696N039612n85975n711073r811753j0316225r297007q094929o267043
3783A00438303n458332m815749l293534k267857j514160n00988j173229j236381
3775H0178073r83399j316983L41540J109592L210557L974675R16167k627323n265476
3766G9537423n236467m277997k703115k725157k255620q66787p69705p60324j508259
3757E8433992j903836j29182l70912p72394j2852q72673o92j06977k61104l1267
3747E3972103O5941L18345r21497l61115R03015j42601m07577j5541M60653L83012
$$ y = [509096797, 510455186, 432930481, 341953387, 275555014, 227592920, 197192319, 173957287, 158775267, 147624474, 141394222, 137776009, 137061338, 137519867, 140556720, 145482696, 150522308, 149936333, 144225260, 134413507, 124097282, 114800275, 106705346, 100438303, 94979971, 90164222, 86870688, 84602831, 83088671, 82587683, 81414454, 80178073, 79194674, 77877691, 78219231, 79328823, 82539380, 86514055, 87430222, 84802899, 79537423, 74300956, 70022959, 67319844, 64594687, 62339067, 61472280, 60702575, 59942251, 58433992, 56530156, 56400974, 56030062, 55257668, 55244816, 54372143, 54371451, 54264474, 54003370, 53972103, 54038044, 54356389, 53434892, 53073777, 53976792, 53834191, 53426614, 53411073, 53871726, 54254738]
3737E4254738K65726M68322J071051R38542K78856J639389K41430J611488J973073
3728F2742615J86036Q86744K735732L465435M152500M384608L844483K904575
3720H5302728M687541N665702J0212002J3143979K0875066J9764574M326175j2644455
3712A51333312j9843509j8377150j5413031j0819793q357883n499413l276028
3705F9746505j880119m61774N85374J829358K247177j00689k117949l036619j882277
3696F4928987j633001j484762o50554j025460J32324k9732l1255J451009n90630
3687F1066926J50480J317727L24349J556916J202090O06833J414295K021994L306935
3678G2968545K401657L628536K120211K745119K356164L549058K988524M002623
$$ y = [54254738, 54520464, 54988786, 56059837, 56998379, 57277235, 58916624, 59158054, 60769542, 62742615, 62928651, 63815395, 66551127, 70016562, 74169062, 78553670, 82398153, 85302728, 89990269, 95655971, 105867973, 119011952, 139887018, 159651592, 163977767, 151333312, 131489803, 113112653, 97699622, 86879829, 78521946, 73022533, 69746505, 67866386, 67404612, 67989986, 69819344, 72066521, 71965832, 69847883, 66811264, 64928987, 63295986, 61811224, 61160670, 60135210, 60267534, 60237802, 60206547, 61657556, 61066926, 61217406, 62535133, 62859482, 64416398, 65618488, 66225321, 67639616, 69661610, 72968545, 75370202, 78998738, 81118949, 83864068, 86220232, 89769290, 92757814, 96760437]
3670I6760437L404072M353490M647057N502089M526059M322383M289054L019357
3662A30823998M044070L371332K488547J726179J547880Q5874J435854K256319
3654A47780053K466127K998325L500757L539064L997529N627902N639736O325883
3646A81875376O476727N962481L384512N80737j483212k091729l000462m110921
3638A87593509m634213n046762l831785l411205k127786j345908J83515M88422
3630A67867787L69420J346981K433373L472273L964312M697356M548552L145840
3622A91845894P32596j862190l436956m785993n018114m531621m563419m178357
3614A64201840m425598l083643k397646j590211O07570K430766K811322M222623
$$ y = [96760437, 100164509, 104517999, 109165056, 114667145, 119193204, 123515587, 127804641, 130823998, 134868068, 138239400, 140727947, 142454126, 144002006, 144087880, 145523734, 147780053, 150246180, 153244505, 156745262, 160284326, 164281855, 169909757, 175549493, 181875376, 188352103, 194314584, 197699096, 198279833, 196796621, 194704892, 191704430, 187593509, 182959296, 177912534, 174080749, 170669544, 168541758, 167195850, 167379365, 167867787, 168237207, 169584188, 172017561, 175489834, 179454146, 184151502, 188700054, 191845894, 192578490, 190716300, 187279344, 182493351, 177475237, 172943616, 168380197, 164201840, 159776242, 156692599, 154294953, 152704742, 153312312, 155743078, 158554400, 162777023]
3606A62777023M709193M541757M497968L262263L433335J136648k123893m429427
3598A77804867m812755n875943o060900m977461n955484n814516m004951m106519
3590A36196338k614639j801818j638914k578148k387948j942275j567534j880828
3582A19784234k529405l427606n252314o022389o158804o307622n959521n495998
3574G8630575m272854n897690m652450k853285k717029l203737l355096l433587
3566D8244847l503961l225787k653416k492207p15970j785539j599550j686620
3558C0581797p59625n02784r98109o76316j084670q43761o90302M49592r46246
3549B4529576q33301k48114r93586J5462o38038j098574r5381r4344l01683r29316
$$ y = [162777023, 167486216, 172027973, 176525941, 179788204, 183221539, 184358187, 182234294, 177804867, 172992112, 167116169, 161055269, 156077808, 150122324, 144307808, 140302857, 136196338, 133581699, 131779881, 130140967, 127562819, 125174871, 123232596, 121665062, 119784234, 117254829, 113827223, 108574909, 102552520, 96393716, 90086094, 84126573, 78630575, 74357721, 68460031, 63807581, 60954296, 58237267, 55033530, 51678434, 48244847, 44740886, 41515099, 38861683, 36369476, 35653506, 33867967, 32268417, 30581797, 29822172, 29319388, 28321279, 27644963, 26560293, 25716532, 25026230, 25475822, 24529576, 23696275, 23448161, 22454575, 22470037, 21831999, 20733425, 20638044, 20543700, 20242017, 19312701]
3539A9312701Q35089n48026j210759L0984l46905j58310j56131r07717K29353
3530A7080279l14201J260605n91517o88117J36794K45651j39533p46325j019399
3521A5224237p17572Q2552P3032o6941O583O55580j71308K25152p53905k25804
3511A4331606j23388Q9449P37871L2794j26784r5083L77359p42566p54118j44276
3501A3582864K0701L63228k69759L36572J14996J55024m99131m56186M20273M93799
3491A4262381J19797N37531N59514Q3448l96730o74816K18469O12917Q1644Q1023
3481A5485178l96462J94550L65036L31495Q81616j160051j162342O9575J49696
3472A4758291k82509K07550k7826K31127p17658L74082O93256k67621q27274L2124
$$ y = [19312701, 20147790, 19599764, 18389005, 18419989, 18073084, 17914774, 17758643, 16850926, 17080279, 16766078, 18026683, 17435166, 16747049, 16883843, 17129494, 16989961, 16243636, 15224237, 14506665, 14589217, 14662249, 14595308, 14601891, 15257471, 15086163, 15311315, 14557410, 14331606, 14208218, 14297667, 15035538, 15068332, 14941548, 14846465, 15223824, 14481258, 13727140, 13582864, 13603565, 13966793, 13697034, 14033606, 14148602, 14303626, 13804495, 13348309, 13768582, 14262381, 14382178, 14919709, 15479223, 15562671, 15165941, 14491125, 14709594, 15322511, 15404155, 15485178, 15088716, 15283266, 15648302, 15979797, 16861413, 15701362, 14539020, 14608595, 14758291, 14475782, 14683332, 14655506, 14886633, 14168975, 14543057, 15236313, 14968692, 14141418, 14173542]
3462A4173542r4023l59138m62885k38923O67977L78183j61017n85579k10922J47376
3452A3254591k50814M87255K38684k57392q94182l36529L92223L29368P61412
3443A3724616l83811N15149m66697J63761O48184o14649j68493M73157J37936
3434A4029153o6541n13370K42186L265M35848o00343M28520J041168J45494l57709
3424A4787671M06148r26550m05070O09200N87954k55084j00860K59425k2743J66912
3414A5107003M65689j84004l33368M99696l29949m05078P51546J017116n11861
3405A6076790m33330K81557q0203M03537P15639l25612J75823r8977L3694J54352
3395A6903270k18426j53751J209491K88930k67187M64940P14003J28250j28567
$$ y = [14173542, 14079519, 13720381, 13257496, 13018573, 13686550, 14064733, 13903716, 13318137, 13107215, 13254591, 13003777, 13491032, 13729716, 13472324, 12578142, 12241613, 12633836, 12963204, 13724616, 13340805, 13855954, 13389257, 13553018, 14201202, 13586553, 13418060, 13891217, 14029153, 13962612, 13449242, 13691428, 13694693, 14130541, 13530198, 13958718, 14999886, 15145380, 14787671, 15193819, 14267269, 13862199, 14471399, 15059353, 14804269, 14703409, 14962834, 14940091, 15107003, 15572692, 15388688, 15055320, 15555016, 15225067, 14819989, 15571535, 16588651, 16076790, 15643460, 15925017, 15844814, 16248351, 16963990, 16638378, 16814201, 16715224, 16748918, 16903270, 16684844, 16531093, 17740584, 18029514, 17762327, 18227267, 18941270, 19069520, 18940953]
3386A8940953N73982O17354k11785q9761O99310N91299J74810N35277K61435M03600
3376B2496474O27020M19038r33824N92984M84267P06086k91762l9166j55998P96923
3366B4702042J30105P1323J126268p606Q6967M22090l1211P53761j9478m10482
3356B6823779j98584k04680J328649p9304M20900P48642N04449J119262K34631
3347C0697744o99083l10244M71616Q75844j48267M84089L97323K87240R09846
3338C2966108P78577O79517R98411Q56654J987721J310389l27597r6128l26827
3329C8826825j86418j70161k83904J46395J65188P05773o446p39059J3649N86797
3319C9058639M61684j106646M77175J326465j00874P00253Q05005r10729Q47759
$$ y = [18940953, 19514935, 20132289, 19920504, 19830743, 20530053, 21121352, 21296162, 21831439, 22092874, 22496474, 23123494, 23542532, 22608708, 23201692, 23685959, 24392045, 24100283, 24061117, 23905119, 24702042, 24832147, 24903470, 26029738, 26022132, 26109099, 26531189, 26499978, 27253739, 27234261, 26823779, 26625195, 26420515, 27749164, 27669860, 28090760, 28839402, 29343851, 30463113, 30697744, 29998661, 29688417, 30160033, 31035877, 30887610, 31371699, 31769022, 32056262, 32966108, 33744685, 34424202, 35422613, 36279267, 38266988, 39577377, 39249780, 39153652, 38826825, 38640407, 38470246, 38186342, 38332737, 38497925, 39203698, 39197252, 38458193, 38471842, 39058639, 39520323, 38413677, 38890852, 40217317, 40116443, 40816696, 41621701, 40710972, 41558731]
3310D1558731R26024J85523O88948P46760J24452N79024N61296j4586P5586n12768
3300D4918990L8784J2821k38808q65527m16369j43650m52538k78424J08641o3616
3290D2620304k68768o23911L43309M3953n22678n47788J10542l37995N4468r75543
3280C9895893j289446N0702J2640q91888q44617q48294l475L52744q8296j5643
3270C6330320N85896p86753o2012R3406J56943M05305K64172m96701n50501j196229
3260C4743846j70415R07918q91125k88638q6483k39906P7355j19276L22731J24064
3250C4380071M06798K91123l746O10504l17292q11743l0189R19310M05898N7178
3240C5907912q56299P14909L16116k06110P11365K18794n45068n24332K37620
$$ y = [41558731, 42484755, 42670278, 43359226, 44105986, 44230438, 44809462, 45370758, 45356172, 45431758, 44918990, 44957774, 44970595, 44731787, 43866260, 43449891, 43306241, 42853703, 42575279, 42683920, 42620304, 42351536, 41727625, 42070934, 42114887, 41592209, 41044421, 41154963, 40816968, 40871436, 39895893, 38606447, 38657149, 38669789, 37777901, 36933284, 36084990, 36081515, 36434259, 36345963, 36330320, 36916216, 36129463, 36067451, 36160857, 36317800, 36723105, 36987277, 36490576, 35940075, 34743846, 34573431, 35481349, 34590224, 34301586, 34215103, 33975197, 34052552, 33933276, 34256007, 34380071, 34786869, 35077992, 35074246, 35684750, 35367458, 34555715, 34525526, 35444836, 35850734, 35907912, 35051613, 35766522, 36082638, 35876528, 36587893, 36806687, 36261619, 35737287, 35974907]
3231C5974907J676021L90026m07092P7831O39418J035824M49542J38542J156942
3222D1131961K81199L9598N84889M69587R52413l21064m05295J092130J90293
3213D4015711p84760J37242J457687J315245N95813Q19162Q83307R09207R27881
3204E0276495O49939J716677J188527K40056R84890Q72827j49969K10183M28851
3195E6418476M56905O23473K8364r65150m7924P6001p67963Q39085J041449M12893
3185E8115609N77264O68074k17003J621355J357524N51609P78961O75545R53218
3176F5082156N08666k61307J498869P97155l68239M8968P20965N32896J071379
3167F9631508J228907K051955J249925O48985o280P70509R03724m00914K91687
$$ y = [35974907, 37650928, 38040954, 37633862, 37711693, 38351111, 39386935, 39836477, 39975019, 41131961, 41413160, 41452758, 42037647, 42507234, 43459647, 43138583, 42733288, 43825418, 44015711, 43230951, 43368193, 44825880, 46141125, 46736938, 47556100, 48439407, 49348614, 50276495, 50926434, 52643111, 53831638, 54071694, 55056584, 55929411, 55779442, 55989625, 56418476, 56875381, 57498854, 57527218, 56562068, 56514144, 56590145, 55822182, 56661267, 57702716, 58115609, 58692873, 59360947, 59143944, 60765299, 62122823, 62674432, 63453393, 64128938, 65082156, 65590822, 65329515, 66828384, 67625539, 67257300, 67306268, 68027233, 68560129, 69631508, 70860415, 72912370, 74162295, 74811280, 74805000, 75575509, 76479233, 76078319, 76370006]
3158G6370006M4834R92700L64343m44494J36053P28449R73348Q44041N18852J174884
3148H1703016M89035P38127J296472Q7310J97024J409199K471472J543798J601052
3139I1536505K281815K295356K412692K836595L460740K374062J762240J463118
3131A10423123J976925J657311J727764J503386J386852J130163K391807J951603
3123A24148934J308692J274527K196048K313567L069030L731120L929774L575683
3115A45547375J678506R7448l30696m8973Q67184o24926J909746J811900K59236
3106A51166800J340022J215849J131372K222275L010082J485088J296067J377804
3098A64245359K075321K672946M368925M627800L532303L533605K215671K943839
$$ y = [76370006, 76414840, 77407540, 77771883, 77327389, 77463442, 78191891, 79165239, 80009280, 80528132, 81703016, 82192051, 82930178, 84226650, 84313960, 84510984, 85920183, 88391655, 89935453, 91536505, 93818320, 96113676, 98526368, 101362963, 104823703, 107197765, 108960005, 110423123, 112400048, 114057359, 115785123, 117288509, 118675361, 119805524, 122197331, 124148934, 125457626, 126732153, 128928201, 131241768, 134310798, 138041918, 141971692, 145547375, 147225881, 147323329, 146992633, 146943660, 147810844, 147185918, 149095664, 150907564, 151166800, 152506822, 153722671, 154854043, 157076318, 160086400, 161571488, 162867555, 164245359, 166320680, 168993626, 173362551, 177990351, 181522654, 185056259, 187271930, 190215769]
3090A90215769K756674K647393L149828K106478L081605M749872N314955L071072
3082B17093646n7723j133662j392150l79730K47051J176891J959960J848846m32304
3073B18930825k479840j996959k83521m97690j539560p65683j717416j605701
3065B08044455j795874q52974p76554k40060k632410m799087o405861o054419
3057A84487216n062478n837206o749086o398217o481311n233075m274530k198739
3049A42252574j116987j604329r54028j004904k659707k739723k964616l765926
3041A25442354l180692k936727j666654p02735k31857j538743j674486l532357
3033A09978103l270725m144545l282139k680807k011632j524311o66993j668100
$$ y = [190215769, 192972443, 195619836, 198769664, 200876142, 203957747, 208707619, 214022574, 217093646, 217035923, 215902261, 214510111, 214130381, 214377432, 215554323, 217514283, 219363129, 218930825, 216450985, 214454026, 214170505, 213672815, 212133255, 211367572, 209650156, 208044455, 206248581, 205395607, 204619053, 204378993, 201746583, 196947496, 190541635, 184487216, 179424738, 173587532, 166838446, 160440229, 153958918, 148725843, 144451313, 142252574, 141135587, 139531258, 138577230, 137572326, 134912619, 132172896, 129208280, 125442354, 122261662, 119324935, 117658281, 116955546, 116723689, 115184946, 113510460, 109978103, 106707378, 102562833, 99280694, 96599887, 94588255, 93063944, 92396951, 90728851]
3025I0728851j311305j512733k107244j658435j951956j641919j121264j120105
3017G8303890j248691j801450r80885p86352j500920m51797l41539j129054j570540
3008F8492662l04535r95980q18896l48894K89027J45535Q87510l09441l29145
2999F6707843M49505Q01376J5028J374796O86138O07180Q18495M32636P01247
2990G2594244J363727J450148K467105K091844K127476J564021J140554J199209
2982H5998328j70900j72501O05460r11178j003509j745695j842148j245736k200180
2973G7311941j928456k674570k345220j277141j632450j264330j468106j555385
2965F3166283j376766q19793j159041j129684m5674j295346l29057l91693j561124
$$ y = [90728851, 89417546, 87904813, 85797569, 84139134, 82187178, 80545259, 79423995, 78303890, 77055199, 75253749, 74272864, 73486512, 71985592, 71533795, 71192256, 70063202, 68492662, 68188127, 67192147, 66373251, 66024357, 66313384, 66458919, 67346429, 67036988, 66707843, 67157348, 67958724, 67973752, 69348548, 70034686, 70641866, 71460361, 71892997, 72594244, 73957971, 75408119, 77875224, 79967068, 82094544, 83658565, 84799119, 85998328, 85827428, 85654927, 86260387, 85349209, 84345700, 82600005, 80757857, 79512121, 77311941, 75383485, 72708915, 70363695, 69086554, 67454104, 66189774, 64721668, 63166283, 61789517, 60969724, 59810683, 58680999, 58635325, 57339979, 57010922, 56619229, 55058105]
2956E5058105n06890m7837j42695M63158j63096n01285o79902n82885j032293
2947E1864380r85906r89849k022298n67434p17493o38644n89483n36521m08033
2938D4408719R4389j74193m24331L31260p1077j88745n56880j044045j183618
2929D1191479j391748m61452n77798K41439n15168p79259p8302j110668l37407
2920C6181116m15651N88797n22809m82734j87133q08675j81247M31532j150066
2911C3453130m67599N19237l41308k00408N00347n13118q08934P3977M171n03623
2901C1715872j08756J57099k52004q6115K13023k83264M9415L76268j02568l24866
2891C1354104O27390l12229K18477j50535m20596m54056K70580q9085l64575l82789
$$ y = [55058105, 54551215, 54503378, 54360683, 54823841, 54660745, 54159460, 53479558, 52896673, 51864380, 50878474, 49888625, 47866327, 47298893, 46581400, 45942756, 45353273, 44816752, 44408719, 44503108, 44328915, 43904584, 44235844, 44164767, 43976022, 43419142, 42375097, 41191479, 39799731, 39338279, 38760481, 39001920, 38486752, 37707493, 37629191, 36518523, 36181116, 35765465, 36354262, 35831453, 35348719, 35161586, 34352911, 34171664, 34603196, 33453130, 32985531, 33504768, 33163460, 32963052, 33463399, 32950281, 32141347, 32215324, 32219495, 31715872, 31607116, 31764215, 31512211, 31426096, 31639119, 31355855, 31405270, 31781538, 31678970, 31354104, 31981494, 31669265, 31887742, 31737207, 31316611, 30862555, 31133135, 31044050, 30679475, 30296686]
2881C0296686l64323o99023k97508j12984j82095j035664O733q2219K06654J30396
2871B7866653M804J26693J4351r65428J16305L07265j201606L73911j15925o72238
2861B5854785j26111K73554J22891M09190m63133L37423r32404j34838q5206Q29203
2851B6085354K31431q33339P56648j72928m1318K28358j49053j087464N53752
2842B5571441L76910n32372L02180M84768o20205p91432J18296L54390k93745
2833B4970231J48464o75866o65983o48156L23456O28102K86348l50670n78629
2824B3437297o9564L17645O0794m60592N45914m52383N75468p78318J21060N8779
2814B3356100K56842l59966K4275J14815q0244j51510J17625Q3624j82782L3453
$$ y = [30296686, 29932363, 29233340, 28935832, 28822848, 28640753, 27605089, 27611822, 27529603, 27736257, 27866653, 27871457, 27998150, 28012501, 27047073, 27163378, 27470643, 26269037, 26642948, 26527023, 25854785, 25728674, 26002228, 26125119, 26534309, 26071176, 26408599, 25476195, 25341357, 25256151, 26085354, 26316785, 25483446, 26240094, 26067166, 26025848, 26254206, 26105153, 25017689, 25571441, 25948351, 25415979, 25718159, 26202927, 25582722, 24791290, 24909586, 25263976, 24970231, 25118695, 24442829, 23776846, 23128690, 23452146, 24080248, 24366596, 24015926, 23437297, 23367733, 23685378, 23746172, 23285580, 23831494, 23379111, 23954579, 23176261, 23297321, 23356100, 23612942, 23252976, 23277251, 23392066, 23311822, 23160312, 23277937, 23361561, 23178779, 23212232]
2804B3212232o73327M41796J69063o8532K57017J56603l90929K77549j70000k7422
2794B3184050J64943L35493K11806l76532n37093J41827O01667k58321P8459j045646
2784B2500653K93552j68854K90602L18681k36944j66519l99732P46757N04030
2775B3682226n97663L3224j45253K60158K7930r4193N37059L22530K5825K25686
2765B4277529L98766n23938o21831l0645L89415J110471l59380K0216P05575j144526
2755B4221652L16955k69062k12251P23526J418484l93791n51836N68933J223603
2746B7046213n10306j02546N840Q86802N73003l40443q87279l23372m32518j79262
2736B5736132P94870j025082P18536L70292N77571k59859N59934N36771Q33397
$$ y = [23212232, 22538905, 22980701, 23149764, 23081232, 23338249, 23494852, 23103923, 23381472, 23211472, 23184050, 23348993, 23684486, 23896292, 23519760, 22982667, 23124494, 23726161, 23467840, 23546299, 22500653, 22794205, 22625351, 22915953, 23234634, 22997690, 22831171, 22431439, 23178196, 23682226, 23084563, 23117787, 22972534, 23232692, 23260622, 23166429, 23703488, 24026018, 24051843, 24277529, 24676295, 24152357, 23530526, 23499881, 23889296, 24999767, 24640387, 24660603, 25366178, 24221652, 24538607, 24269545, 24057294, 24780820, 26199304, 25805513, 25253677, 25822610, 27046213, 26535907, 26433361, 26439201, 27326003, 27899006, 27558563, 26671284, 26347912, 25915394, 25736132, 26531002, 25505920, 26224456, 26594748, 27172319, 26912460, 27472394, 28009165, 28842562]
2727B8842562N36426L4224l78289k4513J51801o90O92755k65230l53587N22346
2717B9757805k18070J315021M5214l8061K52600j85114J59386J65824K20785N09152
2707C1984542R71415J244319L07640L42217N46042J86296J384526R05638O73715
2698C8546350J624961J35540J543827J301701P48904J259438Q66101J316750P43795
2689D8087367L63737K31213O79024Q97462J406201J118497R86429P63242K4274
2680E4557446J167395J861593O89484J403079J485327J410284J553712K162640
2672F6290960K419897J082219J701086J328962J151265J693281J547640K879319
2664H0094629L397122L600984M713674M380871M980781N572935N514986O113954
$$ y = [28842562, 29378988, 29413212, 29034923, 29010410, 29162211, 29161521, 29854276, 29589046, 29235459, 29757805, 29539735, 30854756, 30899970, 30861909, 31114509, 30929395, 31088781, 31254605, 31475390, 31984542, 32955957, 34200276, 34507916, 34850133, 35396175, 35582471, 36966997, 37872635, 38546350, 40171311, 40306851, 41850678, 43152379, 43901283, 45160721, 46026822, 47343572, 48087367, 48451104, 48682317, 49361341, 50258803, 51665004, 52783501, 53769930, 54533172, 54557446, 55724841, 57586434, 58275918, 59678997, 61164324, 62574608, 64128320, 66290960, 68710857, 69793076, 71494162, 72823124, 73974389, 75667670, 77215310, 80094629, 83491751, 87092735, 91806409, 96187280, 101168061, 106740996, 112255982, 118369936]
2656A18369936N303973P331122O124789O360379N366225L819210K255066l22555
2648A54608145j936175k870263m527770l528622j181878K023095K641208P86120
2640A46013860m561524q060070q104401q102915q226167o863772n296142m858968
2632I1939901k792075k029795j455056r85456p781J264619J337722J848121J952003
2623I1072203M297727L294853M261392P601137J0679269J5498780J0419903l328076
2615A43797188j2278625j4001453j3678052j2653367j1363466q482736n904719
2608F5434770n047732k903183k910562j746723m58682j146072n9782J30981R0750
2599E1383765O24628J599274J641215L826820N859156O827088N566380o69694
$$ y = [118369936, 123673909, 131005031, 137129820, 143490199, 148856424, 152675634, 154930700, 154608145, 152671970, 149801707, 145273937, 141745315, 140563437, 142586532, 145227740, 146013860, 141452336, 133392266, 125287865, 117184950, 108958783, 102095011, 96798869, 91939901, 89147826, 87118031, 85662975, 84677519, 84669738, 85934357, 87272079, 89120200, 91072203, 95369930, 98664783, 102926175, 110527312, 121206581, 136705361, 147125264, 143797188, 131518563, 117517110, 103839058, 91185691, 79822225, 71339489, 65434770, 60387038, 57483855, 54573293, 52826570, 52367888, 51221816, 51162034, 51293015, 51383765, 52008393, 53607667, 55248882, 59075702, 64934858, 71761946, 77328326, 76658632]
2591G6658632n310505o457786o931190o852708n215367m434472l567698k303731
2583C5585175k002472j627900j168430j453236n25111J38528j96308j145241n73938
2574B7031067q50892n53331j049072j350696j053065k35087N1045M68408m35399
2565B2022978o78781l81867n01400P4709p44358P54635k63781j160782r43362
2556A8177991l06775n14556r3790m126j60444k53538m34461q2000R48754j108792
2546A6168263L9506n2813p36161J02158k05565k01261l50250Q11142m90257p50422
2536A4334340l14055q3162J83623m50547k36759N80597j44839k16426n03019k04292
2526A2945461m98193m46753J094862L82538k10502j96361N69540j383545k932
$$ y = [76658632, 71348127, 64890341, 57959151, 51106443, 45891076, 41456604, 37888906, 35585175, 33582703, 31954803, 30786373, 29333137, 28808026, 28946554, 28750246, 27605005, 27031067, 26180175, 25626844, 24577772, 23227076, 22174011, 21938924, 21989969, 22458377, 22022978, 21344197, 20962330, 20460930, 20535639, 19791281, 20545916, 20282135, 19121353, 18177991, 17871216, 17356660, 17262870, 17258744, 17098300, 16844762, 16410301, 16328301, 17277055, 16168263, 16207769, 16154956, 15418795, 15520953, 15315388, 15114127, 14763877, 15575019, 15084762, 14334340, 14020285, 13937123, 14120746, 13670199, 13433440, 14014037, 13869198, 13652772, 13149753, 12945461, 12447268, 12000515, 13095377, 13477915, 13267413, 13071052, 13640592, 12257047, 12254115]
2517A2254115j27954R99271k33253r43634r61853O17584J11216q08909p1324L68442
2507A1203701m76933m56684O93376M85537m77390M64677q0943p02999J06840k11756
2497A0547426k69854p08692Q59251J78270n6439r8088k66779o21089n29611J238712
2487A0273107r3729m73093L08433l60227R2174O60022o4284R4499L35363K6343
2477A0798608J60422L94053L3399J89138L74648K6078r1635p8942P00850Q17544
2467A3324163M94640Q8800K50331M80713J80062J320995O03457m06770J262227
2458A7598618J09834K56693J5172m79914Q446R12258R39799J80476j74057O7225
2448A9434550N58792k79217J00638m60579N3837N31673K5918L84059Q34207p3956
$$ y = [12254115, 12126161, 13125432, 12892179, 11948545, 10986692, 11604276, 11715492, 10906583, 10835259, 11203701, 10726768, 10270084, 10963460, 11448997, 10971607, 11436284, 11355341, 10652342, 10759182, 10547426, 10277572, 9568880, 10428131, 10606401, 10549962, 10451874, 10185095, 9564006, 9034395, 10273107, 10179378, 9706285, 10014718, 9654491, 9746665, 10406687, 10342403, 10436902, 10772265, 10798608, 10959030, 11353083, 11386482, 11575620, 11950268, 11976346, 11884711, 11805769, 12506619, 13324163, 13818803, 13907603, 14157934, 14638647, 14818709, 16139704, 16743161, 16336391, 17598618, 17708452, 17965145, 17980317, 17500403, 17508849, 18421107, 19360906, 19541382, 19367325, 19434550, 19993342, 19714125, 19814763, 19354184, 19408021, 19939694, 19965612, 20349671, 21183878, 21109922]
2438B1109922N12040J669359Q80290J467177Q94817J534540l29276l18369m58087
2429B6962413r530P76066K71152J198198Q77921j36326k59766p5373M91720k6251
2419C0070224J010568L99514l41826l1768R74563P94925O02234l25891L63342
2410C3515885P78362M72667R89577J71074J91043J052275J383675P88314J121511
2401D0464383J304931J324187K296357J861007J731233K037765R04161n06423
2393E1417601p98388k356533l313256j984075j884913j370356j097323j044829
2385C7567928Q11027J066360k62118L28522Q68751O47399J236136J064207O20628
2376D3948840J532966Q85685L51299j018816k024388q99648j582836k057880k237198
$$ y = [21109922, 21621962, 23291321, 24171611, 25638788, 26533605, 28068145, 27738869, 27420500, 26962413, 26952883, 27728949, 28000101, 29198299, 30076220, 29939894, 29680128, 29604755, 30096475, 30070224, 31080792, 31480306, 31138480, 31106712, 32081275, 32876200, 33478434, 33152543, 33515885, 34294247, 34766914, 35756491, 35927565, 36118608, 37170883, 38554558, 39342872, 40464383, 41769314, 43093501, 45389858, 47250865, 48982098, 51019863, 51924024, 51417601, 50619213, 48262680, 44949424, 42965349, 41080436, 39710080, 38612757, 37567928, 38378955, 39445315, 39183197, 39511719, 40380470, 41027869, 42264005, 43328212, 43948840, 45481806, 46367491, 46718790, 45699974, 43675586, 42775938, 41193102, 39135222, 36898024]
2367C6898024k500072j305031p41449j269601l84717k42677q35471k75380q42306
2358B8501320L64557M3419k15435o55641j069567j568270j730260j414007j707375
2349B0548741j019042j390806j129332n66952j206336p20748k66037J64082j056190
2340A3357380j049049P5626p70375m86719K50968p84734r97354j87125m03662
2331I004956m12849k542n94277q12943Q19439l63966m34611o23360k2459n96749
2321E960639r7823l36328j75911m270o10236J206390n95126j5492J10666p16105
2311D726404n22064p29452J4348R1680R3438L96672l72873p45202L49575k92118
2301C010408j99262K37968r5011m87873q847K61215J76457j64861P6591k26213
$$ y = [36898024, 34397952, 33092921, 32351472, 31081871, 30697154, 30454477, 29619006, 29343626, 28501320, 28865877, 28909296, 28693861, 28038220, 26968653, 25400383, 23670123, 22256116, 20548741, 19529699, 18138893, 17009561, 16442609, 15236273, 14515525, 14249488, 14413570, 13357380, 12308331, 12383957, 11613582, 11126863, 11377831, 10593097, 9595743, 9408618, 9004956, 8592107, 8589565, 7995288, 7182345, 8001784, 7637818, 7203207, 6579847, 6557388, 5960639, 5862816, 5526488, 5350577, 5346307, 4736071, 5942461, 5347335, 5331843, 5442509, 4726404, 4204340, 3474888, 3489236, 3580916, 3674354, 4071026, 3698153, 2952951, 3302526, 3010408, 2811146, 3049114, 2954103, 2466230, 2457383, 2718598, 2895055, 2730194, 2806785, 2580572]
2291B580572n20900K45838P27905k29255p91977N17558l94941j89085K40526o92817
2281A493424M19175K78584j037388K24393p81502k04383J13085J025548l17757
2272A213179j5546M44546n36762l23640l16682N27227k70840j50916o21514K85435
2262B34487L8593K02521m98247Q40193J90639R2136J17407n26204n6610R00684
2252A535599J62221r75631L06472j158798K16598K99819j18134P03649p66398
2243B05397N46853P8442r48603K28636j53151k01575K41663j36328j61342L0721
2233b69287l89579P73540m19327N98531p57868M56711J60427L01776k79132n77005
2223d01213J64928J69578k60432K37947m172K19739l31364J030143R3470j12782
$$ y = [2580572, 2059672, 2305510, 3033415, 2804160, 2012183, 2529741, 2134800, 1945715, 2186241, 1493424, 1912599, 2191183, 1153795, 1378188, 596686, 392303, 505388, 1530936, 1213179, 1197633, 1642179, 1105417, 781777, 465095, 992322, 721482, 570566, -50948, 234487, 273080, 475601, -22646, 817547, 1008186, 1100322, 1217729, 691525, 634915, 1535599, 1697820, 722189, 1028661, -130137, 86461, 386280, 268146, 971795, 205397, 752250, 830692, -117911, 110725, -42426, -244001, -2338, -138666, -300008, -269287, -658866, 114674, -304653, 293878, -463990, -7279, 153148, 454924, 175792, -401213, -236285, -66707, -327139, -89192, -93364, 126375, -204989, 825154, 918624, 805842]
2213H05842o72303k04742J14426j89674p1340L6241K17787k56154P38608k82392
2203B36299j52153p24545P23289M8308N35255K5323j85853J03889Q289j81102
2193D36999l43761N9320L83008j40365K71768j12338m92496o59972r748Q83158
2183B75573K03126K14265n37765r7274J62975k73728r38K49144j25287J03735
2173A73826Q415L43030n41794j81481O69999n65046l07583l76510L37827O77802
2163B38485m36507L74435j41991n83025j6540k78768K68180m33493k4885M9479
2153i84630Q06738k98558L11311M80867L052m75974m29641L18570K28041k72379
2143c12603L37372P3863m10848j00870P55367j4841o94045l07195J45176O24182
$$ y = [805842, 133539, -71203, 43223, -146451, -217791, -181550, 36237, -219917, 518691, 236299, 84146, -640399, 82890, 131198, 666453, 691776, 505923, 609812, 618101, 436999, 93238, 152558, 535566, 395201, 666969, 554631, 62135, -597837, -607585, 275573, 478699, 692964, 155199, 57925, 220900, -52828, -53766, 195378, 70091, 173826, 182241, 525271, -16523, -198004, 471995, -93051, -400634, -777144, -439317, 238485, -198022, 176413, 34422, -548603, -565143, -843911, -575731, -1009224, -1034109, -984630, -177892, -476450, -165139, 315728, 318780, -157194, -586835, -268265, -40224, -312603, 24769, 98632, -312216, -413086, 342281, 327440, -366605, -673800, -528624, 95558]
2133I5558o60255J47251N98969j053652J82346k14855N56898n88247m50287O24407
2123g61867L90725J0218P5624k25426m82677L1285L39679O43069o8463r03889
2113i51722M91581r9967J15506O93517k6955o47906o67644L50553N75861K45501
2103G8325k78715j27459l43812k37608M87105k18278J33406J043083J65610m96048
2093B05609n31426k74390P409o1127L79954n80383n53716J22636J70111M94502
2083f20821O47394O37503o85479o6501j016958N51190J29486k55530K94430m06582
2073g91868M647P54479l77214m94342M92981m6751K76208r53532R8604P83880
2063b52908M83811J2716m96919p52732j64830Q59700P0783j83122j27810o8757
$$ y = [95558, -564697, -417446, 181523, -872129, -689783, -904638, -347740, -935987, -1386274, -761867, -371142, -360924, -285300, -510726, -993403, -962118, -622439, 20630, -47833, -951722, -460141, -560108, -444602, 248915, 221960, -425946, -1093590, -743037, -167176, 78325, -200390, -327849, -671661, -909269, -422164, -640442, -507036, 536047, 701657, 205609, -325817, -600207, -592798, -653925, -273971, -854354, -1408070, -1285434, -1115323, -620821, 26573, 664076, -21403, -87904, -1104862, -553672, -424186, -679716, -385286, -791868, -787221, -32742, -409956, -904298, -411317, -458068, -181860, -1135392, -1036788, -252908, 230903, 243619, -253300, -1006032, -1170862, -311162, -240379, -423501, -551311, -620068]
2053f20068J51927n72896o618Q80880j46908j67441l31742J32553J36535l1539
2043e75317L41843J22558p70233L99291K46063k93074Q07143J18883j157118P65844
2033E883r02700P24747k67521P23690m05497k27076Q17186n25071j43237J75384
2023b4212J83875q38855J847k28918J193401k64880j04699J0679K86432q47580
2013f32910J2107R4585l3751M85504m03310k51814L34028K74362L50170n85154
2003c56183k35846O68797l64318N82252K73823J73306n83247p09603L80421L9857
1993a30741J8445R77393l32736o67657n7347k34930p22346N72741O4615l16827
1983h29390m61555K25244J113843M83709o40088J16507K55992l52941J32527K46577
$$ y = [-620068, -468141, -1041037, -1047655, -166775, -313683, -481124, -812866, -680313, -543778, -575317, -233474, -110916, -881149, -481858, -235795, -528869, 278274, 397157, -759961, 5883, -896817, -172070, -439591, 284099, -121398, -348474, 468712, -56359, -199596, -24212, 159663, -679192, -677345, -906263, 287138, 22258, -82441, -71762, 214670, -632910, -620803, -526218, -559969, -74465, -477775, -729589, -395561, -121199, 228971, -356183, -592029, 76768, -287550, 294702, 568525, 741831, 158584, -551019, -170598, -130741, -112296, 865097, 532361, -135296, -192643, -427573, -1149919, -577178, -512563, -829390, -1290945, -1065701, 48142, 531851, -108237, 8270, 264262, -88679, 43848, 290425]
1973B90425p0217j78089m41541N47751p96907M98779K05004k38451O09149p07203
1963b81300K97540m97770M33066l21467L80742r9160k40197l28401j6601M85929
1953a87619L96845l48617j61761L14366l55259n7013j20324O18179j40154k91313
1943c32670M34452L51257J91130m25064m26871l8093K17456O77204L81169o47536
1933C82434m64630l0387k17019J21684N78398J23612m53514l85898l48693L86565
1923c07448N14126q6879O25279L32682r47426k23021O96287m9575n65269k55589
1913b66833K4666K72278N51592n70006q8459m49034K74364M82675o72369O39893
1903A98767j77177m84625K34598J396637l45432r64723L70694l95202j0389N28042
$$ y = [290425, 220208, 42119, -399422, 148329, -648578, -149799, 55205, -183246, 425903, -281300, 16240, -481530, -48464, -369931, 10811, -88349, -328546, -656947, -673548, -187619, 209226, -139391, -301152, 13214, -342045, -399058, -519382, 98797, -41357, -332670, 101782, 453039, 644169, 219105, -207766, -245859, -28403, 648801, 1029970, 382434, -82196, -112583, -329602, -207918, 370480, 494092, 40578, -345320, -694013, -307448, 206678, 119799, 745078, 1077760, 130334, -92687, 603600, 554025, -11244, -266833, -242167, 30111, 581703, 11697, -76762, -525796, -251432, 231243, -441126, 198767, 21590, -463035, -228437, 1168200, 822768, -141955, 228739, -166463, -176852, 351190]
1893C51190K52984r43851J16654L31036M7378L7929k40650J60129N73199Q0252
1883G66250m80197P52950N85106j071198j28244k05061J64284J3272P6907k07892
1873B66177K62042k56992l16241J188259N19206Q4238m65642k57711O37946k4302
1863A636980J4030L75954o98482n66234J769118K72456q3786L18070p52910L97929
1853B683125L47180l6291N78873j84740K63348n71336R68446J7958l24379k10374
1843C531810L20902L54064K12011M39261J61714M04201m53421R78271J23479o59927
1833E412365K73652L97050J65261R16247m93270K05358l61334P56407M47972K08995
1823G928703L49328M31799K17691O43204J122687L12279J51081J102375l08758
$$ y = [351190, 604174, -339677, -223023, 108013, 155391, 193320, -47330, 112799, 685998, 766250, 286053, 1039003, 1624109, 552911, 424667, 219606, 383890, 397162, 474069, 266177, 528219, 271227, -45014, 1143245, 1662451, 1746689, 1281047, 1023336, 1661282, 1636980, 1651010, 2026964, 1328482, 762248, 2531366, 2803822, 2720036, 3038106, 2285196, 2683125, 3030305, 2994014, 3572887, 3388147, 3651495, 3080159, 4048605, 4066563, 3742184, 3531810, 3852712, 4206776, 4418787, 4858048, 5019762, 5423963, 4970542, 5948813, 6072292, 5412365, 5686017, 6083067, 6248328, 7164575, 6671305, 6876663, 6515329, 7271736, 7719708, 7928703, 8278031, 8709830, 8927521, 9570725, 10693412, 11005691, 11156772, 12259147, 11950389]
1814A1950389J289750J693655k05814J504368J465966J380929J396673K776326
1806B3252242L681672K872498L921935L230820K972023P392584P735329J0471086
1798F5530189J4628003K3115379L0085960J1137763k0415528l0994060k2697684
1791G0390022j5817498j1487023q246333n941612l824547l292741j741387j068591
1783A8970290k031949k063571j862993j490803k306372j86824k07960j037138
1775G782680n02142J60809n85793q91529p39969p12365K3632q4628n86397l45307
1765C518991L26526j97253l49200l64266l14936q0509M32767j49677K40924l49878
1755B713489m40801p54544M22429k05654J01692K50399n61158J75556r1386L4518
$$ y = [11950389, 13240139, 14933794, 14727980, 16232348, 17698314, 19079243, 20475916, 23252242, 26933914, 29806412, 33728347, 36959167, 39931190, 47323774, 55059103, 65530189, 80158192, 103273571, 133359531, 144497294, 124081766, 93087706, 70390022, 54572524, 43085501, 34839168, 28897556, 25073009, 21780268, 20038881, 18970290, 16938341, 14874770, 13011777, 11520974, 9214602, 9027778, 8819818, 7782680, 7280538, 7441347, 6855554, 5964025, 5224056, 4511691, 4535323, 4450695, 3864298, 3518991, 3845517, 3648264, 3299064, 2934798, 2619862, 2539353, 2972120, 2822443, 3063367, 2713489, 2272688, 1518144, 1940573, 1734919, 1836611, 2087010, 1525852, 1701408, 1610022, 1644540]
1745A644540K70094r9698m64573j23364m80418L62768M72653k33114r90958j59118
1735A98812M31684J43453j65100K80318j52769q5597k29597N15342K07859k26784
1725I17621k24985m02791n15836N74817p67019J231116p00173p36349K30058L46221
1715d7320M38407l47372Q27572p48736K69885R1750J29323K46056n18862j42090
1705A98613N83195m55651l96372N52074j52438l53209Q22591j05388r07904k40103
1695d54592l80944J018822K90513m96463M3557J37076J15184J89523M8141l21254
1685A89563o39074l08257k8113Q6935K10251N2083j39453O18479J84763o51306
1675d24129N18181n92626M1484M102K72174Q9910n02112j33921M39292l52372
$$ y = [1644540, 1914634, 1814936, 1350363, 1226999, 746581, 1109349, 1582002, 1348888, 357930, 198812, 630496, 773949, 608849, 889167, 736398, 650801, 421204, 936546, 1144405, 917621, 692636, 289845, -225991, 348826, -418193, 812923, 112750, -623599, -393541, -47320, 391087, 43715, 871287, 122551, 392436, 484186, 613509, 859565, 340703, 198613, 781808, 326157, -70215, 481859, 329421, -23788, 798803, 693415, -214489, -454592, -835536, 183286, 473799, -22664, 20893, 157969, 273153, 462676, 510817, 189563, -449511, -757768, -785881, -698946, -488695, -436612, -576065, 42414, 227177, -424129, 94052, -498574, -457090, -452988, -180814, -90904, -593016, -726937, -287645, -640017]
1665f40017k04018n26480O59175O17358n78983q34557M78007O78814j10338L32508
1655a28531p7612J63874J73643Q0455k50381m96486O81938j67855l95640M76415
1645E9820n65912q0213M68140J65265o9931p80355R28889K81937m87021K02605
1635A23224j60531j41387J09282j278353O146J62380K61227O18515k89695j95773
1625g84965P7361K87063N20769l11977J78816l99820L8463L86009j41441L44886
1615A95164m1729N49315j124266j09699j39554o0707Q25568M3987l59701Q22392
1605F00770P8824P3581j3118Q2102j42895j010374L23496L12238M97559o34705
1595A67478J34675n1515J09937N88479o59645k69252m67517K01487j19752O83697
$$ y = [-640017, -844035, -1370515, -711340, -93982, -672965, -1507522, -1029515, -350701, -461039, -128531, -206143, -42269, 131374, 211829, -38552, -535038, 146900, -20955, -416595, 59820, -506092, -586305, -118165, 47100, -22831, -803186, 125703, 407640, -79381, 123224, -37307, -178694, -69412, -1347765, -1341619, -1179239, -918012, -299497, -589192, -784965, -707604, -420541, 100228, -211749, -32933, -432753, -394290, -8281, -149722, 195164, 153435, 702750, -421516, -531215, -670769, -731476, 94092, 138079, -221622, 600770, 679594, 753175, 740057, 822159, 679264, -331110, -7614, 304624, 802183, 167478, 302153, 250638, 360575, 949054, 289409, 20157, -447360, -245873, -365625, 318072]
1585C18072n22633o32595O43929N87573o64171l42707O5860L43541L25845m94995
1575c72281M44796o47972l09089Q61693m43622r0287N03923n3962o04320P170
1565g03951L71625J06303K96213k1823o11360k24169P17420L99559o6747o85840
1555d22770n3440k7335J60607n3173L52272J33327l25558m41254K7514O99353
1545D9543k93509j25706p6194o780n20884n54723O01910Q47024l02219l18507
1535g00045l49486N69173L07938n54471M42404K0729K7110k61886m03239M87299
1525d14474J109761j598m16998n67932J88611j39424k73129M82226O00082n27722
1515C9403n94874J49600k14793M48638m45843j9412N49677r38832M57680J83174
$$ y = [318072, -204561, -837156, -193227, 394346, -269825, -612532, -546672, -203131, 122714, -372281, 72515, -575457, -884546, -22853, -466475, -556762, -52839, -106801, -711121, -703951, -332326, -226023, 70190, 48367, -562993, -787162, -69742, 329817, 263070, -422770, -476210, -503545, -342938, -396111, -43839, 89488, -236070, -677324, -649810, 49543, -243966, -369672, -445866, -452646, -973530, -1528253, -926343, -79319, -381538, -700045, -1049531, -480358, -172420, -726891, -284487, -263758, -236648, -498534, -901773, -414474, 695287, 693689, 276691, -291241, -102630, -242054, -515183, -32957, 567125, 39403, -555471, -405871, -620664, -172026, -617869, -637281, -87604, -1026436, -568756, -385582]
1505c85582j30789N16628M58664l37508O5129M81269l82810j56270k96903p9293
1495b47465L6184J86327J71812k13623j24482J62299k89427L67157k52301k94775
1485d98294j36813k99589k26220N02685N30790o3431L1932K4110J67394j712r54813
1474i23961J002767j81448j50349m70053K05941L60676l44575R8358j19271k51451
1464g73366J03419j00523M34103m63333N19612K30204q73436O37121m45426M75961
1454b55664m39272Q9428P51909k7823m19554N4309O9942k63502P89481k99483
1444D9771m80857l04166Q8838M80177p01129O55125M35104j201405K84062K05526
1434d88954k19796K29609L27717L31489k97636K58902j59594j61243r49395l47644
$$ y = [-385582, -516371, 257, 458921, 121413, 186542, 667811, 285001, 128731, -168172, -247465, -211281, -24954, 146858, -66765, -191247, -28948, -318375, 48782, -203519, -498294, -635107, -934696, -1160916, -658231, -127441, -190872, -158940, -134830, 32564, 30852, -923961, 78806, -102642, -252991, -723044, -517103, -156427, -501002, -402644, -521915, -773366, -669947, -770470, -336367, -799700, -280088, -49884, -923320, -286199, -731625, -255664, -694936, -605508, 146401, 118578, -300976, -246667, -176725, -440227, 349254, 49771, -431086, -735252, -646414, -166237, -867366, -212241, 222863, -978542, -694480, -488954, -708750, -479141, -151424, 180065, -117571, 141331, -18263, -179506, -1128901, -1476545]
1424a476545J500445j68256J81979K32850r564j70517l61817m2652K63693L72599
1414C22215m9759K92487p43089k81940Q34713J4246r58181n1150p09964O99421
1404f31001M93841L09109j83634l72770j16367k91349O73701K6483l40354O98105
1394B65764j446444N72217O60362N0935K93745p43447L1218J56275K12240l91377
1384c38512m40931J056617j79998l43887J63653J59512j4224l65273Q5338n3494
1374b71199J00086p61720K22170L51058M20631J04350m18250k66861n53206M71957
1364f00984J77984N94390K74701l30492M11181j07347l51371n24741Q2543L61949
1354a2187K16514q83165M77955k71502j17059K56875M20163r22965p3563j67010
$$ y = [-1476545, 23900, -144356, 37623, 270473, 260909, 90392, -271425, -314077, -50384, 322215, 272456, 564943, -178146, -460086, 374627, 388873, -569308, -620458, -1330422, -631001, -137160, 171949, -11685, -384455, -500822, -792171, -118470, -91987, -432341, 265764, -1180680, -608463, 51899, 102834, 396579, -346868, -315650, -159375, 52865, -338512, -779443, 277174, 97176, -246711, -83058, 76454, 62230, -303043, -217705, -271199, -171113, -932833, -710663, -359605, 61026, 165376, -252874, -519735, -1072941, -600984, -423000, 171390, 446091, 115599, 526780, 419433, 68062, -456679, -374136, -12187, 204327, -678838, -200883, -472385, -589444, -332569, 87594, -835371, -908934, -1075944]
1344a075944M51269P0857P2150l38057J24404L71238j49995L83468M2253K171
1334d6186j72843R9338J87286m47798K5204k58881L29481J140894j171764l89601
1324g04870j66712N84358J50782p82559M06404M32663J97223k77286L12431r693
1314A42741r79792P39827k13331M31560j49915n69265k8936K98756j55906p3833
1304e58094J93123L21617L43823j8950k19000q13467J21264N48527l84599q1407
1294e47163K68474J62343M99184m09709m0798J75334n33485O21334o04790n6753
1284d66029J70844P75527m42861J52308q3885j150455O52719l60778M68357M6011
1274b38242K62821N74072o98420l03183j29276J166241n7398m96526L04896O939
$$ y = [-1075944, -624675, -553818, -481668, -819725, -695321, -324083, -474078, -90610, -48357, -46186, -219029, -119691, 67595, -380203, -354999, -613880, -284399, 856495, -315269, -704870, -871582, -287224, -136442, -919001, -512597, -79934, 117289, -159997, 152434, 142741, -837051, -97224, -310555, 121005, -28910, -598175, -627111, -328355, -484261, -558094, -364971, -43354, 300469, 281519, 62519, -750948, -629684, -81157, -465756, -547163, -278689, -116346, 382838, -26871, -67669, 107665, -425820, 195514, -409276, -466029, -295185, 480342, 37481, 189789, 105904, -1044551, -391832, -752610, -284253, -238242, 24579, 598651, -99769, -402952, -532228, 634013, 576615, 80089, 384985, 391924]
1264C91924j96254M48772M62798q44034j30237K1185j19135k3244l76420j20123
1254d84768M207R40932n51745j55603K24177j99194j10345J46607J45852J95072
1244A55192M55719o6991q15604l77296K36996J62900j36105M1386O67633k66246
1234E7584L61420l22725k42475K99002j77865r7192M51714l50688l43114j59516
1224e23855K54973K5704k15531P1971l47696J02748n28054J121064O27164o95866
1214a07378M19330k68164j47743J09995P40624j040601m31256k40932K771Q07317
1204a56037M61307n47592J26613M73094j93665r35175J206545j117114M94004
1195a88020k23860P27634j50878l50445L54761j50709N83846l54447P70494q23089
$$ y = [391924, 195670, 644442, 1107240, 263206, 132969, 154154, 35019, 11775, -364645, -484768, -480561, 460371, -91374, -246977, -22800, -221994, -332339, -185732, -39880, 155192, 610911, 543920, -271684, -648980, -411984, -249084, -385189, -343803, 323830, 57584, 419004, 96279, -146196, 152806, -25059, -122251, 329463, -21225, -364339, -523855, -268882, -243178, -458709, -386738, -734434, -631686, -1159740, -38676, 588488, -107378, 311952, 43788, -103955, 6040, 746664, -293937, -725193, -966125, -963354, -156037, 305270, -242322, -115709, 357385, 163720, -771455, 435090, -682024, -188020, -411880, 315754, 164876, -185569, 169192, 18483, 602329, 247882, 1018376, 195287]
1185A95287k85200k04021Q11290L48183O5309j050359K6933j81376l03155O7146
1175e09963k9293N16412k15684l31369J98408J23427l73522M53110K06132M27193
1165D64851R7052K45159l49882p09809K23617o41699K51168j69324o2596N54493
1155i6970L04870o02154j58559M00471R8440j66145J92835L40694l42737k71154
1145c00409n11878L30302K73362P34381m37745M06188k37471n72102k82858L07932
1135b90298R0027L85581J65579o09798N71071N5082P4335l43809k06606j38738
1125b47574L34757m18125M85271m45942J03247M144J65487j46835J79750J63103
1115A77283k13986m53798R4375L13469l7816Q5011Q7903L67145l82536M98803
$$ y = [195287, -89913, -293934, 517356, 865539, 930848, -119511, -92578, -273954, -577109, -509963, -539256, -22844, -238528, -569897, -371489, -248062, -621584, -168474, 37658, 464851, 561903, 807062, 457180, -252629, -29012, -670711, -419543, -588867, -651463, -96970, 207900, -394254, -552813, -152342, -53902, -220047, -27212, 313482, -29255, -300409, -812287, -481985, -208623, 525758, 88013, 494201, 256730, -315372, -598230, -290298, -200271, 185310, 350889, -258909, 312162, 367244, 441579, 97770, -108836, -247574, 87183, -330942, 154329, -291613, -188366, -184222, -18735, -165570, 14180, 177283, -36703, -490501, -396126, -82657, -120473, -35462, 52441, 419586, 37050, 535853]
1105E35853r69704j98210Q72874k68830m97277j48018R08713m1481j6628l30975
$$ y = [535853, -433851, -632061, 240813, -28017, -525294, -673312, 235401, 193920, 177292, -153683]
$$ [...]
##END NTUPLES=NMR SPECTRUM
##END=
