##TITLE=1H_EC-3305(VI-2)
 CDCl3
 8 sc, 
 3.7.2024
##JCAMPDX= 6.0         $$ Bruker NMR JCAMP-DX V2.0
##DATA TYPE= NMR SPECTRUM
##DATA CLASS= NTUPLES
##ORIGIN= UXNMR, Bruker Analytische Messtechnik GmbH
##OWNER= root
$$ XWIN-NMR		Version 3.5
$$ Wed Jul  3 14:21:57 2024 Russian Standard Time (UT+4h)  she@DPX200
##.OBSERVE FREQUENCY= 200.1314
##.OBSERVE NUCLEUS= ^1H
##.ACQUISITION MODE= SIMULTANEOUS
##.ACQUISITION SCHEME= undefined
##.AVERAGES= 8
##.DIGITISER RES= 18
##SPECTROMETER/DATA SYSTEM= spect
##.PULSE SEQUENCE= zg30
##.SOLVENT NAME= DMSO
##.SHIFT REFERENCE= (INTERNAL, DMSO, 0, 21.4322)
##AUDIT TRAIL= $$ (NUMBER, WHEN, WHO, WHERE, WHAT)
$$ ##TITLE= Audit trail, XWIN-NMR		Version 3.5
$$ ##JCAMPDX= 5.01
$$ ##ORIGIN= Bruker BioSpin GmbH
$$ ##OWNER= she
$$ F:/spectra/data/she/nmr/H-F/1/pdata/1/auditp.txt
$$ ##AUDIT TRAIL=  $$ (NUMBER, WHEN, WHO, WHERE, WHAT)
(   1,<2024-07-03 14:20:43.26 +0400>,<she>,<DPX200>,
      <created by zg, POWCHK disabled, PULCHK disabled
       configuration hash MD5:
       00 E9 B6 7A A2 85 ED C7 34 08 36 98 17 FE 4E 26
       data hash MD5: 16K
       B8 8A 7B 79 96 82 F7 D7 9B A4 98 B2 5A 6C 95 31>)
(   2,<2024-07-03 14:20:53.98 +0400>,<she>,<DPX200>,
      <Start of raw data processing
       efp BC_mod = 2 LB = 0.24 FT_mod = 6 PKNL = 1 PHC0 = -25498.68 PHC1 = 11.18748 SI = 16K 
       data hash MD5: 16K
       A2 77 37 70 A6 7D FA A5 AD F2 07 98 73 DB 42 6D>)
(   3,<2024-07-03 14:21:10.50 +0400>,<she>,<DPX200>,
      <pk PHC0 = -3.491187 PHC1 = 4.8 
       data hash MD5: 16K
       45 BA 48 F4 F4 31 3C 49 47 92 C7 C1 5E 08 9F D6>)
(   4,<2024-07-03 14:21:14.35 +0400>,<she>,<DPX200>,
      <abs ABSG = 5 
       data hash MD5: 16K
       40 A2 60 DA F2 8B F5 BB 16 1D 71 14 CD EA E8 66>)
$$ ##END=
$$ 
$$ hash MD5
$$ 3D 84 1C B2 5B 66 53 FF 0C 4A 7C E9 C3 E1 2D D2
##$RELAX= 
##$RELAX= 
##$RELAX= 
##$RELAX= 
##$RELAX= 
##$RELAX= 
$$ Bruker specific parameters
$$ --------------------------
##$DU= <F:/spectra>
##$EXPNO= 1
##$NAME= <H-F>
##$PROCNO= 1
##$TYPE= <nmr>
##$USER= <she>
##$AMP= (0..31)
100 100 100 100 100 100 100 100 100 100 100 100 100 100 100 100 100 100 
100 100 100 100 100 100 100 100 100 100 100 100 100 100 
##$AQSEQ= 0
##$AQ_mod= 1
##$AUNM= <au_zg>
##$AUTOPOS= <>
##$BF1= 200.13
##$BF2= 200.13
##$BF3= 200.13
##$BF4= 200.13
##$BF5= 200.13
##$BF6= 200.13
##$BF7= 200.13
##$BF8= 200.13
##$BYTORDA= 1
##$CFDGTYP= 0
##$CFRGTYP= 5
##$CHEMSTR= <none>
##$CNST= (0..31)
1 1 145 1 1 1 1 1 1 1 1 1 1 1 1 1 1 1 1 1 1 1 1 1 1 1 1 1 1 1 1 1 
##$CPDPRG= <>
##$CPDPRG1= <>
##$CPDPRG2= <>
##$CPDPRG3= <>
##$CPDPRG4= <mlev>
##$CPDPRG5= <mlev>
##$CPDPRG6= <mlev>
##$CPDPRG7= <mlev>
##$CPDPRG8= <mlev>
##$CPDPRGB= <>
##$CPDPRGT= <>
##$D= (0..31)
0 1.2 0 0 0 0 0 0 0 0.06 0 0.03 0 0 0 0 0.0002 0 0 0 0 0 0 0 0 0 0 0 0 
0 0 0 
##$DATE= 1720002042
##$DBL= (0..7)
120 120 120 120 120 120 120 120 
##$DBP= (0..7)
150 150 150 150 150 150 150 150 
##$DBP07= 0
##$DBPNAM0= <>
##$DBPNAM1= <>
##$DBPNAM2= <>
##$DBPNAM3= <>
##$DBPNAM4= <>
$$ [...]
##$SUBNAM3= <"">
##$SUBNAM4= <"">
##$SUBNAM5= <"">
##$SUBNAM6= <"">
##$SUBNAM7= <"">
##$SUBNAM8= <"">
##$SUBNAM9= <"">
##$SW= 24.0689651099613
##$SWIBOX= (0..15)
0 0 2 0 0 0 0 0 0 0 0 0 0 0 0 0 
##$SW_h= 4816.95568400771
##$TD= 16384
##$TD0= 1
##$TE= 0
##$TE2= 300
##$TE3= 300
##$TEG= 300
##$TL= (0..7)
0 120 120 120 120 120 120 120 
##$TP= (0..7)
150 150 150 150 150 150 150 150 
##$TP07= 0
##$TPNAME0= <>
##$TPNAME1= <>
##$TPNAME2= <>
##$TPNAME3= <>
##$TPNAME4= <>
##$TPNAME5= <>
##$TPNAME6= <>
##$TPNAME7= <>
##$TPOAL= (0..7)
0.5 0.5 0.5 0.5 0.5 0.5 0.5 0.5 
##$TPOFFS= (0..7)
0 0 0 0 0 0 0 0 
##$TUNHIN= 0
##$TUNHOUT= 0
##$TUNXOUT= 0
##$USERA1= <user>
##$USERA2= <user>
##$USERA3= <user>
##$USERA4= <user>
##$USERA5= <user>
##$V9= 5
##$VALIST= <valist>
##$VCLIST= <CCCCCCCCCCCCCCC>
##$VD= 0
##$VDLIST= <DDDDDDDDDDDDDDD>
##$VPLIST= <PPPPPPPPPPPPPPP>
##$VTLIST= <TTTTTTTTTTTTTTT>
##$WBST= 1024
##$WBSW= 4
##$XGAIN= (0..3)
0 0 0 0 
##$XL= 0
##$YL= 0
##$YMAX_a= 425067
##$YMIN_a= -565673
##$ZGOPTNS= <>
##$ZL1= 120
##$ZL2= 120
##$ZL3= 120
##$ZL4= 120
##$ABSF1= 20.87447
##$ABSF2= -3.194708
##$ABSG= 5
##$ABSL= 3
##$ALPHA= 0
##$AQORDER= 0
##$ASSFAC= 0
##$ASSFACI= 0
##$ASSFACX= 0
##$ASSWID= 0
##$AUNMP= <proc_1d>
##$AZFE= 0.1
##$AZFW= 0.1
##$BCFW= 0
##$BC_mod= 2
##$BYTORDP= 0
##$COROFFS= 0
##$CY= -3
##$DATMOD= 1
##$DC= 0
##$DFILT= <>
##$DTYPP= 0
##$F1P= 0
##$F2P= 0
##$FCOR= 1
##$FTSIZE= 16384
##$FT_mod= 6
##$GAMMA= 0
##$GB= 0
##$INTBC= 1
##$INTSCL= 3.70164e-10
##$ISEN= 128
##$LB= 0.24
##$LEV0= 0
##$LPBIN= 0
##$MAXI= 10000
##$MC2= 0
##$MEAN= 0
##$ME_mod= 0
##$MI= 1.114404
##$NCOEF= 0
##$NC_proc= -7
##$NLEV= 6
##$NOISF1= 3.799351
##$NOISF2= 2.8
##$NSP= 0
##$NTH_PI= 0
##$NZP= 0
##$OFFSET= 21.43222
##$PC= 1
##$PHC0= -25502.17
##$PHC1= 15.98748
##$PH_mod= 1
##$PKNL= yes
##$PPARMOD= 0
##$PSCAL= 0
##$PSIGN= 0
##$REVERSE= no
##$SF= 200.129519259476
##$SI= 16384
##$SIGF1= 3
##$SIGF2= 2
##$SINO= 5.538805
##$SIOLD= 16384
##$SREGLST= <1H.CDCl3>
##$SSB= 0
##$STSI= 16384
##$STSR= 0
##$SW_p= 4816.95568400771
##$SYMM= 0
##$S_DEV= 0
##$TDeff= 16384
##$TDoff= 0
##$TI= <>
##$TILT= no
##$TM1= 0
##$TM2= 0
##$TOPLEV= 0
##$USERP1= <user>
##$USERP2= <user>
##$USERP3= <user>
##$USERP4= <user>
##$USERP5= <user>
##$WDW= 1
##$XDIM= 16384
##$YMAX_p= 456776957
##$YMIN_p= -2748707
$$ End of Bruker specific parameters
$$ ---------------------------------
##NTUPLES= NMR SPECTRUM
##VAR_NAME=  FREQUENCY,     SPECTRUM/REAL,   SPECTRUM/IMAG
##SYMBOL=    X,             R,               I
##VAR_TYPE=  INDEPENDENT,   DEPENDENT,       DEPENDENT
##VAR_FORM=  AFFN,          ASDF,            ASDF
##VAR_DIM=   16384,         16384,           16384
##UNITS=     HZ,            ARBITRARY UNITS, ARBITRARY UNITS
##FACTOR=    0.29402158847633, 1,            1
##FIRST=     4289.21997711965, 0,            0
##LAST=      -527.735706888061, 0,           0
##MIN=       -527.735706888061, -2748707,    0
##MAX=       4289.21997711965, 456776957,    0
$$ Real data points
##PAGE= N=1
##DATA TABLE= (X++(R..R)), XYDATA
$$ [...]
6642H2794930j859657j07342K054896M199265O293511Q237572R679969J0695555
6634A21988699J0939989Q137537J859721l675002q289144q786979q046857o940577
6626A07187387n153506l494356j939961j264330l396554n468276p022665q029371
6618G1418368p457750n663147m165291l074889j695452j277193j003370J7991
6610D7099267P72791Q11725J624165K671201L220416M031148M434766L958494
6602F8623973L110036L849997M301454M394665L157604J251694p94592k703572
6594H5191259l340540l038560j380870m27993r57948k898822n663350p501646
6586E9981530q009962p529622o064205m524563l070139k601794k071885j720975
$$ plain form
6642 82794930 80935273 80827931 82882827 87082092 93375603 101613175 111293144 121988699
6634 121988699 132928688 141066225 142925946 139250944 130961800 122174821 114127964 107187387
6626 107187387 102033881 98539525 96599564 95335234 91938680 86470404 79447739 71418368
6618 71418368 63960618 58297471 54132180 51057291 49361839 48084646 47081276 47099267
6610 47099267 47872058 48683783 50307948 52979149 56199565 60230713 64665479 68623973
6602 68623973 71734009 75584006 79885460 84280125 87437729 88689423 87894831 85191259
6594 85191259 81850719 78812159 77431289 77003296 76045348 73146526 67483176 59981530
6586 59981530 51971568 44441946 38377741 33853178 30783039 28181245 26109360 24388385
6578B4388385j083048r93654j010185n06761l24060o50312l21955m400l15146
6569A9178864n73304o92447l92700J33009m62657n42809l29173l41896m91994
6560A5484893n43599m83094q04566m44329l67362l90976j28652n56046j10565
6551A1655704m11423j06670j40936l67048K03844p7599j4622J10883l06429R2267
6541A0637971k52228p0283L29745o3019j44524K40993j4470J02190j40550n3289
6531A0572536L1382J29850r5219J08820P5225J89049j31003M676M64114j6348
6521A1333082l0484l6330J05447M05307J08255K51868K01720M8405N53350K10914
6511A3151534L25655K25731J83293K87104L34646M99342K3109J31176O07771J72916
$$ plain form
6578 24388385 23305337 22311683 21301498 20794737 20470677 19820365 19498410 19494010 19178864
6569 19178864 18605560 17913113 17520413 17653422 17190765 16647956 16318783 15976887 15484893
6560 15484893 14941294 14458200 13653634 13209305 12841943 12450967 12322315 11766269 11655704
6551 11655704 11244281 11137611 10996675 10629627 10833471 10755872 10741250 10852133 10545704 10637971
6541 10637971 10385743 10315460 10645205 10582186 10437662 10678655 10664185 10766375 10625825 10572536
6531 10572536 10603918 10733768 10638549 10747369 10822594 11011643 10880640 10885316 11349430 11333082
6521 11333082 11302598 11266268 11371715 11777022 11885277 12137145 12338865 12387270 12940620 13151534
6511 13151534 13477189 13702920 13886213 14173317 14507963 15007305 15030414 15161590 15769361 15942277
6501A5942277J99881P98006L84482O11387P38037J074494J053284J130413R93446
6492B2925707J351755K023550J309692Q20131l65895n08623j35901K32656O67581
6483B8320653J452756J224203J100935N45621L3379K37555O46591J049618J706139
6474C6317450K120729L266114M683163M915104K956374m75988l223541k664467
6466D7894938j225774P37126K878584M206698L843714K260472o22025l108398
6458E6865335l674827l301317l064724k331950p74190P5450Q78232J158384Q02861
6449D6633254k1178n07989k80884M55680J054525K354951M093540M933411N601218
6440F4316528M896561K395459k01127k910276m149752l083260q27972J642127
$$ plain form
6501 15942277 16142158 16940164 17324646 17936033 18674070 19748564 20801848 21932261 22925707
6492 22925707 24277462 26301012 27610704 28430835 28064940 27556317 27420416 27653072 28320653
6483 28320653 29773409 30997612 32098547 32644168 32677547 32915102 33561693 34611311 36317450
6474 36317450 38438179 41704293 46387456 51302560 54258934 53782946 50559405 47894938
6466 47894938 46669164 47406290 50284874 54491572 58335286 60595758 59973733 56865335
6458 56865335 53190508 49889191 46824467 44492517 43718327 43793777 44672009 45830393 46633254
6449 46633254 46612076 46104087 45823203 46278883 47333408 49688359 53781899 58715310 64316528
6440 64316528 69213089 71608548 71407421 68497145 64347393 61264133 60436161 62078288
6432F2078288K954794K214180J51841k012104n108809o494541n809695m488635
6424D3485319l296354k018903k062890j405824m42031o33623r17234o17584o28191
6415C1462685L8225O96199J335168J795002J771089K680413K163555N16854k464327
6406C9994863l795166l298776j719556l15549R44724J848008Q21615p35550l129241
6397C0615372l797784l045387k211604j714138j443905j552720j279378n52058
6389A5018398q21803k11240l72518j59162K71691M60429J73762l6662j31619n91610
6379A3599666o63006q26776p78217q65636j69953k9902k67252q6260l14937l94552
6369I203175l75342n87930m67007m06837l38021m6112k95085l23710q9669n6603
$$ plain form
6432 62078288 65033082 67247262 67399103 65386999 60278190 53783649 47973954 43485319
6424 43485319 40188965 38170062 36107172 34701348 34259317 33625694 32708460 32090876 31462685
6415 31462685 31500910 32197109 33532277 35327279 37098368 39778781 41942336 42459190 39994863
6406 39994863 36199697 32900921 31181365 30865816 31810540 33658548 34480163 33744613 30615372
6397 30615372 26817588 23772201 21560597 19846459 18402554 16849834 15570456 15018398
6389 15018398 14196595 13985355 13612837 13453675 13725366 14185795 14359557 14322895 14191276 13599666
6379 13599666 12936660 12109884 11331667 10466031 10296078 10266176 9998924 9912664 9597727 9203175
6369 9203175 8827833 8239903 7772896 7366059 7028038 6981926 6686841 6363131 6273462 6216859
6359F216859L3581l35098j88264K1654j59471j78305j32423o3593p5003k16124
6349D923813J29782K12471j85396j8828O3716j08874n69631l47455j81059K271
6339C920810k59379j55854j00129j83796k4771J09518j7805j14692N6399j54641
6329C075660j92512J32935l2166k037l9492K2292J24528k81733r6634r1715p8572
6318B540554j97682j2719J85970O3168J30126l27211j51332n1616l0185J4050
6308B163123k7512O5767l1944L35685l03724k76921o347j19234k16613j63662
6298A418618M24304j69799p5030K62966P8588J81095p4496j31456J45249j14155
6288A945884N4229m8064P6857J75985l4751p2601j05232J00301J00508J14762
$$ plain form
6359 6216859 6250440 5915342 5727078 5748732 5589261 5410956 5278533 5214940 5139937 4923813
6349 4923813 5053595 5266066 5080670 5061842 5125558 5016684 4447053 4099598 3918539 3920810
6339 3920810 3661431 3505577 3405448 3221652 3196881 3306399 3288594 3173902 3230301 3075660
6329 3075660 2883148 3016083 2983917 2981880 2942388 2964680 3089208 2807475 2710841 2619126 2540554
6318 2540554 2342872 2330153 2516123 2579291 2709417 2382206 2230874 2179258 2149073 2163123
6308 2163123 2135611 2201378 2169434 2505119 2201395 1924474 1918127 1798893 1582280 1418618
6298 1418618 1842922 1673123 1598093 1861059 1939647 2120742 2046246 1914790 2060039 1945884
6288 1945884 2000113 1952049 2028906 2204891 2170140 2097539 1992307 2092608 2193116 2307878
6278B307878m3845K4900k29630L68757J61341j83117M386M53061L25798k01479
6268B988050l9363K9844K28567j2677L50346K41402L85104k05392j78353N24420
6258D311948l72148J11836l9424k64587K05817R2535J42963l27768j53386O51431
6248D359217L00844j45556L02563l38701L80962L10742k32812n8417r4570p4058
6238D710214L85056k93510J9814K67860J87683J3094K45026K42223J05208j65379
6228E717289j43423k61560m55667l8770r742k36725M1121K31094n3752J44513
6218D934378Q1374K98827K85986O4975p600Q0947l76461l07588j01869k47191
6208D705778l69956l64436j71010N3217J32303k8046m34200r8293k71642P534
$$ plain form
6278 2307878 2264033 2288933 2059303 2428060 2589401 2406284 2410670 2863731 3189529 2988050
6268 2988050 2948687 2978531 3207098 3194421 3544767 3786169 4171273 3965881 3787528 4311948
6258 4311948 3939800 4051636 4012212 3747625 3953442 4045977 4188940 3861172 3707786 4359217
6248 4359217 4660061 4514505 4817068 4478367 4859329 5170071 4937259 4878842 4784272 4710214
6238 4710214 5095270 4801760 4821574 5089434 5277117 5290211 5535237 5777460 5882668 5717289
6228 5717289 5573866 5312306 4856639 4817869 4808127 4571402 4612523 4843617 4789865 4934378
6218 4934378 5015752 5314579 5600565 5665540 5657940 5738887 5362426 5054838 4952969 4705778
6208 4705778 4335822 3971386 3800376 3853593 3985896 3957850 3523650 3425357 3153715 3161249
6198C161249o5879j62080J46180l59331J8030J77583K89917j21148K37943k38565
6188C083899m51100O17680L9065o4645J00096J59618J8015J86005j45239k5718
6178C517676J2205K63375Q5342L16815L74178M32542K85658J66411J84574L547
6168E642323n753m993o39425J68805j46824l2215J8354o887L6455l47725k24855
6157D457260j13159k7447j06358K27427J10578j91135p9412l51029k01469K18976
6147C944232J66592j83910j6078L98949L81425k12921K14877M23045l9098k58427
6137D818686k087j41409j50340K23222l3853j69683r9475J4650l46938m22570
6127C690203n4671j48961k18540o6272j45317J22812j41895l54247o3061l2768
$$ plain form
6198 3161249 3095370 2933290 3079470 2720139 2738169 2915752 3205669 3084521 3322464 3083899
6188 3083899 2632799 3250479 3289544 3224899 3324995 3484613 3502628 3688633 3543394 3517676
6178 3517676 3529881 3793256 3878598 4195413 4569591 5002133 5287791 5454202 5638776 5642323
6168 5642323 5636570 5631577 4992152 5160957 5014133 4981918 5000272 4993385 5029840 4682115 4457260
6157 4457260 4344101 4316654 4210296 4437723 4548301 4357166 4277754 3926725 3725256 3944232
6147 3944232 4110824 3926914 3910836 4309785 4691210 4478289 4693166 5116211 5077113 4818686
6137 4818686 4816599 4675190 4524850 4748072 4714219 4544536 4445061 4459711 4112773 3690203
6127 3690203 3635532 3486571 3268031 3201759 3056442 3179254 3037359 2683112 2620051 2587283
6117B587283k42819j46026J8461j0077q7530N0977K5722K857J20405p4265L34677
6106B579665K2370j12090R6550k76971j04297j42213J19098j43556j08698r1980
6096A837878k01510j28707k1338J42055o884j09498k25444l6513R4661l71445
6086I73255l05608Q156J74925r310j18124k41243J39031j90130L39677P8056r0699
6075G57986j10352o203Q081J45204Q5384J7595m14602n656J35916K24723N0325
6064H88401k4943P4215j49215K4390L58563m2433l79409m24k11047M08244K52957
6053A199299l5553k81790J23380j3335j67276k62309L0874J34791k19906L00999
6043H09174k74985o8760K8124L01593j20530l5043O4075l97486p6737L08819K01645
$$ plain form
6117 2587283 2344464 2198438 2216899 2206822 2119292 2170269 2195991 2198848 2319253 2244988 2579665
6106 2579665 2602035 2489945 2586495 2309524 2205227 2063014 2182112 2038556 1929858 1837878
6096 1837878 1636368 1507661 1486323 1628378 1621494 1511996 1286552 1250039 1344700 973255
6086 973255 667647 675803 850728 841418 723294 482051 621082 430952 770629 848685 757986
6075 757986 647634 641431 649512 794716 880100 897695 483093 477437 613353 838076 888401
6064 888401 863458 937673 788458 812848 1171411 1128978 749569 749145 538098 946342 1199299
6053 1199299 1163746 881956 1005336 992001 824725 562416 593290 728081 508175 809174
6043 809174 534189 465429 493553 795146 674616 639573 703648 306162 229425 538244 739889
6032G39889m9492l7084L2340k17678M8251J58303l38287K79201j28405j56580
6022C30458L66775l01321r1214L3969j56943N72973J76614j24654L5750q9293
6012G53114M9734M8361k58814j05569O9225j2588l1022Q9215K361K4747J02902
6001G31666K2587o2562j97531K39704J0066K74002K45612r7774Q6350k70814J67120
5990A148426K3549Q531K4883k93579K27999K34954o4572k25262j30126K94785
5980A249588k2581L01207r2868o3948R9474J2932K95019L20423n05311K15529
5970A809464J32532j45771L91574O07777J89276K70041K03654M14236K54692q7379
5960D040096J85711O2879k34209M9902N06624j74847k03319P3004j85015k40616
$$ plain form
6032 739889 690397 653313 685653 467975 516226 674529 336242 615443 487038 330458
6022 330458 697233 395912 304698 338667 181724 754697 931311 806657 842407 753114
6012 753114 802848 851209 592395 486826 556051 543463 512441 601656 604017 628764 731666
6001 731666 754253 691691 494160 733864 743930 1017932 1263544 1165770 1252120 981306 1148426
5990 1148426 1171975 1180506 1205389 911810 1139809 1374763 1310191 1084929 954803 1249588
5980 1249588 1227007 1528214 1435346 1371398 1470872 1483804 1778823 2099246 1593935 1809464
5970 1809464 1941996 1796225 2187799 2795576 2984852 3254893 3458547 3872783 4127475 4040096
5960 4040096 4225807 4288686 4054477 4104379 4611003 4436156 4232837 4305841 4120826 3880210
5950C880210M2230k68575j23691o8354l63199l03553r6437O194m1682j25879r155
5939B528109K71706K64657j66653M4326j62267M28832L01164K86965L25962Q1130
5929D203931K24714J94824O6158l39214j78813J15542j90148n9493K05306p3350
5919D169457P9620l70233j53690k7271k44413n38647k73891M9077j16525Q4073
5909B657557l99454n7889l10025m8386k19074j64757P9151K95142J26354k66437
5899A692182K55625j30922j90245J98318J48257k10188k81652J47044K78100J26826
5889B033345k70758K42392k13088l05459J35369J8513m8939J34833K68474P7392
5879B072074K10003j49741P6418N8519m2287j78829K87610q2912J04381K9894
$$ plain form
5950 3880210 3922440 3653865 3530174 3461820 3098621 2795068 2698631 2704825 2663143 2537264 2528109
5939 2528109 2799815 3064472 2897819 2942145 2779878 3208710 3509874 3796839 4122801 4203931
5929 4203931 4428645 4623469 4689627 4350413 4171600 4287142 4096994 4037501 4242807 4169457
5919 4169457 4249077 3878844 3725154 3697883 3453470 2914823 2640932 2690009 2573484 2657557
5909 2657557 2258103 2200214 1890189 1841803 1622729 1457972 1537123 1832265 1958619 1692182
5899 1692182 1947807 1816885 1626640 1824958 1973215 1763027 1481375 1628419 1906519 2033345
5889 2033345 1762587 2004979 1791891 1486432 1621801 1640314 1591375 1726208 1994682 2072074
5879 2072074 2282077 2132336 2208754 2267273 2224986 2046157 2333767 2250855 2355236 2385130
5869B385130J36532j3533J95348k25232j12180J9122m34929j54904M32259j2375
5859B215238j29171M4225J4984k35835K07156N4329l38317M3269m6732o510L96666
5848B219302m1642K3367j74424k15402K33291J24927j08850j92468M04546o7524
5838B205123J50143j95204N3804m7970l45798K94877J29815k40087L0483m9034
5828A986152j63156j38145J88634o4261j5673q0467j96818j00650j02714K50749
5818A563651J20065m9266j36975P3999J10964J25726j17430n5988J43040p2404
5808A705382o9833L58K23804r553r7787q2911J73601O377j15643N1006K43126
5797B027927m42588q9841K08733j36450O8554k0041R1155L5932k33941K82543
$$ plain form
5869 2385130 2521662 2508129 2703477 2478245 2366065 2385187 1950258 1795354 2227613 2215238
5859 2215238 2086067 2130292 2145276 1909441 2116597 2170926 1832609 1875878 1829146 1822636 2219302
5848 2219302 2177660 2201027 2026603 1811201 2044492 2169419 2060569 1868101 2272647 2205123
5838 2205123 2355266 2160062 2213866 2165896 1820098 2114975 2244790 2004703 2035186 1986152
5828 1986152 1822996 1684851 1873485 1809224 1793551 1713084 1516266 1415616 1312902 1563651
5818 1563651 1683716 1634450 1497475 1571474 1682438 1808164 1690734 1634746 1777786 1705382
5808 1705382 1635549 1635907 1859711 1850158 1752371 1669460 1843061 1849438 1733795 1784801 2027927
5797 2027927 1585339 1495498 1704231 1567781 1636335 1616294 1707449 1743381 1509440 1791983
5787A791983M162k19180k41132L2984J09836m5852k6905j27596j01528K21635
5777A398407m1546K0029k7090J03902J64353Q2297j26239m24851o0574j48341
5767I40347J09145j79436p6694M80995l1947j05667r6388r046j99178k18996K63845
5756H76980J7814k57116J79480J64210j63332k49077P7980N7099j90352J49088
5746F62774J45631n5940m3619j21625l66965J42815M98932l50037K31006K53527
5736I96499k87878k93536O3880J18579m848J8807K7486j58524l3359M12927r794
5725H50239K4701n1782j5467o4800K67064j80341J86616q8829j5412J67244J6377
5714A095610K4650r0418j01601k35991R9455J72365j32622J87000Q1546L19361
$$ plain form
5787 1791983 1796145 1576965 1335833 1368817 1478653 1432801 1405896 1278300 1176772 1398407
5777 1398407 1356861 1376890 1349800 1453702 1618055 1700352 1574113 1149262 1088688 940347
5767 940347 1049492 870056 793362 1274357 1242410 1136743 1040355 1031309 832131 613135 876980
5756 876980 894794 637678 817158 981368 818036 568959 646939 704038 513686 662774
5746 662774 808405 752465 708846 587221 220256 363071 862003 511966 742972 996499
5736 996499 708621 415085 478965 597544 592696 611503 638989 480465 447106 860033 850239
5725 850239 874940 823158 807691 742891 1009955 829614 1016230 927401 911989 1079233 1095610
5714 1095610 1120260 1029842 928241 692250 791705 964070 831448 1018448 1099994 1419355
5704A419355k86020j34685q9218j17627M60956k12130k8776n7623o5999K56091
5694A144324p9047J18551Q0074o3846K6005L7679M9076n1106J76138J12087p79
5683A549156M2069o985m4277L06279l8902J42509j87859j09866r560j15749N6463
5672A583278n0869j87602j07132N79844k20009k50989n6500p1120K43421j39064
5662A323258J90055K19746k53037q3975j88520J79990L12789L82191L5622n9832
5652B058287q9144M48180k75980J582Q3073K11236N2485j18097K46768K83290
5642B901680k06118k9743j10041L19168M96354l43886j34652l18441K11783k79906
5632B506198J80417J41091K1814P9687P3464j46999N61526R1956P9825j34526
$$ plain form
5704 1419355 1133335 998650 909432 791805 1252761 1040631 1011855 954232 888233 1144324
5694 1144324 1065277 1183828 1263902 1200056 1226061 1263740 1312816 1261710 1437848 1549935 1549156
5683 1549156 1591225 1584240 1539963 1846242 1807340 1949849 1761990 1652124 1642564 1526815 1583278
5672 1583278 1532409 1344807 1237675 1817519 1597510 1346521 1290021 1218901 1462322 1323258
5662 1323258 1513313 1733059 1480022 1396047 1207527 1387517 1700306 2082497 2118119 2058287
5652 2058287 1969143 2417323 2141343 2142925 2225998 2437234 2489719 2371622 2618390 2901680
5642 2901680 2695562 2665819 2555778 2874946 3371300 3027414 2892762 2574321 2786104 2506198
5632 2506198 2686615 2827706 2849520 2929207 3002671 2855672 3417198 3509154 3588979 3454453
5622C454453R5261Q8194q6198R8075k0031o7533j56498M0034o5826K96200o4980
5611C611151k18140j04844k4072K54432m3275Q5253l94326N9344J09086k86464
5601C048145P6221j2487Q8373k18318m6370j24234R069K75613r9908k80620j29437
5590B586047l643j961n257P9278o8143l76668m52779N05181l8855j62127j81715
5579A879358l27340J73788k09249k77298K65349j19346j68685j98686P7278J1872
5569A107041j78508K80334l27390k14674J44027Q5643j81852j11157J24399R6720
5559H24583j34678j36237J87041j19074R9385O2729o2133k47248k02595J9501
5549B91274J91126K76098n8004j76191k95613J15333k12818j19897L10020q8581
$$ plain form
5622 3454453 3549714 3637908 3551710 3649785 3629754 3562221 3405723 3445757 3379931 3676131 3611151
5611 3611151 3393011 3288167 3264095 3518527 3475252 3560505 3166179 3225523 3334609 3048145
5601 3048145 3124366 3111879 3200252 2981934 2935564 2811330 2820399 3096012 2996104 2715484 2586047
5590 2586047 2582404 2580443 2575186 2654464 2586321 2209653 1756874 2262055 2223200 2061073 1879358
5579 1879358 1552018 1725806 1516557 1239259 1504608 1385262 1216577 1017891 1095169 1107041
5569 1107041 928533 1208867 881477 666803 810830 896473 714621 603464 727863 824583
5559 824583 689905 553668 740709 621635 721020 783749 721616 474368 271773 291274
5549 291274 482400 758498 700494 524303 228690 344023 131205 11308 321328 232747
5539B32747J91447k20864K5279K14083j81779j73636n3131N0309N0916j58395
5529b3024l06135K70211M59266L8020k79058j53528J05563J1740j7108L2009L9212
5518A77168M7149O3274J18969j77752k18562j20697J96089j23410M32532J76581
5508E71341k10682j41123R9237m37434j32335J16665n181J41241J94842l27857
5498a31286K60532p9306r9530N1643p8190R8619j41189J62008L13088l28606j13219
5487h5436J04644K27503k22665L77755J20098k05374k80366n4075J84586J0274
5477A76944K8089k59205K08414k614R9194k07033L23792J01874j18015j91936
5467A59504Q7600k21659j8008J01041K62344n7108l30878J99515j20242k10506
$$ plain form
5539 232747 424194 203330 228609 442692 260913 87277 34146 84455 135371 -23024
5529 -23024 -329159 -58948 400318 438338 159280 5752 111315 123055 105947 137956 177168
5518 177168 224317 287591 406560 228808 10246 -110451 85638 -37772 394760 571341
5508 571341 360659 219536 318773 -118661 -250996 -134331 -139512 1729 196571 -131286
5498 -131286 129246 49940 -49590 2053 -76137 22482 -118707 43301 356389 27783 -85436
5487 -85436 19208 246711 24046 401801 521899 316525 36159 -17916 166670 176944
5477 176944 205033 -54172 154242 151628 250822 43789 367581 469455 351440 159504
5467 159504 247104 25445 7437 108478 370822 313714 -17164 182351 62109 -148397
5457a48397J32482J30327L35646j62717n7438K9590K22025k25762q118K4315K4075
5446B96028j41111J86926J5600j86410J52788J49430j58887j74847j33322K36725
5436B42920J54231l335j74741j27162L0585m9565J02870o5636o6841r2003J26311
5425G7634J36644J56018l37741M69527j90310j67148J2871j52351K24529j14293
5415A15380Q260R9208m6974k40482P8260K65748j22165K4994p8461l1973m7297
5404B4498j45664J55356p5026P472O6475j32168M2907J99648J55124j3069k173
5393B83380J59448l6980j56694j74712m3280j1549J53526N6775k2627n1616j68170
5382a2499Q5123N7920K22887R0353k11416m9519J21972J29587J72050k18523j89499
$$ plain form
5457 -148397 -15915 114412 450058 287341 229903 259493 481518 255756 247638 271953 296028
5446 296028 154917 341843 357443 171033 323821 473251 314364 139517 6195 242920
5436 242920 397151 393816 219075 91913 122498 72933 175803 110167 43326 -48677 77634
5425 77634 214278 370296 32555 502082 311772 144624 157495 5144 229673 115380
5415 115380 123640 222848 175874 -64608 13652 279400 157235 182229 103768 71795 24498
5404 24498 -121166 34190 -40836 -33364 33111 -99057 -56150 143498 298622 285553 283380
5393 283380 442828 405848 249154 74442 31162 19613 173139 229914 207287 155671 -12499
5382 -12499 72624 130544 353431 443784 232368 182849 304821 434408 606458 387935 198436
5371A98436J25723J03642J46554k37709N8316O7130j69930n6035Q0854k45945
5361G1036O9373O9845o4448M0918K8096j31333J30069J75451P8715k64748m08492
5350b05518P6382L88187o5335r359l2376j47603K01837J13650k35210p5355M5122
5339E4422J73607K92866k73741J90628K17439j02446j2649k89059R3184J86948
5329E31199j20659K23618m33985k0951p5708K61077J08496Q0245J541j56800l14308
5318H3765J72229J23567J73963K15272k97892J67714k7679p7537p617K08182j08659
5307F25308L08821j46540K01599j71993n9972J65014J49358K07268j51820J63491
5297A290534P8443L0208p2053j19635j46233L351k03900J44164k3599k1869j11295
$$ plain form
5371 198436 324159 427801 574355 336646 394962 462092 292162 236127 316981 71036
5361 71036 140409 210254 145806 186724 214820 83487 213556 389007 467722 202974 -205518
5350 -205518 -129136 259051 193716 184357 151981 4378 206215 319865 84655 9300 54422
5339 54422 228029 520895 247154 437782 655221 552775 540126 251067 344251 531199
5329 531199 410540 634158 200173 179222 103514 364591 473087 553332 554873 398073 83765
5318 83765 255994 379561 553524 768796 470904 638618 610939 533402 525785 733967 625308
5307 625308 934129 787589 989188 817195 757223 922237 1071595 1278863 1127043 1290534
5297 1290534 1368977 1399185 1327132 1207497 1061264 1064615 860715 1004879 981280 959411 848116
5286H48116R0374j29562r652j68490j48756J34721J14785p2346j71697j23035
5276C64458j69582J86535J22350j58568J94313M7129j66239j8924K46052m87933
5266A59591k8051L05000l07810P5744J40530o022j4324J833j99144L64290K8493
5255E20130q456q0240J83599j83763k9917J08634j27989K56602k67466J13609
5245D84743J87712k25774m54015J48184p687o776L1265L0039K1669L30479R1590
5234F31429p2279N3771j31340k3823J5115J76496l32739O8694K92120J9808k07250
5223D90002K30695l2657j65094n1956K08455J10889k01962m8671L35158j7958
5213H56901l64350P0233o4137J74229J42875l0170o4752k60609L0910J92543P2397
$$ plain form
5286 848116 938490 808928 799276 630786 482030 616751 731536 659190 487493 364458
5276 364458 194876 381411 503761 345193 539506 586635 420396 401472 647524 159591
5266 159591 131540 436540 128730 204474 345004 338982 324658 326491 127347 491637 520130
5255 520130 511674 431434 615033 431270 401353 509987 381998 638600 371134 484743
5245 484743 672455 446681 -7334 140850 133163 126387 157652 187691 209360 539839 631429
5234 631429 559150 612921 481581 457758 472873 649369 316630 385324 677444 697252 490002
5223 490002 720697 688040 522946 470990 679445 790334 588372 539701 874859 856901
5213 856901 492551 562784 498647 672876 815751 785581 720829 460220 491130 683673 756070
5202G56070k8389M6205m61955l9932J99957R1441j99896K0756J26708j88966L63
5191C22362j38860K83479k21596J20054o8760J87882M9730j52063O7706p3835
5181C76099J90971O4205o823O0035q0135l7213j07467r6761J24181K93677K08256
5170I89025k26873j33794j09396o7407P2910J38638L4372j64480l3938l3582k8116
5159D37359K26063K22067n4539j25799L05123k83548j15007j74463j46098M91434
5149G82592l17243Q6729P9739k17672K25384j18768j28741J30802J54986l751
5139F74057P8549O439R4692j21495L0948o1640O3744m4919J15205J4978L111M3203
5127H96872k01641K72981N3044J32297j40512r282j59630j62427K77377k04513
$$ plain form
5202 756070 727681 773886 311931 271999 471956 563397 363501 384257 510965 321999 322362
5191 322362 183502 466981 245385 365439 296679 484561 534291 382228 449934 376099
5181 376099 567070 631275 624452 684487 604352 567139 459672 362911 487092 780769 989025
5170 989025 762152 628358 518962 451555 524465 663103 697475 532995 499057 465475 437359
5159 437359 663422 885489 830950 705151 1010274 726726 611719 437256 291158 782592
5149 782592 465349 552078 631817 414145 639529 520761 392020 522822 677808 674057
5139 674057 752606 759045 853737 732242 763190 701550 765294 720375 835580 850558 853669 896872
5127 896872 695231 968212 1021256 1153553 1013041 1003759 844129 681702 959079 754566
5117G54566m1044J4976J01431j27606N9774K4321m8259j77359K15671K35544k4359
5106I87656l30877J15651J66203K74845J00177l92104J68124K2587K3667J28740
5096A264669J30949m40873J99221K22803J3562j34604m5879J5510j90889L69391
5086A403860j8097n3129k53104k52905J06324J66534l8809K76909k49299k03010
5076H85274K81313p2710J61980p0211J30922j68837K45430j67105K44658J86603
5066A657317n2640K67214j83832k91792K66197J50032k32390l22875K05192J65848
5056A628271j22452M77444j81309P4267K2983P2908l35615M25802n4818j50179
5046A857302J50904K606K9990j78857r8911R7109Q9903J32241L13274p8131M8218
$$ plain form
5117 754566 713522 728498 829929 702323 762097 786418 738159 560800 776471 1012015 987656
5106 987656 656779 772430 938633 1213478 1313655 921551 1089675 1112262 1135929 1264669
5096 1264669 1395618 954745 1153966 1376769 1390331 1255727 1209848 1225358 1034469 1403860
5086 1403860 1385763 1332634 1079530 826625 932949 1099483 1060674 1337583 1088284 885274
5076 885274 1166587 1093877 1255857 1185646 1316568 1147731 1393161 1226056 1470714 1657317
5066 1657317 1604677 1871891 1688059 1396267 1662464 1812496 1580106 1257231 1462423 1628271
5056 1628271 1505819 1983263 1801954 1876221 1899204 1972112 1636497 2062299 2007481 1857302
5046 1857302 2008206 2010812 2040802 1861945 1763034 1860143 1950046 2082287 2395561 2317430 2365648
5035B365648L26764k08186J11692J1708j33115J3742n4183M43228n0335O18974
5025C445937j09370L12104J99984M1848j7844J92081J70370K60168l1763O8907
5015D532422J77761J91630j24647n5966L05047K27445K96267K55279M2473J93914
5005F041625R5783L54481K75123J8540L03457L14056L29690K44171M10978j01001
4995H286903m61069k52112k25326l1272j84299r7031j64935M2641O2879l29899
4985F646480m32492l91113l86945q605J39961m34759J02338l17416l97271M6179
4975D566357J2605k08518M66931k40814j28349J23594M37794J9943k67633j34447
4965D647463j06248l50627k77036j01483q4502l9874j57374j01028l13748J89208
$$ plain form
5035 2365648 2692412 2484226 2595918 2607626 2474511 2488253 2434070 2877298 2826963 3445937
5025 3445937 3336567 3648671 3848655 3890503 3872659 4064740 4235110 4495278 4463515 4532422
5015 4532422 4710183 4901813 4777166 4721200 5026247 5253692 5549959 5805238 5847711 6041625
5005 6041625 6137408 6491889 6767012 6785552 7089009 7403065 7732755 7976926 8387904 8286903
4995 8286903 7825834 7573722 7348396 7317124 7132825 7035794 6870859 6913500 6976379 6646480
4985 6646480 6213988 5822875 5435930 5427325 5567286 5132527 5234865 4917449 4520178 4566357
4975 4566357 4578962 4370444 4837375 4596561 4468212 4591806 5029600 5049543 4781910 4647463
4965 4647463 4541215 4190588 3913552 3812069 3727567 3687693 3530319 3429291 3115543 3304751
4955C304751q2039J72505K07167P1409j10583n69709L57402K24121j18173R1841
4945C548692k59463j49403J54952k579j73773j3336J81601O9867q1027O957O41
4934C283129l48119J54662O537Q5257L07190q3660q3840j75686J12947L86499
4924C644916o0895J3759j53078k81563K68479n8921L20864O0606j18364M7118
4914C682921k01811N1671K45668p679p1670j36643j1228m1640j56266j84116M1536
4903C210743L55628K126R6946k67329J2494N37254J7023J56919k61440P452r2173
4892C775643M9260K20879N1759L573m341N0405R4525N824J21909J70173p2003
4881D467606j10841q2605K09028R7613O7903j12969L62615K15774J0009J86767
$$ plain form
4955 3304751 3222712 3395217 3602384 3673793 3563210 2993501 3350903 3575024 3456851 3548692
4945 3548692 3289229 3139826 3294778 3292199 3118426 3105090 3286691 3356558 3275531 3282488 3283129
4934 3283129 2935010 3089672 3096209 3181466 3488656 3404996 3321156 3145470 3258417 3644916
4924 3644916 3584021 3597780 3444702 3163139 3431618 3372697 3693561 3754167 3635803 3682921
4914 3682921 3481110 3532781 3778449 3770770 3699100 3562457 3551229 3509589 3353323 3169207 3210743
4903 3210743 3566371 3568497 3665443 3398114 3410608 3947862 3964885 4121804 3860364 3867816 3775643
4892 3775643 3824903 4045782 4097541 4101114 4096773 4147178 4241703 4247527 4369436 4539609 4467606
4881 4467606 4356765 4274160 4483188 4580801 4648704 4535735 4898350 5114124 5124133 5310900
4871E310900K72852K45232R9157L95818J06935j58235Q9342Q4739M29793M06368
4861G282901J43841Q52427L39732J40364Q36618O08504P74355O37882Q55713N70137
4851A3042474K89469k27329l89392k73443K50423N82248J78575M43389O91708
4842A4588122Q22132M24633K36787N13742K72248J94992N90808j95082j57345
4833A7291037M7105p0112k18476K25354J62223K67334p5647R680J51750L69409
4823A8159657P40316M87132j65037j2366l09508j206631p03227j54386l50873
4814A6485077l75574J02638M04507L02693R367Q58775K80294K29473j55622N42846
4804A8684474K02480M12674J42575M01709L49359M29163L68780R67289N97370
$$ plain form
4871 5310900 5583752 5828984 5928141 6323959 6430894 6272659 6362001 6446740 6876533 7282901
4861 7282901 7426742 8279169 8618901 8759265 9595883 10204387 10978742 11616624 12472337 13042474
4851 13042474 13331943 13104614 12715222 12441779 12692202 13274450 13453025 13896414 14588122
4842 14588122 15410254 15834887 16071674 16585416 16857664 17052656 17643464 17448382 17291037
4833 17291037 17338142 17268030 17049554 17274908 17437131 17704465 17628818 17638498 17790248 18159657
4823 18159657 18899973 19387105 19222068 19209702 18900194 17693563 16990336 16835950 16485077
4814 16485077 16109503 16212141 16616648 16919341 16928708 17787483 18067777 18297250 18141628 18684474
4804 18684474 18886954 19299628 19442203 19843912 20193271 20622434 20991214 21958503 22555873
4795B2555873M15997P60862O26017J384032O32244J155400J132282J336371J553549
4786C1552627J979465K124819K024962K752988K676849K158342J693476K040792
4778D9004320K512265L810003M278816N374450P630801R553752J1259166J0491727
4770A03915300N791633j584496o783582n898786k632437n47048J826623M029649
4762I8116856N434316N200032K857751j05377J553026N113194O553584L485544
4754A28208926l237906q403889o343302k597833M4055m99407k920733p235688
4746I7014223p231166l878154L1587L785198O066163O702877L729543l272573
4738A02947698j3216762j3687427j0166553p605811n236334m590360l846909l813066
$$ plain form
4795 22555873 22971870 23732732 24358749 25742781 26375025 27530425 28662707 29999078 31552627
4786 31552627 33532092 35656911 37681873 40434861 43111710 45270052 46963528 49004320
4778 49004320 51516585 55326588 59605404 64979854 72610655 82164407 93423573 103915300
4770 103915300 109706933 108122437 101338855 95440069 92807632 92260584 94087207 98116856
4762 98116856 103551172 108751204 111608955 111503578 113056604 118169798 124723382 128208926
4754 128208926 124971020 116567131 110223829 107625996 107670051 107170644 104249911 97014223
4746 97014223 89783057 85904903 85936490 89721688 95787851 102490728 106220271 102947698
4738 102947698 89730936 76043509 65876956 58271145 53034811 48444451 44597542 40784476
4730D0784476l116991j849720j412757j558646j189255o99177m50286o81203m95045
4721B9331396o296K54983j04111q5513J37074J95827K05159J33522J67816M31311
4711C0661168L92189P0388K3833M34105N38249N08438M55963P65462R39239O38627
4701C5427661J099149J091786J338705J564131J034004J896408K380506K113828
4693D7946178K517379K781941L273994M108177M259245K885618J44894k833482
4685F5083944l782813k420525o59620J006502K039082L128143L774355K708701
4677G0877769R25224O60359J227363J801103J879329j222262l737559m166067
4669F8245259k777449o98044N49640k17976j382927k851012j889048k80995J108186
$$ plain form
4730 40784476 37667485 35817765 34405008 32846362 31657107 30957930 30507644 29826441 29331396
4721 29331396 29325100 29580083 29475972 29390459 29527533 29723360 29928519 30062041 30229857 30661168
4711 30661168 31053357 31123745 31147578 31581683 32119932 32628370 33084333 33849795 34789034 35427661
4701 35427661 36526810 37618596 38957301 40521432 41555436 43451844 45832350 47946178
4693 47946178 50463557 53245498 56519492 60627669 64886914 67772532 67917426 65083944
4685 65083944 61301131 58880606 58220986 59227488 61266570 64394713 68169068 70877769
4677 70877769 71802993 72463352 73690715 75491818 77371147 76148885 72411326 68245259
4669 68245259 65467810 64769766 65319406 65101430 63718503 60867491 58978443 58697448 59805634
4660E9805634K152056L079747K966956O62671l735581o062629n100698l698276
4652E0069880k489477j298003r9649L21264J261813J901175J963192P24125o45899
4643E1708421k301128k893090k912358k351778j236158q78942m71137K24990Q22439
4634C9711259J224934J765062J977633K314587K878210L911809M914702O125891
4626F4824087N679575K962016j035893n180390p351646p102679n201853l941510
4618D3651707k878437k437993j387241q64086n00493q8017O57907Q36945R03013
4609C7893305J558900K223851K738318K303740M36238j964381l900047m286776
4601C7003148m023160l369037k719813k046347j973396j676937q60673q48358
$$ plain form
4660 59805634 61957690 65037437 68004393 68667064 64931483 58868854 53768156 50069880
4652 50069880 47580403 46282400 46182751 46504015 47765828 49667003 51630195 52354320 51708421
4643 51708421 49407293 46514203 43601845 41250067 40013909 39134967 38663830 38888820 39711259
4634 39711259 40936193 42701255 44678888 46993475 49871685 53783494 58698196 64824087
4626 64824087 70503662 73465678 72429785 67249395 59897749 52795070 47593217 43651707
4618 43651707 40773270 38335277 36948036 36083950 35583457 35495440 36153347 36990292 37893305
4609 37893305 39452205 41676056 44414374 46718114 47154352 45189971 41289924 37003148
4601 37003148 32979988 29610951 26891138 24844791 22871395 21194458 20333785 19485427
4593A9485427p05691o93519p71215o66624k92821l70162p64623p06603p29369
4584A3784800n41914k93461n25784m44282k53169k5640j68117k04109l88530J24371
4574A1064165j21182l02434K36462k21498K1130k52031p23677l64791m35769j18564
4564H781811j30763O6580m01138K44923k77486P2851k05266O1536R1861L81858
4554H686767K32583k80029p4740L4848J88061n96551k91593k45608j89757l29270
4544G134711p4563p928j20607j4736m9668O61983j08711J63329R5695j46699j32432
4533G400374j41951L67107P5597n9234j8922N338k11251j59958m1618K63875n8181
4522G421176J23556k22352J07602L4504K0378N6170L970P0222k65582K46496R0389
$$ plain form
4593 19485427 18779736 18086217 17315002 16648378 16355557 15985395 15220772 14514169 13784800
4584 13784800 13242886 12949425 12423641 11979359 11726190 11700550 11532433 11328324 10939794 11064165
4574 11064165 10942983 10640549 10877011 10655513 10676643 10424612 9700935 9336144 8900375 8781811
4564 8781811 8651048 8717628 8316490 8561413 8283927 8356778 8151512 8213048 8304909 8686767
4554 8686767 8919350 8639321 8564581 8599429 8787490 8190939 7899346 7653738 7463981 7134711
4544 7134711 7060148 7052220 6931613 6916877 6867209 7529192 7420481 7583810 7679505 7532806 7400374
4533 7400374 7258423 7625530 7701127 7641893 7622971 7628309 7417058 7257100 7215482 7479357 7421176
4522 7421176 7544732 7322380 7429982 7464486 7484864 7541034 7545004 7615226 7349644 7596140 7686529
4511G686529l7552M7018k03171N3575Q9072k6119K19615J70102J2872K7078j78952
4500G860067k5288p3965K68920j66918r5947J9324j2636K59231k7111K44240L0891
4489H280808J07696l42130L40856K65667J53636q2335l47603J22238k34677J4025
4479H278181J11909k1189K02421M3375R1097L54236j60927K17341J9898j69115
4469H967227o3045K97113P5869J91148N14909J42644j0824L79173M40081j58832
4459A0775463K6049L60966Q8261L28562M68508K24646K15446N7253J7428K26196
4449A2788778M28555K73653K08979P61920N01669O49730M16004R74745J111872
4440A8115905R00510J297437Q50411J58635k16214q38846L37662J19418N79167
$$ plain form
4511 7686529 7648977 7695995 7492824 7546399 7635471 7609352 7828967 7999069 8011941 8039019 7860067
4500 7860067 7834779 7760814 8029734 7862816 7766869 7786193 7773557 8032788 8005677 8249917 8280808
4489 8280808 8388504 8046374 8387230 8652897 8806533 8724198 8376595 8498833 8264156 8278181
4479 8278181 8390090 8368901 8571322 8614697 8705794 9060030 8899103 9116444 9136342 8967227
4469 8967227 8904182 9201295 9277164 9468312 9983221 10125865 10115041 10494214 10934295 10775463
4459 10775463 10801512 11162478 11250739 11579301 12047809 12272455 12487901 12545154 12562582 12788778
4449 12788778 13217333 13490986 13699965 14461885 14963554 15613284 16029288 17004033 18115905
4440 18115905 19016415 20313852 21164263 21322898 21106684 20267838 20605500 20724918 21304085
4431B1304085M14390M42915N54639R61995Q26494N35376O90929N01206M99060
4422B6731089L49347n00171J98242J07064R5488r2321k07243n55380k95839M70510
4412B6300786O31892M85871N65934J010085J009029J068967L79628N5291n77728
4403C0929755k53499n83355l15021J06037M5481K45213K69294O10159N64872M12948
4393C2031884P63087R58325P35506R98237Q99829R10997J203473P52992R18628
4384D0172958J020869J261033P24299J088339J340624J644339J651884J656648
4376E0560993J928649K151860K521400K809377L108842L282574L259073L832717
4368G3455485L498208L218860K905868K093334K412632L562543N196069O148414
$$ plain form
4431 21304085 21718475 22161390 22716029 23678024 24504518 25039894 25730823 26232029 26731089
4422 26731089 27080436 26580265 26778507 26885571 26981059 26888738 26681495 26126115 25830276 26300786
4412 26300786 26932678 27418549 27984483 28994568 30003597 31072564 31452192 31507483 30929755
4403 30929755 30676256 30092901 29777880 29883917 29929398 30174611 30443905 31054064 31618936 32031884
4393 32031884 32794971 33753296 34488802 35487039 36386868 37297865 38501338 39254330 40172958
4384 40172958 41193827 42454860 43179159 44267498 45608122 47252461 48904345 50560993
4376 50560993 52489642 54641502 57162902 59972279 63081121 66363695 69622768 73455485
4368 73455485 76953693 80172553 83078421 85171755 87584387 91146930 96342999 102491413
4360A02491413O855907P588922Q677998R532549J1629699J2663971R532618K848679
4352A71821756o615438p613422n350353j762979J981332N890206O304522M158266
4344A68813890P53270k004153p7015M129538O830830P826414L726929l591798
4336A86407905p623120o627468l528306j871199k884568o191710n468954k636073
4328A49576507Q49684M434872O858122R156534P989939M196158l237746p137336
4320A72686734o874640o776966o647718o927237o804579n891287o192478m781427
4312A21790402l775098j549055j048179o07828N80591J540161K630520L427871
4304A22989385M019456N485027P007136Q210409P360692L166557k041186l635190
$$ plain form
4360 102491413 109347320 116936242 125614240 135146789 146776488 159440459 168973077 171821756
4352 171821756 165206318 157592896 152242543 150479564 152460896 158351102 164655624 168813890
4344 168813890 169567160 167563007 167485992 171615530 178446360 186272774 189999703 186407905
4336 186407905 178784785 172157317 168629011 166757812 163873244 157681534 152212580 149576507
4328 149576507 150426191 154861063 161719185 170875719 178865658 183061816 179824070 172686734
4320 172686734 165812094 159035128 152387410 145460173 138655594 132764307 126571829 121790402
4312 121790402 118015304 116466249 115418070 114810242 115390833 116930994 119561514 122989385
4304 122989385 127008841 132493868 139501004 147711413 155072105 158238662 156197476 152562286
4296A52562286l048372O6244K704323O419590R204289J3308109J4594294J1904452
4288B07715215M681538J355437O044781J4753035K5290961L7205514M0893857
4281C37940338K5154668p414215m7588818n0094775l9231372k8007869k0252883
4274A70505074j5552884j2251234r585737p789144n966924m385684l322420k801104
4266A08849943k289730j564217o18522j35936O82860J124306J615666J601673
4258A09266043J769463J770503J180187O91086J273159K159288L460950L774893
4250A25345572K091055j034003m891564n112545l629943k027257K45927J756518
4242A12743760K534844L167940K018695Q22537N60063R97788J674004J289681
$$ plain form
4296 152562286 149513914 149580158 152284481 158704071 167908360 181216469 195810763 207715215
4288 207715215 212396753 213752190 219796971 234550006 259840967 297046481 337940338
4281 337940338 363095006 355680791 308091973 257997198 218765826 190757957 170505074
4274 170505074 154952190 142700956 133115219 125326075 119359151 114973467 111651047 108849943
4266 108849943 106560213 104995996 104377474 104241538 104924398 106048704 107664370 109266043
4258 109266043 111035506 112806009 113986196 114677282 115950441 118109729 121570679 125345572
4250 125345572 127436627 126402624 121511060 116398515 112768572 110741315 110987242 112743760
4242 112743760 115278604 118446544 120465239 121287776 121847839 122845627 124519631 125809312
4234A25809312l84756l090126m614946l751810j412355j9935r92699k156038j741286
4225A07645361j9792P29579K147497K797125L558329L473339J750479j111873
4217A20970044l533946l293983k396913j476835p51311p46246r22883r25753j208747
4208A05713427j182768j148206l06925O55080J391354J329599R11295J271589
4200A08634445J477478K044649K085041R01011l42208r009J460881K810469K315665
4191A21378422N85113k041226m106740n909947o102418m509268k442595j143960
4183I5707381r00252o27131n80653J53550J984270L219859M406994L707366K267783
4174A09339167p22502k927502m968104n117726m052385j803431j773514l036199
$$ plain form
4234 125809312 125424556 122334430 117719484 113967674 112555319 112535384 111542685 109386647 107645361
4225 107645361 107625569 108355148 110502645 113299770 116858099 120331438 122081917 120970044
4217 120970044 117436098 114142115 111745202 110268367 109517056 108770810 107847927 106922174 105713427
4208 105713427 104530659 103382453 103075528 103730608 105121962 106451561 107362856 108634445
4200 108634445 110111923 112156572 114241613 115142624 114800416 114791407 116252288 119062757 121378422
4191 121378422 121963535 119922309 115815569 109905622 103803204 99293936 96851341 95707381
4183 95707381 94807129 94179998 93599345 93752895 95737165 98957024 103364018 107071384 109339167
4174 109339167 108616665 105689163 100721059 95603333 91550948 89747517 87974003 84937804
4166H4937804m272697m109168k636461j302509m91828j008993j049719o22829
4158F9443600j96962l13850j879444l995914l807987l496787l505307k697681
4150D9549668k541348j536725j787508k214998j846325j701940j619703j177575
4142C5123546j356566j463206j841393j883515j544515j301481r89389r57136
4134B3786345o74554n69511j48652o21937m20248l76272k29342j28050j50381
4125B0467398p56047R8535m57452l23650k83317k60093J07667J74441J29252K61497
4115A9158231K28127l64k26871K71764J4290k03226J15770J57337K17619L29044
4105B0061721O82007n49541p93409r13365o00895K23450K1240K14045K39502J71880
$$ plain form
4166 84937804 80665107 76555939 73919478 72616969 72125141 71116148 70066429 69443600
4158 69443600 69246638 68932788 67053344 63057430 59249443 55752656 52247349 49549668
4150 49549668 47008320 45471595 43684087 41469089 39622764 37920824 36301121 35123546
4142 35123546 33766980 32303774 30462381 28578866 27034351 25732870 24743481 23786345
4134 23786345 23111791 22542280 22393628 21771691 21351443 20975171 20745829 20617779 20467398
4125 20467398 19711351 19809886 19352434 19028784 18745467 18485374 18593041 18767482 18896734 19158231
4115 19158231 19386358 19385994 19159123 19430887 19445177 19241951 19357721 19515058 19732677 20061721
4105 20061721 20743728 20194187 19400778 18487413 17886518 18109968 18131208 18345253 18584755 18756635
4095A8756635L53885O28846K93535o86546o71881p36189m64309n04055q81127
4086A6088794p87063k67678p63160m07352l40071n5147r292J60353l87257l06090
4076A2926037j21555K11570m80469j42896K64305J80504k78337j42222R0924j3386
4066A2494475K54856J22142j13294J04117K27136O94013M88532M89029Q71111
4057A5632117O03086J161415J306930P61131L71767m82648j115819o79103n43222
4048A7015654q64731o19653j65621K55441k4956k24426L60565J13839L90639P93674
4038A7030425R01891P25083J180446J257219K000872K661329K818028L116525
4030C1691818K939291J499705j252012l019701l534134l018637k470652j575629
$$ plain form
4095 18756635 19110520 19739366 20032901 19346355 18674474 17938285 17473976 16969921 16088794
4086 16088794 15301731 15034053 14270893 13863541 13523470 13468323 13459031 13619384 13232127 12926037
4076 12926037 12804482 13016052 12535583 12392687 12656992 12837496 12559159 12416937 12507861 12494475
4066 12494475 12749331 12871473 12758179 12862296 13089432 13783445 14271977 14761006 15632117
4057 15632117 16235203 17396618 18703548 19464679 19836446 19353798 18237979 17558876 17015654
4048 17015654 16150923 15531270 15365649 15621090 15596134 15371708 15732273 15846112 16236751 17030425
4038 17030425 17932316 18657399 19837845 21095064 23095936 25757265 28575293 31691818
4030 31691818 34631109 36130814 34878802 31859101 28324967 25306330 22835678 21260049
4022B1260049j031321q04553m46274n33115Q12L52339L73801K57033O84984J058607
4012B1172362J464648J442944J424560K443359L039946L667166L782764J907599
4004D0345348j134417l514928l771595l588567l188515j833656j414870j452042
3996B0446758p97598m91519j36710j31600K04436K49771O8123P34141O17412R02528
3986B1665742J389004J162402J959204J746794J764153L57376k96022j301887
3978B8446766j912898j969222j505785j634722r96881m08008m65664N1174m80267
3969A9124493j16394O503n49155n4136n628J32041Q538O09194O15784M94593J6126
3958B0281959N69718L92884L63965l78918l54669l25146k14400j36405M55533
$$ plain form
4022 21260049 20228728 19424175 18977901 18444786 18445598 18797937 19171738 19428771 20113755 21172362
4012 21172362 22637010 24079954 25504514 27947873 30987819 34654985 38437749 40345348
4004 40345348 39210931 35696003 31924408 28335841 25147326 23313670 21898800 20446758
3996 20446758 19649160 19157641 19020931 18889331 19093767 19343538 19411661 20145802 20763214 21665742
3986 21665742 23054746 24217148 26176352 27923146 29687299 30044675 29748653 28446766
3978 28446766 26533868 24564646 23058861 21424139 20427258 20019250 19553586 19604760 19124493
3969 19124493 19008099 19014602 18465447 18411311 18405683 18537724 18546262 19155456 19771240 20265833 20281959
3958 20281959 20851677 21244561 21608526 21229608 20874939 20549793 20335393 20198988 20654521
3949B0654521p0319Q8907J35467R5782K35213l0379R451L23104j55722k03622
3939B1082403L53257J82307L81731M14925L96729M47190O05087J63755J05913
3930B4133297M55876L68560J189677J010400P23258Q93981J115177J342833J397814
3921C2630873J134957O50945K54819m71224l60626K765l17080M82907k07753O95755
3911C4496338P80477P50076P42704O20818M76204J131286J297782J323138J252353
3902D2871176J424209J431244J921524K167134K376104K628296K552880K495064
3894E9867631J823667Q84540N91385P59808J092316K403415K569912K839117L381694
3885G6213485M195996N504800P052970Q137565R991317J2061414J5922585J9841971
$$ plain form
3949 20654521 20584202 20673109 20808576 20904358 21139571 21109192 21118643 21441747 21286025 21082403
3939 21082403 21435660 21617967 21999698 22414623 22811352 23258542 23863629 24027384 24133297
3930 24133297 24589173 24957733 26147410 27157810 27881068 28775049 29890226 31233059 32630873
3921 32630873 33765830 34416775 34671594 34200370 33839744 33842509 33525429 34008336 33800583 34496338
3911 34496338 35276815 36026891 36769595 37390413 37866617 38997903 40295685 41618823 42871176
3902 42871176 44295385 45726629 47648153 49815287 52191391 54819687 57372567 59867631
3894 59867631 61691298 62575838 63167223 63927031 65019347 67422762 69992674 72831791 76213485
3885 76213485 80409481 85914281 92967251 101104816 111096133 123157547 139080132 158922103
3877A58922103K4758963K5258808K5191544K4788014L0741958M6699297O4820274
3870D01180961M8529880P066116o7188299q4476591o3316283m6089519l0868921
3863A64837344k5269223j9282381j5212352r998258p444272n110908n103242n054636
3855G2362072m835671l153568k513426j059611j453838o34840l02154O37743R94481
3846F0041188J852235K535690M518118N544004M326542J072322n977121q337814
3838F5575164o206049n083033l146777k904288j303197j639423m61160m87281
3830D4343956O13400m84354K31055n75703M17564j85352M95967K18803Q30805
3821D5906141M49636J097356R66108J353058J139318J872846J228032J945403
$$ plain form
3877 158922103 183681066 208939874 234131418 258919432 289661390 336360687 401180961
3870 401180961 449710841 456776957 389588658 305112067 241795784 195706265 164837344
3863 164837344 139568121 120285740 105073388 95075130 87630858 82519950 77416708 72362072
3855 72362072 67526401 64372833 61859407 60799796 59345958 58711118 58408964 59046707 60041188
3846 60041188 61893423 64429113 68947231 74491235 78817777 79890099 73912978 65575164
3838 65575164 59369115 54286082 51139305 48235017 46931820 45292397 44831237 44343956
3830 44343956 44957356 44473002 44704057 44128354 44545918 44360566 44856533 45075336 45906141
3821 45906141 46355777 47453133 48419241 49772299 50911617 52784463 54012495 55957898
3813E5957898J755124J815123K126173K882612K139505K177988J878570L719546
3805G4452539M655790P208480P344324R622787J1534546J6535377K1179106L0867872
3797A83400821K9004117J5383764j4496987m1333961l4275127k5620635j5618935
3790I6443057j0472892p368208n567876l140926j889916j17935K76447J374004
3782F9535755J883797J772545K20962k469427m547915n317041m944191l347727
3774E2786758k770378k032139j790309j983162j416869k11365j0190k55158r25429
3765D1391759r50413m20771l52205O0694J34378O45623O42099Q5518j104526j729038
3755C8403118j636310j275481p79493m52583m41976o62823n11669l06401J72972
$$ plain form
3813 55957898 57713022 59528145 61654318 64536930 66676435 68854423 70732993 74452539
3805 74452539 79108329 86316809 93661133 103283920 114818466 131353843 152532949 183400821
3797 183400821 212404938 227788702 213291715 171957754 137682627 112061992 96443057
3790 96443057 85970165 78601957 73034081 69893155 68003239 67885304 68161751 69535755
3782 69535755 71419552 73192097 73413059 70943632 66395717 61078676 56134485 52786758
3774 52786758 50016380 47984241 46193932 44210770 42793901 42582536 42572346 42317188 41391759
3765 41391759 40441346 40020575 39668370 39729064 39863442 40509065 41151164 41236682 40132156 38403118
3755 38403118 36766808 35491327 34711834 34259251 33817275 33154452 32642783 32336382 32509354
3746C2509354N6763l59493l80002n07514j33284K66020j45573K6660J84839j96448
3736C1321322K22267K06709K80092J56591J42240M17248J24339O18298O46895
3727C4136001J39842J60099M06058J070721N68585J098739J577298J883903K314939
3718D3356185J694882J595062K220439L163018M785414O247687R367222R421271
3710H1851180O135167l361834j0529988j0671792r067351n802562m000912k482553
3702D2069355j934708j142298q73826m27512j46053O79986O11018P61052J223746
3693D0820760J740495R83606K07778m74421r89162j92797M60571r5591M34622
3684D2895861N69875P90960L64583J000197J116115O90253J280619P59868J081985
$$ plain form
3746 32509354 32566117 32206624 31826622 31319108 31185824 31451844 31306271 31332931 31517770 31321322
3736 31321322 31543589 31750298 32030390 32186981 32329221 32746469 32870808 33489106 34136001
3727 34136001 34275843 34435942 34842000 35912721 36481306 37580045 39157343 41041246 43356185
3718 43356185 45051067 46646129 48866568 52029586 56815000 63062687 72429909 81851180
3710 81851180 87986347 84624513 74094525 63422733 54355382 48552820 44551908 42069355
3702 42069355 40134647 38992349 38118523 37691011 37544958 38224944 38835962 39597014 40820760
3693 40820760 42561255 43544861 43752639 43278218 42289056 42096259 42556830 42461239 42895861
3684 42895861 43465736 44256696 44621279 45621476 46737591 47427844 48708463 49468331 50550316
3675E0550316J061610J221980J363164J711016J682702K071429K088704J956483
3667F3707404K163767K357754L046841K939280K980786L489167L629945L476705
3659H7791649M086445M208175M850604M792111M568583M439300M861736N635295
3651A25233898N918161N784977N379402M783429M663620N462189N608738N268757
3643A68103171L837005K598220J938142J970555L315010M485367N614953N802855
3635A97665278N582041M995215L896273K723871L156506L206640L050373J941095
3627B26217292K3775q47469p45534j421167k220441k818856m069332l508690j648819
3618B08960759j81750J049376K460630K802093K777458K531114J559113P16652
$$ plain form
3675 50550316 51611926 52833906 54197070 55908086 57590788 59662217 61750921 63707404
3667 63707404 65871171 68228925 71275766 74215046 77195832 80684999 84314944 87791649
3659 87791649 91878094 96086269 100936873 105728984 110297567 114736867 119598603 125233898
3651 125233898 131152059 136937036 142316438 147099867 151763487 157225676 162834414 168103171
3643 168103171 171940176 174538396 176476538 178447093 181762103 186247470 191862423 197665278
3635 197665278 203247319 208242534 212138807 214862678 218019184 221225824 224276197 226217292
3627 226217292 226241067 225393598 224648064 223226897 221006456 218187600 214118268 210609578 208960759
3618 208960759 208779009 209828385 212289015 215091108 217868566 220399680 221958793 222675445
3610B22675445k39618o45360j680090k235841l450964m270946l970698k594707
3602B03587221j221879P29693K548567M154912M975295M752667K748190K82266
3594B22556932j836236k755618k988048l435694n142959p193531q376704p246812
3586A83581330n810285n223161n542354o013673n461052n040155k635990j113119
3578A46741541l85724j373019l330001n080649o359594o785558p430370p699134
3570A08297492p900218q127483p791738p295795o338730n725617m677858l982133
3562E6457920l756020l303772k214007k267682k303715k158901k193088k076161
3554C6184574j695181j971351j218740j053912q80397j344450j135215p82972
$$ plain form
3610 222675445 222435827 221790467 220110377 217874536 214423572 210152626 206181928 203587221
3602 203587221 202365342 203095035 205643602 209798514 214773809 219526476 222274666 222556932
3594 222556932 220720696 217965078 214977030 211541336 206398377 199204846 190828142 183581330
3586 183581330 177771045 172547884 167005530 160991857 155530805 150490650 147854660 146741541
3578 146741541 146355817 144982798 141652797 136572148 130212554 123426996 115996626 108297492
3570 108297492 100397274 92269791 84478053 77182258 70843528 65117911 60440053 56457920
3562 56457920 52701900 49398128 47184121 44916439 42612724 40453823 38260735 36184574
3554 36184574 34489393 32518042 31299302 30245390 29364993 28020543 26885328 26102356
3546B6102356j091387q14399n00527p85304l67015r95324j051654m78293n32863
3537A9485590n35447p32361m72297l86113l32552p46582n92979k38400m66201
3528A4982658m00937o67150l90169l21080k97422m91153J27486n85813k38410
3519A1718010k89401k45448j61484k20406o58714l9906O88730k19372n12138j46082
3509I913789J65223k35105k86760J63053l79178m37268K2071o4044k89572J9504
3499H591713j29050J0922l41302K27684J36228o38459J84311l2280K7781J20570
3489H158118j84631l60248J25522l04855n5946J64612k18227J81268k47278J96519
3479G454854K23813j74685l24096k53631M11211r2907P6583j02298k01462k10985
$$ plain form
3546 26102356 25010969 24196570 23696043 22910739 22543724 21548400 20496746 20018453 19485590
3537 19485590 18950143 18217782 17745485 17359372 17026820 16280238 15687259 15448859 14982658
3528 14982658 14581721 13914571 13524402 13203322 12905900 12414747 12542233 11956420 11718010
3519 11718010 11428609 11183161 11021677 10801271 10142557 10102651 10791381 10572009 10059871 9913789
3509 9913789 10079012 9843907 9557147 9720200 9341022 8903754 8925825 8861781 8572209 8591713
3499 8591713 8462663 8473585 8132283 8359967 8496195 7857736 8042047 8009767 8037548 8158118
3489 8158118 7973487 7613239 7738761 7433906 7377960 7542572 7324345 7505613 7258335 7454854
3479 7454854 7678667 7503982 7179886 6926255 7337466 7244559 7321142 7218844 7017382 6806397
3469F806397m07000J45948K13931j60396j04718j21233L6093K02321K94670l87374
3459F518639j1996j81287L4275K45622K39887j37620j94479l74032L31922k16929
3449F254002j43366L73061k13420M86067k25456O1844m2211l72994k2905L39369
3439F493991r5731J12809n2087J64819J31300j73992K04596l44783J18109o2658
3429F496373K87593J42446K58510j14584q7586J67983Q0891K512l4397j31621
3419G068120J0929J55942J66333K34351l12723j89346K64569J79562N0924J85559
3409G814220J04586j87956K92284k43023j56833J50865K3874J33939N4047m2852
3399G943151L64413j3857j02484j65599P12804n9532J79599j37395K05694J06747
$$ plain form
3469 6806397 6399397 6545345 6759276 6598880 6494162 6372929 6409022 6611343 6906013 6518639
3459 6518639 6506643 6325356 6359631 6605253 6845140 6707520 6513041 6139009 6470931 6254002
3449 6254002 6110636 6483697 6270277 6756344 6530888 6592732 6550521 6177527 6154622 6493991
3439 6493991 6398260 6511069 6458982 6623801 6755101 6581109 6785705 6440922 6559031 6496373
3429 6496373 6783966 6926412 7184922 7070338 6982752 7150735 7231626 7234138 7199741 7068120
3419 7068120 7079049 7234991 7401324 7635675 7322952 7133606 7398175 7577737 7628661 7814220
3409 7814220 7918806 7730850 8023134 7780111 7623278 7774143 7798017 7931956 7986003 7943151
3399 7943151 8307564 8293707 8191223 8025624 8738428 8678896 8858495 8721100 8926794 9033541
3389I033541J0261k54578n5995K46456J06425J76760P5302L89219k02566L76362
3379I901187J8683m5657Q1859L10708l2753j0668K58713J74154M0045J03450R756
3368A0809477K32671L31242J05211Q1073J58443j4040J9305j5709L8652L97694
3358A2144019J00636j85161J15908J21122K90353k07298j0282K83391J57390K83045
3348A3093123Q6058K697N25591J98629K56375l7498J66095J91949R7451K19621
3338A4800091K05639K94118L15112J48739j84016M90644J58683P02173L79721
3329A7310904M3725K12004l122M21959M3643K39321N60866N50030K51315J73527
3319A9804172j05751j41863j13442P1589o8686J05963l2780j57488K97894K53766
$$ plain form
3389 9033541 9043802 8789224 8733229 8979685 9086110 9262870 9338172 9727391 9524825 9901187
3379 9901187 9919870 9874213 9956072 10266780 10234027 10223359 10482072 10656226 10696271 10799721 10809477
3368 10809477 11042148 11373390 11478601 11559674 11718117 11704077 11723382 11707673 11746325 12144019
3358 12144019 12244655 12059494 12175402 12296524 12586877 12379579 12369297 12652688 12810078 13093123
3348 13093123 13179181 13181878 13707469 13906098 14162473 14124975 14291070 14483019 14580470 14800091
3338 14800091 15005730 15299848 15614960 15763699 15579683 16070327 16229010 16931183 17310904
3329 17310904 17354629 17566633 17563511 17985470 18029113 18268434 18829300 19379330 19630645 19804172
3319 19804172 19698421 19556558 19443116 19514705 19446019 19551982 19519202 19361714 19659608 19913374
3309A9913374L04807J05443L43388K78222K00596O35780K98346O10403M60562
3300B3150921N66837P97598M31232O92570L83371M18418R5261m01971o15402o24398
3290B4894437m43878n52551j13179k03414k51659k39887l9694j00008K91364O9938
3280B3311469L66883m73k07811L35538J58049j35417L51144M08857N73997L91232
3270B5553468K21347k93535l22727m75322q67968j097949r04133m50044k59210
3261B1103927l87681j03762j9100m04178K0142P4310m64266l5462l9945o3913
3251A9680072J36082J12243M62400J58986M08578O67360K76453J82555l93304
3242B1691425l39019k07265l77099k54326l26609j11306j11472j9697j12632J833
$$ plain form
3309 19913374 20218181 20323624 20667012 20945234 21145830 21781610 22079956 22690359 23150921
3300 23150921 23717758 24515356 24946588 25639158 26022529 26440947 26536208 26134237 25518835 24894437
3290 24894437 24450559 23898008 23784829 23581415 23329756 23089869 23050175 22950167 23241531 23311469
3280 23311469 23678352 23677879 23470068 23805606 23963655 23828238 24179382 24588239 25162236 25553468
3270 25553468 25774815 25481280 25158553 24683231 23815263 22717314 21813181 21363137 21103927
3261 21103927 20716246 20612484 20593384 20189206 20209348 20283658 19819392 19783930 19743985 19680072
3251 19680072 19816154 19928397 20390797 20549783 20958361 21625721 21902174 22084729 21691425
3242 21691425 21352406 21145141 20768042 20513716 20187107 20075801 19964329 19944632 19832000 19833833
3232A9833833j58502M12284n5145J98896J31822N2548J65255L55926M48226O46978
3222B2032121L66865L98331M63434K98730J59615J57601K82369M5282J02879K42572
3212B4549799K69339J46789J36280O2195J57705Q5510K61084N0374L16677L56349
3202B6392101L96915P12033M36845M40640M4460M45861K49789j5593N9731Q3014
3192B9245796J65140J35735K41457L13910N6091J05534K59826N24436L51064L71188
3182C1770177K98322M97361O46621M71284N52749K48672L57132L84955L88526
3173C5615799N16829O86904N30303N18116O31715J84554M27284L41416N88290
3164D0041210O93758O08358O67334N36064O91021M72919P03153N70827P10985
$$ plain form
3232 19833833 19675331 20087615 20032470 20231366 20363188 20415736 20580991 20936917 21385143 22032121
3222 22032121 22398986 22797317 23260751 23559481 23719096 23876697 24159066 24204348 24307227 24549799
3212 24549799 24819138 24965927 25102207 25164402 25322107 25407617 25668701 25719075 26035752 26392101
3202 26392101 26789016 27501049 27937894 28378534 28422994 28868855 29118644 29103051 29162782 29245796
3192 29245796 29410936 29546671 29788128 30102038 30158129 30263663 30523489 31047925 31398989 31770177
3182 31770177 32068499 32565860 33212481 33683765 34236514 34485186 34842318 35227273 35615799
3173 35615799 36132628 36819532 37349835 37867951 38499666 38684220 39111504 39452920 40041210
3164 40041210 40734968 41343326 42010660 42546724 43237745 43710664 44413817 44984644 45695629
3155D5695629M35824N45271Q02426P82064L00888M18456N47992L47346P50283
3146E0626179R04540R03209P45570J006067R81394R49289J269916J563935J570848
3137F0520947J140092J903737K373437J794104K668677K564932K597343K609203
3129G8172472K241341J968369K001261J665599J990966K107936J652231J886538
3121I3686713J921257K280743K544066K269900L081132K623139K710209K505079
3113A13622238K177162K659762K236485J973973J689137J517696J895248K738133
3105A30509834L513443L658307L108335L421474L002979L102076L630677M832038
3097A58779163N827978O600715O288127N669030M548653M034068M028701L645547
$$ plain form
3155 45695629 46131453 46676724 47479150 48261214 48562102 48980558 49528550 49875896 50626179
3146 50626179 51530719 52433928 53179498 54185565 55166959 56116248 57386164 58950099 60520947
3137 60520947 61661039 63564776 65938213 67732317 70400994 72965926 75563269 78172472
3129 78172472 80413813 82382182 84383443 86049042 88040008 90147944 91800175 93686713
3121 93686713 95607970 97888713 100432779 102702679 105783811 108406950 111117159 113622238
3113 113622238 115799400 118459162 120695647 122669620 124358757 125876453 127771701 130509834
3105 130509834 134023277 137681584 140789919 144211393 147214372 150316448 153947125 158779163
3097 158779163 164607141 171207856 177495983 183165013 187713666 191747734 195776435 199421982
3089A99421982L413070L927546N182003O029857O429046O005338O678091Q302117
3081B45389050J0499460J2004169J3471632J1916619O718853R29566j877710j762117
3073B97289522p29096Q53744K199558K758324J640818l76090j005184K12473l34892
3064C02509177k088703m456612m982067l656352l036543j955812q699r7160l265526
3055B78961703r853290j4292920j5289047j3965689j1466583r189112p281461
3048A97623601o187519n374411n126525m157181l966586l549376l999278m188302
3040A61074423m977221n550237o606053p088817o258583m539569l241760k620307
3032A20191876k522632l550844n172190n912014m529753l994136l237299k604128
$$ plain form
3089 199421982 202835052 206762598 211944601 217974458 224403504 230408842 237086933 245389050
3081 245389050 255888510 267892679 281364311 293280930 299999783 300929349 299051639 297289522
3073 297289522 296560426 297414170 299613728 302372052 304012870 303636780 302631596 302844069 302509177
3064 302509177 300420474 295963862 290981795 287325443 284288900 282333088 282324389 282227229 278961703
3055 278961703 269108413 254815493 239526446 225560757 214094174 204905062 197623601
3048 197623601 191436082 186061671 180935146 176777965 172811379 169262003 165262725 161074423
3040 161074423 156097202 150546965 143940912 136852095 130593512 126053943 122812183 120191876
3032 120191876 117669244 114118400 108946210 103034196 98504443 94510307 91273008 88668880
3024H8668880k638085k540340k305647j691397j499881j901368k142449k673799
3016G1275914l088340k703774k050243k286640k119110j986307j656284j930510
3008E3454706j766322j521353j138764j600849j434873j469976j219777j062518
3000D2240274j077711j337502j199344j217644o99408o05685p33474o55102p59441
2991C3954963o32109o49761o09315m61308k61932r2960l13849m48340K96170j984
2981C0779575k64025q6983l22801p8055j39330O0586j38416k34986k48199O160
2971B9333526J891q42751q86104m68715l49900n31436o29127r4723k34123k56916
2961B5041622P3969k81879j50864l0142N9246j56637k8224L38484K46769k2993
$$ plain form
3024 88668880 86030795 83490455 81184808 79493411 77993530 76092162 73949713 71275914
3016 71275914 68187574 65483800 63433557 61146917 59027807 57041500 55385216 53454706
3008 53454706 51688384 50167031 49028267 47427418 45992545 44522569 43302792 42240274
3000 42240274 41162563 39825061 38625717 37408073 36708665 36102980 35369506 34714404 33954963
2991 33954963 33322854 32673093 32063778 31602470 31340538 31247578 30933729 30485389 30781559 30779575
2981 30779575 30515550 30428567 30105766 30027711 29888381 29948967 29810551 29575565 29327366 29333526
2971 29333526 29335417 28492666 27606562 27137847 26787947 26256511 25627384 25532661 25298538 25041622
2961 25041622 25115591 24833712 24682848 24652706 24711952 24555315 24527091 24865575 25112344 25089351
2951B5089351J45728K70932K82738O9410j28175J36963J03080m18960m85315n52643
2941B4513109m30893n08985l25807m53374l64957j31161J52277k7084n3639J93275
2931B2562761n1294j17112o5496k89664k4298k32824m02853j60370k54288k53485
2921B0711077l06321m985k94910k7988l5774k16651M6564j58527J35465l14829
2911A9533121p9402m80668O3681l39933N0863j91308r9958k40743k94051O0786
2901A7982388N4173Q6360J46973k47961o2776K39525L70842n5236M2280n9483
2891A8497085M88862m11256Q396m0981N0035j76825j97552J75400J62324L20423
2881A8875911k59758k37698j9712O8898m14721p5790j94284P5562J5119K52755
$$ plain form
2951 25089351 25235079 25506011 25788749 25858159 25729984 25866947 25970027 25551067 25065752 24513109
2941 24513109 24082216 23573231 23247424 22794050 22429093 22297932 22450209 22423125 22369486 22562761
2931 22562761 22511467 22394355 22328859 22039195 22014897 21782073 21379220 21218850 20964562 20711077
2921 20711077 20404756 20399771 20104861 20076873 20041099 19824448 19871012 19712485 19847950 19533121
2911 19533121 19453719 18973051 19036732 18696799 18747662 18556354 18456396 18215653 17921602 17982388
2901 17982388 18036561 18122921 18269894 18021933 17959157 18198682 18569524 18514288 18556568 18497085
2891 18497085 18985947 18574691 18583087 18542106 18592141 18415316 18217764 18393164 18555488 18875911
2881 18875911 18616153 18378455 18358743 18427641 18012920 17937130 17742846 17818408 17833527 18086282
2871A8086282j18651j76906K05365J25781q2097j39961O2488K20121k11782J0064
2861A7980704J38977J09243l24579j59566k33152K54056l61342J8412N5696l02980
2851A7175469l6415p3003o4063j3911J21765m8065q1651K35298K3508L873n19227
2840A6723578J31941O2667M0767J063k46234k23627J32010r5218J99307k08305
2830A6517949l76454J87409J38588p7883N112m51122j42242J82846k09952k73540
2820A5500711M2873k89125o1690o1728L1187J4767O2614K70135k47095r0169N4323
2809A5226803j29746R783Q4083j4327J16294R8180j13039j83700O8546n7330j55349
2798A4950198j81822J30087L45217K573k80627j7150O1053K2165k29506J06856
$$ plain form
2871 18086282 17967631 17790725 17996090 18121871 18039774 17899813 17962301 18182422 17970640 17980704
2861 17980704 18119681 18228924 17904345 17744779 17511627 17765683 17404341 17422753 17478449 17175469
2851 17175469 17139054 17066051 17001988 16988077 17109842 17061777 16980126 17215424 17238932 17242805 16723578
2840 16723578 16855519 16918186 16958953 16960016 16713782 16490155 16622165 16526947 16726254 16517949
2830 16517949 16141495 16328904 16467492 16389609 16394721 15943599 15801357 15984203 15774251 15500711
2820 15500711 15543584 15254459 15192769 15131041 15162228 15176995 15239609 15509744 15262649 15172480 15226803
2809 15226803 15097057 15106840 15190923 15176596 15292890 15391070 15278031 15094331 15162877 15105547 14950198
2798 14950198 14768376 14898463 15243680 15246253 14965626 14948476 15009529 15031694 14802188 14909044
2788A4909044J96868J08919l2754k29763J47065J72491j91771P7200L42915K21136
2778A5721350J7980J88159k29233J80310L00506R4590n76J52558Q3225L31142
2768A6840011N6755J57979K76007L92182J44283J09297k03879P0260J22993q7772
2758A7878116L02127j24909L31768L5188M01660K07115M85222O2784j84635J51392
2748A9545828J49197P89666P9058K82214M50351p0360L45208K49712L92695j18093
2738B2095476N6920M11285K24821L1805p2498M72441Q5377N14415N87682K06622
2728B4614346M98819L41435M97509L40211M09625M69805L09140P95175N27122
2719B8803187J060960L46240K87643L23216M57487N94980N34801L03852K94704
$$ plain form
2788 14909044 15105912 15214831 15182077 14952314 15099379 15271870 15080099 15157299 15500214 15721350
2778 15721350 15739330 15927489 15698256 15878566 16179072 16273662 16273086 16425644 16508869 16840011
2768 16840011 16896766 17054745 17330752 17722934 17867217 17976514 17772635 17842895 17965888 17878116
2758 17878116 18180243 18055334 18387102 18422290 18823950 19031065 19516287 19579071 19394436 19545828
2748 19545828 19695025 20484691 20563749 20845963 21296314 21225954 21571162 21820874 22213569 22095476
2738 22095476 22152396 22563681 22788502 22820307 22747809 23220250 23305627 23820042 24407724 24614346
2728 24614346 25113165 25454600 25952109 26292320 26701945 27171750 27480890 28276065 28803187
2719 28803187 29864147 30210387 30498030 30821246 31278733 31873713 32408514 32712366 33007070
2710C3007070O49682O33461M26535K43660Q48732P54373O45890R75955L80233
2701C8565591Q65957J145832J229042Q33418R33859R31557R56307J041400J159374
2692D7662337J393731R46380J220062J380687J135360R67140O19660P17719J266909
2683E7309985J396829J023300J256440J243278J178915J715047J704939J665606
2675F8494339J871215K017784J735513K535077K220334K399433K630775L114924
2667H7019394K942849K926294L458818M160744M885216M890029N770916O825289
2659A22879549P232823P694269P942596Q085641Q477280Q458973Q180264P291300
2651A86242695M920676J754427k398630o021978q491410q881493r117967q105793
$$ plain form
2710 33007070 33656752 34290213 34716748 34960408 35809140 36563513 37209403 38185358 38565591
2701 38565591 39431548 40577380 41806422 42639840 43573699 44505256 45461563 46502963 47662337
2692 47662337 49056068 50002448 51222510 52603197 53738557 54705697 55325357 56043076 57309985
2683 57309985 58706814 59730114 60986554 62229832 63408747 65123794 66828733 68494339
2675 68494339 70365554 72383338 74118851 76653928 78874262 81273695 83904470 87019394
2667 87019394 89962243 92888537 96347355 100508099 105393315 110283344 116054260 122879549
2659 122879549 130112372 137806641 145749237 153834878 162312158 170771131 178951395 186242695
2651 186242695 191163371 192917798 190519168 184497190 176005780 167124287 158006320 149900527
2643A49900527o693694n906571m602288k953756j475990j55575k66544k427471
2635A25418638m519252n514655n396850n211620m597321m503015l434404k767452
2627H9474069k262734j722674j670360j457162j066292p49333l09261J20138J01650
2618H0458041O97075J551327K755576M348448O118412N229402J214223m645032
2610I7727472p768915q233257q092270o606900n186359l862061l118632k454631
2602E2404447j526940j508213j165969p94965m52998m41518K69581L82666R2313
2593D7258404N87587R68061K311310K335178K580241J153466k192741l586410
2585E1415096m267953l829698k974608k603683j419422j378764j347000q55930
$$ plain form
2643 149900527 143206833 137300262 132697974 129744218 128268228 128112653 127846109 125418638
2635 125418638 120899386 115384731 109987881 104776261 100178940 95675925 92241521 89474069
2627 89474069 87211335 85488661 83818301 82361139 81294847 80545514 80236253 80356391 80458041
2618 80458041 81155116 82706443 85462019 89810467 95928879 101158281 102372504 97727472
2610 97727472 89958557 81725300 73633030 67026130 61839771 57977710 54859078 52404447
2602 52404447 50877507 49369294 48203325 47408360 46955362 46513844 46783425 47166091 47258404
2593 47258404 47845991 48814052 51125362 53460540 56040781 57194247 55001506 51415096
2585 51415096 47147143 43317445 40342837 37739154 36319732 34940968 33593968 32738038
2577C2738038q41536q63623n41133r21648n08954m50687m84295n42769n33150
2568B7050243k64899k13150j18872m89592n40977l65319j88777l79620k12106
2559B4276931k38296j58307k48256n46719k98472j61079p8876k05472l64528o8110
2549B1908816j75149l79817K7477r1341l54471j77317l13906j98709M5868k54301
2539B0037150j07108r0472P4856k40862Q0224l73325j57412p8215l63244j8662
2529A8762930J23911k65451j18688j95754J4037j59202m55288K43639j92401l60476
2519A7397257j76636l58942j34109K17490j74689l09487k34600J15499j15919
2510A6225864N7279n6033k85777l30018J85661j32660m6316j0227j28625l04032
$$ plain form
2577 32738038 31896502 31032879 30491746 29570098 29061144 28610457 28126162 27583393 27050243
2568 27050243 26785344 26572194 26453322 25963730 25422753 25057434 24868657 24489037 24276931
2559 24276931 24038635 23880328 23632072 23085353 22786881 22625802 22546926 22341454 21976926 21908816
2549 21908816 21733667 21353850 21381327 21289986 20935515 20758198 20444292 20245583 20291451 20037150
2539 20037150 19930042 19839570 19914426 19673564 19753788 19380463 19223051 19144836 18781592 18762930
2529 18762930 18886841 18621390 18502702 18306948 18320985 18161783 17706495 17950134 17757733 17397257
2519 17397257 17220621 16861679 16727570 16945060 16770371 16460884 16226284 16341783 16225864
2510 16225864 16283143 16227110 15941333 15611315 15796976 15664316 15618000 15607773 15479148 15175116
2500A5175116l65747k1484K05178p2231l86965n6939q0391l16199j4976P3155
2490A4138517l2948K4251J11724l09297j68549L27957P0145O468M31072J18510
2480A4717850J0782k78057k27711Q37877k4989k04839O8569K13349O6178N4076
2470A5233085N46710L84474J70405n983K21167N35067N25737K88446K31511M47113
2460A8577732M84709L44278O54869N88132M63852N00519L31976p3196J24708J48798
2450B2146377K72005K28157N91715N02280J29253L03116K37103n6231O1611L34462
2440B4749848K05188N59268L37808N38758L84861M83190J019599J114558J659882
2431C1052960J200802O00581Q64833L43498q3090P96920R87053R90047J471045
$$ plain form
2500 15175116 14809369 14787885 14993063 14920832 14533867 14476928 14396537 14080338 14065362 14138517
2490 14138517 14105569 14129820 14241544 13932247 13763698 14091655 14161800 14168268 14599340 14717850
2480 14717850 14728632 14450575 14222864 15060741 15035752 14830913 14899482 15112831 15179009 15233085
2470 15233085 15779795 16164269 16334674 16328691 16549858 17084925 17610662 17899108 18130619 18577732
2460 18577732 19062441 19406719 20061588 20649720 21113572 21614091 21946067 21872871 21997579 22146377
2450 22146377 22418382 22646539 23238254 23740534 23869787 24172903 24410006 24353775 24415386 24749848
2440 24749848 24955036 25514304 25852112 26390870 26775731 27258921 28278520 29393078 31052960
2431 31052960 32253762 32854343 33719176 34062674 33979584 34776504 35763557 36753604 38224649
2422C8224649J206575O77459O24074M50802M87296P61171R49731N87152K99374
2413D4268283M10448L90028O15504N90163P43010P39521R57640J333851J052359
2404E1100807J514062J833819J776053K161521K368106K596919L071752L211599
2396F9634638K698973J585345m55310j262837k871252l261537k790211k294578
2388F0983231j300188j012994n34361K5665P60422J138400J106960J594540J715278
2379F4476953J275063J477686J291323J385473N95005k93336o10303j742954k427388
2370F5427522k649472k933665l255097k465980k013229j775358j446928p84187
2362D8103606n17651J69469l99575j33062r6531p03965j021324r42269j080525
$$ plain form
2422 38224649 39431224 40108683 40732757 41183559 41670855 42432026 43381757 43968909 44268283
2413 44268283 44678731 45068759 45684263 46274426 47017436 47756957 48714597 50048448 51100807
2404 51100807 52614869 54448688 56224741 58386262 60754368 63351287 66423039 69634638
2396 69634638 72333611 73918956 73463646 72200809 69329557 66068020 63277809 60983231
2388 60983231 59683043 58670049 58135688 58161353 58921775 60060175 61167135 62761675 64476953
2379 64476953 65752016 67229702 68521025 69906498 70501503 70208167 69597864 67854910 65427522
2370 65427522 62778050 59844385 56589288 54123308 52110079 50334721 48887793 48103606
2362 48103606 47585955 47755424 47355849 47222787 47126256 46422291 45400967 44458698 43378173
2353D3378173j768513k437309k587735k177359k109536j640631k026560j344848
2345B7285682r74804j276067j156220q08013p42233r23233o34588n40547o18042
2336A9611935k90784n31171q68703n19629n28367r02385p17502j04039l37430
2327A4811925q99577l78885k27629n24917k20836m12096m91949m44655m00955
2318A0810426j66825k11197N2164n01923l68016k579n1287k80085J34834k75994
2308I139518k08051k54454l40242k12444j25494k3840m6197k20651j43842k93990
2298G270313p0791j14549m50979j50654Q6022j4918j05474j81672m13514J44671
2288E998455Q6097j65114r7267l11685L4588K59933l00343m07340P6091J94659
$$ plain form
2353 43378173 41609660 39172351 36584616 34407257 32297721 30657090 28630530 27285682
2345 27285682 26310878 25034811 23878591 23070578 22328345 21405112 20770524 20229977 19611935
2336 19611935 19321151 18789980 17921277 17401648 16873281 15970896 15253394 15149355 14811925
2327 14811925 13912348 13533463 13305834 12780917 12560081 12147985 11656036 11211381 10810426
2318 10810426 10643601 10432404 10484568 9982645 9614629 9612050 9560763 9280678 9415512 9139518
2308 9139518 8931467 8677013 8336771 8124327 7998833 7974993 7928796 7708145 7564303 7270313
2298 7270313 7199522 7084973 6633994 6483340 6569362 6554444 6448970 6267298 5853784 5998455
2288 5998455 6084552 5919438 5822171 5510486 5545074 5805007 5504664 5097324 5173415 5368074
2278E368074k06718l58610l3263j64537m7934k10196J60313p9218m22071J98963
2268D204803k46957k12279o5358K36315k8202l81134l3641j16374j87834J3595
2258C182934Q1433J07981q3789k11853J25860J35040r7360M7784j57959l84049
2248B746022m2100R3206Q7304N5557k57576P1810J08658J2415O5818j05350k0394
2237B815370k7933k133j64097j73939j4578K36800j20681l63599N8633J80754
2227B424597P5562K04234k96076o1085N9298m5541P7992k20641K16126o9848k3667
2216B340951N4684J10381m60554R1776J03439K25678J14224k7088J46646k7217
2206B672920l19109O963o032j09514o5939j11345Q0290K16220j37029j6889K39832
$$ plain form
2278 5368074 5161356 4802746 4769483 4604946 4557012 4346816 4507129 4427911 4005840 4204803
2268 4204803 3957846 3745567 3680209 3916524 3888322 3507188 3473547 3357173 3169339 3182934
2258 3182934 3264367 3372348 3288559 3076706 3202566 3337606 3240246 3288030 3130071 2746022
2248 2746022 2703922 2797128 2884432 2939989 2682413 2754223 2862881 2875296 2941114 2835764 2815370
2237 2815370 2787437 2785304 2621207 2447268 2432690 2669490 2548809 2185210 2243843 2424597
2227 2424597 2500159 2704393 2408317 2347232 2406530 2360989 2438981 2218340 2434466 2364618 2340951
2216 2340951 2395635 2506016 2045462 2137238 2240677 2466355 2580579 2553491 2700137 2672920
2206 2672920 2353811 2360774 2354742 2245228 2179289 2067944 2148234 2364454 2227425 2210536 2450368
2195B450368j36440j65617O7540J27609j04687k65410j41786L99958k91441j28753
2185A811341k7063J80384j3717r2678M7702k2558j4240K01294J34077R031j65664
2174B047909Q9146j69680r6181J01640k06942J68895J86174j13900K72064K0671
2164B299796m01353k68269J80317J24679r0959k10287K5018J54778j88000p8547
2154A547173j73087K93468k22472l4596o1368J89604K47714l57081l1180K2104
2144A420279L45634K13248j61160k61474k49391K93459j02356j44165P7412K4838
2134A456324r8361Q2310l37883Q9479J84726k28902k69175L48934J07537j88023
2124A146966K34199P1499j67133j05548P4601j0837q807J55136l38723J83206
$$ plain form
2195 2450368 2313928 2148311 2215851 2343460 2238773 1973363 1831577 2231535 1940094 1811341
2185 1811341 1784278 1964662 1950945 1858267 1905969 1883411 1869171 2070465 2204542 2213573 2047909
2174 2047909 2137055 1967375 1871194 1972834 1765892 1934787 2120961 2007061 2279125 2299796
2164 2299796 1898443 1630174 1810491 1935170 1844211 1633924 1658942 1813720 1625720 1547173
2154 1547173 1374086 1667554 1445082 1410486 1349118 1538722 1786436 1429355 1398175 1420279
2144 1420279 1765913 1979161 1818001 1556527 1307136 1600595 1498239 1354074 1431486 1456324
2134 1456324 1357963 1440273 1102390 1191869 1376595 1147693 878518 1227452 1334989 1146966
2124 1146966 1381165 1452664 1285531 1179983 1254584 1243747 1234940 1390076 1051353 1234559
2114A234559k1089k0766R7075J4129j12243k21395J44564j03383N9809J29623
2104A200883j17078j50142J22128l38938j4501p2722J91780M4243J38952k79584
2094G25021J17215K04692J01641j21211j01839L15050j57371k42425j8182R4300
2084I16891j74229o3545l4128K75019J9780l95071O4616K44994J66139l68699
2074F51767P3978K6963r6435J51978J66071j55506J40808o4705N0110j41516Q896
2063H12409O4952L6423j25645J18486J95833l44543j11803k93949K19834R9467
2053F71464n7992J56708O902k0842k70613K03240j49001j10917L46492J37093
2043I12534k08052k91902K32199M40871j11308Q3438J94507j12098n22369k19874
$$ plain form
2114 1234559 1213470 1192704 1289779 1303908 1191665 970270 1114834 1011451 1071260 1200883
2104 1200883 1083805 933663 1055791 716853 702352 629630 821410 865653 1004605 725021
2094 725021 842236 1046928 1148569 1027358 925519 1240569 1083198 840773 822591 916891
2084 916891 742662 679117 644989 920008 939788 544717 609333 854327 1020466 651767
2074 651767 725745 752708 656273 808251 974322 818816 959624 894919 945029 803513 812409
2063 812409 877361 913784 788139 906625 1102458 757915 646112 352163 571997 671464
2053 671464 613472 770180 777082 756240 485627 688867 539866 428949 775441 912534
2043 912534 704482 412580 644779 1085650 974342 1057780 1252287 1140189 617820 397946
2033C97946K80165M9510j57525j44990J98868J70074R4649k68014K00687J57719
2023I79089k60534o8399j75530j09844J69601O3271j905L1494k6331j30933J3067
2012D83046J18319j89584J92175K42712j19909k09783J37420l23321j38299J48403
2002C41179J61726O5753l014K84792M2333J13838l33748L33607l65003o2481J81395
1991G60377k64505J68687J48176l78434j13133P8470N3842k87404K03423J88290
1981E57789j3321j31712r197K73283J50438k45162j19290J37230n5913J6325K00957
1970G61427j42045j04149j57649K70066l5421k9042K8683M6565N6560m49964j01776
1959A43255K22010L39894l00977J55723L397r2501M249j83448J50415l5948J73270
$$ plain form
2033 397946 678111 727621 570096 425106 623974 794048 888697 620683 821370 979089
2023 979089 718555 650156 474626 364782 534383 597654 595749 627243 600912 469979 483046
2012 483046 601365 411781 603956 846668 726759 516976 654396 331075 192776 341179
2002 341179 502905 568658 565644 850436 892769 1006607 672859 1006466 641463 578982 760377
1991 760377 495872 664559 812735 434301 321168 399638 453480 166076 369499 557789
1981 557789 544468 412756 403559 676842 827280 582118 462828 600058 544145 560470 761427
1970 761427 619382 515233 357584 627650 592229 563187 591870 638435 694995 245031 143255
1959 143255 365265 705159 404182 559905 563302 470801 475050 291602 442017 406069 579339
1948E79339p8123q5647p8570J60888j28250J35521M6469J27799l06023N0992L2321
1937D56716j83806N4904K0407J01961K79120r9966j45231O4947k87917N611J40094
1926D06840K84323j63605J26509k72994j25520L26922K06362L5150k80979p1472
1916D71536O6907K32769M76312j85633o91355J04809N1784n8783K17532j64990
1906E20888n7630J34347M9991m9305L58537m06431j30357J96361k1301q4982J48286
1895F58404n3156p4468K88865J69093j35837j36992j13488L0456J46961K08866
1885I88704o0453K7852Q9508k21859j03091j44196J3756K01125n440j8515O0794
1874H28185J27008J07751J26910j55991p0702R7933M13464J0196k04186r2384
$$ plain form
1948 579339 501216 415569 336999 497887 369637 505158 551627 679426 373403 424395 456716
1937 456716 272910 327814 348221 450182 729302 629336 484105 549052 261135 266746 406840
1926 406840 691163 527558 654067 381073 255553 582475 788837 823987 543008 471536
1916 471536 538443 771212 1247524 1061891 370536 475345 527129 468346 685878 520888
1906 520888 463258 597605 647596 598291 956828 550397 420040 616401 595100 510118 658404
1895 658404 605248 530780 819645 988738 852901 715909 602421 632877 779838 988704
1885 988704 928251 956103 1045611 823752 720661 576465 590221 791346 785906 767391 828185
1874 828185 955193 1062944 1189854 1033863 963161 1061094 1474558 1484754 1280568 1188184
1864A188184N88039j14875O9066K7212m2884Q1903R944j2688K15899j6154L9163
1853B032809j53310K59769j19734J29500M23925J20268N0422j8861j11052N6229
1843B669965N25003k20898k76878R0090N74415P0767j08030J36430J62718L86629
1833D010211l15004K96619K75814L64460k20153l9255J86247L67546J81254j40420
1823D967319M53161K97769J67006L65999M04661K10369K19422J31063N87910P62457
1813H567136K75649L88677Q02850P20251J330819J361892J569246J148507J398819
1804A7563846K204837K613345K368242L775422M858855P288022R476287J3442574
1796F3591430J4961364L33398j5654934j5821891j1605877p882939n377131l856897
$$ plain form
1864 1188184 1776223 1661348 1730414 1757626 1714742 1796645 1806589 1793901 2009800 1993646 2032809
1853 2032809 1879499 2139268 2019534 2149034 2572959 2693227 2743649 2724788 2613736 2669965
1843 2669965 3194968 2974070 2697192 2787282 3361697 3432464 3324434 3460864 3623582 4010211
1833 4010211 3695207 3991826 4267640 4632100 4411947 4372692 4558939 4926485 5107739 4967319
1823 4967319 5420480 5718249 5885255 6251254 6655915 6866284 7085706 7216769 7804679 8567136
1813 8567136 8842785 9231462 10034312 10754563 12085382 13447274 15016520 16165027 17563846
1804 17563846 19768683 22382028 24750270 28525692 33384547 40672569 50148856 63591430
1796 63591430 78552794 78886192 63231258 47409367 35803490 27920551 22543420 18686523
1788A8686523l014210j989954j843647p61111q10154q11850j012463j047977p64264
1779F630893q07323m02942r5119q62185k40186j07850m04224l73052K00829l36531
1769C202310P7852j78600l82186R5937k92076M4205k06160j32316j19126N1719
1759B161559j07065k1993j00328j5476k02498j01381J49977p3007Q1111j78985
1749A591914j20024L47700n82773J0584o2099P1216k4669J36983n3883l10046
1739A004903l0633n8408p1376J78185j95390K169K50353q774l20336j22246K64758
1728H93205r8424J17232o1916j47741J5432j42541J80759q5896k94135K46259
1718F22234N1915r5369J46986L1741j51917n8229L0422L06749M3140l95830k4784
$$ plain form
1788 18686523 15672313 13682359 11838712 11077601 10267447 9455597 8443134 7395157 6630893
1779 6630893 5823570 5420628 5325509 4463324 4223138 4115288 3711064 3338012 3538841 3202310
1769 3202310 3280162 3101562 2719376 2815313 2523237 2567442 2361282 2228966 2109840 2161559
1759 2161559 2054494 2032501 1932173 1916697 1714199 1612818 1762795 1689788 1770899 1591914
1749 1591914 1471890 1819590 1236817 1247401 1185302 1256518 1231849 1368832 1314949 1004903
1739 1004903 974270 915862 844486 1022671 827281 829450 1079803 1071029 750693 628447 893205
1728 893205 794781 912013 850097 702356 717788 575247 756006 670110 375975 622234
1718 622234 674149 578780 725766 757507 605590 547361 577783 884532 927672 531842 507058
1707E07058K11049j77264O9516j23061j20174K87156k03554p0983j0397L6956
1697D06302l4691K55467j92743k59545K68508L1766N6445Q2454j05700m1497j51076
1686C15690J34534k21630J52371J31358l45476Q7877O1834j0768K7507L9929j26148
1675B47078J15314j9036j25210J04763q2128N7250l5809J53915k43512R2032L79515
1664F44172m20732LL36424K55434l35330l02598K37336k77666N5741J34377J81608
1653E08769j53806m6213o4530k51012K36279m4099j3194L34587N4986j04899k16817
1642B40051O5715l7747K7641J36619K32702n29685N0601J50918L2535p4607q6047
1631B08696o7420k45429K26538r0279J53116J26365J35093n6756K7211j35842
$$ plain form
1707 507058 718107 540843 610359 487298 367124 654280 450726 379743 369346 406302
1697 406302 371611 627078 434335 174790 443298 475064 531509 613963 508263 466766 315690
1686 315690 450224 228594 380965 512323 166847 254724 316558 305790 333297 373226 247078
1675 247078 362392 343356 218146 322909 240781 298031 262222 416137 172625 264657 644172
1664 644172 223440 223443 559867 815301 479971 177373 414709 137043 192784 327161 508769
1653 508769 354963 308750 244220 -6792 229487 185388 172194 506781 561767 456868 240051
1642 240051 305766 268019 295660 432279 664981 135296 185897 336815 369350 294743 208696
1631 208696 141276 -104153 122385 32106 185222 311587 446680 389924 417135 281293
1621B81293K6324j05480j70975K19181J10214j12574L2334k4609j82799J6020
1611H8929o5212J31968l4863J76485J6930j0899K03295o1832o976k9077j6487
1600C92261R0354j66263l04240o379N03458J24866k11131J43689J13382q6188
1590E93809j89332K8017o1442N2805j22281Q3395m6511p6067N9646j300j85575
1579A35164q4364P3795O6198n9206J7888K83919j90768K71115J88737l92384k43444
1568F6650K30045o1748k48133O1198r4363M31802l8285k42764J74185p1863r5577
1557A11147o1649l04660r7923J45627K53832p4583P296m8381K26947j78922J78797
1546A57528r7109p4933K27457K2172j95925O9644j63042J37822J63605k48843
$$ plain form
1621 281293 307617 202137 31162 250343 360557 247983 280317 255708 72909 88929
1611 88929 23717 155685 120822 297307 314237 303338 506633 444801 437825 408748 392261
1600 392261 482615 316352 12112 5733 509191 634057 422926 566615 679997 593809
1590 593809 404477 432494 371052 423857 301576 384971 338460 262393 322039 320739 135164
1579 135164 50800 124595 190793 131587 149475 433394 242626 513741 702478 310094 66650
1568 66650 296695 234947 -13186 48012 -46351 385451 347166 104402 278587 206724 111147
1557 111147 49498 -255162 -353085 -207458 46374 -28209 -20913 -69294 157653 -21269 157528
1546 157528 60419 -14514 212943 235115 39190 108834 -54208 83614 247219 -1624
1536a624J42611K55472m58969j0310K68804J07373M1064K01317j47112r6068k04648
1525I7910j33576Q8287J7865l2979K68974P0406l52310Q5748k56497K98203L10261
1514D62292j83125k02596j44484l55K297l42102Q5076L43576L1057R2816N2753
1503A97205j15485j36370Q5588P6122q7857R4196l7081J21612j44138Q7775J72187
1492C13754j01080l31704n8385R9973K14550R6793J08039j52619j40171P2036
1482A21186q6254l7189K52977j25623k81189J39977L1384J65929Q5224J26145
1472C92567j71031l3762j22866j49280o9977L8853J12784q1567L4633J64878k24712
1461a09480N2843o0258P741J02436r5878J98595O9536K8395m49362J86392j27406
$$ plain form
1536 -1624 140987 396459 -62510 -72820 195984 303357 344421 545738 398626 302558 97910
1525 97910 -35666 52621 70486 37507 306481 376887 24577 110325 -146172 152031 462292
1514 462292 279167 76571 -67913 -68268 -65971 -408073 -322997 20579 51636 144452 197205
1503 197205 81720 -54650 30938 107060 19203 113399 76318 197930 53792 141567 313754
1492 313754 212674 -119030 -177415 -77442 137108 233901 341940 189321 49150 121186
1482 121186 34932 -2257 250720 125097 -156092 -16115 15269 181198 266422 392567
1472 392567 221536 187774 64908 -84372 -154349 -115496 -2712 -84279 -49646 115232 -109480
1461 -109480 -56637 -116895 -109154 -6718 -102596 95999 165535 193930 -255432 -69040 -196446
1450a96446k1550J09199L06803j74746J71112J43618n5032J3898L27886o5064
1440E59678k52740j69122O5767j65452K6860l6876J76438Q7399n79j34494k22478
1429f5599M0860M26690j56735J33497J09989k94179L3009l37639L30799k6033
1419A94659j87970q7807K3296J09073L80937m17879J8003j09680k09126M68739
1409A82245k7702j32426j19959J70201K67122l34429r7589j6494K07103K81502
1399C79574j83852j63066K0868j97496K17477m8041J61080O1822p7066l07888
1389a36588J69669M1676m4254J80546j43507m1747l46339K7308J09627L35707
1379A52098J31058m6537j05721J69575l5526K7463J19971n12472l9190Q3842O175
$$ plain form
1450 -196446 -217996 -108797 198006 23260 194372 337990 282958 296856 624742 559678
1440 559678 306938 137816 203583 38131 64991 28115 204553 291952 291373 156879 -65599
1429 -65599 -24739 401951 245216 378713 488702 194523 227532 -110107 220692 194659
1419 194659 6689 -81118 -57822 51251 432188 14309 32312 -77368 -286494 182245
1409 182245 154543 22117 -97842 72359 339481 5052 -92537 -109031 98072 379574
1399 379574 195722 32656 53524 -143972 73505 25464 186544 248366 171300 -136588
1389 -136588 33081 74757 30503 211049 67542 25795 -320544 -293236 -183609 152098
1379 152098 283156 236619 130898 300473 264947 292410 412381 -100091 -139281 -55439 -49264
1368d9264k09729k00702K60311o7643J91904K0819J07535J73689j40480J17445
1358B03885j87916q8021L40563j35327P2910n9997r6694k95064q1023K82410l5445
1347g9719N4358r3394l7353R4705K2871J88P1911j71992R5703q750K63792j27834
1335H4486o1489l3186L30834l30356q0374N6991J85304n6648N0935L12097j05199
1324C53395k03040Q0107J95846j75263L01246k80583j64093J46490J20166K6781
1314D01052r061l34163J07523O9421k76930n8868l4181L32052j01574K4407Q4208
1303B03886k41197m099J29088n7678k88702J25630J30236j01016j41190K91970
1293D6928l06k88520k58553N11337J72005k2867j25686L3455N8528m2520P2132
$$ plain form
1368 -49264 -258993 -459695 -199384 -267027 -75123 -54304 53231 226920 86440 203885
1358 203885 15969 -72052 268511 133184 206094 146097 49403 -245661 -326684 -44274 -79719
1347 -79719 -25361 -118755 -156108 -61403 -38532 -38344 33567 -138425 -42722 -51472 212320 84486
1335 84486 22997 -10189 320645 -9711 -90085 -33094 152210 95562 146497 458594 353395
1324 353395 150355 230462 426308 251045 552291 271708 107615 254105 374271 401052
1314 401052 391991 57828 165351 234772 -42158 -101026 -135207 196845 95271 119678 203886
1303 203886 -37311 -41410 87678 30000 -258702 -133072 -2836 -103852 -245042 46928
1293 46928 46622 -241898 -500451 10886 182891 160024 34338 67793 126321 83801 155933
1282A55933J38276J33201l66214n1104K9189J87358P207N3140k31064K5994j36631
1271e4715J00803n3670K74660o8057k4297q1353k03436K32299k96153K40986L41732
1260D08799k04587k2697j13355p5595j58400J80986K40194l23615o1766J6005
1250a14031K08593K20987k1678m25545n3870K818r065L22799k4300k36058L2920
1239i6430n5230J00486j33961J12965j2184J61903l17811n0549K81796K963L6069
1228C0017j02966r7761L17681k05514Q7255N1023j24377o1597J89534M99J4817
1217I8611l3732m77790K80306j40938K95061K44572k60126J19178J92592j72365
1207A45369j10942J20802m2515Q7734J05266k26938j18740j65101j1359N4404
$$ plain form
1282 155933 294209 427410 61196 10092 39281 226639 233846 286986 55922 81916 -54715
1271 -54715 46088 -7582 267078 199021 174724 93371 -110065 122234 -173919 67067 408799
1260 408799 204212 181515 68160 -7435 -165835 15151 255345 -68270 -130036 -114031
1250 -114031 94562 315549 293871 -131674 -185544 -182726 -191791 131008 106708 -129350 -96430
1239 -96430 -151660 -51174 -185135 -72170 -84354 77549 -240262 -290811 -9015 -6052 30017
1228 30017 -72949 -170710 146971 -58543 28712 79735 -44642 -106239 83295 83794 98611
1217 98611 64879 -412911 -132605 -273543 21518 266090 5964 125142 317734 145369
1207 145369 34427 155229 112714 200448 305714 78776 -39964 -205065 -216424 -162020
1197a62020J94777k991k25735L09105L59662k29455n9309p2378L9772P3185j18963
1186A05650n4762n7720k984M9198k23175K8254k458k2833M81258p6391m36344
1175b12307J06588M03833p1880j20619q7868N7413j9916j9654R7803j19484K9406
1164D3315J55934M5485l94962P1637J19122r6410k03154n2002L79307R2953K4166
1153A85391L3733m34643M6376N2345k8252j88143N1191M61158J32057m28255j29224
1142b46266L21986j61058L5883o8056J79174J7433j19982K30828j97292K9350
1132B2000J36576m18L1313k82678J24412J69260J8814k6474k14873j64308Q0049
1121a06327n567K55095j24721q5351O5165j01046J08857J71022k9449n7650q5093
$$ plain form
1197 -162020 32757 29766 -195969 113136 472798 243343 184034 111656 151428 224613 105650
1186 105650 50888 -6832 -9816 39382 -183793 -155539 -157997 -180830 300428 224037 -212307
1175 -212307 -105719 298114 226234 105615 17747 75160 55244 35590 133393 13909 43315
1164 43315 199249 244734 -150228 -78591 40531 -55879 -259033 -311035 68272 161225 185391
1153 185391 219124 -215519 -169143 -116798 -145050 -333193 -282002 179156 311213 -117042 -246266
1142 -246266 75720 -85338 -49455 -117511 61663 79096 -40886 189942 -7350 22000
1132 22000 158576 158158 189471 -93207 31205 200465 219279 192805 -22068 -186376 -106327
1121 -106327 -111894 143201 18480 -66871 -1706 -102752 6105 177127 147678 90028 4935
1110D935J2048P7014O1107l22811m6816J82026K39424l70014N730j7207J51224
1099b3340o6492j12562J13856J83434K1445j87839K04775k57462K2962k46415
1089c47638K33594J67520k774J49986J17919j56581j01368q4360J10814J0940
1079I8052K14353k90482M0571k30535L03321j00883l695l91620q2447N75841j13688
$$ plain form
1110 4935 16983 93997 155104 -167707 -214523 -32497 206927 -163087 -157357 -174564 -23340
1099 -23340 -89832 -202394 -88538 94896 116341 -71498 133277 -124185 -101223 -347638
1089 -347638 -114044 53476 50702 200688 318607 162026 60658 -23702 87112 98052
1079 98052 312405 21923 62494 -168041 135280 34397 30702 -360918 -443365 132476 18788
$$ [...]
##END NTUPLES=NMR SPECTRUM
##END=
