##TITLE=1H_EC-3305(V-26)
 CDCl3
 8 sc, 
 24.6.2024
##JCAMPDX= 6.0         $$ Bruker NMR JCAMP-DX V2.0
##DATA TYPE= NMR SPECTRUM
##DATA CLASS= NTUPLES
##ORIGIN= UXNMR, Bruker Analytische Messtechnik GmbH
##OWNER= root
$$ XWIN-NMR		Version 3.5
$$ Mon Jun 24 14:08:42 2024 Russian Standard Time (UT+4h)  she@DPX200
##.OBSERVE FREQUENCY= 200.1309
##.OBSERVE NUCLEUS= ^1H
##.ACQUISITION MODE= SIMULTANEOUS
##.ACQUISITION SCHEME= undefined
##.AVERAGES= 8
##.DIGITISER RES= 18
##SPECTROMETER/DATA SYSTEM= spect
##.PULSE SEQUENCE= zg30
##.SOLVENT NAME= CDCl3
##.SHIFT REFERENCE= (INTERNAL, CDCl3, 0, 13.4618)
##AUDIT TRAIL= $$ (NUMBER, WHEN, WHO, WHERE, WHAT)
$$ ##TITLE= Audit trail, XWIN-NMR		Version 3.5
$$ ##JCAMPDX= 5.01
$$ ##ORIGIN= Bruker BioSpin GmbH
$$ ##OWNER= she
$$ F:/spectra/data/she/nmr/H-F/1/pdata/1/auditp.txt
$$ ##AUDIT TRAIL=  $$ (NUMBER, WHEN, WHO, WHERE, WHAT)
(   1,<2024-06-24 14:07:07.89 +0400>,<she>,<DPX200>,
      <created by zg, POWCHK disabled, PULCHK disabled
       configuration hash MD5:
       00 E9 B6 7A A2 85 ED C7 34 08 36 98 17 FE 4E 26
       data hash MD5: 16K
       A4 95 BB 4E 29 A3 9C D7 CA 60 52 88 BA 99 6D 52>)
(   2,<2024-06-24 14:07:10.12 +0400>,<she>,<DPX200>,
      <Start of raw data processing
       efp BC_mod = 2 LB = 0.24 FT_mod = 6 PKNL = 1 PHC0 = -25311.62 PHC1 = 9.387481 SI = 16K 
       data hash MD5: 16K
       53 EF 65 49 66 9C CD 4C CA 87 79 6B BC 3D 1A 56>)
(   3,<2024-06-24 14:07:30.51 +0400>,<she>,<DPX200>,
      <pk PHC0 = -1.406511 PHC1 = -1.2 
       data hash MD5: 16K
       90 68 83 88 61 93 B8 46 13 ED FE C7 1F 32 AE 55>)
(   4,<2024-06-24 14:07:35.79 +0400>,<she>,<DPX200>,
      <abs ABSG = 5 
       data hash MD5: 16K
       2C 74 46 4E 1E 8F 1E F1 9D 65 F9 55 DE A3 25 FE>)
$$ ##END=
$$ 
$$ hash MD5
$$ D8 6E 07 A0 07 6B 50 9B 52 41 3B 9A 3C B3 82 A1
##$RELAX= 
##$RELAX= 
##$RELAX= 
##$RELAX= 
##$RELAX= 
##$RELAX= 
$$ Bruker specific parameters
$$ --------------------------
##$DU= <F:/spectra>
##$EXPNO= 1
##$NAME= <H-F>
##$PROCNO= 1
##$TYPE= <nmr>
##$USER= <she>
##$AMP= (0..31)
100 100 100 100 100 100 100 100 100 100 100 100 100 100 100 100 100 100 
100 100 100 100 100 100 100 100 100 100 100 100 100 100 
##$AQSEQ= 0
##$AQ_mod= 1
##$AUNM= <au_zg>
##$AUTOPOS= <>
##$BF1= 200.13
##$BF2= 200.13
##$BF3= 200.13
##$BF4= 200.13
##$BF5= 200.13
##$BF6= 200.13
##$BF7= 200.13
##$BF8= 200.13
##$BYTORDA= 1
##$CFDGTYP= 0
##$CFRGTYP= 5
##$CHEMSTR= <none>
##$CNST= (0..31)
1 1 145 1 1 1 1 1 1 1 1 1 1 1 1 1 1 1 1 1 1 1 1 1 1 1 1 1 1 1 1 1 
##$CPDPRG= <>
##$CPDPRG1= <>
##$CPDPRG2= <>
##$CPDPRG3= <>
##$CPDPRG4= <mlev>
##$CPDPRG5= <mlev>
##$CPDPRG6= <mlev>
##$CPDPRG7= <mlev>
##$CPDPRG8= <mlev>
##$CPDPRGB= <>
##$CPDPRGT= <>
##$D= (0..31)
0 1.2 0 0 0 0 0 0 0 0.06 0 0.03 0 0 0 0 0.0002 0 0 0 0 0 0 0 0 0 0 0 0 
0 0 0 
##$DATE= 1719223627
##$DBL= (0..7)
120 120 120 120 120 120 120 120 
##$DBP= (0..7)
150 150 150 150 150 150 150 150 
##$DBP07= 0
##$DBPNAM0= <>
##$DBPNAM1= <>
##$DBPNAM2= <>
##$DBPNAM3= <>
##$DBPNAM4= <>
$$ [...]
##$SUBNAM3= <"">
##$SUBNAM4= <"">
##$SUBNAM5= <"">
##$SUBNAM6= <"">
##$SUBNAM7= <"">
##$SUBNAM8= <"">
##$SUBNAM9= <"">
##$SW= 18.0517689322627
##$SWIBOX= (0..15)
0 0 2 0 0 0 0 0 0 0 0 0 0 0 0 0 
##$SW_h= 3612.71676300578
##$TD= 16384
##$TD0= 1
##$TE= 0
##$TE2= 300
##$TE3= 300
##$TEG= 300
##$TL= (0..7)
0 120 120 120 120 120 120 120 
##$TP= (0..7)
150 150 150 150 150 150 150 150 
##$TP07= 0
##$TPNAME0= <>
##$TPNAME1= <>
##$TPNAME2= <>
##$TPNAME3= <>
##$TPNAME4= <>
##$TPNAME5= <>
##$TPNAME6= <>
##$TPNAME7= <>
##$TPOAL= (0..7)
0.5 0.5 0.5 0.5 0.5 0.5 0.5 0.5 
##$TPOFFS= (0..7)
0 0 0 0 0 0 0 0 
##$TUNHIN= 0
##$TUNHOUT= 0
##$TUNXOUT= 0
##$USERA1= <user>
##$USERA2= <user>
##$USERA3= <user>
##$USERA4= <user>
##$USERA5= <user>
##$V9= 5
##$VALIST= <valist>
##$VCLIST= <CCCCCCCCCCCCCCC>
##$VD= 0
##$VDLIST= <DDDDDDDDDDDDDDD>
##$VPLIST= <PPPPPPPPPPPPPPP>
##$VTLIST= <TTTTTTTTTTTTTTT>
##$WBST= 1024
##$WBSW= 4
##$XGAIN= (0..3)
0 0 0 0 
##$XL= 0
##$YL= 0
##$YMAX_a= 259180
##$YMIN_a= -560825
##$ZGOPTNS= <>
##$ZL1= 120
##$ZL2= 120
##$ZL3= 120
##$ZL4= 120
##$ABSF1= 16.12816
##$ABSF2= -1.923737
##$ABSG= 5
##$ABSL= 3
##$ALPHA= 0
##$AQORDER= 0
##$ASSFAC= 0
##$ASSFACI= 0
##$ASSFACX= 0
##$ASSWID= 0
##$AUNMP= <proc_1d>
##$AZFE= 0.1
##$AZFW= 0.1
##$BCFW= 0
##$BC_mod= 2
##$BYTORDP= 0
##$COROFFS= 0
##$CY= -3
##$DATMOD= 1
##$DC= 0
##$DFILT= <>
##$DTYPP= 0
##$F1P= 0
##$F2P= 0
##$FCOR= 1
##$FTSIZE= 16384
##$FT_mod= 6
##$GAMMA= 0
##$GB= 0
##$INTBC= 1
##$INTSCL= 3.70164e-10
##$ISEN= 128
##$LB= 0.24
##$LEV0= 0
##$LPBIN= 0
##$MAXI= 10000
##$MC2= 0
##$MEAN= 0
##$ME_mod= 0
##$MI= 1.114404
##$NCOEF= 0
##$NC_proc= -7
##$NLEV= 6
##$NOISF1= 3.799351
##$NOISF2= 2.8
##$NSP= 0
##$NTH_PI= 0
##$NZP= 0
##$OFFSET= 13.46176
##$PC= 1
##$PHC0= -25313.03
##$PHC1= 8.187481
##$PH_mod= 1
##$PKNL= yes
##$PPARMOD= 0
##$PSCAL= 0
##$PSIGN= 0
##$REVERSE= no
##$SF= 200.130012256936
##$SI= 16384
##$SIGF1= 3
##$SIGF2= 2
##$SINO= 5.538805
##$SIOLD= 16384
##$SREGLST= <1H.CDCl3>
##$SSB= 0
##$STSI= 16384
##$STSR= 0
##$SW_p= 3612.71676300577
##$SYMM= 0
##$S_DEV= 0
##$TDeff= 16384
##$TDoff= 0
##$TI= <>
##$TILT= no
##$TM1= 0
##$TM2= 0
##$TOPLEV= 0
##$USERP1= <user>
##$USERP2= <user>
##$USERP3= <user>
##$USERP4= <user>
##$USERP5= <user>
##$WDW= 1
##$XDIM= 16384
##$YMAX_p= 442463911
##$YMIN_p= -605790
$$ End of Bruker specific parameters
$$ ---------------------------------
##NTUPLES= NMR SPECTRUM
##VAR_NAME=  FREQUENCY,     SPECTRUM/REAL,   SPECTRUM/IMAG
##SYMBOL=    X,             R,               I
##VAR_TYPE=  INDEPENDENT,   DEPENDENT,       DEPENDENT
##VAR_FORM=  AFFN,          ASDF,            ASDF
##VAR_DIM=   16384,         16384,           16384
##UNITS=     HZ,            ARBITRARY UNITS, ARBITRARY UNITS
##FACTOR=    0.220516191357247, 1,           1
##FIRST=     2694.10210719582, 0,            0
##LAST=      -918.614655809953, 0,           0
##MIN=       -918.614655809953, -605790,     0
##MAX=       2694.10210719582, 442463911,    0
$$ Real data points
##PAGE= N=1
##DATA TABLE= (X++(R..R)), XYDATA
$$ [...]
11969 140116 -4559 -23756 -40579 -37634 145631 102046 -88843 -207982 -190204 -275222 -196328
11958 -196328 -37373 6431 -30559 -82927 -197631 -164526 1644 197212 319362 1893
11948 1893 -242016 -197014 -232132 -225359 -313866 -83003 -14503 -98420 -19588 -189149 -9450
11937 -9450 -101265 -173493 -265084 130061 72798 -52674 -112455 -119348 -95366 -70701 -118483 -190433
11925 -190433 -320328 -218779 -223812 -204071 -88294 51364 31596 -75887 -235452 -379834
11915 -379834 -246304 -123356 49491 -169378 -241773 -123859 151334 92661 -69499 -313311
11905 -313311 -227574 -120681 -145131 -103515 -20138 -259713 -72662 26317 -45738 59862 -32910
11894 -32910 58516 -54550 27498 -95078 -275413 -218823 -202193 -263023 -255486 -262427 -318030
11883 -318030 -159718 -245866 -243121 -457184 -376141 -389984 -333423 -92574 -125275 14871 25123
11872 25123 21357 -186510 -287237 -175202 -162013 -242947 -113834 -143900 -245166 -253401 -120743
11861 -120743 121953 -75498 41503 84724 -121507 -216757 17161 6023 -22902 -102254
11851 -102254 -240812 -252099 -30822 36894 -168184 -19726 61235 -292458 -454531 -246077
11841 -246077 98085 -67600 -150192 -94912 -254741 -55341 -45349 96221 94005 -91483 -45708
11830 -45708 25919 -255140 -400433 -198017 -56597 -14301 -160732 -101804 -115993 -29498 -24870
11819 -24870 -217230 -249954 -151871 -237704 -61891 -240180 -453892 -306350 -197555 -136447
11809 -136447 -64240 62050 -62939 -228237 -344564 -173518 -77868 -312746 -282645 60198
11799 60198 139054 97148 128984 64733 -182409 8568 -115507 118458 -66706 -186476
11789 -186476 130343 161732 266756 -7492 -137701 73679 66845 140830 154099 91345 -65443
11778 -65443 14931 -195917 -209271 -218844 -173159 -166110 -196209 -282836 -199593 -72352 -8710 22425
11766 22425 70089 35000 -59857 -115884 -267606 -326810 8388 -125417 -285365 -264646 -229934
11755 -229934 -305100 -301894 -254254 -306692 -231898 -133149 -37677 -214074 14587 -45622 -209660
11744 -209660 -294408 -212131 -102878 -53807 -14087 -12752 -184331 -180307 -259402 -81588 15208
11733 15208 -17302 -78807 61029 44659 162163 -1371 -197613 -18809 -87236 -112457 -2893
11722 -2893 -29633 -158285 -38448 5884 -151556 -54304 -30902 -92889 -102834 75401 -197837
11711 -197837 -272319 -125509 -131827 -288471 -322482 61021 91532 -85435 -113272 -82383 -238192
11700 -238192 -308575 -304247 -253906 -473110 -511992 -345756 -223905 -246040 -146329 -185713 -145564
11689 -145564 -157494 -201367 -49443 22111 46599 32839 92009 34618 237764 38970 -87272
11678 -87272 53306 16632 93061 -49635 -114997 -83665 111745 -125628 -82110 -115012 -200473
11667 -200473 -82392 -197216 2771 -71606 49263 -33140 -294070 -190485 -242049 -278888
11657 -278888 -105050 -73363 -88981 -37299 -126297 -20853 144125 30649 22371 1695 -50169
11646 -50169 -190599 -228597 -129395 -126487 -109145 71212 5285 -115550 -221969 -133901 -72357
11635 -72357 -259036 -317316 -34899 -58512 -189847 -243017 -132359 -106539 -4703 77350 -5671
11624 -5671 113720 30299 -161751 -70684 -15869 -143034 -89764 57855 -159903 -168203 -64406
11613 -64406 110457 159797 31929 -1063 -31362 137193 -79256 -141628 -82571 5646 8825
11602 8825 101270 94683 86060 461 -134144 -126875 -57938 -102931 -174561 22246 251338 233713
11590 233713 188421 -83400 -156197 -242579 -201410 -29528 150138 27455 96198 76927 -92322
11579 -92322 -81980 -21559 -28906 -171250 -118168 11561 -67778 -361487 -194658 63796 -6109
11568 -6109 -70105 -108766 175020 -33938 -199604 -73253 175758 402185 194122 52517
11558 52517 101298 224514 194965 271560 177457 41875 -106274 -118434 -248074 -72513 -53963
11547 -53963 -220704 -244014 -155509 -295493 -285836 -231373 -53650 -103712 -246149 -39594 176574
11536 176574 139697 -101608 -137295 -13040 143611 58824 -50670 34076 -316 -85829 -72518
11525 -72518 -108419 -228751 -57094 170894 93156 144662 -18796 -23357 -5738 -32385 140696
11514 140696 208231 57822 83809 23431 72350 -109026 -109163 207867 128614 -143420 -92220
11503 -92220 -202716 -232156 172789 22809 23821 42672 113965 129688 -118346 -173935 55637
11492 55637 185428 184477 82270 129170 111879 100233 173216 -61728 -77701 -74529 178054
11481 178054 219164 311837 276698 -11389 3850 115934 38720 93941 229482 167842 117408
11470 117408 142257 217246 154466 88449 -18356 137280 98465 186118 427329 175941 74191
11459 74191 -37285 -29383 -90002 -157524 -149467 -73541 185295 164243 240990 70297 49507
11448 49507 15718 -38859 60463 297695 335284 74069 183695 -8040 -113631 -156690 -207245
11437 -207245 10777 143840 196966 147601 -39404 49529 139597 83525 -66310 75234
11427 75234 220242 93055 207015 228528 251587 30117 156909 144815 -42080 68004
11417 68004 143650 58252 108915 63631 -27878 116159 212467 260102 300353 171688 7979
11406 7979 84630 169788 173734 223077 103911 70880 154571 132794 119559 79555 36622 -52134
11394 -52134 -21247 -57431 -38973 -29278 -49165 -78897 -89492 -177790 -174598 69413 249195 36911
11382 36911 119049 121336 96788 176592 90461 222929 267568 -200256 -316865 -191452 -3394
11371 -3394 322691 230556 51250 -10859 38176 -20452 -39277 36758 179102 -31877 94625
11360 94625 99167 60081 92505 269135 295984 270192 212837 -70201 -138524 58360 13846
11349 13846 82357 155618 262698 235104 278029 234303 98506 192785 -32216 -32080 -25989 -62414
11337 -62414 133019 97767 48987 108186 -105014 80089 96475 -146853 -263573 -358777 -93969
11326 -93969 82104 26931 70052 103880 58284 88002 149411 258247 103013 10942 -106015
11315 -106015 -139233 119695 95689 132796 98070 220024 243323 138355 93186 -132662 -295478
11304 -295478 53315 105272 131589 93588 88317 96096 68453 40149 -44448 -139022 -71612 -31894
11292 -31894 -94536 -45061 -116278 -77242 -3815 -87560 -77687 -94761 -96735 -29504 164175 -51777
11280 -51777 -99578 -17529 -140824 -284193 -419683 -90307 38093 48447 180776 372256
11270 372256 295332 155130 153509 37935 258028 244131 333662 167632 60013 299350
11260 299350 363102 213239 74917 90520 121843 117604 211677 126462 157230 62016 87759
11249 87759 182678 86299 89534 -34437 68662 117910 88416 189096 276029 109270 -8564
11238 -8564 157846 -24484 -54548 326652 289093 223923 337341 340509 208695 128649 112056
11227 112056 23457 268847 489200 454431 544780 573327 470195 388133 456481 375839 524917
11216 524917 435124 550430 491376 643021 633131 1096101 1557361 1615000 1322113 1173973
11206 1173973 1070447 1004199 833091 770769 750129 861545 941137 547569 517198 415715
11196 415715 368622 136423 106183 87008 253684 392092 349197 316993 192325 285880 232097
11185 232097 357553 190232 42925 48784 92707 241723 189236 259695 83581 9688 -12346
11174 -12346 -1949 90814 264390 177572 113907 63069 53725 71241 -22362 109088 243392
11163 243392 191020 313066 366310 301494 405222 270404 327748 38663 -17390 310391
11153 310391 201995 192779 392192 138963 95748 263401 190917 241419 267637 361540 252534
11142 252534 436053 14536 202989 361722 224344 300194 33102 -22016 152143 226582
11132 226582 354759 540895 358369 264789 391772 432984 352700 358791 282093 115046 19331
11121 19331 -59040 -231227 77380 78061 26696 352922 128182 -50326 156774 260898 475194
11110 475194 326794 292352 401687 277686 283667 422014 412152 279994 181955 192593 330357
11099 330357 353819 308896 455439 345852 226377 172289 233561 74504 -3979 222025
11089 222025 469260 739669 458926 91339 192662 252265 406170 391209 196792 237841
11079 237841 171097 263442 340903 313662 560511 666868 389544 517031 430482 481002 608356
11068 608356 539212 516257 559397 437505 537419 743370 551304 559496 531032 471885 611047
11057 611047 499451 472930 706138 632859 515832 669893 513789 861941 754148 670995
11047 670995 787364 766001 860331 922386 968854 946772 1172243 1080573 980747 951162 864819
11036 864819 678459 764149 853910 937331 943880 866680 879337 765927 795954 1083884 1060435
11025 1060435 1019068 1085017 1274418 1490497 1389346 1277340 1403809 1542384 1459727 1347625
11015 1347625 1282666 1109310 1126676 1195415 1080443 1368909 1281640 1396573 1540335 1515760
11005 1515760 1308082 1593279 1635926 1587676 1658589 1512762 1382237 1457297 1477009 1431676
10995 1431676 1571159 1884708 1767371 1669533 1598613 1410116 1625072 1722632 1834989 1837948
10985 1837948 2022733 1924981 1883159 1962148 1955762 1910770 1937674 1968780 2106812 2158275 2182083
10974 2182083 2176235 2041918 2004663 2104543 1995821 1964024 1957595 2012665 2187905 2186075 2010972
10963 2010972 1923707 2052453 2082628 2022443 2215294 2409731 2309261 2197329 2260119 2376050
10953 2376050 2269704 1998300 2101966 2157148 2232412 2153813 2337313 2380611 2365430 2221061
10943 2221061 2485074 2384668 2325977 2195974 2502981 2591001 2133123 2136335 2281375 2190469
10933 2190469 2122243 2325968 2527405 2554054 2459533 2513644 2485191 2498849 2208497 2086846
10923 2086846 2023441 2115845 2101015 2033646 2135807 2251671 2472352 2417332 2212769 2351037
10913 2351037 2233017 2115277 2224735 2223403 2237569 2162745 2226301 2067946 2156399 2192721 2169877
10902 2169877 2346571 2149486 2094397 2210168 2223976 2243264 2261502 2300737 2254038 2167531 2109061
10891 2109061 2308958 2527157 2415987 2551528 2519260 2362579 2326266 2309262 2302235 2529168
10881 2529168 2597695 2496189 2395921 2487580 2518370 2473549 2535028 2578403 2605410 2758334 2806850
10870 2806850 2702835 2745636 2822857 2669788 2604727 2788797 2734158 2658360 2705167 2785944 2886085
10859 2886085 3011159 2934439 2878166 3071093 3257124 3130100 3184372 2981018 3159853 3257244
10849 3257244 3144752 3161735 3085304 3413699 3748519 3635151 3332270 3559834 3608272 3734615
10839 3734615 3663345 3579876 3621203 3828291 3952696 3907930 3928685 4044159 4113726 4272955
10829 4272955 4433942 4554800 4409746 4467989 4405753 4552365 4844868 4979581 5017351 5147534
10819 5147534 5370346 5217872 5168543 5383425 5554738 5840061 5976152 6260137 6211630 6278939
10809 6278939 6471775 6713679 6673993 6961314 7404898 7582943 7874531 8255518 8467213 8983224
10799 8983224 9264048 9377147 9470891 9275603 9212769 9512564 9637324 9773838 9998687 10235665
10789 10235665 10574301 11017673 11041166 11298344 11614048 12063796 12562926 12985346 13194366
10780 13194366 13578324 14154034 14652497 15164351 15775137 16350741 16828275 17510112 17978273
10771 17978273 18346608 18832531 19224822 20005756 20752190 21346060 22133888 22960669 23577870
10762 23577870 24480783 25189553 25899356 26917497 28374514 29987354 31729308 33734203
10754 33734203 35907950 38508805 41478421 44813117 48792964 53227956 58184097 64629709
10746 64629709 71661686 80193467 90589754 102862239 116127841 130959641 149566941
10739 149566941 175700196 212201760 240740489 228042425 203301926 173129641 139318323
10732 139318323 116004134 99277612 88178772 80022437 73915771 68203870 63775798
10725 63775798 59582280 56177572 52822216 49496530 46593994 44730973 43347059 42325984
10717 42325984 41513767 41375430 40979600 40949117 41208802 41546864 41820179 42862938 44021344
10708 44021344 45460222 47088579 49131717 51227392 54027351 57459659 60847509 63262377
10700 63262377 64815223 64514155 62569958 59624631 57065907 54726316 53425698 52425779
10692 52425779 51962602 51850020 51998000 52509713 53776554 54961023 56759628 58868568 61918293
10683 61918293 65412927 68360704 70414078 71290354 69863470 67358585 64763293 62304233
10675 62304233 60221806 59152468 58709861 58751374 59235724 60170056 61737533 64042691 66505586
10666 66505586 69303210 72572014 76911555 82201794 87665208 92272121 95394180 96499861
10658 96499861 95700107 93896106 90996629 87901174 84481766 81042384 78267737 76393514
10650 76393514 75527212 75603795 76306081 77713741 79642455 82651190 86333800 90799361 95220683
10641 95220683 98508723 100176401 100234410 98554284 95635922 92024853 88167973 84194803
10633 84194803 80544979 77343239 74769333 73219836 72755913 73249707 73937727 75489182
10625 75489182 77794996 80702150 84680132 89747468 95791566 102309754 108454513 113600665
10617 113600665 116663714 117805527 117449036 116349753 115707401 115896444 118127475 121318701
10609 121318701 124622777 126434980 125727149 122611874 117549892 112800205 109016746 106522841
10601 106522841 105803158 106670087 108580939 109878827 109320586 106166232 100305276 92733440
10593 92733440 85288996 78627070 72987801 68581397 65486922 63142685 61547108 60265636
10585 60265636 59656403 59580278 60045451 61069923 62531719 64542017 67303829 70887107 74859972
10576 74859972 78493878 81372692 83006231 83339019 83258132 82919306 83588708 85700157 89222338
10567 89222338 93777454 98452739 101878983 102875810 100896189 96420823 90646082 84709221
10559 84709221 79597122 76174861 74220849 73131413 72184281 70511905 67825108 63609932
10551 63609932 58509563 53234299 48065521 43686267 39784670 36812996 34250624 32113196
10543 32113196 30522506 28915971 27445035 25929460 24814424 23568088 22357750 21525936
10535 21525936 21129580 20241727 19360447 18698456 18098030 17366464 16975912 16442782 16002514
10526 16002514 15718435 15251611 14832575 14452910 14158289 13925110 13582512 13057457 12578986
10517 12578986 12455509 12157720 12005460 11966131 11740976 11589907 11288844 11043926 10787653
10508 10787653 10624104 10519453 10278266 10110720 9994181 9745406 9623415 9423120 9338543
10499 9338543 9345601 9316957 9097654 9030218 8897477 9015658 8998857 8685375 8852029 8619334
10489 8619334 8492398 8573353 8562422 8585030 8586047 8806184 8949558 8957903 8788314 8834744 9066092
10478 9066092 9004108 8924250 9092730 9330128 9617232 9720911 9556589 9520420 9407505 9348113
10468 9348113 9395622 9443523 9585305 9783686 9879380 9657125 9576460 9799493 9875303 10054710
10458 10054710 10271163 10458340 10632734 10685799 10776534 11031957 11264083 11365380 11736691 12051870
10448 12051870 12318359 12413338 12807719 13189933 13423532 13753252 14196307 14578533 15311526
10439 15311526 16100232 16568431 17136809 17880880 18810523 19914567 21126337 22582781 24076606
10430 24076606 25825321 27653174 29701779 32249537 35101803 38122848 41307759 43522438
10422 43522438 44059530 43398985 42601435 41854389 41835508 42380955 43718448 45718662 47906914
10413 47906914 50049375 51636136 52131586 51346267 49958257 48544334 47712964 47940113 48828292
10404 48828292 49535101 49638658 48640546 47051928 45621695 44268834 43596220 43564870 44077802
10395 44077802 45142855 46833568 48700362 50479202 51497988 51994917 52571402 53543438
10387 53543438 55232228 57841642 61123675 64840803 68481701 70748318 72021119 72050506
10379 72050506 70534863 68744299 67840623 67604330 68723038 70787848 73431867 76332836
10371 76332836 77891935 78481270 77670578 75781549 73415159 71437192 70346032 69452333
10363 69452333 69026235 68297034 66797777 64402207 61487375 58316911 55749686 53915150
10355 53915150 52819146 52539704 53069194 53291013 53262353 52663125 51610341 49608190 47472618
10346 47472618 45748921 44796693 44450629 44720800 45393309 45828327 45423340 44359445 42621815
10337 42621815 40635279 39180049 38738820 38767317 39276040 40278993 41334316 41934518 41851733
10328 41851733 40854393 39381323 37716850 36143107 35393808 35112697 35147369 34769204 33622511
10319 33622511 31825865 29612119 27638604 26297548 25231254 24687066 23966012 23985373 23947096
10310 23947096 23737394 23177663 21764114 20018712 18350657 16625532 15283433 14447384
10302 14447384 13449507 12767976 11979566 11519688 10856956 10282305 10087919 9772725 9503003
10293 9503003 9001842 8708420 8318436 7978441 8020303 7618623 7259598 6829410 6561561 6425775
10283 6425775 6307418 6332668 6155208 5803090 5631201 5836245 5599397 5400316 5233929 5038329
10273 5038329 4932280 4766049 4737379 4859962 4737731 4857620 4972311 4865278 4882004 4869732
10263 4869732 4751710 4776786 4969730 4753187 4737473 4811124 4600661 4264824 3839079 3761208
10253 3761208 3789928 3752487 3690424 3720691 3456589 3409527 3446364 3483926 3380389 3346739 3177025
10242 3177025 3090519 2852038 2819030 2980993 2847466 2780125 2757793 2523794 2413519 2365894
10232 2365894 2407231 2477803 2461917 2286044 2157163 2135683 2201984 2460694 2218156 1949576
10222 1949576 1973790 1902997 1759143 1938370 2010137 1945979 1884211 1840704 1687030 1947728
10212 1947728 1846744 1849938 2030138 1914706 1945891 1967771 1876397 1685893 1729015 1776240 1865724
10201 1865724 1797778 1831542 1907367 1911854 1930034 1834805 1740201 1795988 1728666 1475162 1379995
10190 1379995 1387314 1374841 1384391 1328816 1101885 1281803 1300779 1242569 1235592 1314969 1193096
10179 1193096 1304693 1306052 1262424 1165771 979520 924307 954804 881110 749113 1036027 1085732
10168 1085732 1004655 843743 1070942 1209917 1168379 1279645 1216921 1094266 1171858 976028
10158 976028 824336 873572 606252 713941 734396 794030 1016442 872637 687298 534641
10148 534641 534209 491996 238539 345916 595478 661389 626601 758556 736188 452168 548508
10137 548508 575750 294113 145874 405450 388486 407020 479271 438280 494912 564693 376929
10126 376929 478124 532975 457171 562493 448765 375485 400459 592333 759015 676859
10116 676859 576103 514482 483458 241174 283956 534924 633857 464155 508633 444936 409928
10105 409928 531360 238209 101857 313591 336659 329977 369928 394615 338886 309596 643735
10094 643735 782216 630402 537139 564021 495282 656925 547714 622129 925957 973123
10084 973123 813361 620754 682775 583876 846955 912069 889324 827555 885651 928800 799804
10073 799804 1026914 939627 901327 830453 814351 957161 1140646 884745 873832 771438
10063 771438 1012736 945240 738319 862999 1054437 1143211 1071433 1292746 1111658 1023566
10053 1023566 1129947 1090644 1244035 1210399 1173183 1222524 1254925 1334368 1236236 1395003 1480080
10042 1480080 1477983 1406873 1167718 1109674 1058443 1074925 909683 881478 978238 1197485 1157119
10031 1157119 1260392 1185866 1088124 1133666 1012545 1000542 1109315 1136299 1019262 1021950 1083349
10020 1083349 1127074 969868 832256 1016927 1114158 1096876 1384687 1214156 1281533 1531611
10010 1531611 1350367 1280244 1305756 1569025 1562604 1551574 1728023 1762835 1797159 1714920 1760615
9999 1760615 1781820 1522290 1472309 1620649 1618074 1431109 1361074 1124430 1240046 1298876 1034340
9988 1034340 1280937 1483590 1113879 895632 1331154 1194081 1175435 1131144 1435265 1341651
9978 1341651 1387279 1481589 1471328 1358226 1114227 973651 1077293 1000188 759142 752825 795552
9967 795552 684820 855469 929791 789542 740222 764402 765066 952318 828678 693121 662663
9956 662663 603648 402561 331135 516581 529860 538230 488534 398490 271875 323005 334122
9945 334122 436948 635905 578866 414501 478113 399975 450222 600138 527800 495111 304520
9934 304520 156537 282961 314071 299778 142213 152595 132657 41712 174666 71978 17855
9923 17855 145191 174758 136659 97662 26271 121763 180383 198860 361895 278905 154511
9912 154511 -40563 48171 3672 36499 -9442 -126397 13909 -115786 -187736 58906 -32849
9901 -32849 87440 119164 155030 35651 -64590 -41521 -24849 7794 -35819 137691 189735
9890 189735 70396 48537 55742 279866 79172 3050 -21867 250873 284070 174376 176452
9879 176452 134872 -80840 -213881 -337869 -174285 -160849 -188495 1019 -59888 -208473
9869 -208473 -66027 13482 -19334 8914 -53176 -47656 -126994 -20458 -65532 54406 127311
9858 127311 149799 -125868 -134813 17201 9323 120677 50842 -124022 -105802 31450 -142838
9847 -142838 -93546 31482 -209163 -106404 -7447 133223 244196 232934 111924 41949
9837 41949 92502 289579 408647 412054 308104 480663 302855 226386 119464 -41899 -39050
9826 -39050 -50070 16255 12038 75254 -106135 -115364 39889 -187774 -65069 -21207 166110
9815 166110 33106 36029 193456 -121811 -158977 21694 -93079 -133694 -82283 -218471 -276293
9804 -276293 -147189 -67032 -190920 -280991 -275556 -232731 -179563 -15957 -204849 12285 118811
9793 118811 -166978 -215092 -234872 -151164 62346 104296 -125921 -181687 -41391 -102101 21163
9782 21163 30966 105254 458046 322061 207571 122332 -103184 -63073 -173221 -56789 -31247
9771 -31247 -136128 -29818 -55846 -131934 100387 207630 -17852 -129392 -317214 -185670
9761 -185670 -40267 105744 292233 45015 26101 47956 -113703 -54966 -86058 -122126 -137402
9750 -137402 -150055 -192760 -340955 -232382 -266962 -365368 -153144 -150319 -167229 -134021 -186896
9739 -186896 85351 -37873 1872 15619 -12049 90123 133589 129367 -185865 -304926 -215526
9728 -215526 -192371 -317059 -313273 -294203 -149970 -13710 22962 -83685 -258244 -251038 -235879
9717 -235879 -288573 -436853 -459800 -352572 -176023 20770 111449 167581 305514 119041
9707 119041 -122778 -204210 -145197 -148897 -197595 58880 -23480 127687 119145 174749 109291
9696 109291 -113083 -45537 -96113 -762 94343 -101966 -162315 91263 -89523 -137917 -192004
9685 -192004 -251660 76207 136605 57519 -47140 -86479 21694 -180937 -75437 -155253 -90939
9674 -90939 -29867 -64902 -11810 -91075 49973 64822 -83505 77899 61898 349876 208234
9663 208234 -32959 75374 91301 55803 9974 20691 -114352 22462 21300 26364 42540
9652 42540 289863 278421 122209 39245 20624 94462 131722 2685 93236 16 -155755
9641 -155755 -142163 51753 48016 -76681 -159760 18904 11301 86866 133735 -113474 41103
9630 41103 150533 73799 -13805 90435 8543 -44640 79581 135983 114781 -162402 -328602
9619 -328602 -135467 -206666 -115457 194623 54207 -81355 -31090 70456 -94490 50933
9609 50933 -48448 -91432 65960 11214 104649 93165 48867 222776 93370 10767 50459
9598 50459 76664 -46443 23120 217684 -5098 178449 210094 6097 163641 286227
9588 286227 229771 143221 290482 155349 -96777 179244 164090 -45460 -164161 -74860
9578 -74860 -152888 -93834 141753 156003 -127036 -115830 9130 -166402 -190316 27412 77766
9567 77766 81985 -59388 -73126 3203 -126979 -95524 -4328 1236 14536 46194 -53659 43440
9555 43440 -16374 -51055 -6742 -152916 -127378 -91531 44556 5312 -30079 -170288 82406
9544 82406 92608 -90424 37469 170889 55930 120341 -5455 85259 203869 136931 -146455
9533 -146455 -134835 64770 -36961 85275 186815 210279 112606 130311 -61963 -105590 -81049
9522 -81049 -63915 -114297 -351392 -129104 -192110 -105606 819 -18922 52730 -104967 -104870 -47817
9510 -47817 -229113 -25572 204903 117612 52059 -111198 34187 155935 91956 69685 181281
9499 181281 88123 39215 -96555 -2429 -19460 -16681 61352 306910 260026 102437 12649
9488 12649 32499 207887 283271 -20403 191475 188258 178798 186487 117193 85905 77458 10161
9476 10161 63767 -56216 -145902 87800 -10594 193941 199922 1428 -5399 -36240 -54361
9465 -54361 -306971 -290908 -29838 39166 166054 104817 23898 63220 -28462 -61112 -246289
9454 -246289 -79571 187111 -38276 64421 -7432 40490 23831 -81270 43034 167865
9444 167865 189572 303758 218309 71253 -124692 -179747 -55237 15199 -50593 -171827 -52510
9433 -52510 -39441 -161568 -251775 -295839 -92269 41236 -54263 -83539 38559 -22909 129941
9422 129941 183546 187789 158474 115383 -85912 38108 74178 -193944 -118494 -251947 -163925
9411 -163925 -136737 161579 45563 -154972 21917 97493 182391 120317 -74777 -54471 98335
9400 98335 84335 -53452 -35415 -52919 -21877 16989 18755 -322637 -222813 -225346 -243373 -55649
9388 -55649 163169 250365 232315 258024 258798 187690 19373 419658 309619 523618 361105
9377 361105 378272 485268 314685 335644 468749 333478 362517 355389 355844 334495 372956
9366 372956 304551 426265 508287 510504 262221 284769 603433 404330 362452 495648 615237
9355 615237 610972 530626 398891 338982 302701 411505 188055 373886 448833 565501 592103
9344 592103 572922 416152 439572 332044 247281 164150 177106 147244 147743 298669 306268 328620
9332 328620 169255 228466 345868 325942 324262 395058 462119 369522 210017 64347 139130
9321 139130 268236 119142 177503 49704 127410 -225276 -156952 7849 -43963 142406
9311 142406 113243 205857 197192 327358 401354 337444 478180 189855 99867 -140735 -119849
9300 -119849 245096 128854 -91291 -3196 -17543 56619 61454 -65096 -109864 -104811 33080
9289 33080 -111573 7405 85754 263618 198959 247267 292569 119060 -105691 -62831 -52420
9278 -52420 -10303 187461 183845 -64354 1378 74052 82586 320686 -89804 -244162 -18484
9267 -18484 -68127 -8100 -151833 -265870 -81862 127786 94677 16299 124825 -116507 -81116
9256 -81116 103357 -10302 79035 236315 125128 83550 243460 176755 -32894 -52845 -117581
9245 -117581 -160843 -109090 -46444 45280 -218805 -146745 -98581 -57219 -102877 -127828 -10582
9234 -10582 -1644 -270782 -50276 -119383 -22707 -12630 -117871 -115447 -126205 -171732 -164512 -101285
9222 -101285 -157405 -201678 -155164 -233559 -123610 -48807 -400921 -207237 -126987 174423 365492
9211 365492 353667 280128 278097 145694 -76484 -32979 92816 173885 75520 -154376 -127038
9200 -127038 -129232 -142011 -256302 -50444 -137734 -142237 -214720 -203216 7373 -28199 -9604
9189 -9604 73275 -57548 -79388 -157948 -50819 -18222 141978 167720 12645 -135241 -159095
9178 -159095 15553 90228 66253 -75539 40176 -19660 -120492 67305 145504 28774
9168 28774 -53093 -269222 -250704 -116397 -40813 -80029 24809 70672 -228614 98236 194607
9157 194607 48197 -24861 -72797 6846 -231292 -277171 -300535 -387234 -280609 11100 -45987
9146 -45987 247893 194445 -74769 28650 71558 -73154 -70416 56794 -208168 -311192 -121041
9135 -121041 -232479 -192757 -64231 109975 -42190 -237694 25631 -43520 -19195 -77680
9125 -77680 -188527 -170217 -148472 35350 33035 151949 58285 -61981 -130493 -174203 -68035
9114 -68035 -6 -36056 -70716 37786 -24137 57646 86829 -1620 -11264 40399 232225 293389
9102 293389 27372 45555 -19468 -131268 -115314 -4268 -139131 -196442 -53051 -32018 28638
9091 28638 -8454 77132 -266 -42607 -35519 18859 47366 -177872 -92591 -156470 -153732 3959
9079 3959 30148 23184 -62549 88940 -98748 -177514 41041 12317 31366 -41830 59980
9068 59980 -37180 -195489 -134856 -188457 82629 -12138 15607 -2742 -105788 32659 100958
9057 100958 5240 63676 97479 230944 65578 -38948 46323 6702 -83719 -182203 65700
9046 65700 -5635 73368 71080 -99401 -83557 6912 -111852 -28910 117588 222553 24136
9035 24136 146175 225766 118099 141917 -2380 121640 175609 47315 101321 -37542 -62021
9024 -62021 -86625 11967 -13332 -98950 32346 53164 56951 25312 -9307 38110 -8542 -106431
9012 -106431 34152 218738 37062 -121659 62332 17606 -105084 96545 151236 -56238
9002 -56238 108169 73723 153176 52042 326000 217301 223626 233630 -23901 -27690 -28753
8991 -28753 17490 56088 -17138 115997 85002 -96659 -45262 -26471 138189 65773 192102
8980 192102 30141 -50825 88890 50479 144471 266602 36501 -74869 -54205 184343
8970 184343 429101 167053 147029 112874 29215 -198918 -184834 -140526 -192699 -160158 -41714
8959 -41714 96967 225488 233274 -13709 -56907 101074 154303 -13835 51843 49941 83515
8948 83515 188760 128421 251749 213366 31987 -4282 250955 434979 317676 159199
8938 159199 225262 321218 294583 231172 228052 265039 219083 153896 255279 369389 276891
8927 276891 260247 109068 214886 304820 349665 311111 463418 270766 200693 216634 339472
8916 339472 252567 112183 261115 278257 189994 12509 69844 232188 227623 248453 148700
8905 148700 228160 324435 97651 175677 65724 -188392 79312 47067 250824 512494
8895 512494 331732 449851 541153 388904 104004 258656 255963 135405 285369 238097
8885 238097 37991 -11016 37754 170315 223914 114593 62634 270743 359380 439880 364710
8874 364710 228657 97323 399123 543777 451620 298488 192747 502308 301551 268627
8864 268627 191213 256830 402030 283385 294042 393874 366867 466512 624757 629997 621149
8853 621149 611378 543423 437838 355579 440717 499663 494990 478558 405968 436764 376362 308042
8841 308042 232118 313498 517088 711985 588759 652091 989765 933301 851630 1111609 1423072
8830 1423072 1665718 1724993 1777250 1624125 1337694 1201570 1223117 1081462 1067532 939152
8820 939152 1212338 1255412 1315476 1357823 1306917 1193002 1132398 1080359 1158315 1312249 1220061
8809 1220061 1140651 1076873 1074969 930585 799122 821626 752339 730615 712545 496986 502838
8798 502838 549124 564619 564648 438496 324360 330412 326795 343677 337505 314653 238764 137327
8786 137327 114981 391170 496045 315254 347936 576442 329186 298464 246037 179575 248430
8775 248430 292077 129227 151832 149095 211586 356673 156126 8690 120662 65785 391341
8764 391341 423607 383888 220911 203304 333398 244991 127823 127598 149473 199069 223906
8753 223906 175172 228928 213099 181356 403628 411811 187066 349486 96191 124128 246260
8742 246260 283334 99359 71473 141743 -32552 -10192 26004 131716 369218 377485 449856
8731 449856 420708 337370 298131 446221 328001 25822 173948 216255 132949 180811 237211
8720 237211 46086 4631 18474 437338 713252 535274 448573 332975 309704 486166
8710 486166 593527 475001 506503 676833 404218 130667 215202 289276 316503 154020
8700 154020 333067 338354 247777 181290 226946 110644 157853 38412 30629 99090 343505
8689 343505 299174 52460 -12808 36474 158112 304610 136337 108294 259237 318497 362654
8678 362654 302818 198739 145654 224375 131019 50632 29619 185340 63418 21276 199099
8667 199099 298062 131319 131688 189569 401552 288036 105451 56362 56046 223528 466595
8656 466595 446579 356639 206847 249400 347105 168369 89647 29365 -25498 70059 72826
8645 72826 284016 419286 396242 245290 83624 121429 -25226 14880 -52904 -120275 3347
8634 3347 438156 566038 314575 380118 244414 310971 446716 385871 243607 316297 533391
8623 533391 456283 234991 460270 582158 414072 265124 402056 336214 601054 433798
8613 433798 223555 350060 255976 196881 205232 454785 323664 434276 573182 337106
8603 337106 152242 211526 298957 192501 -58047 96598 34420 38001 -336 -132766 100065
8592 100065 310113 142017 108384 178572 279926 410515 207383 79522 253242 341639
8582 341639 200536 -60398 255232 207877 106681 193039 114047 -107959 183250 414781
8572 414781 530698 500640 243534 401185 389536 403074 444849 251544 103522 224043
8562 224043 411322 433574 370741 356377 375549 328104 335479 243624 246378 395186 122728
8551 122728 195614 295579 497305 431539 82244 3467 83863 104893 297728 246130 313081
8540 313081 294999 312742 338683 482012 223234 257050 434765 243026 195303 241295 319348
8529 319348 376054 388249 338328 359489 331162 170014 110017 306903 297730 313944 333027
8518 333027 428190 383478 699080 570030 412042 457748 514695 410543 242761 338573 505938
8507 505938 600980 493339 583713 414810 506645 497968 267553 259422 127863 412536 560856
8496 560856 531872 447957 513812 430465 520913 471712 542686 597330 387972 490710 567451
8485 567451 545786 578403 493980 383405 442544 528241 665399 577932 438175 538010 556188
8474 556188 498756 550926 648051 783919 610091 430426 489969 456455 383023 463023 228620
8463 228620 369313 439368 513022 581401 622903 446479 488930 288886 576712 726935 514516
8452 514516 477759 669473 809777 581311 439639 616991 800104 605353 472610 460136
8442 460136 697245 716255 650496 830732 778063 496468 504158 606151 836805 904004 905304
8431 905304 600731 876167 1011200 1019107 893867 978593 929264 841147 899692 1014863 885917
8420 885917 886936 813638 1140967 964776 810876 1134079 876811 756551 676512 603638 568536
8409 568536 540807 748899 920181 839762 653971 841314 1097589 1096761 1259855 1166314 1113854
8398 1113854 1076018 1071040 1217919 892081 860281 713265 625864 766861 309352 430819
8388 430819 530375 492612 757065 1072015 998553 925391 781949 859128 692418 664420 684489
8377 684489 1000387 952637 907347 988592 827732 898019 724366 870278 1059875 853795
8367 853795 1029542 1328648 1367597 1223078 1330656 1222976 1171352 1155401 1225716 1298069 1355614
8356 1355614 1273970 1254286 1192298 1194010 1368175 1454324 1442958 1392823 1424579 1464639 1551024
8345 1551024 1650206 1701803 1683358 1667691 1569995 1431806 1381042 1369188 1412472 1377457 1489970
8334 1489970 1657059 1555271 1543748 1370047 1322288 1496356 1499734 1281548 1216305 1445168
8324 1445168 1530489 1576984 1687997 1620219 1452127 1506814 1466469 1334247 1399275 1419454 1604062
8313 1604062 1800754 1688921 1551272 1431858 1174959 1364150 1385401 1297533 1108326 1115708
8303 1115708 1208767 1278338 1197214 1295530 1308092 1258939 1376394 1213612 1362524 1298783 1132142
8292 1132142 1306179 1323340 1383171 1420179 1610203 1354633 1379117 1417735 1466108 1591112 1531346
8281 1531346 1446561 1562639 1572777 1605927 1716118 1889434 1869426 1808028 1864120 1812337 1773908
8270 1773908 1755849 1723865 1708792 1817883 1812892 1868516 1947674 1958221 2207892 2334615 2368736
8259 2368736 2283376 2101929 2230673 2012512 2205934 2558825 2390459 2225278 2194791 2370564
8249 2370564 2330141 2034599 1980008 1963046 2051729 2065619 2218872 2186741 1969671 2088133 2075365
8238 2075365 2091016 2173230 1924789 2046089 2365001 2238346 2291964 2325353 2320290 2563636 2475946
8227 2475946 2202142 2162022 2315118 2288708 2333405 2288222 2482490 2385603 2459003 2489194 2482934
8216 2482934 2313434 2426846 2577639 2409436 2466139 2477513 2372739 2670371 2764229 2450969
8206 2450969 2626288 2659898 2628019 2455467 2460849 2504301 2646002 2615390 2511615 2597805 2615375
8195 2615375 2512111 2523178 2558396 3355415 3244784 2701246 2732740 3039925 3180775 3107920
8185 3107920 2986711 3061112 3057165 2996909 3189631 3178144 3111536 2954609 3120018 3267901 3255894
8174 3255894 3174751 3258645 3106999 3250746 3113242 3047402 3153264 3028538 3181524 3521877
8164 3521877 3421648 3375201 3280157 3334123 3540651 3602578 3653051 3652722 3781217 4086002 3971719
8153 3971719 3645755 3826692 3840634 3938661 4040897 3853100 4005700 4101007 4100933 4122051 4211282
8142 4211282 4237203 4242522 4325239 4496679 4556696 4589009 4400240 4441954 4564539 4525854 4472518
8131 4472518 4507664 4634115 4400739 4276247 4686573 4659026 4837865 4989048 4786611 4942633
8121 4942633 4898920 5199182 5323585 5152959 5236175 5535043 5598768 5930576 6081681 6190696
8111 6190696 6207414 5980134 6152087 5989687 5923464 6150545 6375003 6237659 6382721 6421717
8101 6421717 6451078 6623015 6729991 6804268 6933737 7271421 7092743 7158839 7462450 7889581
8091 7889581 7944535 7912387 8167137 8360337 8490290 8686086 8866641 8948713 9080327 9558234
8081 9558234 9843169 10151798 10268825 10473019 10785604 11070190 11469766 11779622 11947334 12083221
8071 12083221 12396425 12723103 13003168 13400936 13731240 13948920 14515309 14897295 15168403
8062 15168403 15932389 16370663 16598062 17076629 17538811 18099336 18685835 19087442 19798123
8053 19798123 20422927 21067131 21807831 22577744 23345521 23996031 24646210 25748339 26890001
8044 26890001 27939440 29307962 30648386 32117239 33804782 35450388 37547529 40044987
8036 40044987 42534071 45638495 49109928 53133658 57446016 62345238 67941180 74668831
8028 74668831 82882650 91649704 98343083 100092105 98260886 94590748 90533343 87318803
8020 87318803 86201439 86960326 89041652 92522950 97463053 103511166 109830990 114175842
8012 114175842 115831569 116306718 116649940 118374499 122232578 127464996 131904059 133115945
8004 133115945 131037850 126949911 122370422 118738914 117351319 118499098 121305487 122866620
7996 122866620 121841520 119440697 116568445 113922598 112904039 113542690 116049911 120105502
7988 120105502 125913265 133617136 141638412 145724320 143742964 138467056 131615799 125234691
7980 125234691 120392719 117892693 116927427 117626357 119047652 121343281 123305492 124661519
7972 124661519 124223785 122258733 118928026 114630856 110467084 106671358 103771475 101926530
7964 101926530 100968857 100657262 100603359 101185529 102713561 104689250 106998053 110020124 114094420
7955 114094420 118439880 122659629 127066003 132059776 137684313 144347612 151729461 160026577
7947 160026577 168716910 174808489 176514428 172857383 165075527 155260358 145373740 136948279
7939 136948279 130176495 124889130 120633725 117406196 114651717 112038193 109536766 107183391
7931 107183391 105313397 104057140 103421621 103325214 103519362 104344459 106036663 108431493 111279028
7922 111279028 114901652 118495679 121294357 121705508 119269100 114820045 108913881 102935680
7914 102935680 97684850 93430926 90060436 87321311 85158581 83558088 81856988 80608628
7906 80608628 79715933 78777319 78194424 78144661 78948255 79676762 80278122 80271733 79084416 77083528
7896 77083528 74202952 70901160 67655915 64891688 62455454 60411205 59176985 58213611
7888 58213611 57557595 57208869 57162710 57483945 58532316 59933208 61706910 63996598 66775971
7879 66775971 70049031 73933381 78331302 83287381 88858617 94409153 99003100 101601376
7871 101601376 100728411 96465593 89800912 82384614 74851731 68575764 63864499 60010168
7863 60010168 56662915 54122553 52145265 50345105 49061239 47681598 47078777 47024234 47435330
7854 47435330 47839690 48672356 50042519 51320466 53223340 55409480 57810255 59811807
7846 59811807 61299646 61390604 59368645 56216383 52376891 48053047 43922561 40552657
7838 40552657 37389320 34800279 32569543 30751177 29203802 27840805 26253007 24926279
7830 24926279 23934770 22999342 22052038 20929802 20221753 19416725 18576957 17857328 17119073
7821 17119073 16782404 16263420 15693091 15354563 14727447 14424275 14282590 13887444 13710313
7812 13710313 13915778 13455186 12992160 12524808 12404821 12350056 12339319 11887029 11403347 11185891
7802 11185891 11078195 11007363 10496030 10239221 9923582 9684755 9498933 9256906 8902359 8747071
7792 8747071 8712527 8482293 8471779 8356008 8331960 8233014 8172967 8114644 7977212 8054671 7938194
7781 7938194 7668837 7532476 7486867 7377884 7491571 7513165 7269625 7482970 7251708 6900021
7771 6900021 7153069 7048835 6957939 6900106 6813295 6786882 7050955 7055538 6921167 6953748 6889977
7760 6889977 6642960 6653252 6644296 6769857 6689772 6642709 6427484 6290738 6537452 6498576 6404855
7749 6404855 6258334 6140714 6359570 6299343 6206879 6325603 6302097 6254665 6553363 6654091
7739 6654091 6547301 6239408 6114762 6101785 6157824 6405239 6305360 6095009 6166423 6297395
7729 6297395 6347957 6398127 6404281 6432376 6515548 6612323 6645330 6661370 6616511 6581440 6455176
7718 6455176 6535732 6647639 6516888 6387317 6537770 6563921 6440282 6367617 6582041 6683275
7708 6683275 6660121 6787135 7005109 7168757 7529416 7597501 7352264 7280750 7419720 7499963
7698 7499963 7297246 7411368 7433771 7733930 7804365 7754765 7771223 7834399 7961230 7804116
7688 7804116 7664401 7826485 8126491 8259696 8200085 8302235 8067679 8190899 8277549 8274288
7678 8274288 8594891 8740793 8834249 9058750 9235058 9316608 9494283 9509864 9398268 9413118
7668 9413118 9536346 9712162 9859105 9902947 9795769 9760898 9640683 9345001 9400312 9336518
7658 9336518 9246167 9307231 9289089 9260751 9501828 9583264 9675185 9525695 9597562 9828570 10157005
7647 10157005 10000788 9978855 10066296 10323427 10512900 10636894 10746136 10923233 10993355 10866469
7637 10866469 10634183 10593049 10654777 10610170 10741136 10829332 11122009 11028212 11121920 11248965
7627 11248965 11200519 11268332 11233333 11054139 11108816 11142049 11253337 11470993 11354309 11451611
7617 11451611 11644975 11744372 11862508 11905486 12176079 12335433 12522806 12846035 13038730 13261963
7607 13261963 13548855 13766096 13979862 14452847 14609783 14704221 14762736 14857676 15143638 15358809
7597 15358809 15619141 16037939 16294460 16908816 16920511 17133786 17508609 17876187 18338807 18653757
7587 18653757 19039826 19463694 20341393 20810870 21399642 22093600 22724927 23396404 24247011
7578 24247011 24989819 25982072 26953357 28008847 29172938 30183934 31495404 32644990 33953651
7569 33953651 34929776 35398030 35837894 35770715 35919058 36187132 36526668 37240407 38168832 39197259
7559 39197259 40296065 41510211 42868781 44646832 46837128 49035178 51462411 53986573
7551 53986573 57030529 60226333 63479027 67825724 72534189 77761471 83632316 89655787
7543 89655787 95295997 100924150 106100770 110976201 113938424 113696295 110823699 106007685
7535 106007685 100684656 96143141 92549176 90213643 88885024 88744896 89238079 90265616
7527 90265616 92010104 93943839 96051891 98456948 101398976 105204195 110217915 116186346
7519 116186346 122958177 130145769 137901717 146587483 156657515 166720380 173320377 173492853
7511 173492853 167541852 156897727 144892502 133606316 124442112 117005052 111501706 107353416
7503 107353416 104616914 102894578 101987316 101290912 100825194 100101470 99142868 98891970 99366220
7494 99366220 100492533 102313612 104397841 106550032 108658796 110786563 112803824 114347926
7486 114347926 114464495 112803233 108722714 103700182 98155252 92882778 88906174 85861090
7478 85861090 83634420 82339423 81358634 80542359 79998090 79210155 78700110 78154372 77775824
7469 77775824 77188635 77103544 77540195 77973088 78589889 79320343 80215784 81218677 82082557
7460 82082557 83428344 85093242 87496862 90215502 93662008 97502647 102101101 107344770
7452 107344770 112996257 119428342 126987316 135179111 143730643 151763205 158921987 165192304
7444 165192304 171269861 176835138 178534426 174963052 169006485 162156223 156096184 152614190
7436 152614190 151345423 152385682 155448584 160101965 166760126 174532338 180847100 185142321
7428 185142321 189000462 193191105 198900178 206951568 217803720 230618379 242852633 250704621
7420 250704621 251747140 246222110 237206588 227717790 220114009 215355217 211324284 205944785
7412 205944785 200413855 196161984 192886156 191236040 190833759 192067822 194920933 199170347
7404 199170347 205551254 213363990 220350043 223197286 221202636 216819656 212279891 209186294
7396 209186294 207751859 207892736 208763804 209581861 209928363 208886627 206833007 203917550 201380694
7387 201380694 199976421 200477873 203074147 206451334 209821834 213255628 216535404 219465575
7379 219465575 221690884 222920584 223891450 224916761 224514413 221939858 218901510 216857378
7371 216857378 216910228 219480834 223577008 227272945 228902290 228438648 225076425 218314847
7363 218314847 209426266 199632004 190156218 182651322 177130501 173569190 172295567 172205069
7355 172205069 172952123 174002789 176222528 178915902 182677744 188139207 195384086 204424479
7347 204424479 213886423 221606815 226994271 230119472 230673498 227885214 222914769 217721012
7339 217721012 213452294 211570599 212061868 213659414 214253723 212982354 210242853 205218842
7331 205218842 198430624 191106922 184377994 178517467 172931469 167072640 160769092 154865318
7323 154865318 150646881 147764192 145484287 142595788 138299856 133201811 127944057 122592786
7315 122592786 117208733 112367561 108070046 104186335 101328095 98952132 96305301 93348912
7307 93348912 89838295 86572040 83413042 80814368 78669531 76903473 74791458 72061580
7299 72061580 69096685 66056912 63399838 61206113 59444920 57505324 55885969 54579966
7291 54579966 53584928 52835882 52082762 51383629 51028898 50911309 50874850 51345048 51772641 52687741
7281 52687741 53356616 54042273 54668914 55170514 55291608 54821505 53952315 52693348 51432516
7272 51432516 50311351 49276075 48258831 47054975 46087910 45248465 44930299 44662764 44233390
7263 44233390 44494129 44640213 44966720 45351556 45634095 46260360 47099402 48234222 49833365
7254 49833365 51325405 53237610 55737058 58568874 61554277 65245863 69498634 74513904
7246 74513904 80544458 87474626 95427200 105221007 116175677 128290776 142340946 158939094
7238 158939094 176625143 190153810 191073422 179762551 161464845 140671089 121667355
7231 121667355 106235559 94217104 84961379 77447415 70973386 65702720 61029334 56656901
7223 56656901 52798649 49355388 46027821 43470371 40884897 38876846 37362513 35903458
7215 35903458 34471168 33220477 32002326 31021539 29897893 29077299 28424327 27594248 26669500
7206 26669500 25885926 25070691 24343786 23709915 23081411 22737481 22380436 21863682 21796988 21442039
7196 21442039 21081282 20835875 20416025 19937985 19736595 19838446 19732173 19520311 19403752
7187 19403752 19422226 19523714 19558054 19747938 20316095 20609953 21101521 21961896 22813257 23615468
7177 23615468 24030894 23875352 23323152 22401937 21568316 20712822 19657283 19075430 18589462
7168 18589462 18267337 18036283 17806883 17787288 17880138 18017752 18187724 18154667 18627691 18749920
7158 18749920 19211747 20061796 20750400 21912339 23039990 23938338 24772254 25815649 27046785
7149 27046785 28617626 30654119 33480334 36059405 37923341 38518221 37352815 34864561
7141 34864561 31927462 29115669 26624958 24320474 22611460 21306879 20239397 19380537
7133 19380537 18758939 18118431 17673129 17483263 17281706 17167508 17085280 17364874 17819481 18211953
7123 18211953 18975523 19607114 20473672 21676735 22719301 24218329 26016629 27994891 30789894
7114 30789894 33760696 35737493 36611685 35756207 33600950 30856971 28068946 25626139
7106 25626139 23235915 21324643 19997022 18978458 18037872 17227635 16335683 15613428 15070633
7097 15070633 14734769 14477622 14215100 13874673 13605457 13520119 13356774 13515587 13739028 13961192
7087 13961192 14116969 14573435 15103131 15756594 16565310 17554568 18327509 18827111 18792378 18312771
7077 18312771 17548700 16483856 15614006 14631086 14008360 13588191 13186763 13182875 13099273 12821689
7067 12821689 12962877 12771384 12368992 12052951 11619155 11446082 11377213 10889645 10732365 10608032
7057 10608032 10416642 10250635 10111141 9910748 9811169 9694823 9770878 9840031 9672979 9780977
7047 9780977 9924136 9975660 9774043 10035736 10065302 10268674 10647085 10947975 10963770 11133891
7037 11133891 11454567 11696812 11855835 11750861 11659156 11703984 11681703 11428430 11326112 11004034
7027 11004034 10870707 10589706 10283010 9964151 9509882 9349828 9320864 9204568 8982689 8978071
7017 8978071 8709088 8448873 8349314 8400819 8445587 8606757 8710611 8835708 8963570 8984694
7007 8984694 9323526 9446191 9574162 9392165 9430820 9534260 9517051 9554387 9826483 9847145
6997 9847145 9888868 9621198 9266947 8963563 8484225 8245626 7999258 7838714 7619401 7265580
6987 7265580 7237578 7318776 7392493 7129624 7069211 7009655 6780214 6688768 6747358 6722848 6791938
6976 6791938 6728680 6833340 6736529 6612203 6642324 6951530 6929522 6949996 7109967 7231987
6966 7231987 7292323 7317463 7234728 7078511 7235380 7104305 7003591 6831927 6776282 7026966
6956 7026966 7166899 7206958 7105349 7156793 7279949 7571083 7824534 7643832 7592295 7731043
6946 7731043 8108053 8143512 8283721 8381417 8584118 8404778 8633281 8790379 9206180 9466080
6936 9466080 9794632 9909314 9791992 9403271 9524339 9594233 9783257 9926106 10082324 9956393
6926 9956393 9993957 10124601 10361831 10476183 10747171 10735800 10935925 11189300 11398191 11545049
6916 11545049 11502679 11571787 12029791 12337346 12452155 12831966 13214870 13779805 14289250 14780667
6906 14780667 15661627 15896991 16158610 16653980 17011503 17082777 17021636 17384781 17684406 18011527
6896 18011527 18323413 18745287 19201483 19803364 20311783 20848665 21241523 21948365 22512901
6887 22512901 22944499 23795222 24807443 25833461 26566120 27483503 28723201 30009008 31273827
6878 31273827 32442566 33421481 34308830 34939516 35473153 36281754 37312649 38376808 39337975
6869 39337975 40694728 42146398 43469212 44735396 46348723 47804095 49529922 51811702
6861 51811702 54557333 57577180 61361309 65323861 70288205 75958293 82986767 90621660
6853 90621660 99144716 108510102 120382570 133894221 149717590 168633138 191688422
6846 191688422 217269468 245990020 279719850 325147939 385097143 442463911 441368181
6839 441368181 399808640 349356211 286316757 234902597 197309189 170998105 151800918
6832 151800918 136962913 124050937 113421213 103839844 95208633 87005812 79876470 73564745
6824 73564745 68528798 64057659 60673055 57900216 55742449 53579703 51567008 49111167
6816 49111167 46877372 44514999 42458064 40634100 39240403 37551877 36251083 34756602
6808 34756602 33425683 32387686 31410848 30398999 29389316 28931990 28433604 27942315 27259739
6799 27259739 26396472 25559184 24872436 24232429 23813676 23229477 22718826 22425119 21995422
6790 21995422 21648897 21293826 20851299 20579902 20258952 20200357 19899577 19595702 19264471 19011554
6780 19011554 18994324 18966829 18627953 18342711 18220686 18080655 18249346 18312977 18245562 18302579
6770 18302579 18256024 18213400 18201270 18199327 18378452 18287707 18408578 18500438 18352359 18362740 18512643
6759 18512643 18601539 18583360 18701653 19221044 19537604 19604275 19717009 20176366 20385275 20406131
6749 20406131 21001437 21377349 21715976 22012991 22355793 22636834 22969464 23665242 24237994
6740 24237994 24908012 25314290 25939707 26488658 27191641 27877949 28447363 29784308 31423938
6731 31423938 33436206 35441333 37407280 39007725 40545186 42933832 45877033 49228436
6723 49228436 53064493 57640405 63093643 70180603 79314347 88736191 91194271 87776733
6715 87776733 81600883 72590382 64354547 57767259 53385767 50218066 48048533 46761446
6707 46761446 45872599 45248395 44981285 45268452 45836615 46635035 48185628 50207264 53043690
6698 53043690 55985425 59401296 63885274 70036197 77408489 80885809 77458537 72567855
6690 72567855 66148335 59377399 54656447 51134494 48770805 47430956 46492544 45646951
6682 45646951 45032973 44512919 44152152 44256457 44291396 44955927 45626445 45999493 46888250 48018050
6672 48018050 49049631 50262705 51918741 53551323 55516035 57498949 59989289 62499188
6664 62499188 65154378 68170102 71372351 74519650 77921665 81499721 84923377 88291245
6656 88291245 91624593 94970498 97702576 100118570 102380571 104464118 106301901 107820351
6648 107820351 109317719 110567146 112019505 113336662 114765893 116453565 118411073 120607090
6640 120607090 123386720 126414664 130172135 134231162 138503019 143526779 148433946 153265401
6632 153265401 158425933 163808868 168691226 173087648 177296148 180474763 182460513 183289765
6624 183289765 183449688 183248957 182673275 181726314 180684393 179482171 178061649 176958769 176585919
6615 176585919 176471803 176989922 177957384 179390978 181418047 184179101 186945949 190141923
6607 190141923 193865192 197803654 202107950 206413861 211073060 215641529 220019708 223734522
6599 223734522 226962820 229249368 230592965 231432479 231384972 231352898 231724813 232251761 232920427
6590 232920427 234130914 235420576 237143099 239029124 240540103 241687096 242224115 242294347
6582 242294347 242019010 241649737 241299403 241216837 240977015 241160157 241325798 241616865 241846155
6573 241846155 242406659 243374039 244245804 244380768 244056895 243224728 242359522 241396504 240480485
6564 240480485 239837912 239420980 239061516 238429913 237823087 236756696 234900952 232306066 229105330
6555 229105330 224853475 219551593 213969748 208275074 202741077 197274885 192010701 186666541
6547 186666541 181898546 177195157 172473580 167696381 163034516 158008428 152664942 147739165
6539 147739165 143028095 138330051 134050191 129796136 125238902 120792676 116374132 112045791
6531 112045791 107413579 103095980 98620455 94222571 89716721 85368245 81296395 77396296
6523 77396296 73295416 69459292 65876281 62287648 59088383 56287425 53607139 50990943
6515 50990943 48954618 47211972 45417009 43501307 41703960 40060169 38373087 36992843
6507 36992843 35681593 34749755 33539755 32495600 31540765 30658428 29850088 28964773 28085151
6498 28085151 27148450 26417241 25838792 25157732 24473993 23858549 23301554 22793899 22077575
6489 22077575 21603057 21099410 20508480 19955216 19608464 19022913 18645867 18246245 17684181
6480 17684181 17295457 16797753 16780684 16263544 15810587 15449859 14875323 14529980 14119311 13679020
6470 13679020 13742174 13563462 13269772 12869318 12554308 12256846 12045312 11885847 11551719 11135364
6460 11135364 10782997 10468205 10378462 10088440 9874665 9821991 9654810 9412495 8975716 8831947
6450 8831947 8856532 8835791 8681344 8576524 8304514 8091703 8179585 8049020 7841150 7785689
6440 7785689 7678161 7531229 7317514 7385927 7299687 7046387 6698464 6764047 6751004 6554435
6430 6554435 6425058 6435225 6312014 6114479 6164932 6119937 6013722 5846643 5896447 5780504
6420 5780504 5675861 6108277 5986285 5846374 5668657 5607813 5558484 5456018 5272717 5459185
6410 5459185 5403220 5480315 5454856 5277341 5175989 5071186 4988851 5007785 4943348 4846353 4913079
6399 4913079 4591223 4464123 4347850 4372818 4320686 4398757 4449695 4378010 4285146 4345370 4435569
6388 4435569 4121413 3950284 4065916 4114546 4176411 4079083 4024301 3986232 4072186 4324102 4382164
6377 4382164 4177088 4064440 3949270 4073685 3981768 3589344 3523749 3712111 3706081 3647577
6367 3647577 3652906 3742854 4076421 3954012 3866365 3836127 3905198 4103590 4074169 3936961 4005224
6356 4005224 3734055 3624672 3683084 3704328 3370189 3308811 3468915 3557755 3577170 3441537
6346 3441537 3533040 3635731 3585730 3782073 3714624 3784931 3706433 3655904 3943703 3862078 3834167
6335 3834167 4039178 3949522 3823573 3792203 3798407 3840396 3802430 3658453 3597666 3658317 3511806
6324 3511806 3584284 3679525 3470206 3274925 3581953 3665593 3497117 3293033 3297177 3450716
6314 3450716 3659961 3484689 3758607 3809384 3822749 3619538 3696529 3777778 3833705 3915561 3948400
6303 3948400 4129750 4151486 4287500 4293220 4298249 4284472 4285219 4284108 4188422 4151197 3895859 4040868
6291 4040868 4116638 4007356 3852681 3717381 3840825 3716399 3831984 3904593 3767828 3736732
6281 3736732 3705799 4003232 4072309 3967915 3920535 3946591 4056985 3982285 3968538 4194974 4158119
6270 4158119 3964395 3983982 4022123 4055026 4253723 4108554 3997847 3791783 3877439 3945137
6260 3945137 3839974 3867569 3575900 3478734 3694080 3774819 3863687 3855738 3735193 3682964 3555872
6249 3555872 3590660 3666669 3812866 3743183 3569598 3685176 3851571 3525448 3404976 3437470
6239 3437470 3669626 3743818 3792493 3551864 3585072 3647774 3845510 3834633 3813770 3830214 3898100
6228 3898100 3967137 4105359 4272018 4410867 4464588 4225977 4238342 4320514 4501050 4954173
6218 4954173 5068665 5382813 5935795 6132686 6664100 6945962 6943159 6510325 6107745 5972833
6208 5972833 5458551 5403435 5343037 4983652 5126417 4913630 4854512 4971014 4881699 4841917
6198 4841917 4905846 4758028 4770994 4581696 4443805 4410026 4494880 4696756 4736072 4837051
6188 4837051 4693045 4611073 4517976 4594966 4375978 4373383 4417432 4550257 4951649 5040961 4954320
6177 4954320 4908811 4963896 4883243 4798872 4931058 5042917 4938762 4666456 4786912 4790043 4946412
6166 4946412 4975707 4846750 4840952 4951534 4873291 4732429 4865198 4957629 4750436 4625547
6156 4625547 4640078 4634519 4812105 4829532 4879282 4651990 4605108 4863660 4900611 4977298 5223619
6145 5223619 5157399 4920078 4819202 4895000 4862559 4963642 5094834 5042352 5062652 4782980
6135 4782980 5049510 5093845 4981748 5149904 5094527 5047041 4977859 4917794 5131841 5337676
6125 5337676 5170782 5097998 5104706 4917319 5026112 4912739 4826367 4775168 4636073 4751086
6115 4751086 4829908 5074862 5239570 5307028 5053851 5073442 5390619 5205029 5211701 5396958
6105 5396958 5312374 5485778 5471682 5374049 5255087 5149433 5233566 5435700 5297519 5298304 5221375
6094 5221375 5144336 5268905 5580583 5474116 5459547 5496748 5355727 5375042 5396705 5423262 5731060
6083 5731060 5728336 5656694 5605028 5566141 5647672 5667024 5616810 6036627 6088362 5896728 5888486
6072 5888486 5884599 5809170 5765346 5849940 5796033 6067408 6169739 6122187 6299955 6270652 6222969
6061 6222969 6165300 5998988 6005111 6411755 6638562 6674561 6763801 6796202 7007105 7020340 6854322
6050 6854322 6915527 6952248 6995038 7186744 7411499 7653198 7634469 7735735 7788307 7972089
6040 7972089 8049479 7965700 7955595 8392870 8242127 8302722 8489876 8722689 8727192 8839030 8725400
6029 8725400 8876566 9040353 9253726 9243299 9333708 9809692 9767512 9682109 9728536 10105980
6019 10105980 10299213 10423461 10517928 10592208 10729719 11147015 11348990 11342097 11305304 11588947
6009 11588947 11830379 12057536 12220601 12406976 12480586 12648772 12843133 13426779 13816388 13972796
5999 13972796 14245362 14207369 14256242 14726104 15055313 15374161 15832677 16143865 16438914 16894346
5989 16894346 17265245 17774553 18276341 18734789 18971253 19443555 20027441 20577356 21511489
5980 21511489 22096382 22684144 23013096 23842020 24605928 25631910 26559830 27457125 28469391
5971 28469391 29591406 30783088 31944390 32945456 34077817 35240608 36187878 36981969
5963 36981969 37970417 39268381 40426725 41623325 42726687 43993360 45187188 46793042
5955 46793042 48615088 50315611 52057671 53865965 55732873 57530301 59133043 60866658
5947 60866658 62460616 63973100 65495380 67180612 69115844 71078912 72997001 74822678
5939 74822678 76499583 78470701 80162252 82110287 84113257 85938492 87950075 90030662
5931 90030662 91910806 93952727 96773923 99646479 102690668 105878201 109156656 112275423
5923 112275423 115121404 116902850 118338843 119848284 120826619 122102914 123726167 125122305
5915 125122305 126641124 128473147 130287999 132006014 133745403 135610250 137503463 138994876
5907 138994876 140766023 142415604 144120379 145874381 147789778 150354404 153086780 155979447
5899 155979447 159394884 162979422 166790594 170330800 173519788 176367166 179124739 181320805
5891 181320805 183474203 185703096 187948585 190089825 191918514 193839925 195352143 196904439
5883 196904439 198219071 199501453 200503594 201891585 203238440 204629312 206345244 208299692
5875 208299692 210702219 213593424 216655686 219828953 222911995 225476695 227173282 228018495
5867 228018495 228576219 228941879 229009645 229349768 229461101 230170917 230846019 231161049 231233155 231031747
5857 231031747 230261187 229286330 228131697 226892813 225555119 224481665 223526401 221852578
5849 221852578 220401735 219004061 217376901 215754347 214479693 212605014 210122189 207117694
5841 207117694 204087611 201170537 198487107 195742713 193471245 191671408 189939102 188178393
5833 188178393 186214809 183752350 180923028 178074033 175014967 171512681 167753798 163905972
5825 163905972 160443611 157142243 154083912 151435409 149465728 148110314 146567584 145191223
5817 145191223 143744122 141951320 139377650 136283682 132889833 129671058 126436820 123602258
5809 123602258 121345361 119339259 117341368 115318589 113306319 111213245 108961639 106709932
5801 106709932 104400487 102097256 99439906 96816685 94121772 91635043 89403806 87305471
5793 87305471 85148038 83142040 81608387 79656555 77521684 75348745 73120266 70619294
5785 70619294 68419823 66402957 64663439 62993881 61296420 59827103 58382988 57138320
5777 57138320 55722377 54349366 52893055 51504960 50303782 48761603 47315089 45794595
5769 45794595 44184875 42790079 41255746 39933648 38855712 37526230 36392783 35289410
5761 35289410 34182113 33155361 32372286 31648621 30761323 29885350 29220071 28459051 27613907
5752 27613907 26760878 26114398 25600915 25133455 24641131 24323883 24075920 23633020 23254237
5743 23254237 22869759 22872829 22931791 22787311 22609845 22621355 22738163 22973645 23278342 23383356
5733 23383356 23920657 24689888 25343883 26053162 26969502 28085842 29170605 30563343 32526794
5724 32526794 34410059 36699983 39558078 42588864 44918352 45985061 45455805 43865461
5716 43865461 42023123 40233821 37563337 34589750 31694257 28833197 26731981 25112461
5708 25112461 23744405 22511801 21245549 20350347 19405075 18622079 18068971 17492074 16942635
5699 16942635 16333052 15483965 14869014 14441184 14004527 13588538 13273621 12943186 12882551 12694757
5689 12694757 12518006 12250089 11783978 11449644 11421607 11310401 10961708 10678563 10524084 10537406
5679 10537406 10387245 10213362 9857341 9563615 9219479 9017718 9102974 9006118 8908659 9092102
5669 9092102 8754113 8533665 8634808 8705486 8448816 8430647 8545815 8698987 8428445 8375535
5659 8375535 8377538 8104906 8164420 8227251 8125652 8102831 8171238 8252917 8212938 8114176 7806437
5648 7806437 7873633 7657600 7596133 7374277 7473866 7582112 7472104 7526531 7654839 7595549
5638 7595549 7413533 7434874 7574724 7490195 7455454 7517998 7508537 7550104 7760293 7505569 7706646
5627 7706646 7587587 7808670 7974979 7834916 7517826 7793564 7723480 7588954 7629943 7675897
5617 7675897 7797954 7616914 7618931 7487690 7572415 7398547 7376375 7232006 7332558 7285860
5607 7285860 7325026 7043793 7116933 7074856 7067292 7030202 7180536 7175082 7216544 7196925 7210206
5596 7210206 7233215 7328347 7438283 7554302 7636965 7585438 7693402 7526342 7467800 7230459
5586 7230459 7152228 7044356 6779669 7037861 6965262 7021911 6896802 6910586 6896907 6630416
5576 6630416 6693599 6657636 6414948 6329690 6441018 6503088 6292784 6357809 6372383 6570376 6547740
5565 6547740 6374552 6269126 6533676 6491427 6617567 6428099 6449224 6527021 6503649 6382214
5555 6382214 6341551 6413111 6004588 5880555 6057971 6100729 6020913 6029908 6023394 5836296 5903467
5544 5903467 5940755 5696536 5484480 5593009 5689176 5720756 5658757 5496946 5396207 5313746
5534 5313746 5249290 5403430 5313314 4992865 5303656 5351456 5342009 5163936 5010239 5166288
5524 5166288 5290966 5298053 5130613 4879702 4672846 4790360 4831622 4812696 4811660 4682262 4812886
5513 4812886 4579115 4677977 4439972 4289959 4371042 4300835 4394227 4641447 4426720 4311788
5503 4311788 4192326 4192683 4201377 4198957 4327961 4443915 4431361 4302757 4148720 4132411 3947135
5492 3947135 4011775 4273059 4322740 4199346 4258987 4351546 4342871 4228894 4064078 4347119 4498484
5481 4498484 4421922 4388721 4355511 4618311 4741851 4655394 4636126 4716741 4508453 4627403 4829821
5470 4829821 4936134 4936675 5042406 5360617 5474186 5590012 5868495 6024395 6002038 6358409
5460 6358409 6697929 7030413 7316987 7655476 8007574 7632750 7318699 7030956 6611282 6413603
5450 6413603 6123507 5807255 5698591 5804159 5722201 5636956 5613510 5521441 5674857 5907033
5440 5907033 5631565 5567167 5515468 5606959 5643759 5682663 5769364 5862587 6062877 6179819 6190238
5429 6190238 6174596 6226940 6146567 6068395 6200576 6123553 5795267 5808435 5866916 6016097 5929044
5418 5929044 6108413 6303737 6272703 6289504 6381374 6501522 6702206 6755939 6872634 6901524
5408 6901524 7077320 7212443 7101051 7351759 7403992 7508009 7798048 8094673 8226918 8351902
5398 8351902 8469416 8631955 8579570 8585062 8571331 8675085 8899175 9038863 8858327 8919683
5388 8919683 8807898 8853785 8874560 8976958 9198970 9373374 9318447 9359772 9543971 9586274
5378 9586274 9697008 10006595 10356279 10444952 10706283 10954609 11333999 11701232 11748553 11935584
5368 11935584 12169653 12425633 12796234 13033790 13160536 13593309 13905077 14053731 14257157
5359 14257157 14654946 14701520 14786020 14888392 15092640 15268556 15542430 15864496 16098508 16302742
5349 16302742 16526610 16618877 17009773 17512002 18041035 18554348 19051009 19407962 19667705 20279043
5339 20279043 20796232 21329183 21841084 22445000 23059964 23831154 24603998 25411118 26341160
5330 26341160 26966559 27293178 27870935 28512816 29341804 30226966 31161341 32049180 33223546
5321 33223546 34632603 36267109 37871553 39506320 41106440 42685980 44173014 45890698
5313 45890698 47465326 48935405 49881707 51012717 51884286 52775566 53569321 54274771 54821281
5304 54821281 55183667 55130201 54427720 54287353 54235367 53996385 53791259 53651835 53774327 53876059
5294 53876059 54371691 55497196 57397936 59721426 61454210 61382026 59649209 56815675 53359789
5285 53359789 50363334 47735074 45169780 43127129 41410316 39391072 37872644 36929080
5277 36929080 35891592 35121338 34572040 34156978 34239184 34500832 34696234 35334178 36315888
5268 36315888 37577010 39168277 40819324 42704651 45259766 48294005 51391546 55396733
5260 55396733 60171979 66342235 72376773 74407415 72564760 68388567 62528066 56754897
5252 56754897 51137500 45806193 41524251 38086661 35135504 32953862 31257777 29643699
5244 29643699 28264995 26951675 25875563 25165284 24180378 23753744 23572937 23715667 23891441
5235 23891441 24290262 25015130 25401217 26126280 27282113 28442930 29874124 31735001 34238600
5226 34238600 36761991 38324391 37856014 35879251 33126622 29755266 26656036 24110873
5218 24110873 21776980 19857963 18817855 17688283 16547398 15739502 15093107 14161507 13243691
5209 13243691 12794250 12190368 11728618 11465304 11010301 10753752 10286614 9900897 9721221
5200 9721221 9659945 9455583 9320575 8960352 8681265 8788119 8623488 8332403 8189465 8120369
5190 8120369 7818298 7617327 7347911 7139067 7069187 7107496 7220396 7008230 6795191 6773810
5180 6773810 6653529 6435719 6302202 6120050 6008096 5913658 5930340 5762907 5686992 5764960
5170 5764960 5755318 5728221 5693349 5626516 5437727 5260371 5485594 5388513 5161322 5044990 4957291
5159 4957291 5137116 4897059 4833779 4912502 4806263 4730252 4577179 4645803 4678887 4741937 4840823
5148 4840823 4622245 4722150 4623684 4318247 4221920 4458242 4215547 4186797 4188743 4060166 4248778
5137 4248778 4327703 4289828 4277346 4175231 4216983 4077904 3976004 3968047 4022658 3952143 3752491
5126 3752491 3808556 3850866 3819030 3772238 3732268 3721456 3965601 3874263 3632568 3650860 3840358
5115 3840358 3647918 3763282 3808996 3896922 4065233 4001247 3685844 3808137 3982387 3966925
5105 3966925 3699224 3604136 3671080 3542608 3545945 3532532 3610435 3537693 3354336 3191240 3318482
5094 3318482 3482117 3449211 3577660 3568200 3479164 3425076 3289385 3263625 3474044 3451923 3425465
5083 3425465 3489526 3511805 3765456 3932056 3936738 3663987 3699133 3746197 3863617 4162777 4275469
5072 4275469 4393606 4360545 4470888 4668851 4513420 4389446 4533791 4546519 4630784 4775856
5062 4775856 4975386 5419190 5491556 5391436 5663262 5999303 6007521 6313339 6600348 6916788
5052 6916788 7175818 7433064 7762639 7962857 7789932 7643916 7713610 7964157 7847456 7885506
5042 7885506 8049932 8248512 8386837 8412642 8901584 9089395 8985970 8913749 8897181 8612573
5032 8612573 8577102 8655497 8491363 8456872 8526624 8821355 9249053 9380309 9500065 9560079
5022 9560079 9608666 10155447 10700107 11498865 12162246 13009589 13697138 13438625 13055259 12827550
5012 12827550 12655983 12528109 12446034 12424735 12847409 13443740 14257881 14513098 14706299 14826946
5002 14826946 14733012 14740180 14762934 14735130 14737005 14850675 15200329 15374720 15654320 15805502 15800731
4991 15800731 15814069 16159445 16312734 16327169 16563406 16798926 17066873 17215658 17469675 17688127
4981 17688127 17658219 17806047 17517046 17558672 17891454 18443943 18812176 19176519 19817405 20477278
4971 20477278 21211792 21870669 22684888 23571338 24648372 25071325 25183259 24610630 23498529
4962 23498529 22249184 21160466 20038662 19005207 18144845 17659750 17020574 16566876 16297446
4953 16297446 15977687 15924690 15968976 15760811 15907531 15978469 15955137 16215945 16304835 16407537
4943 16407537 16751442 16557763 16875677 17171696 17309484 17365528 17374189 17302092 17021802 16795128
4933 16795128 16366875 15998751 15171160 14420547 13698126 12955161 12333162 12064706 11701148
4924 11701148 11413163 11147219 10960586 10727317 10574820 10412632 10199720 10247873 9881835 9794679
4914 9794679 9942905 9759012 9604185 9337799 8916577 8474746 8203840 7959695 7652948 7389691
4904 7389691 6837800 6557365 6338360 5991446 5775022 5710641 5610387 5457211 5291261 4999570
4894 4999570 4838750 4605159 4483526 4368700 4324618 4108488 4005666 3773632 3534120 3654684
4884 3654684 3609614 3510201 3422437 3290349 3368540 3397344 3373054 3223482 3016446 2794117 2696603
4873 2696603 2786345 2814931 2711385 2745616 2529613 2370171 2281114 2096038 2162500 2208099 2110927
4862 2110927 1974297 1892344 1898972 1896120 2090344 2013546 1807151 1902023 1810641 1637582 1680176
4851 1680176 1680296 1631303 1529131 1464950 1680847 1639656 1392821 1291969 1410805 1237037 1343785
4840 1343785 1336260 1306961 1586311 1581453 1461274 1284595 1240034 1256706 1125475 1226162 1237982
4829 1237982 1014304 816840 1100492 1162478 1066161 1019301 1095055 1119750 935832 823916
4819 823916 852815 889245 1164787 1009063 834741 926497 673435 642206 802007 675396
4809 675396 628978 739126 725582 820280 865902 502508 287115 476896 499725 434896 367954
4798 367954 292928 353506 262709 308305 554150 449289 539009 524890 548163 329569 348456
4787 348456 370524 624895 844314 635950 498673 579370 496691 334088 243105 321871 267132
4776 267132 222471 186153 366338 149141 310205 367716 282432 464964 421671 333352 172055
4765 172055 319121 370568 420341 468824 388555 255235 275545 586234 379767 208744 322716
4754 322716 313020 336012 284007 111407 22163 238133 313200 255110 196898 382312 198966
4743 198966 79732 71251 288759 196815 265787 203887 255355 157023 134450 169717 113114
4732 113114 274641 307357 370671 300877 324121 398007 434379 296445 343776 329589 263758
4721 263758 169397 331225 468094 402941 315994 149371 311888 366779 427319 288817 467561
4710 467561 281779 212989 340927 270993 101154 63811 192400 229628 4936 -76188 154460
4699 154460 300679 324693 387592 321438 191299 219537 219055 244265 177331 228423 17938
4688 17938 -125242 -106804 -4394 35194 159499 -1219 -7968 246690 299923 112062 365892
4677 365892 373865 117752 110307 270642 118520 22891 -22305 -125806 -9631 30121 102749
4666 102749 207945 90163 181552 338264 312243 73733 65850 148078 81059 37516 -155203
4655 -155203 47008 45312 145793 126257 12533 239576 107416 21573 -68872 -66782 -155380
4644 -155380 -91451 111708 104009 3796 27418 103806 -20422 67558 62278 -159942 -201386
4633 -201386 28217 62525 46562 -12284 -14527 58250 301714 89454 -5581 -18099 17839
4622 17839 216552 318424 131996 -68058 -83921 32252 22145 108870 -191410 -158590 -28073
4611 -28073 34078 98050 -27676 -255736 -141791 90214 -6591 -38619 -96717 -174558 -340535
4600 -340535 -33219 133345 210144 -76866 6469 -160809 -223172 -233462 -26352 -183679
4590 -183679 -219670 -161560 -152771 -1117 -141900 -171825 -107823 -51296 -104480 54938 -141640
4579 -141640 -214898 18549 248734 113605 -32556 -27284 -219849 -150107 56712 59940 21066
4568 21066 -118965 -169204 -66684 74142 -228231 -16701 291255 -41307 22271 115630
4558 115630 -60830 -114267 -200577 -271042 -130931 7210 303167 172573 153615 208164 -21142
4547 -21142 -104571 -52439 -28271 -55952 -104429 -101845 -54725 -55524 15783 -72850 70665 275303
4535 275303 86429 188710 175699 85002 112827 56498 137331 62021 -30438 74149 251714
4524 251714 149532 -118287 -201521 -107614 -264402 -171436 -102265 -274062 -273064 -209326 84709
4513 84709 -2264 -120616 48573 -85090 -189727 -32791 -61941 20716 160013 -156191
4503 -156191 112359 178164 146505 104634 -67108 107076 74760 50474 -118410 -93321 -9165
4492 -9165 -105244 -63074 -19777 -27458 -191702 -136619 -47372 158742 240852 190003 89125 -40454
4480 -40454 199373 16273 107680 156953 111869 -32479 13666 53827 -18584 -174325 -118008
4469 -118008 -174 -131328 -40252 78954 58293 186705 267826 105429 -18641 -44045
4459 -44045 -106129 -36503 -10729 -253524 -28001 -48067 -336274 -316273 60712 225868 22662
4448 22662 -1421 143492 60930 114451 -113519 -103828 -173899 -19837 147602 274980 204078
4437 204078 -21993 571 101271 5588 217684 250240 226878 272219 235678 213365 213372 208867
4425 208867 91622 203568 72465 181696 295074 105239 -46316 200678 330502 42092
4415 42092 -75584 -247103 -76618 141840 51363 174046 24039 440 -31140 -113532 -166767
4404 -166767 -81084 -116742 -104752 -319364 -179243 -187586 -317447 -223125 -62483 -113010 -124460
4393 -124460 -84581 -178880 -309325 -118456 130877 61533 -154929 -457172 -168759 -90701
4383 -90701 -132698 -217037 -283463 -56596 -95989 -127154 95090 223216 -131208 -196020 -30488
4372 -30488 -70701 55847 -32874 121467 146496 317355 192366 221862 407151 300454 147823
4361 147823 44802 -15494 -16795 21048 110449 62753 -179203 -107178 -109617 -87355 -76968 -86451
4349 -86451 -68334 -5501 -141862 -63467 -44789 127774 -24954 -53173 -139910 14115 180272
4338 180272 320709 182263 10887 181048 75351 120785 60777 43644 6624 92472 -48390
4327 -48390 -53720 49787 56688 244720 279655 96792 11544 -57137 19586 26777 -34764 -158608
4315 -158608 -114226 -17988 -5430 290657 429935 255572 279585 227294 -35269 106973 -177247
4304 -177247 -214298 42704 82952 -11878 175877 323064 248325 209079 318113 352300 261384
4293 261384 269697 259567 314517 214589 233795 58259 271899 441906 350358 120977 181010
4282 181010 257464 402830 296983 181985 309278 457269 531723 599453 273176 92066
4272 92066 398961 513565 507886 431082 394776 229072 637827 680781 412453 512793 545295
4261 545295 535873 747706 637553 474900 671460 460840 736372 833161 777382 747713 782910
4250 782910 1045414 999335 944345 823944 913451 840813 1033331 994343 1148674 1063510 904247
4239 904247 1107404 1013951 832354 891122 1196687 1314306 1583203 1601042 1550281 1476597 1747123
4228 1747123 1616763 1689637 1944039 1968254 1803089 1993964 2000895 2016526 2235205 2480097
4218 2480097 2457112 2389534 2482901 2448942 2505168 2429628 2401725 2423830 2875068 3156666 3280597
4207 3280597 3316448 3454523 3635768 3655209 3634094 4066665 4247414 4435534 4838127 4924107
4197 4924107 4885989 5125199 5302239 5672470 5976331 6186467 6225411 6525903 6978045 7317659
4187 7317659 7646136 8360506 9142291 9796076 10563434 11611839 12745552 13691294 14706941
4178 14706941 15621303 17108516 18946590 21072999 23394976 26744827 30491118 34970184
4170 34970184 39416377 45317248 53503601 64875676 72406669 68999043 58707273 46820894
4162 46820894 37811215 31591906 27446203 23885386 21504105 19683918 18047771 16219168
4154 16219168 14903074 13884023 13174771 12163814 10933048 10334856 9583512 8648246 7854998
4145 7854998 7426734 6951033 6289939 6067505 6025053 5546388 5262290 4945324 4621063 4476580
4135 4476580 4152372 3834582 3580627 3341224 3363098 3243620 2988656 3070985 2935035 2695824
4125 2695824 2690821 2498816 2260517 2163306 2056398 2063590 2035305 2191258 2203168 1967416 1989713
4114 1989713 1840469 1772451 1620274 1507396 1692467 1897835 1730688 1398843 1341309 1199467
4104 1199467 1207398 1237954 1172160 1148146 982747 952263 943533 1079254 808590 779389 885200
4093 885200 989239 824685 825916 986823 1071093 892995 594338 638623 768121 774162 723542
4082 723542 505758 468606 558365 515114 519936 289333 211362 148111 334581 360006 288639
4071 288639 329558 316457 450820 385812 285143 237512 307035 409494 438080 249456 223741
4060 223741 141022 333517 644965 412866 14503 -80348 241662 431611 387110 210095
4050 210095 108560 164651 402485 377282 414598 273320 475755 424056 326822 304218 244341
4039 244341 374445 408658 222423 340635 592809 586790 377977 113230 179666 241983 56795
4028 56795 68136 -10227 8087 176088 89363 143367 -107694 -172301 -219925 32054 -82852
4017 -82852 -139369 -183780 -198949 -41296 -58192 30833 113855 -336 -38617 -146920 -29737
4006 -29737 118818 24960 102412 31300 71414 -36865 -57332 -12789 -20207 133412 280244
3995 280244 150076 21615 -120169 -126660 -49728 -18827 -101324 -302776 -85451 217134 180395
3984 180395 74607 21385 89800 158018 46959 239672 155011 3295 207221 114674 121144
3973 121144 111310 72514 13469 -181942 -189202 -213519 -314628 -85799 141872 144505 95322
3962 95322 8173 -165146 -115582 -127864 -77485 116162 -50662 -71699 -142410 -248292 -45390
3951 -45390 23817 -91362 2927 199102 142562 -24898 -50167 -66048 -247919 -249521 -255711
3940 -255711 -320464 -285640 -145767 -115903 -224946 -334220 -262638 -153375 -50612 149747
3930 149747 141326 -3213 64291 34465 -29115 -55233 -269008 -149578 -106641 -164598 -62722
3919 -62722 162353 27790 -31628 -79430 -81340 -153250 -109277 -28850 -68041 -81894 -234998
3908 -234998 -63839 85552 49599 -9803 130096 47789 118788 310326 270827 40235 292711
3897 292711 203131 153233 236708 130324 2788 66127 79291 -149346 88928 -77376 -161743
3886 -161743 -59322 -49977 -53020 51059 227703 97376 -118838 -116423 -140731 -105425 -160269
3875 -160269 40266 17875 -157985 -229688 8193 -119602 -112602 55341 89980 116992 -81285
3864 -81285 -12513 -113484 -92391 -117906 -239850 -347000 -132321 -268006 -230702 -257724 -246237
3853 -246237 -109643 -136056 -68110 -76754 5607 -92077 -148892 -297009 -207384 -148934 -283425
3842 -283425 -167149 49651 84174 -15724 39796 25875 19298 118928 11759 94949 -30909
3831 -30909 -99335 38935 -27533 110839 152159 214417 53392 -111204 66626 61944 -3173
3820 -3173 -79453 92718 184521 163894 156492 108037 826 -364268 -540810 -446865 -203116
3809 -203116 -83894 -30537 -169098 -285709 -66963 -47644 -155909 -247535 -257791 -55474
3799 -55474 -165418 -178316 -98297 -175261 -6305 180306 38105 -14225 -25378 -127814 -52163
3788 -52163 -101434 -171821 11707 31435 94997 234158 139945 67313 -16504 24244 54235
3777 54235 -93745 34025 15722 29711 4027 7106 -131349 -268731 -201653 -139207 -110079
3766 -110079 -170814 -5734 6123 -188187 -255114 -243210 -66082 -175141 -255537 -333094 -241301
3755 -241301 -9737 111922 63773 8922 -27780 -115815 -16251 -21963 -68183 -288396 -304898
3744 -304898 -67942 -36233 14073 -273885 -343165 -178266 13259 821 33024 357997 95766
3733 95766 142003 -76407 31048 86532 148088 29943 70882 -11906 -262363 -207554 -234605
3722 -234605 -189707 121858 -93796 -160353 -243637 -163780 147141 28516 -115111 -24701 -222958
3711 -222958 -76810 64995 44617 -88684 -130603 -14426 29502 -92722 -139251 -668
3701 -668 -101110 -301242 -255620 -52148 -50657 40242 -61515 -37060 146326 73853 -307926
3690 -307926 -351454 -211597 -67479 17966 -64826 7246 144384 -7027 -200876 -299177 17100
3679 17100 196473 -9520 -244848 -216361 -155949 -30282 10153 -13078 99392 23025 -101244
3668 -101244 -128344 -338998 -134301 -169956 -316870 -103361 -88564 -71865 -171476 -281377 -235927
3657 -235927 -202710 -85325 -191566 80890 12797 -77977 -110109 60479 -288505 -159472
3647 -159472 -74545 -236017 -47672 -1594 -74102 -140100 -302229 -206639 -350056 -127630 -67982
3636 -67982 -405180 -232330 -83807 -77912 -51613 -47782 -68523 -39495 95450 96871 -184535
3625 -184535 -132259 -161706 -188737 -169714 -174192 6136 86787 209404 -29080 -25011 -80700
3614 -80700 -161579 -97070 -61659 72854 -46581 -225591 -238342 -104634 -302558 -200279 -152728
3603 -152728 -174496 -269150 -100012 -11976 7601 -32351 58475 -18934 -120595 -249182 -65458
3592 -65458 -296226 -346717 -147539 -229084 -297169 -195925 -247626 -175122 -274809 -135683 -124413
3581 -124413 -134815 -150850 -160521 -181952 -211342 -325935 -243254 -370982 -263546 30390 113267
3570 113267 -12287 -11100 -17800 -87951 -406156 -408660 -297512 -422573 -310795 -266783 -249622
3559 -249622 -221489 -242310 -241676 -275675 -107675 173573 37309 -8187 -176329 13667 136365
3548 136365 237924 41470 210575 192048 269731 277822 133565 -250148 -83377 -107497 -277164
3537 -277164 -250060 -194353 -130978 -107455 -74956 -252517 14358 5605 -138461 -199363 -72625
3526 -72625 33746 -130445 20742 20326 34100 42095 -120381 -163718 -181461 -76538 -122032
3515 -122032 28427 -75102 166931 -43571 -164858 -154040 -167744 -98431 -100987 -30191 -39361
3504 -39361 -68953 -81769 -54512 -26200 155348 245413 143751 10290 -1996 -65494 25362
3493 25362 -106739 -218935 -356666 -39876 65409 -58790 -158016 -258421 -375723 -324025
3483 -324025 -257771 -239046 -187811 -57113 -136433 -137388 -36013 -75921 -151433 -74109 -92437 -140911
3471 -140911 -60166 -152076 -192093 -236514 -421975 -235808 13497 -117822 -124240 29963 17746
3460 17746 -71679 20918 135234 36153 114911 111591 -144624 -169517 -75759 108641 -36732
3449 -36732 -122973 -214959 -340052 -113463 -69438 -163126 -223786 -138327 -82745 116008 222555
3438 222555 84016 189589 -92678 -246269 -176176 -211647 -215514 -243446 -133748 -230262 -373184
3427 -373184 -265749 -269684 -147780 187259 9664 -247973 -98856 -20810 -17447 -219389 -115443
3416 -115443 26141 131946 243459 350938 259057 183824 136032 -40925 -43536 -116032 94837
3405 94837 63455 -225903 -229924 -243233 -166072 -166853 -150257 -166860 -89152 -171633 -12844 64965
3393 64965 -58168 -18702 3985 157263 133441 -31604 139270 97015 45261 -53055 -206259
3382 -206259 -167679 -291193 -275452 -186033 -19591 85873 7122 -175766 -214407 -204186 -313368
3371 -313368 -188482 145232 -122237 -113848 -50553 46425 -113571 -170605 -84562 -89385 -119397
3360 -119397 -46661 -120608 -33930 183215 -95378 -61522 -53958 -27976 -16173 32019 125453
3349 125453 74987 -230248 -247319 -59446 29331 36622 -215802 -159874 -184168 -64656 148228
3338 148228 265890 249489 -42197 -21064 58649 15145 44179 163600 111897 305586 260006
3327 260006 148173 165815 82179 67611 -25257 -297478 -222681 -275450 -269889 -169174 -151050
3316 -151050 -110504 -70442 -20733 -117426 -57829 46482 125194 293217 262485 100010 104965
3305 104965 108280 37330 95691 127783 -86544 -117005 44203 150287 118051 -166784 -67600
3294 -67600 150066 48631 127715 -11774 -107581 -166847 -201493 -313202 -169901 -100171 -94024
3283 -94024 -168308 4419 60913 133457 201063 -130136 -180815 -12948 -33432 -276466 -29442
3272 -29442 261609 262281 136930 -7031 -189342 -68643 20751 -60052 -135934 12049 113877
3261 113877 51239 -8101 -42901 -174860 -188898 -200307 -373136 -165573 -23007 -175248 -216845
3250 -216845 3567 38102 4180 44789 17738 61438 -241874 -220172 -195352 -245168 -43022
3239 -43022 -146849 -23613 -67923 -164644 -70885 -91941 -153802 -148737 -71252 -225037 -152662
3228 -152662 -26748 -96732 118579 -13401 -35334 76526 70948 -110768 -311501 -117385
3218 -117385 -88012 -211598 -249201 -80907 -54831 -268153 -384347 -324615 -244170 -184379 -39848
3207 -39848 17493 -7829 -49355 -73082 84125 -6015 -161926 27858 61130 13162 -67474
3196 -67474 -265520 -272055 -744 38887 -133752 -61996 -164369 -58266 -89961 -2435 38624
3185 38624 -206471 -44974 -140975 -150851 59270 23226 -18929 -31537 72211 167861 106650
3174 106650 -127201 -194556 -187289 15302 208552 -161655 -156400 60842 -769 77246 -44419
3163 -44419 -219074 -143294 -80306 -100750 -282570 -53625 -66138 -173527 -182255 -222123 -209421
3152 -209421 -98126 5444 -41610 -5090 -163171 -175821 -146067 -5161 22892 -39373 170694
3141 170694 126904 14189 -38758 23688 177428 72389 -129417 42545 8527 123288
3131 123288 -34480 -13955 -111605 -240858 -150400 -66176 -42598 20507 -135698 -264048 -139045
3120 -139045 -45029 -152369 -191561 -207739 -129632 114586 -45530 -114589 -133531 -14640 -86707
3109 -86707 -191869 -85587 -89438 -344157 -274654 -241512 -135904 -57241 -168171 -156489 -185744
3098 -185744 7514 34329 -13810 48001 -232032 -99086 85710 214552 53127 -71775
3088 -71775 -281771 8454 445476 155792 122115 212811 119144 243129 427385 343917 264123
3077 264123 170796 167875 138098 -231387 -138460 -189295 -242438 -97607 61767 26582 -117166
3066 -117166 -118560 -60999 -129335 -66165 -125003 -151187 -25994 3724 55233 -19280 -17634 -79833
3054 -79833 -209916 -184819 -112005 -318644 -364934 -210689 -255662 -108622 -190815 -126439 87070
3043 87070 55732 6704 -11560 108447 151392 65365 -62281 -123504 -194036 -309987 -106098
3032 -106098 -30112 46165 68867 87886 34407 169264 -113170 -27217 210764 70830 87770
3021 87770 -200383 -176168 -141399 70438 29633 27525 -10672 -37191 -129891 40465 96235
3010 96235 -80578 -193605 25185 170776 217111 -2870 -99492 85545 140008 -155993
3000 -155993 -24093 90178 76521 94568 -3244 -118811 -115773 24711 122133 72129 58366
2989 58366 20112 -277098 -208751 -57691 12906 145588 169178 61348 -220443 -476283 -605790
2978 -605790 -480442 -244463 -150511 -46786 52908 101725 95868 262119 183407 67598 -25300
2967 -25300 -151352 59351 62939 253297 245763 -11179 -81608 -214841 -140802 204754 110223
2956 110223 4344 113392 136789 218141 185998 -59822 -212398 -50922 32482 23546 13790
2945 13790 -38763 -59147 87881 239346 333242 209283 69631 342764 291560 223327 -6170
2934 -6170 -211796 -230513 -157135 -60678 -289156 -334782 -15050 -27375 -58495 -217685 -372269
2923 -372269 -158506 -166715 -174252 27428 198941 9005 -32640 -164314 -75028 45657 193342
2912 193342 -68562 -174517 -141374 -93534 110247 203303 171916 132480 21781 -113774 -138744
2901 -138744 82853 103320 187397 330456 121255 -20835 100619 37875 119671 197958 160471
2890 160471 115215 49762 138577 -51404 60289 152404 18115 6572 -116109 -43592 32297
2879 32297 30745 67875 -85082 -52591 1150 13494 40405 144590 209565 192199 228800 35886
2867 35886 90600 44822 88572 195655 273512 117795 -120103 -368164 -252257 -150996 -123337
2856 -123337 -28371 -53126 -28024 -65043 -33858 -144957 -162505 -33380 94659 -155973 -79216
2845 -79216 84211 105378 151724 147807 110407 57565 59896 57981 68692 71758 90239 55138
2833 55138 -81042 -30491 -114400 -83357 -148799 -14715 -239537 -221711 6343 -324626 -338211
2822 -338211 -257103 -262480 -298569 -188329 -203481 -239095 -8744 83480 -98837 -158814 -264270
2811 -264270 -148038 -206023 -90924 -198280 -260156 -133919 1660 51343 -113015 -90270
2801 -90270 178110 -28532 3917 106356 102420 -40052 -64573 94468 25973 125790 69802
2790 69802 78349 88616 196035 19797 -29610 4934 37976 -13213 -1683 41036 -36710 -103963
2778 -103963 -89517 142409 165702 42641 89211 102517 223517 96715 -78169 -184441
2768 -184441 -127659 1874 170546 -52581 17760 -61580 -44136 -110200 -91195 39787 36349
2757 36349 12717 -131190 -34184 2082 18570 -139887 -15808 8481 -172191 -86441 -189900
2746 -189900 -131113 -127552 -99113 -50789 -106190 -44792 289938 183882 -108274 -133569 -300303
2735 -300303 -203240 117701 -7237 53272 183792 256752 193042 -20215 -54752 162555 67070
2724 67070 -167791 39612 19 -133982 -6543 -143070 207003 109840 103897 257242 -111159
2713 -111159 -101825 -277144 -157960 -14330 187869 146353 -37216 -130524 111046 163457 299895
2702 299895 -1094 -289139 -270745 -128353 33410 -118719 -46854 143049 130506 90399
2692 90399 31243 96866 -68831 -62888 35885 59985 -100539 -6224 -151093 -49 29880
2681 29880 -121157 80657 96581 120664 67174 -39550 4519 78126 107079 -46364 -86603
2670 -86603 -186011 -53730 57142 57791 175068 115721 7616 -49633 -40517 -151093 -76769
2659 -76769 -101542 -72155 -16980 79465 -100094 -128860 36716 -255528 -295427 -266180 -171766
2648 -171766 87083 7409 339361 384038 159437 243942 364772 69178 -50123 -75068
2638 -75068 -33012 67343 -13479 210384 2716 -65065 -110572 -109928 -34326 -220784 -443445
2627 -443445 -239501 -79114 -105491 2222 196353 51584 68031 88867 -153583 13594
2617 13594 55353 62674 -74976 -75075 -36654 -93763 46442 -23845 -10527 158403 292152 99532
2605 99532 49015 212227 59400 -19441 -228765 -201429 -238375 -110568 27398 27408 13819
2594 13819 2638 -34308 43007 169739 38522 68461 129736 107300 -40253 -254270 -114447
2583 -114447 -169989 -215300 -60911 10841 -56162 46609 43430 -133155 -219906 -150976 -174408
2572 -174408 -105558 -169170 -211044 73450 141913 41330 -216262 -103002 32645 102779 115004
2561 115004 90524 279137 59467 -149177 -17480 -40239 -50832 63860 137567 178129 80626
2550 80626 56810 -127898 217661 126787 -98447 -116423 -138806 13898 -37717 48591 -16003
2539 -16003 -110693 -24645 103970 29927 -24619 -139154 -83305 155088 219486 69334 -29100
2528 -29100 26079 292312 288373 -10046 12690 147805 141954 -51494 -37429 -80706 -152452
2517 -152452 33431 227411 106461 159049 227302 210354 73411 3418 -38760 -186346 -54222
2506 -54222 -224257 -114667 49793 47624 -145053 -184890 -121977 -33172 -48265 157942 91821
2495 91821 -40690 72947 264221 313948 149864 145343 -58632 3098 88289 38669 21843
2484 21843 -76643 -202790 -254141 -271989 -311785 -166853 -206779 -132511 -33565 172674 188827
2473 188827 286606 287263 196050 46146 157337 408665 499654 503235 168002 202522 114283
2462 114283 37845 61737 183570 225823 42498 -5201 118805 220678 113196 -206053
2452 -206053 -189573 31600 99720 -74239 75110 77045 208622 169089 66904 109793 26729
2441 26729 18353 -146708 -66270 160027 58439 -260164 -207379 -26004 218824 203158 128972
2430 128972 128349 238342 -8751 -23723 170995 201496 264328 170236 27441 -101979 -123275
2419 -123275 -8625 35009 -172746 -5979 91535 -5136 9771 -34266 95125 -19894 -76875
2408 -76875 -26244 -279843 -144807 -98114 -184758 -46637 -235082 -123302 -82257 -226845 -105151
2397 -105151 -50873 -16813 193019 225720 210235 -55322 15955 190898 180522 92579 -150406
2386 -150406 -219952 -178936 28430 43979 33736 13485 -50262 -88175 -79070 -73604 -190968 -194014
2374 -194014 -54664 -113810 -19165 1110 -17198 54320 242993 29865 48467 86622 209978
2363 209978 240535 271049 78518 -37235 -157537 -72150 57519 21606 -191442 -195025 5289
2352 5289 24646 91312 188671 238539 109835 142458 124553 178592 53811 24381 94295 255078
2340 255078 -151580 -171941 -185139 33518 70072 -126951 -198409 -69523 115843 -23618
2330 -23618 -169483 -144583 84723 364011 129118 169753 218854 34334 160542 65893 207354
2319 207354 294531 52270 -34481 39175 144754 10660 -157896 59667 131216 166456 102346
2308 102346 72229 85466 122630 119594 168145 54363 12995 16380 7711 99964 141803 106340
2296 106340 243377 175438 14824 60539 -75491 -92898 -29613 85127 231619 134481 418408
2285 418408 159382 29187 123237 412829 373853 21494 -166738 -16761 95193 93422
2275 93422 204681 161310 -32876 152554 192254 -31822 -92471 67796 -42098 -162952
2265 -162952 -2356 -41011 193246 281907 170898 -9884 -41175 -121711 -18939 -80212 95137
2254 95137 -143639 -94281 92413 245335 157056 199362 313676 382496 65440 -26266 -112538
2243 -112538 114748 296381 206328 -32726 121455 142509 -173257 -216715 -168041 -8453
2233 -8453 33580 53514 -173434 10240 140727 157153 -50947 10952 -70773 -14059 -16359
2222 -16359 -158282 -97298 2822 -161807 -96803 -33491 -27175 -97455 83500 207224 168264
2211 168264 88405 19903 -60933 -41152 25684 -34569 275205 136695 70657 34918 146993
2200 146993 210985 -14578 -56107 30898 11454 -41703 -40921 230835 180311 -80481 45756
2189 45756 49468 255760 456595 387161 371498 303123 199617 41658 -31878 62583 -27172
2178 -27172 -57234 -66326 -22584 42452 -52911 -273084 -134784 88567 449588 315997 94984
2167 94984 94693 -116020 -87597 83652 -29351 25706 18040 -55776 -29283 -143082 -60672 90567
2155 90567 59244 -114824 -220665 93126 276870 213735 253976 163118 3831 -98421 -2144
2144 -2144 -676 138667 -56691 -157310 -100416 117742 19860 -60954 110230 158782 258941
2133 258941 363766 176777 116036 144459 57091 193353 99434 211162 272820 429566 439010
2122 439010 260577 309981 267241 122534 129749 148529 162901 269713 151435 70351 222709
2111 222709 83067 -118810 39278 81796 33737 -14749 19822 -71175 -140250 -124682 -139371
2100 -139371 -51284 43566 54194 306448 256923 106041 10942 127151 -105699 67589 87365
2089 87365 145209 61932 -161718 -192958 -4115 176553 149981 19724 30050 186339 30510
2078 30510 -47959 -35089 92549 60579 -25049 -68500 -85361 -335285 -227012 -176725 -31032
2067 -31032 -173027 69746 209157 167253 -95336 -92355 163584 108769 120618 78040 17846
2056 17846 41677 -113986 -286068 -296095 -46477 245887 227967 34895 -10763 -79592 16249
2045 16249 -39272 15181 65773 180427 33117 78927 78223 73176 156708 31085 -98372 97437
2033 97437 203316 155152 34423 -218560 -242774 -46138 42872 -5819 -6355 112362 360389
2022 360389 296598 223206 -4964 -109691 28609 335643 408356 139804 28134 -37380
2012 -37380 -84773 96345 152922 201089 40017 -82022 225224 275427 -84537 32685 204602
2001 204602 49057 -32545 -58579 -114051 57755 -5565 260789 215487 403043 195172 -8696
1990 -8696 192094 -83142 -142145 -245573 -94927 -219016 -68624 -21759 -139140 -65748 -168017
1979 -168017 -224933 -224301 -123641 -135859 -180147 -345566 -147322 -145515 -66103 -49876 18798 135159
1967 135159 180239 224420 383394 305716 261190 226801 -96925 -43107 -5115 -138932 -47688
1956 -47688 -90817 -220069 54736 188769 242182 203354 261407 94097 -36278 28912 -58004
1945 -58004 79668 194656 133168 286234 373030 21252 -33293 -143012 -129663 -74294 448
1934 448 107360 114250 -79475 -110536 55052 -53201 -295304 -198857 -19291 92951 -165173
1923 -165173 22277 429667 53674 -55207 -66784 -32859 -16311 72097 91753 -208010 -376828
1912 -376828 35615 -59362 -201016 -95745 153685 148866 176100 -65287 -147871 -118496 -295431
1901 -295431 -26400 10632 -75993 -86810 -173226 -330876 -383124 -8805 191560 143043 232277
1890 232277 167615 -19281 8815 -38980 26405 225047 148710 -53848 40415 128082 1314
1879 1314 -86291 -157734 -280832 -34661 150990 182914 5681 -268874 37167 115079 14097
1868 14097 186164 113909 -42962 -112276 10302 50616 -60394 -80099 43719 57716 130531
1857 130531 308399 177436 105152 -67747 -136483 -185541 -42407 8121 167225 123530 -34517
1846 -34517 115733 192717 284155 153373 200477 97001 -109249 87754 8764 75176 52740
1835 52740 199910 146821 173384 215750 223338 191052 40260 258643 176595 188171 176639
1824 176639 99869 67831 237964 159121 145966 165010 27484 -114157 -112101 15188 -125809
1813 -125809 -162103 -139044 -115327 -71626 39460 -2372 92543 384997 525873 361014 162445
1802 162445 183268 89053 171618 72597 256906 394406 276068 311306 166311 159935 -64841
1791 -64841 -100939 -16393 -225030 -181608 -275723 -169030 -168735 154309 146859 -50204 11250 114630
1779 114630 98490 1012 45914 61670 70788 208299 192729 187631 -31689 -101163 -13949 54593
1767 54593 236954 270168 303388 -46017 62895 73396 249957 140221 -73906 -177866
1757 -177866 -183997 -46222 -82671 -244300 -447151 -480935 -266863 -238164 49400 142075 24764
1746 24764 26973 203850 167550 49959 120936 105256 -20316 206156 79458 -27978 40523
1735 40523 57748 51019 -11818 188910 215943 13863 -5346 198511 248706 172519 153129
1724 153129 -85329 -80630 -54744 -120104 93809 120349 65720 193838 463396 431431 238588
1713 238588 46640 46419 -47807 -88231 107300 -10295 -113561 39596 -94043 85519 46169
1702 46169 -118150 -62964 -41128 -31149 -114814 65316 -9278 -90727 54780 -2171 -50283
1691 -50283 26461 -138654 -135241 -72186 -286225 -72946 -157694 127180 108401 87827 -94041
1680 -94041 66657 173386 190869 134376 151539 82371 110142 -74683 -85857 23671 125787
1669 125787 262481 179351 191548 49057 -23770 37084 -24059 -21183 246073 177584 165698
1658 165698 151722 137065 -53248 -34453 -120586 93202 40958 122118 84409 24851 134333
1647 134333 252255 97796 96034 17007 3503 78144 314012 97084 12521 98654 142019
1636 142019 19471 -196149 -22756 113788 69544 8429 49793 152024 167244 201777 66246
1625 66246 -58092 16338 28486 -178340 -220804 32114 46992 -160078 -215490 -118000 -49129
1614 -49129 16273 26852 147708 140362 82106 1475 -86606 -22753 -10550 -96021 -9074 -43810
1602 -43810 38090 24508 -195502 -235325 -61209 -211456 -133824 44583 255977 239512 289003
1591 289003 248167 94358 -104157 -26564 -2956 92746 133901 241549 105664 -19944 -50823
1580 -50823 190652 345897 121288 119713 5992 45854 278250 323891 23339 -190436 6323
1569 6323 43098 -243203 -127676 -7715 64959 8686 -176657 -199303 -284821 -204480 71166
1558 71166 322548 238257 57788 -2227 121025 51994 157167 203928 118162 142724 40153
1547 40153 87314 375402 269595 248152 329335 155961 304574 263713 110106 56199 80687
$$ [...]
##END NTUPLES=NMR SPECTRUM
##END=
