##TITLE=1H_EC-3305(V-25)
 CDCl3
 8 sc, 
 24.6.2024
##JCAMPDX= 6.0         $$ Bruker NMR JCAMP-DX V2.0
##DATA TYPE= NMR SPECTRUM
##DATA CLASS= NTUPLES
##ORIGIN= UXNMR, Bruker Analytische Messtechnik GmbH
##OWNER= root
$$ XWIN-NMR		Version 3.5
$$ Mon Jun 24 15:25:17 2024 Russian Standard Time (UT+4h)  she@DPX200
##.OBSERVE FREQUENCY= 200.1309
##.OBSERVE NUCLEUS= ^1H
##.ACQUISITION MODE= SIMULTANEOUS
##.ACQUISITION SCHEME= undefined
##.AVERAGES= 8
##.DIGITISER RES= 18
##SPECTROMETER/DATA SYSTEM= spect
##.PULSE SEQUENCE= zg30
##.SOLVENT NAME= CDCl3
##.SHIFT REFERENCE= (INTERNAL, CDCl3, 0, 13.4563)
##AUDIT TRAIL= $$ (NUMBER, WHEN, WHO, WHERE, WHAT)
$$ ##TITLE= Audit trail, XWIN-NMR		Version 3.5
$$ ##JCAMPDX= 5.01
$$ ##ORIGIN= Bruker BioSpin GmbH
$$ ##OWNER= she
$$ F:/spectra/data/she/nmr/H-F/1/pdata/1/auditp.txt
$$ ##AUDIT TRAIL=  $$ (NUMBER, WHEN, WHO, WHERE, WHAT)
(   1,<2024-06-24 15:24:07.64 +0400>,<she>,<DPX200>,
      <created by zg, POWCHK disabled, PULCHK disabled
       configuration hash MD5:
       00 E9 B6 7A A2 85 ED C7 34 08 36 98 17 FE 4E 26
       data hash MD5: 16K
       CE 0F 0B 75 96 99 D6 97 72 62 14 B9 D9 9B BA D4>)
(   2,<2024-06-24 15:24:10.12 +0400>,<she>,<DPX200>,
      <Start of raw data processing
       efp BC_mod = 2 LB = 0.24 FT_mod = 6 PKNL = 1 PHC0 = -25313.03 PHC1 = 8.187481 SI = 16K 
       data hash MD5: 16K
       CD 31 B4 7D 51 FD FE 0C 1A 99 90 A5 15 07 59 70>)
(   3,<2024-06-24 15:24:28.50 +0400>,<she>,<DPX200>,
      <pk PHC0 = -0.6962947 PHC1 = 2 
       data hash MD5: 16K
       97 D7 61 A5 99 94 89 D7 B7 9B 5B 02 6B 99 4D 18>)
(   4,<2024-06-24 15:24:33.40 +0400>,<she>,<DPX200>,
      <abs ABSG = 5 
       data hash MD5: 16K
       9A D5 56 EE 47 0D 30 50 4B 11 7C 1B C4 65 F3 F9>)
$$ ##END=
$$ 
$$ hash MD5
$$ 3B 31 24 5A 15 F6 7A 2A 41 2C 60 C7 12 87 A8 74
##$RELAX= 
##$RELAX= 
##$RELAX= 
##$RELAX= 
##$RELAX= 
##$RELAX= 
$$ Bruker specific parameters
$$ --------------------------
##$DU= <F:/spectra>
##$EXPNO= 1
##$NAME= <H-F>
##$PROCNO= 1
##$TYPE= <nmr>
##$USER= <she>
##$AMP= (0..31)
100 100 100 100 100 100 100 100 100 100 100 100 100 100 100 100 100 100 
100 100 100 100 100 100 100 100 100 100 100 100 100 100 
##$AQSEQ= 0
##$AQ_mod= 1
##$AUNM= <au_zg>
##$AUTOPOS= <>
##$BF1= 200.13
##$BF2= 200.13
##$BF3= 200.13
##$BF4= 200.13
##$BF5= 200.13
##$BF6= 200.13
##$BF7= 200.13
##$BF8= 200.13
##$BYTORDA= 1
##$CFDGTYP= 0
##$CFRGTYP= 5
##$CHEMSTR= <none>
##$CNST= (0..31)
1 1 145 1 1 1 1 1 1 1 1 1 1 1 1 1 1 1 1 1 1 1 1 1 1 1 1 1 1 1 1 1 
##$CPDPRG= <>
##$CPDPRG1= <>
##$CPDPRG2= <>
##$CPDPRG3= <>
##$CPDPRG4= <mlev>
##$CPDPRG5= <mlev>
##$CPDPRG6= <mlev>
##$CPDPRG7= <mlev>
##$CPDPRG8= <mlev>
##$CPDPRGB= <>
##$CPDPRGT= <>
##$D= (0..31)
0 1.2 0 0 0 0 0 0 0 0.06 0 0.03 0 0 0 0 0.0002 0 0 0 0 0 0 0 0 0 0 0 0 
0 0 0 
##$DATE= 1719228247
##$DBL= (0..7)
120 120 120 120 120 120 120 120 
##$DBP= (0..7)
150 150 150 150 150 150 150 150 
##$DBP07= 0
##$DBPNAM0= <>
##$DBPNAM1= <>
##$DBPNAM2= <>
##$DBPNAM3= <>
##$DBPNAM4= <>
$$ [...]
##$SUBNAM3= <"">
##$SUBNAM4= <"">
##$SUBNAM5= <"">
##$SUBNAM6= <"">
##$SUBNAM7= <"">
##$SUBNAM8= <"">
##$SUBNAM9= <"">
##$SW= 18.0517689322627
##$SWIBOX= (0..15)
0 0 2 0 0 0 0 0 0 0 0 0 0 0 0 0 
##$SW_h= 3612.71676300578
##$TD= 16384
##$TD0= 1
##$TE= 0
##$TE2= 300
##$TE3= 300
##$TEG= 300
##$TL= (0..7)
0 120 120 120 120 120 120 120 
##$TP= (0..7)
150 150 150 150 150 150 150 150 
##$TP07= 0
##$TPNAME0= <>
##$TPNAME1= <>
##$TPNAME2= <>
##$TPNAME3= <>
##$TPNAME4= <>
##$TPNAME5= <>
##$TPNAME6= <>
##$TPNAME7= <>
##$TPOAL= (0..7)
0.5 0.5 0.5 0.5 0.5 0.5 0.5 0.5 
##$TPOFFS= (0..7)
0 0 0 0 0 0 0 0 
##$TUNHIN= 0
##$TUNHOUT= 0
##$TUNXOUT= 0
##$USERA1= <user>
##$USERA2= <user>
##$USERA3= <user>
##$USERA4= <user>
##$USERA5= <user>
##$V9= 5
##$VALIST= <valist>
##$VCLIST= <CCCCCCCCCCCCCCC>
##$VD= 0
##$VDLIST= <DDDDDDDDDDDDDDD>
##$VPLIST= <PPPPPPPPPPPPPPP>
##$VTLIST= <TTTTTTTTTTTTTTT>
##$WBST= 1024
##$WBSW= 4
##$XGAIN= (0..3)
0 0 0 0 
##$XL= 0
##$YL= 0
##$YMAX_a= 245890
##$YMIN_a= -395405
##$ZGOPTNS= <>
##$ZL1= 120
##$ZL2= 120
##$ZL3= 120
##$ZL4= 120
##$ABSF1= 13.46176
##$ABSF2= -4.59009
##$ABSG= 5
##$ABSL= 3
##$ALPHA= 0
##$AQORDER= 0
##$ASSFAC= 0
##$ASSFACI= 0
##$ASSFACX= 0
##$ASSWID= 0
##$AUNMP= <proc_1d>
##$AZFE= 0.1
##$AZFW= 0.1
##$BCFW= 0
##$BC_mod= 2
##$BYTORDP= 0
##$COROFFS= 0
##$CY= -3
##$DATMOD= 1
##$DC= 0
##$DFILT= <>
##$DTYPP= 0
##$F1P= 0
##$F2P= 0
##$FCOR= 1
##$FTSIZE= 16384
##$FT_mod= 6
##$GAMMA= 0
##$GB= 0
##$INTBC= 1
##$INTSCL= 3.70164e-10
##$ISEN= 128
##$LB= 0.24
##$LEV0= 0
##$LPBIN= 0
##$MAXI= 10000
##$MC2= 0
##$MEAN= 0
##$ME_mod= 0
##$MI= 1.114404
##$NCOEF= 0
##$NC_proc= -7
##$NLEV= 6
##$NOISF1= 3.799351
##$NOISF2= 2.8
##$NSP= 0
##$NTH_PI= 0
##$NZP= 0
##$OFFSET= 13.45625
##$PC= 1
##$PHC0= -25313.73
##$PHC1= 10.18748
##$PH_mod= 1
##$PKNL= yes
##$PPARMOD= 0
##$PSCAL= 0
##$PSIGN= 0
##$REVERSE= no
##$SF= 200.130013359176
##$SI= 16384
##$SIGF1= 3
##$SIGF2= 2
##$SINO= 5.538805
##$SIOLD= 16384
##$SREGLST= <1H.CDCl3>
##$SSB= 0
##$STSI= 16384
##$STSR= 0
##$SW_p= 3612.71676300577
##$SYMM= 0
##$S_DEV= 0
##$TDeff= 16384
##$TDoff= 0
##$TI= <>
##$TILT= no
##$TM1= 0
##$TM2= 0
##$TOPLEV= 0
##$USERP1= <user>
##$USERP2= <user>
##$USERP3= <user>
##$USERP4= <user>
##$USERP5= <user>
##$WDW= 1
##$XDIM= 16384
##$YMAX_p= 425717282
##$YMIN_p= -539039
$$ End of Bruker specific parameters
$$ ---------------------------------
##NTUPLES= NMR SPECTRUM
##VAR_NAME=  FREQUENCY,     SPECTRUM/REAL,   SPECTRUM/IMAG
##SYMBOL=    X,             R,               I
##VAR_TYPE=  INDEPENDENT,   DEPENDENT,       DEPENDENT
##VAR_FORM=  AFFN,          ASDF,            ASDF
##VAR_DIM=   16384,         16384,           16384
##UNITS=     HZ,            ARBITRARY UNITS, ARBITRARY UNITS
##FACTOR=    0.220516191357247, 1,           1
##FIRST=     2692.99953043618, 0,            0
##LAST=      -919.717232569587, 0,           0
##MIN=       -919.717232569587, -539039,     0
##MAX=       2692.99953043618, 425717282,    0
$$ Real data points
##PAGE= N=1
##DATA TABLE= (X++(R..R)), XYDATA
$$ [...]
$$ plain form
10220 1881824 2037421 1978450 1864531 1760919 1658998 1676555 1569380 1464898 1521480 1691207
10210 1691207 1952688 1909104 1801786 1810865 1730645 1595604 1319039 1478220 1414296 1347765
10200 1347765 1444663 1174454 1342300 1376949 1568292 1526486 1448098 1360797 1167463 1127854
10190 1127854 982068 1270928 1237207 1177201 1134510 1143864 1239515 1230921 1195543 1132707 1038653
10179 1038653 1062264 795809 617751 646639 823682 801336 1003738 903274 956881 767938
10169 767938 652137 869957 701180 727078 749702 798626 861489 909083 702500 832556
10159 832556 931498 746719 793332 649356 481113 525321 663258 813364 914738 891692
10149 891692 735857 529264 423284 515783 544686 684500 603317 452143 568738 736278
$$ packed form
10220A881824J55597n8971j13919j03612j01921J7557j07175j04482N6582J69727
10210A691207K61481m3584j07318R079q0220j35041k76565J59181o3924o6531
10200A347765R6898k70209J67846L4649J91343m1806p8388q7301j93334l9609
10190A127854j45786K88860l3721o0006m2691R354R5651q594l5378o2836r4054
10179A038653K3611k66455j78058K8888J77043k2346K02402j00464N3607j88943
10169G67938j15801K17820j68777K5898K2624M8924O2863M7594k06583J30056
10159H32556R8942j84779M6613j43976j68243M4208J37937J50106J01374k3046
10149H91692j55835k06593j05980R2499K8903J39814q1183j51174J16595J67540
$$ plain form
10139 736278 498381 391521 632092 724909 651048 619047 633516 552374 489285 518965 345329
10128 345329 497987 707092 628281 426165 281592 173901 279110 500984 658573 864028
10118 864028 854991 705832 476061 285703 272851 471849 450152 521243 723353 715731 557008
10107 557008 726513 702631 759090 699317 770725 726805 848668 819259 526149 762192 700114
10096 700114 617165 501225 765017 636757 640199 713405 917029 889967 867066 736394 811977
10085 811977 792525 957138 1103128 1134903 1159819 1069330 1089518 990727 983469 1128516 1144438
10074 1144438 1110291 980609 1019312 964718 866017 1090974 920444 1088902 955028 887035
10064 887035 946055 1039487 1146691 956262 982703 1005461 902828 988643 832586 938695
$$ packed form
10139G36278k37897j06860K40571R2817p3861l2001J4469q1142o3089K9680j73636
10128C45329J52658K09105p8811k02116j44573j07691J05209K21874J57589K05455
10118H64028r037j49159k29771j90358j2852J98998k1697P1091K02110p622j58723
10107E57008J69505k3882N6459n9773P1408m3920J21863k9409k93110K36043o2078
10096G00114q2949j15940K63792j28260L442P3206K03624k7062k2901j30672P5583
10085H11977j9452J64613J45990L1775K4916r0489K0188r8791p258J45047J5922
10074A144438l4147j29682L8703n4594r8701K24957j70530J68458j33874o7993
10064H87035N9020R3432J07204j90429K6441K2758j02633Q5815j56057J06109
$$ plain form
10054 938695 1063375 1221526 1272806 1415359 1452314 1072659 1084325 1304480 1040677 964248
10044 964248 828686 956711 892745 837068 927162 875127 916886 1064595 998771 989407 795343
10033 795343 895962 929389 773466 1033433 1082123 1070993 1075766 883189 827083 865052 915683
10022 915683 919434 907638 905197 1127493 1208492 1200339 1495298 1506788 1351527 1291462 1408470
10011 1408470 1273097 1287395 1231911 1237835 1105739 1204704 1122711 1245231 1374069 1164108
10001 1164108 1253547 1236263 1079339 1204027 1287130 947000 917736 1202318 1454137 1535241
9991 1535241 1455693 1492195 1473007 1508976 1471181 1311544 1185999 1211284 1138913 1304755 1226054
9980 1226054 889165 928424 654248 747905 971299 828305 798396 786046 602274 413036
$$ packed form
10054I38695J24680J58151N1280J42553L6955l79655J1666K20155k63803p6429
10044I64248j35562J28025o3966n5677R0094n2035M1759J47709o5824r364j94064
10033G95343J00619L3427j55923K59967M8690j1130M773j92577n6106L7969N0631
10022I15683L751j1796k441K22296Q0999q153K94959J1490j55261o0065J17008
10011A408470j35373J4298n5484N924j32096R8965q1993J22520J28838k09961
10001A164108Q9439j7284j56924J24688Q3103l40130k9264K84582K51819Q1104
9991A535241p9548L6502j9188L5969l7795j59637j25545K5285p2371J65842p8701
9980A226054l36889L9259k74176R3657K23394j42994k9909j2350j83772j89238
$$ plain form
9970 413036 469744 455411 553859 608227 628745 654321 745233 579308 811050 590419 763172
9959 763172 598143 405756 836272 634125 606947 469873 370776 523060 555148 637824
9949 637824 809770 490669 506364 659212 627735 404564 449886 631212 429434 316609
9939 316609 383546 248810 -38112 204534 499411 447718 336593 347679 276066 395946
9929 395946 535848 238187 370350 526467 496157 324480 77588 188930 423126 507296
9919 507296 245184 111594 -30326 63661 215285 91993 88330 52907 -23342 -155546 -109690
9908 -109690 -64309 155979 252874 124540 176256 155093 -115599 83902 161869 95157 179569
9897 179569 59442 -28629 -4992 -38248 -66165 158618 215716 155033 219123 -70192 -12433
$$ packed form
9970D13036N6708j4333R8448N4368K0518K5576R0912j65925K31742k20631J72753
9959G63172j65029j92387M30516k02147k7178j37074r9097J52284L2088Q2676
9949F37824J71946l19101J5695J52848l1477k23171M5322J81326k01778j12825
9939C16609O6937j34736k86922K42646K94877n1693j11125J1086p1613J19880
9929C95946J39902k97661J32163J56117l0310j71677k46892J11342K34196Q4170
9919E07296k62112j33590j41920R3987J51624j23292l663l5423p6249j32204M5856
9908a09690M5381K20288R6895j28334N1716k1163k70692J99501P7967o6712Q4412
9897A79569j20127q8071K3637l3256k7917K24783N7098o0683O4090k89315N7759
$$ plain form
9886 -12433 67106 -107620 -66164 187906 63922 5028 1926 -122157 37034 396 30594
9875 30594 58838 142879 55147 78591 152426 30048 -154158 8051 -168357 -64322 185150
9864 185150 166613 229782 218122 36417 -25129 117673 -117541 -159029 91489 260857 235871
9853 235871 158643 163177 117473 47513 344759 203977 -44037 103059 205745 151942 259151
9842 259151 61546 88731 276652 491406 510372 261703 203463 295124 238859 110760 157175
9831 157175 90118 -2670 114530 104633 118636 173493 51353 -59676 -146892 -98349 -207736
9820 -207736 -183622 -127618 -362234 -135345 123085 119557 143183 50384 181202 111310 1501
9809 1501 158033 88610 85492 85405 -98971 -78366 124465 185883 127815 17009 135656 293440
$$ packed form
9886a2433P9539j74726M1456K54070j23984n8894l102j24083J59191l6638L0198
9875C0594K8244Q4041q7732K3444P3835j22378j84206J62209j76408J04035K49472
9864A85150j8537O3169j1660j81705o1546J42802k35214m1488K50518J69368k4986
9853B35871p7228M534m5704o9960K97246j40782k48014J47096J02686n3803J07209
9842B59151j97605K7185J87921K14754J8966k48669n8240R1661n6265j28099M6415
9831A57175o7057r2788J17200r897J4003N4857j22140j11029q7216M8543j09387
9820b07736K4114N6004k34616K26889K58430l528K3626r2799J30818o9892j09809
9809A501J56532o9423l118q7j84376K0605K02831O1418n8068j10806J18647J57784
$$ plain form
9797 293440 58484 129495 79919 168821 129278 -98991 -98182 35046 237660 200629 118676
9786 118676 80579 -104911 -188726 -74578 2453 -157802 46328 269640 146954 94000
9776 94000 -14823 63368 -110804 -158562 -83735 -97273 -161762 -266548 -28540 105439 -107264
9765 -107264 -292821 -126075 104 91745 44601 128979 172440 79956 -16202 -46004 38435
9754 38435 -12390 228792 220808 -83525 -79068 127400 210459 333098 106462 94105 70052
9743 70052 -145143 -232616 -65888 228563 134023 74226 73314 -206628 -226075 -214705 -295942
9732 -295942 -39880 -16458 -193620 -161427 -10127 62198 57346 26739 196867 -9348 85385
9721 85385 88172 -35110 -265307 -167917 -149686 -21582 26396 23382 121580 220754 331865
$$ packed form
9797B93440k34956P1011m9576Q8902l9543k28269Q09J33228K02614l7031q1953
9786A18676l8097j85490q3815J14148P7031j60255K04130K23312j22686n2954
9776I4000j08823P8191j74172m7758P4827j3538o4489j04786K38008J33979k12703
9765a07264j85557J66746J26179R1641m7144Q4378M3461r2484r6158k9802Q4439
9754C8435n0825K41182p984l04333M457K06468Q3059J22639k26636j2357k4053
9743G0052k15195q7473J66728K94451r4540n9797r12k79942j9447J1370q1237
9732b95942K56062K3422j77162L2193J51300P2325m852l0607J70128k06215R4733
9721H5385K787j23282k30197R7390J8231J28104M7978l014R8198R9174J11111
$$ plain form
9710 331865 269293 55917 -50343 -140001 4636 -164742 -44147 45077 59393 95715 55255
9699 55255 275207 107295 315596 -36617 -130184 -15589 -53830 64034 168965 251204
9689 251204 155358 10397 -153494 -99234 -40264 -80445 71535 -30641 229083 230376 124431
9678 124431 97142 50936 97876 127084 67997 79172 43260 208228 221447 -12362 -202319
9667 -202319 -410631 -235234 -137166 -25137 114857 -37778 -21104 -101220 -85921 -79903 -197217
9656 -197217 -35346 41607 -79253 -46649 -107371 -229552 -298979 66580 233493 133360
9646 133360 -77332 -22367 51839 62210 133465 7732 15265 -12127 40830 217712 108996
9635 108996 -98689 110311 239958 239895 -60368 75589 26291 -51389 -87096 -201600 -229764
$$ packed form
9710C31865o2572k13376j06260q9658J44637j69378J20595Q9224J4316L6322m0460
9699E5255K19952j67912K08301l52213r3567J14595l8241J17864J04931Q2239
9689B51204r5846j44961j63891N4260N8970m0181J51980j02176K59724J293j05945
9678A24431k7289m6206M6940K9208n9087J1175l5912J64968J3219k33809j89957
9667b02319k08312J75397R8068J12029J39994j52635J6674q0116J5299O018j17314
9656a97217J61871P6953j20860L2604o0722j22181o9427L65559J66913j00133
9646A33360k10692N4965P4206J0371P1255j25733P533k7392N2957J76882j08716
9635A08996k07685K09000J29647o3l00263J35957m9298p7680l5707j14504k8164
$$ plain form
9624 -229764 -300841 -84719 -113740 67062 345989 175587 190324 82816 31757 -16584 72646
9613 72646 95113 216760 81618 24501 194150 -26513 40911 116283 97769 -50250 98502
9602 98502 43674 -217555 -353286 78531 172806 125068 265593 253338 227279 244151 256888
9591 256888 255333 299329 120606 178854 207305 86554 215808 211663 47334 -167640 -18922
9580 -18922 88830 206057 265164 91549 47393 69948 213016 55631 165238 380743
9570 380743 279320 296172 277145 132797 142431 -37178 158602 304145 136093 185992 388087
9559 388087 258117 64272 33580 -88368 134446 49102 69498 41390 116970 53018 -175125
9548 -175125 -47280 202181 121596 32017 -31531 -129070 -14289 -70026 125703 225546 144690
$$ packed form
9624b29764p1077K16122k9021J80802K78927j70402J4737j07508n1059m8341Q9230
9613G2646K2467J21647j35142n7117J69649k20663O7424P5372j8514j48019J48752
9602I8502n4828k61229j35731M31817R4275m7738J40525j2255k6059J6872J2737
9591B56888j555M3996j78723N8248K8451j20751J29254m145j64329k14974J48718
9580a8922J07752J17227N9107j73615m4156K2555J43068j57385J09607K15505
9570C80743j01423J6852j9027j44348R634j79609J95780J45543j68052M9899K02095
9559C88087j29970j93845l0692j21948K22814q5344K0396k8108P5580o3952k28143
9548a75125J27845K49461q0585q9579o3548r7539J14781n5737J95729R9843q0856
$$ plain form
9537 144690 207997 262156 159277 -11470 -40502 -94414 7188 158595 -90584 -277259
9527 -277259 -112307 67207 31557 107272 87578 83218 15001 152637 233253 33333 -41264
9516 -41264 143936 148689 230343 70328 17940 118444 109137 -35718 -17398 33885 -52886
9505 -52886 98764 22073 -67471 151538 296751 128506 104589 270161 79821 -25492
9495 -25492 -121909 -222027 -226325 75684 48665 70499 75901 77763 95077 -232476 -330241 -120798
9483 -120798 -128295 38603 -57163 25137 125335 -123370 -33936 -126964 -49834 37577 -301792
9472 -301792 -115810 -36735 -174271 -52008 13494 47815 -124391 -73960 31065 64416 25591
9461 25591 -50039 -297203 -185026 10867 -56311 50491 227232 53806 43798 69994 -3717
$$ packed form
9537A44690O3307N4159j02879j70747k9032n3912J01602J51407k49179j86675
9527b77259J64952J79514l5650P5715j9694m360o8217J37636Q0616j99920p4597
9516d1264J85200M753Q1654j60015n2388J00504r307j44855J8320N1283q6771
9505e2886J51650p6691q9544K19009J45213j68245k3917J65572j90340j05313
9495b5492r6417j00118m298L02009k7019K1834N402J862J7314l27553r7765K09443
9483a20798p497J66898r5766Q2300J00198k48705Q9434r3028P7130Q7411l39369
9472c01792J85982P9075j37536J22263O5502L4321j72206N0431J05025L3351l8825
9461B5591p5630k47164J12177J95893o7178J06802J76741j73426j0008K6196p3711
$$ plain form
9450 -3717 -85512 18825 41749 -24337 -72646 -34947 -193120 -169620 45447 299823 238701
9439 238701 139292 -135530 -137776 -122135 24627 12594 124970 184273 208078 199883 99748
9428 99748 220110 223616 -81835 -159309 -81348 -81808 -26784 21053 79626 135326 187028 58747
9416 58747 97056 61513 23911 21362 -7997 -142383 -128886 -304221 -276734 54651 76256
9405 76256 104858 36412 -75329 64015 77701 136747 198004 44815 -75983 -125171 56219
9394 56219 -26224 -160832 -4619 -56257 -9427 -91204 132781 244969 26207 -100376 -60701
9383 -60701 68978 37724 -81097 -28941 -9307 90013 125184 -148418 -13608 140540 345336
9372 345336 245019 221293 -76134 -107209 42627 26398 -60757 -137778 -107712 -60881 70901
$$ packed form
9450c717q1795J04337K2924o6086m8309L7699j58173K3500K15067K54376o1122
9439B38701r9409k74822k246J5641J46762j2033J12376N9303K3805q195j00135
9428I9748J20362L506l05451p7474P7961m60N5024M7837N8573N5700N1702j28281
9416E8747L8309l5543l7602k549k9359j34386J3497j75335K7487L31385K1605
9405G6256K8602o8446j11741J39344J3686N9046O1257j53189j20798m9188J81390
9394E6219q2443j34608J56213n1638M6830q1777K23985J12188k18762j26583L9675
9383f0701J29679l1254j18821N2156J9634R9320L5171k73602J34810J54148K04796
9372C45336j00317k3726k97427l1075J49836j6229q7155p7021L0066M6831J31782
$$ plain form
9361 70901 -55295 192824 214032 117517 174711 171824 178966 -18492 72280 166748 141210 136538
9349 136538 129198 -26308 -39150 96483 103079 62675 78337 181177 -128223 21748 143017
9338 143017 175129 199531 302779 272254 382523 229343 -91924 -257463 -52156 120696
9328 120696 65473 137143 57085 77978 303230 194064 -4182 -71468 196431 275095 221866
9317 221866 167363 139208 29927 197955 277996 243043 199685 -105103 -84640 -164438 -90851
9306 -90851 -34834 -122212 -235956 -140540 -265172 -141954 160385 189792 156182 -66518 -172803
9295 -172803 -168382 37974 161050 95282 55692 -60947 -78796 -118605 -75088 19387 5905
9284 5905 29743 -59470 25707 14537 42332 -113135 -22093 163048 189469 -25363 -189004
$$ packed form
9361G0901j26196K48119K1208r6515N7194k887P142j97458R0772R4468k5538m672
9349A36538p340j55506j2842J35633O596m0404J5662J02840l09400J49971J21269
9338A43017L2112K4402J03248l0525J10269j53180l21267j65539K05307J72852
9328A20696n5223P1670q0058K0893K25252j09166j98246o7286K67899P8664n3229
9317B21866n4503k8155j09281J68028Q0041l4953m3358l04788K0463p9798P3587
9306i0851N6017q7378j13744R5416j24632J23218L02339K9407l3610k22700j06285
9295a72803M421K06356J23076o5768l9590j16639j7849l9809M3517R4475j3482
9284E905K3838q9213Q5177j1170K7795j55467R1042J85141K6421k14832j63641
$$ plain form
9273 -189004 49450 -20154 35932 108128 -144710 -25420 66976 131376 235816 -137964 -179274
9262 -179274 -54890 307352 36949 -161758 -86701 -88416 24999 -27487 -101617 -321444 -167199
9251 -167199 -209849 -92649 73229 91841 128165 58768 48885 27077 -120597 -242680 -174038
9240 -174038 -92001 134448 161352 -11831 -31434 49485 -31967 -90713 -42810 46181 3037
9229 3037 -40797 -145621 37422 -101427 118382 -10466 -211689 -16911 5019 -100979
9219 -100979 -193452 75556 166310 63883 244 -53485 135761 -43265 -185970 -145067 157434
9208 157434 52700 23586 162466 -138626 -57471 17264 -32918 -94875 -4616 20659 115703
9197 115703 24128 -125975 7915 81983 243225 137273 -12644 118559 73708 120489
$$ packed form
9273a89004K38454o9604N6086P2196k52838J19290R2396O4400J04440l73780m1310
9262a79274J24384L62242k70403j98707P5057j715J13415n2486p4130k19827J54245
9251a67199m2650J17200J65878J8612L6324o9397r883k1808j47674j22083O8642
9240a74038Q2037K26449K6904j73183j9603Q0919q1452n8746M7903Q8991m3144
9229C037m3834j04824J83043j38849K19809j28848k01223J94778K1930j05998
9219a00979r2473K69008R0754j02427o3639n3729J89246j79026j42705M0903L02501
9208A57434j04734k9114J38880l01092Q1155P4735n0182o1957R0259K5275R5044
9197A15703r1575j50103J33890P4068J61242j05952j49917J31203m4851M6781
$$ plain form
9187 120489 61732 25679 42970 -12458 -260461 -197702 81962 -24736 -261255 -128360 201601
9176 201601 16991 -261753 63227 -8282 -66417 -66871 -244629 -74468 85606 -111569 -49087
9165 -49087 -162627 -142405 91619 -218031 -141095 -76429 -84607 -133373 -213712 -135970 -353363
9154 -353363 -291864 -26814 -98649 -181733 -24112 18627 -134602 -114015 -36299 -232340 -75923
9143 -75923 206669 98391 -129576 -94154 -124633 -288606 -217905 -163809 -95524 -154171 45972
9132 45972 171556 169896 243064 35891 2597 -276926 -259579 -156633 -160973 3720 41875
9121 41875 92674 -122318 -218276 -292240 -114320 6270 -54749 -237272 -324539 -110037 9136
9110 9136 -15263 167350 -12747 -191869 -77371 33121 -56404 -249038 -228382 -226663 -253399
$$ packed form
9187A20489n8757l6053J7291n5428k48003O2759K79664j06698k36519J32895L29961
9176B01601j84610k78744L24980p1509n8135m54j77758J70161J60074j97175O2482
9165d9087j13540K0222K34024l09650P6936O4666q178m8766q0339P7742k17393
9154c53363O1499K65050p1835q3084J57621M2739j53229K0587P7716j96041J56417
9143g5923K82592j08278k27967L5422l0479j63973P0701N4096O8285n8647K00143
9132D5972J25584j660P3168k07173l3294k79523J7347J02946m340J64693L8155
9121D1875N0799k14992r5958p3964J77920J20590o1019j82523q7267K14502J19173
9110I136k4399J82613j80097j79122J14498J10492q9525j92634K0656J719k6736
$$ plain form
9099 -253399 -72427 -154257 -295592 -258478 -104924 -141207 -92164 -109987 -29381 -26699 -231202
9088 -231202 -187293 -31037 54790 -232700 -86854 -123054 140590 26114 -21438 -279864
9078 -279864 -396335 -188531 -67400 -145002 43290 33379 -133370 -62307 -35078 10988 -58236
9067 -58236 -38069 -7595 -97588 -4088 60803 65212 134130 11209 -68233 -55134 73302 120606
9055 120606 -47037 78923 178992 -46151 -49707 -22516 -52480 -227566 -91978 -73770 -97506
9044 -97506 -126576 89496 135310 118072 40508 -53596 -369473 -55969 11908 -1677 193390
9033 193390 5833 -11429 -8586 -18983 103616 199580 115310 66643 47128 -22645 42702
9022 42702 151262 134839 23563 -124107 -122340 -129263 -188123 -324255 -205035 -141451 -28327
$$ packed form
9099b53399J80972q1830j41335L7114J53554l6283M9043j7823Q0606K682k04503
9088b31202M3909J56256Q5827k87490J45846l6200K63644j14476m7552k58426
9078b79864j16471K07804J21131p7602J88292r911j66749P1063K7229M6066o9224
9067e8236K0167L0474q9993R3500O4891M409O8918j22921p9442J3099J28436M7304
9055A20606j67643J25960J00069k25143l556K7191k9964j75086J35588J8208k3736
9044i7506k9070K16072M5814j7238p7564r4104l15877L13504O7877j3585J95067
9033A93390j87557j7262K843j0397J22599R5964q4270m8667j9515o9773O5347
9022D2702J08560j6423j11276j47670J767o923n8860j36132J19220O3584J13124
$$ plain form
9011 -28327 -77960 -171227 -267994 -112828 -152956 -41137 -83467 32598 -55094 154777 33022
9000 33022 -40432 -6000 -182165 -66793 -129692 25030 -106788 -21569 -138145 -180139 181216
8989 181216 178718 137332 55710 11589 -4022 -133083 -160594 -150502 -1642 26419 -207598
8978 -207598 -74332 73582 -112889 -87454 -274660 -333109 -423393 -249678 -195103 -144482 -238892
8967 -238892 -207655 -1044 195908 285149 263633 258085 122345 164369 243853 287522 439772
8956 439772 235119 67688 2938 146417 137556 252583 169459 -15365 79593 122401 -23151
8945 -23151 147235 253550 300067 119012 55286 190161 28357 59570 192171 94252 61930
8934 61930 99872 20298 89752 53604 -19582 -22180 213472 89939 -9651 80630 96126 -116956
$$ packed form
9011b8327m9633r3267r6767J55166m0128J11819m2330J16065q7692K09871j21755
9000C3022p3454L4432j76165J15372o2899J54722j31818Q5219j16576m1994L61355
8989A81216k498m1386q1622m4121j5611j29061k7511J0092J48860K8061k34017
8978b07598J33266J47914j86471K5435j87206n8449r0284J73715N4575N0621r4410
8967b38892L1237K06611J96952Q9241k1516n548j35740M2024P9484M3669J52250
8956D39772k04653j67431o4750J43479q861J15027q3124j84824R4958M2808j45552
8945b3151J70386J06315M6517j81055o3726J34875j61804L1213J32601r7919l2322
8934F1930L7942p9574O9454l6148p3186k598K35652j23533r9590R0281J5496k13082
$$ plain form
8922 -116956 6246 -35156 -199959 -29424 19039 -200943 -195747 -159809 -140254 -106816 -36083
8911 -36083 38857 62571 47917 -29867 -53589 -121764 -144916 -300496 -288653 -126209 -79737
8900 -79737 -98555 -135247 153114 214134 134712 257313 55734 -13834 39361 41398 92977
8889 92977 115289 84374 206718 170696 -49802 100343 91994 221952 242049 133782 170356
8878 170356 389922 524910 268795 346095 195000 188896 214174 409843 223130 10371
8868 10371 144100 96057 378100 545344 593013 243580 209320 17047 108515 156175 235836
8857 235836 228836 265010 228623 192914 162857 118640 258123 247524 191937 336592 279517
8846 279517 188596 396454 494732 474453 355806 474783 736444 522027 721325 821054
$$ packed form
8922a16956J23202m1402j64803J70535M8463k19982N196L5938J9555L3438P0733
8911c6083P4940K3714j4654p7784k3722o8175k3152j55580J1843J62444M6472
8900g9737j8818l6692K88361O1020p9422J22601k01579o9568N3195K037N1579
8889I2977K2312l0915J22344l6022k20498J50145q349J29958K0097j08267L6574
8878A70356K19566J34988k56115P7300j51095o104K5278J95669j86713k12759
8868A0371J33729m8043K82043J67244M7669l49433l4260j92273R1468M7660P9661
8857B35836p000L6174l6387l5709l0057m4217J39483j0599n5587J44655n7075
8846B79517r0921K07858R8278k0279j18647J18977K61661k14417J99298R9729
$$ plain form
8836 821054 875565 1153178 1285779 1242944 1072047 998763 735727 911512 900879 857826 878122
8825 878122 861244 711915 788754 600889 636262 819476 528336 393947 450197 458338 503012
8814 503012 264242 443042 336543 493958 488237 300678 555485 273059 280246 168102
8804 168102 147981 -37049 83329 393078 404524 377780 314519 148654 209720 355706 296292
8793 296292 82011 -89331 -32886 -157786 -351977 -340470 -103542 78623 45696 -17556
8783 -17556 -209458 -149719 -9009 150659 161493 72459 141639 33921 -23038 25644 10309
8772 10309 -127200 14295 142628 178156 -38962 -76761 -91011 -128618 178532 263113 370762
8761 370762 265594 36748 -44024 -130501 52745 259483 230769 7942 1790 173543 109437
$$ packed form
8836H21054N4511K77613J32601m2835j70897p3284k63036J75785j0633m3053K0296
8825H78122j6878j49329P6839j87865L5373J83214k91140j34389N6250Q141M4674
8814E03012k38770J78800j06499J57415n721j87559K54807k82426P187j12144
8804A68102k0121j85030J20378L09749J1446k6744o3261j65865O1066J45986n9414
8793B96292k14281j71342N6445j24900j94191J1507K36928J82165l2927o3252
8783a7556j91902N9739J40710J59668J0834q9034O9180j07718n6959M8682j5335
8772A0309j37509J41495J28333L5528k17118l7799j4250l7607L07150Q4581J07649
8761C70762j05168k28846q0772q6477J83246K06738k8714k22827o152J71753o4106
$$ plain form
8750 109437 -77915 -34038 -152750 -127891 -87994 -182598 83546 82137 62449 95782 -34789
8739 -34789 -353 -89461 -161492 -175543 -227179 -409042 -233202 -39722 90420 -163035 45016
8728 45016 -174080 -282775 -54700 5154 1747 71065 235887 92845 134988 220552 92335
8717 92335 20889 -22843 60195 162018 -38509 249104 498479 350911 54309 112799 95223
8706 95223 -33571 81274 30777 -206147 -267205 -45759 79699 89531 138207 74364 24007
8695 24007 14892 -155085 98683 140216 151289 4174 -175650 -90655 -145601 124230 -22087
8684 -22087 24488 -33516 212923 86631 -192939 -91702 -102925 -272805 -103437 -120540 -114666
8673 -114666 10016 27706 61629 -139287 42598 252996 201271 -102600 -145528 27410
$$ packed form
8750A09437j87352M3877j18712K4859L9897r4604K66144j409j9688L3333j30571
8739c4789L4436q9108p2031j4051n1636j81863J75840J93480J30142k53455K08051
8728D5016k19096j08695K28075N9854l407O9318J64822j43042M2143Q5564j28217
8717I2335p1446m3732Q3038J01823k00527K87613K49375j47568k96602N8490j7576
8706I5223j28794J14845n0497k36924o1058K21446J25458R832M8676o3843n0357
8695B4007r115j69977K53768M1533J1073j47115j79824Q4995n4946K69831j46317
8684b2087M6575n8004K46439j26292k79570J01237j1223j69880J69368j7103N874
8673a14666J24682J7690L3923k00916J81885K10398n1725l03871m2928J72938
$$ plain form
8663 27410 137 -29268 142837 104197 56626 151339 22389 -56083 58133 -16675 -199149
8652 -199149 -105591 -68494 136427 6052 -246372 -119926 -207231 -255843 -180660 -198757 -78426
8641 -78426 -74098 77718 101301 -6353 132544 76613 11357 98917 -203463 -124472 -74643
8630 -74643 -184060 9155 -25781 -48679 39874 1451 -23369 50309 -89347 -68666 31540
8619 31540 -98445 50184 96772 10973 -10866 209860 154816 -55309 -134087 -73458 -44987
8608 -44987 -168501 -32293 1117 107016 186391 -99587 -117394 -128447 -224201 -242031 -200167
8597 -200167 -261271 -284364 -198123 -196313 -183152 -266918 -230822 -195805 -262081 -396357 -395306 -259773
8585 -259773 -47150 33894 -156300 -153943 -120916 -86147 -97213 -211391 17639 -139546 -28231
$$ packed form
8663B7410k7273k9405J72105l8640m7571R4713j28950p8472J14216p4808j82474
8652a99149R3558L7097K04921j30375k52424J26446q7305m8612P5183j8097J20331
8641g8426M328J51816K3583j07654J38897n5931o5256Q7560l02380P8991M9829
8630g4643j09417J93215l4936k2898Q8553l8423k4820P3678j39656K0681J00206
8619C1540j29985J48629M6588q5799k1839K20726n5044k10125p8778O0629K8471
8608d4987j23514J36208L3410J05899P9375k85978j7807j1053r5754j7830M1864
8597b00167o1104k3093Q6241J810J3161q3766L6096L5017o6276j34276J051J35533
8585b59773K12623Q1044j90194K357L3027L4769j1066j14178K29030j57185J11315
$$ plain form
8574 -28231 -119343 17950 38163 -119940 82206 181829 1462 -184734 -85656 -124937 -44343
8563 -44343 246286 240862 187151 -53697 -49046 87221 12612 -5139 20372 43016 202580
8552 202580 333421 211155 -65048 -149552 -1706 46778 35594 123563 277808 124992
8542 124992 -38640 87667 48323 66647 -38691 34890 210559 309002 161625 62696 107922
8531 107922 -61186 72886 5909 10276 -13069 -40658 110598 61488 26698 -68978 33866
8520 33866 220448 132530 259464 276049 38507 117865 113453 -126673 -168442 -78119 209329
8509 209329 313677 293010 262282 259369 112278 46091 86317 -30149 -8637 133142 -113393
8498 -113393 -140700 -115532 150572 98402 82036 302430 -85549 18216 -44105 40151 6533
$$ packed form
8574b8231r1112J37293K0213j58103K02146R9623j80367j86196R9078l9281Q0594
8563d4343K90629n424n3711k40848M651J36267p4609j7751K5511K2644J59564
8552B02580J30841j22266k76203q4504J47846M8484j1184Q7969J54245j52816
8542A24992j63632J26307l9344J8324j05338P3581J75669R8443j47377r8929M5226
8531A07922j69108J34072o6977M367k3345k7589J51256m9110l4790r5676J02844
8520C3866J86582q7918J26934J6585k37542P9358m412k40126m1769R0323K87448
8509B09329J04348k0667l0728k913j47091o6187M0226j16466K1512J41779k46535
8498a13393k7307K5168K66104n2170j6366K20394l87979J03765o2321Q4256l3618
$$ plain form
8487 6533 17636 -61415 -158324 -2452 200810 197851 121877 -10862 211519 168951 -85445
8476 -85445 -244561 -120902 139152 107777 218270 80477 -9316 -1590 -102751 -179338 -110207
8465 -110207 -68975 -55828 157599 65675 -519 -130578 -40263 236341 99532 227602 317991
8454 317991 197054 232554 267039 229938 253426 -53935 9685 -91273 -191995 -246598 16570
8443 16570 70857 -11925 50736 163702 82471 59031 13118 63915 205698 29054 15730
8432 15730 114502 -131955 -3537 141407 366339 267878 151752 371415 355600 133983
8422 133983 123968 219842 173515 -104174 -104656 165589 287188 142023 -14839 -83548 97465
8411 97465 151660 246727 110483 189483 216269 62784 -14639 -69849 52477 -156724 -172869
$$ packed form
8487F533J1103p9051r6909J55872K03262k959p5974j32739K22381m2568k54396
8476h5445j59116J23659K60054l1375J10493j37793q9793P726j01161p6587O9131
8465a10207M1232J3147K13427r1924o6194j30059R0315K76604j36809J28070R0389
8454C17991j20937L5500L4485l7101K3488l07361O3620j00958j00722n4603K63168
8443A6570N4287q2782O2661J12966q1231k3440m5913N0797J41783j76644j3324
8432A5730R8772k46457J28418J44944K24932r8461j16126K19663j5815k21617
8422A33983j0015R5874m6327k77689m82K70245J21599j45165j56862o8709J81013
8411I7465N4195R5067j36244P9000K6786j53485p7423n5210J22326k09201j6145
$$ plain form
8400 -172869 45112 338456 264684 264869 82019 56169 -42059 157205 140797 191712 179655
8389 179655 60958 267689 327445 147145 47632 64741 -9647 77669 277495 161402 196617
8378 196617 266723 288645 525257 337590 209545 221599 42952 243216 143533 194975 21531
8367 21531 34876 218451 275095 224805 162759 121150 48383 256243 358547 424918 382799
8356 382799 344932 256707 326892 430555 371388 400316 283333 293434 591122 466478 296077
8345 296077 547974 554233 449921 146743 425640 396437 358071 427075 534582 496938 279002
8334 279002 308807 385074 481704 337855 235442 276874 421787 259539 576841 497768 375704
8323 375704 98627 142874 407997 447878 273068 297697 288968 191456 382278 544828 461700
$$ packed form
8400a72869K17981K93344p3772J85j82850k5850r8228J99264j6408N0915j2057
8389A79655j18697K06731N9756j80300r9513J7109p4388Q7316J99826j16093L5215
8378A96617P0106K1922K36612j87667j28045J2054j78647K00264r9683N1442j73444
8367B1531J3345J83575N6644n0290o2046m1609p2767K07860J02304O6371m2119
8356C82799l7867q8225P0185J03663n9167K8928j16983J0101K97688j24644j70401
8345B96077K51897O259j04312l03178K78897k9203l8366O9004J07507l7644k17936
8334B79002K9805P6267R6630j43849j02413M1432J44913j62248L17302p9073j22064
8323C75704k77077M4247K65123L9881j74810K4629q729r7512J90822J62550q3128
$$ plain form
8312 461700 494035 536666 435505 409767 336527 180735 111722 218561 379185 330652 231167
8301 231167 266403 289165 449607 414450 490117 392852 247926 246435 414340 560882 521787
8290 521787 312022 287115 233864 215537 227034 288149 236195 15200 207827 427868 388538
8279 388538 344983 309560 309879 133352 421172 611565 529258 614291 427234 259515 164655
8268 164655 290332 430051 481712 408836 565239 561643 586353 615138 523405 494908 340965
8257 340965 463134 710946 740029 585647 461054 331619 634100 593474 558326 576149
8247 576149 644773 632489 409167 392326 290188 431802 636140 718974 573440 721521
8237 721521 853701 817194 681130 730684 662808 839545 796776 798245 853784 844931 863317
$$ packed form
8312D61700L2335M2631j01161k5738p3240j55792o9013J06839J60624m8533r9485
8301B31167L5236K2762J60442l5157P5667r7265j44926j491J67905J46542l9095
8290E21787k09765k4907n3251j8327J1497O1115n1954k20995J92627K20041l9330
8279C88538m3555l5423L19j76527K87820J90393q2307Q5033j87057j67719r4860
8268A64655J25677J39719N1661p2876J56403l596K4710K8785r1733k8497j53943
8257C40965J22169K47812K9083j54382j24593j29435L02481m0626l5148J7823
8247E76149O8624j2284k23322j6841j02138J41614K04338Q2834j45534J48081
8237G21521J32180l6507j36064M9554o7876J76737m2769J469N5539q853J8386
$$ plain form
8226 863317 830650 1132541 1149702 910922 1036329 1014069 959808 1012338 1243994 1206701 1301973
8215 1301973 1241451 1041529 1067742 1229973 1463403 1439904 1319624 1124767 1145553 1158923
8205 1158923 1122717 1112992 1041941 1107146 1355285 1305931 1209654 1271541 1157228 1142462 1216449
8194 1216449 1319160 603113 -258688 1358979 1684534 1583519 1753818 1919047 2020690
8185 2020690 1735598 1680725 1616339 1722031 1391092 1289609 1374544 1262525 1136449 1437022
8175 1437022 1511362 1603681 1550294 1477510 1512826 1562943 1430401 1358744 1423423 1483879 1515384
8164 1515384 1514893 1625621 1679393 1775251 1743117 1761875 1969922 1727341 1504980 1474807 1456542
8153 1456542 1456803 1309725 1380774 1462949 1602984 1563507 1645111 1745000 1567041 1583729 1586948
$$ packed form
8226H63317l2667L01891J7161k38780J25407k2260n4261N2530K31656l7293R5272
8215A301973o0522j99922K6213J62231K33430k3499j20280j94857K0786J3370
8205A158923l6206r725p1051O5205K48139m9354r6277O1887j14313j4766P3987
8194A216449J02711p16047q61801J617667L25555j01015J70299J65229J01643
8185B020690k85092n4873o4386J05692l30939j01483Q4935j12019j26076L00573
8175A437022P4340R2319n3387p2784L5316N0117j32542p1657O4679O0456L1505
8164A515384m91J10728N3772R5858l2134J8758K08047k42581k22361l0173j8265
8153A456542K61j47078P1049Q2175J40035l9477Q1604R9889j77959J6688L219
$$ plain form
8142 1586948 1637072 1466070 1712761 1798989 1699698 1779124 1641996 1346680 1414892 1580001
8132 1580001 1629255 1580690 1657313 2017814 1741717 1619992 1578915 1642693 1445344 1292920
8122 1292920 1364303 1483582 1762514 1914891 1746934 1708277 1778505 1865744 1843165 1950405
8112 1950405 2174769 1985943 2111648 1927258 1807125 1992829 2142972 2092055 2123651 2168201
8102 2168201 1875293 1943639 2139279 2141939 2113787 2030088 1962276 2221414 2076815 2189272 2237961
8091 2237961 2421218 2440900 2407987 2554921 2637485 2595832 2530653 2783994 2632794 2764590
8081 2764590 2799547 2748251 2767345 2752748 2820507 2995902 3099941 3181951 3076391 3077572 2960925
8070 2960925 3104408 3314359 3381705 3338000 3533488 3807283 3584228 3554155 3550761 3777220
$$ packed form
8142A586948N0124j71002K46691Q6228r9291P9426j37128k95316O8212J65109
8132A580001M9254m8565P6623L60501k76097j21725m1077O3778j97349j52424
8122A292920P1383J19279K78932J52377j67957l8657P0228Q7239k2579J07240
8112A950405K24364j88826J25705j84390j20133J85704J50143n0917L1596M4550
8102B168201k92908O8346J95640K660k8152q3699o7812K59138j44599J12457M8689
8091B237961J83257J9682l2913J46934Q2564m1653o5179K53341j51200J31796
8081B764590L4957n1296J9094j4597O7759J75395J04039Q2010j05560J181j16647
8070B960925J43483K09951O7346m3705J95488K73795k23055l0073l394K26459
$$ plain form
8060 3777220 3911463 3892342 3901034 4026339 4189535 4191235 4299308 4342723 4438833 4481481 4349042
8049 4349042 4386486 4456444 4597181 4841421 5149640 5300442 5390062 5571977 5801221 5938979
8039 5938979 6186705 6163355 6204831 6643176 7239301 7648869 7783454 7887370 7909418 8034311
8029 8034311 8034854 8357111 8751093 9200455 9646761 10323210 10709872 10902890 10862228 10684160
8019 10684160 10539066 10658599 11024360 11152252 11320960 11804304 12104376 12170927 12575191 12694892
8009 12694892 12870834 12935835 13319818 13852813 14285172 14756310 15300149 15703937 15726292 15769055
7999 15769055 15919086 16448624 17297340 18039746 18869083 19525915 20227656 20692099 21081381
7990 21081381 21461851 21998951 22251540 22411128 22489647 22295148 22548694 22699071 22918527 22564432
$$ packed form
8060C777220J34243j9121Q692J25305J63196J700J08073M3415R6110M2648j32439
8049D349042L7444O9958J40737K44240L08219J50802Q9620J81915K29244J37758
8039E938979K47726k3350M1476M38345N96125M09568J34585J03916K2048J24893
8029H034311N43L22257L93982M49362M46306O76449L86662J93018m0662j78068
8019A0684160j45094J19533L65761J27892J68708M83344L00072O6551M04264J19701
8009A2694892J75942O5001L83983N32995M32359M71138N43839M03788K2355M2763
7999A5769055J50031N29538Q48716P42406Q29337O56832P01741M64443L89282
7990B1081381L80470N37100K52589J59588P8519j94499K53546J50377K19456l54095
$$ plain form
7980 22564432 22434485 22598191 22756690 23135558 23796403 24419453 25075205 25884485 26718016
7971 26718016 27863562 28953502 30200838 31454645 32949748 34223791 35168033 36047074
7963 36047074 36969632 37746954 38007031 37762719 37248495 36637224 36038463 35872751 35671251
7954 35671251 35314641 35260470 35217035 35077304 34964664 35388512 35801391 36348812 37257572 38251573
7944 38251573 39498218 41001738 42272731 43108784 43810469 44081127 44609857 45050857 45389333
7935 45389333 45552254 45678574 45591961 45872764 46499518 47057309 47713391 48389689 48808406 49516851
7925 49516851 49921842 50324509 51120788 52239049 53978633 55922005 58279863 60901672 64114087
7916 64114087 67522691 71568589 75857085 80152222 85412295 91030806 96945916 103648348
$$ packed form
7980B2564432j29947J63706J58499L78868O60845O23050O55752Q09280Q33531
7971B6718016J145546J089940J247336J253807J495103J274043R44242Q79041
7963C6047074R22558P77322K60077k44312n14224o11271n98761j65712k01500
7954C5671251l56610n4171m3435j39731j12640M23848M12879N47421R08760R94001
7944C8251573J246645J503520J270993Q36053P01685K70658N28730M41000L38476
7935D5389333J62921J26320q6613K80803O26754N57791O56082O76298M18717P08445
7925D9516851M04991M02667P96279J118261J739584J943372K357858K621809L212415
7916F4114087L408604M045898M288496M295137N260073N618511N915110O702432
$$ plain form
7908 103648348 110148018 114875866 116933977 115908309 112162127 106907409 101046604 95858884
7900 95858884 91584902 88223533 85869865 84466592 83912012 84505684 86109605 88408476
7892 88408476 91794742 96073613 101195401 107022268 113883342 121744178 130915399 141351707
7884 141351707 153269372 166623793 180609246 194443641 205036883 208587595 203079578
7877 203079578 188960020 170329941 151846867 135844167 122701232 112311329 104108427
7870 104108427 97684871 92452265 88475426 85533592 83666699 82998864 83129773 83965516
7862 83965516 85461235 87575845 90370661 94210960 98649913 103642929 109260741 115062973
7854 115062973 120455050 123111592 121325391 115594194 106588754 96392986 86417100 77616384
$$ packed form
7908A03648348O499670M727848K058111j025668l746182n254718n860805n187720
7900I5858884m273982l361369k353668j403273n54580N93672J603921K298871
7892H8408476L386266M278871N121788N826867O861074P860836R171221J0436308
7884A41351707J1917665J3354421J3985453J3834395J0593242L550712n508017
7877B03079578j4119558j8630079j8483074j6002700j3142935j0389903q202902
7870A04108427o423556n232606l976839k941834j866893o67835J30909Q35743
7862H3965516J495719K114610K794816L840299M438953M993016N617812N802232
7854A15062973N392077K656542j786201n731197r005440j0195768r975886q800716
$$ plain form
7846 77616384 70086965 63448442 57861734 53090576 48918397 45386688 42295563 39784562
7838 39784562 37527437 35513776 33670042 32043908 30545727 29260231 27701079 26266562
7830 26266562 25057333 24045796 23004440 22032929 21234826 20459713 19986286 19356290 18886470
7821 18886470 18359457 17705595 17193210 16630710 16111748 15671527 15501979 15393328 15065006
7812 15065006 14714376 14189553 14111244 13761647 13287961 12762209 12245458 11885822 11365166 11009119
7802 11009119 10785078 10641985 10298538 10083235 9951763 10097124 9746741 9772330 9660879 9560800
7792 9560800 9415574 9478551 9182242 8727168 8592694 8316075 8368551 8289610 8162104 8160422
7782 8160422 8159278 8001057 7710926 7623507 7311278 6995593 6933303 6775699 6781783 6637745 6777010
$$ packed form
7846G7616384p529419o638523n586708m771158m172179l531709l091125k511001
7838C9784562k257125k013661j843734j626134j498181j285496j559152j434517
7830B6266562j209229j011537j041356r71511p98103p75113m73427o29996m69820
7821A8886470n27013o53862n12385n62500n18962m40221j69548j08651l28322
7812A5065006l50630n24823p8309l49597m73686n25752n16751l59636n20656l56047
7802A1009119k24041j43093l43447k15303j31472J45361l50383K5589j11451j00079
7792I560800j45226O2977k96309m55074j34474k76619N2476p8941j27506j682
7782H160422j144j58221k90131q7419l12229l15685o2290j57604O084j44038J39265
$$ plain form
7771 6777010 6606875 6464687 6190593 6090744 6088152 5964666 6085997 5984751 5781334 5656637
7761 5656637 5427585 5306373 5284164 5317308 5175631 5219923 5166935 5078386 4876424 4752389
7751 4752389 4910393 5009235 5069715 5029384 4928498 4901507 4869816 4866775 4585954 4721543 4919301
7740 4919301 4799757 4569438 4537478 4279911 4355344 4203139 4182190 4226207 4230523 4231505 4263939
7729 4263939 4012815 3991416 4060428 3874686 3838346 3852732 3854314 3970770 3940025 3861172 3942828
7718 3942828 3812639 3902851 3802117 3703952 3440362 3608633 3795929 3736965 3944560 3962993
7708 3962993 3793837 3723721 3729390 3866837 3859768 3829052 3865112 3878410 4026757 3875877 3539769
7697 3539769 3691992 3830457 3861939 3763422 3717759 3738024 3813747 3794539 3772657 3704018 4024510
$$ packed form
7771F777010j70135j42188k74094r9849k592j23486J21331j01246k03417j24697
7761E656637k29052j21212k2209L3144j41677M4292n2988q8549k01962j24035
7751D752389J58004R8842O0480m0331j00886k6991l1691l041k80821J35589J97758
7740D919301j19544k30319l1960k57567P5433j52205k0949M4017M316R82L2434
7729D263939k51124k1399O9012j85742l6340J4386J582J16456l0745p8853Q1656
7718C942828j30189R0212j00734r8165k63590J68271J87296n8964K07595J8433
7708C962993j69156p0116N669J37447p069l0716L6060J3298J48347j50880l36108
7697C539769J52223J38465L1482r8517m5663K0265P5723j9208k1882o8639L20492
$$ plain form
7686 4024510 3906339 3877221 3864234 4030535 4065260 4127960 4059465 3934092 3987099 4028452 4227289
7675 4227289 4283117 4394222 4435391 4353882 4219502 3916091 4141947 4117524 3982138 4001725
7665 4001725 3879643 3635310 3703367 3814380 3890009 4067142 4054920 4172737 3976058 4146880
7655 4146880 4217181 4460614 4345749 4279544 4303100 4408480 4424335 4453437 4629025 4704142 4681023
7644 4681023 4591497 4627028 4764151 4880320 4942568 4755017 4559983 4864891 5005638 4862157
7634 4862157 4892408 5022632 5078160 5164140 5150712 5403461 5539140 5283380 5353332 5417712 5572537
7623 5572537 5618843 5753863 6005945 5911917 5929934 6028235 6128465 6154322 6277638 6073773
7613 6073773 6212526 6431340 6420103 6494366 6743866 6828997 7051031 7106000 7187292 7176019 7391410
$$ packed form
7686D024510j18171k9118j2987J66301L4725O2700o8495j25373N3007M1353J98837
7675D227289N5828J11105M1169q1509j34380l03411K25856k4423j35386J9587
7665D001725j22082k44333O8057J11013P5629J77133j2222J17817j96679J70822
7655D146880P0301K43433j14865o6205K3556J05380J5855K9102J75588P5117k3119
7644D681023q9526L5531J37123J16169O2248j87551j95034L04908J40747j43481
7634D862157L0251J30224N5528Q5980j3428K52749J35679k55760O9952O4380J54825
7623E572537M6306J35020K52082r4028J8017R8301J00230K5857J23316k03865
7613F073773J38753K18814j1237P4263K49500Q5131K22034N4969Q1292j1273K15391
$$ plain form
7602 7391410 7737896 8091923 8177333 8076014 8269815 8276939 8536111 8665859 9048795 9295036
7592 9295036 9331723 9407197 9864757 10030070 10179745 10404922 10799954 11530299 11698445 11769043
7582 11769043 12164526 12634841 13183997 13684107 14058244 14531309 14926392 15117250 15394043
7573 15394043 15471339 15619752 15830141 16125431 16527761 16741208 17365559 17624887 18010762 18843052
7563 18843052 19522193 20166089 20865643 21546538 21942304 22169633 22236923 22378324 22609912 23053222
7553 23053222 23384515 23843051 24138595 24343138 24441009 24687738 24875613 25033919 25174168 25046627
7543 25046627 25117656 25530097 25873258 26315211 26756873 27050771 27574638 28205230 28994116 30165657
7533 30165657 30960768 31115300 31010474 30402781 30277148 30277560 30665122 30751556 31143846 31303598
$$ packed form
7602G391410L46486L54027Q5410j01319J93801P124K59172J29748L82936K46241
7592I295036L6687P5474M57560J65313J49675K25177L95032P30345J68146P0598
7582A1769043L95483M70315N49156N00110L74137M73065L95083J90858K76793
7573A5394043P7296J48413K10389K95290M02330K13447O24351K59328L85875Q32290
7563A8843052O79141O43896O99554O80895L95766K27329O7290J41401K31588M43310
7553B3053222L31293M58536K95544K04543R7871K46729J87875J58306J40249j27541
7543B5046627P1029M12441L43161M41953M41662K93898N23867O30592P88886J171541
7533C0165657P95111J54532j04826o07693j25633M12L87562Q6434L92290J59752
$$ plain form
7523 31303598 30955328 30970807 31178919 31360456 31335794 31202339 30805477 30697091 30736688 30967864
7513 30967864 31085085 31422785 31966916 32669182 33502103 34451148 35367311 35914589 36108712
7504 36108712 36201006 36213595 36444674 36875236 37449101 38231849 39087558 39475695 39559928 39142028
7494 39142028 38730043 38903426 38792363 38597978 38718300 38894891 39135603 39474891 40189740
7485 40189740 41176380 42457110 43941919 45392164 46522672 47391684 48009016 48458012 49119455
7476 49119455 49333971 50274576 51525081 53014124 54857333 56635079 58753802 60981052
7468 60981052 63329047 66129828 69542341 73490490 77885527 82887633 88489758 94723447
7460 94723447 101077232 107989705 115894804 124422213 133470401 142063966 148403301 150204071
$$ packed form
7523C1303598l48270J5479K08112J81537k4662j33455l96862j08386L9597K31176
7513C0967864J17221L37700N44131P02266Q32921R49045R16163N47278J94123
7504C6108712R2294J2589K31079M30562N73865P82748Q55709L88137Q4233m17900
7494C9142028m11985J73383j11063j94385J20322J76591K40712L39288P14849
7485D0189740R86640J280730J484809J450245J130508Q69012O17332M48996O61443
7476D9119455K14516R40605J250505J489043J843209J777746K118723K227250
7468F0981052K347995K800781L412513L948149M395037N002106N602125O233689
7460I4723447O353785O912473P905099Q527409R048188Q593565O339335J800770
$$ plain form
7452 150204071 146819544 139771110 130998148 122450354 115399491 109817354 105754833 103346590
7444 103346590 102368848 102466288 104174444 106647302 109704437 113706551 118585025 124102584
7436 124102584 130235407 137160313 145412737 155279701 166703906 179765024 195070897 211965400
7428 211965400 227507138 235608129 231805557 217678178 198666220 179510968 162520778
7421 162520778 148808040 137324764 128161076 120608057 114403970 109790770 106224315 104036300
7413 104036300 103111889 103011520 103852961 105618497 107886350 109871555 112178064 114866503
7405 114866503 118281620 121875555 125881136 129829611 133270010 134714931 132555875 126969494
7397 126969494 118810849 110563784 103387599 97290608 92719612 89058077 85496665 82474038
$$ packed form
7452A50204071l384527p048434q772962q547794p050863n582137m062521k408243
7444A03346590r77742R7440J708156K472858L057135M002114M878474N517559
7436A24102584O132823O924906Q252424R866964J1424205J3061118J5305873J6894503
7428B11965400J5541738Q100991l802572j4127379j9011958j9155252j6990190
7421A62520778j3712738j1483276r163688p553019o204087m613200l566455k188015
7413A04036300r24411j00369Q41441J765536K267853J985205K306509K688439
7405A14866503L415117L593935M005581L948475L440399J444921k159056n586381
7397A26969494q158645q247065p176185o096991m570996l661535l561412l022627
$$ plain form
7389 82474038 79775810 77140068 75234356 74124102 72820409 71337522 69686650 67259471
7381 67259471 64931773 62530374 59975033 58061578 56408625 55436649 54613689 53921976 53543002
7372 53543002 53099467 52725688 52461664 52329533 52115395 52343497 52225694 52254768 52219243 52150148
7362 52150148 52094083 51709245 51148948 50129136 49099576 48641487 48717980 49042625 49445945
7353 49445945 49672209 49856807 50081118 50481795 51184122 51917057 52634533 53619556 54625283
7344 54625283 55886018 57504011 59620240 61818461 63992138 65061741 64303351 61721920
7336 61721920 58838954 56348729 54116100 52281418 50440210 48554272 46823620 45189591
7328 45189591 43878851 42682780 41592818 40149980 39014682 38121065 37242386 36540829 36025071
$$ packed form
7389H2474038k698228k635742j905712j110254j303693j482887j650872k427179
7381F7259471k327698k401399k555341j913455j652953r71976q22960o91713l78974
7372E3543002m43535l73779k64024j32131k14138K28102j17803K9074l5525o9095
7362E2150148n6065l84838n60297j019812j029560m58089P6493L24645M03320
7353D9445945K26264J84598K24311M00677P02327P32935P17476R85023J005727
7344E4625283J260735J617993K116229K198221K173677J069603p58390k581431
7336F1721920k882966k490225k232629j834682j841208j885938j730652j634029
7328D5189591j310740j196071j089962j442838j135298q93617q78679p01557n15758
$$ plain form
7319 36025071 35509749 34867962 34289826 33862354 33644606 33535253 33538316 33408294 33229161 33057697
7309 33057697 32816488 32691933 32832802 32911302 33123492 33470576 33796529 34482516 35166841 35636395
7299 35636395 36160589 36813401 37791948 38946523 40134502 41440098 42790766 44537861 46501549
7290 46501549 48644307 51054117 53737734 56289499 58653089 60739398 62667177 63526265
7282 63526265 63659554 62862813 61599529 60615444 59574804 58594596 57959892 57479312 57219295
7273 57219295 57462331 57821006 58640641 59556731 60431685 61655776 63054396 64798307 66411892
7264 66411892 68119833 70637800 73757042 77540065 82526050 88394677 95332836 103805412
7256 103805412 113530634 124269339 135801045 148526095 162701195 178996430 197843880
$$ packed form
7319C6025071n15322o41787n78136m27472k17748j09353L063j30022j79133j71464
7309C3057697k41209j24555J40869P8500K12190L47084L25953O85987O84325M69554
7299C5636395N24194O52812R78547J154575J187979J305596J350668J747095J963688
7290D6501549K142758K409810K683617K551765K363590K086309J927779Q59088
7282F3526265J33289p96741j263284r84085j040640r80208o34704m80580k60017
7273E7219295K43036L58675Q19635R16090Q74954J224091J398620J743911J613585
7264F6411892J707941K517967L119242L783023M985985N868627O938159Q472576
7256A03805412R725222J0738705J1531706J2725050J4175100J6295235J8847450
$$ plain form
7249 197843880 220453331 246788914 276976073 311313376 351192036 394336595 425717282
7242 425717282 421614468 382785191 329078784 277934039 236642450 204280230 178369140
7235 178369140 157337158 140029012 125634895 113332516 102940548 94013611 86310689
7228 86310689 80022119 74824369 70312177 66049034 62041794 58611733 55573273 52888166
7220 52888166 50257556 47577323 45460548 43363311 41287604 39433047 37832302 36343698
7212 36343698 34988426 33596338 32316800 31279942 30301051 29646852 29260462 28478302 27538760
7203 27538760 26498249 25635484 24854214 24169054 23673150 22960567 22317479 22120550 21847361
7194 21847361 21993463 22014732 21494733 21224410 21384255 21582917 21870196 22197848 22601255 22665716
$$ packed form
7249A97843880K2609451K6335583L0187159L4337303L9878660M3144559L1380687
7242D25717282m102814l8829277n3706407n1144745m1291589l2362220k5911090
7235A78369140k1031982j7308146j4394117j2302379j0391968q926937p702922
7228H6310689o288570n197750m512192m263143m007240l430061l038460k685107
7220E2888166k630610k680233k116775k097237k075707j854557j600745j488604
7212C6343698j355272j392088j279538j036858r78891o54199l86390p82160r39542
7203B7538760j040511q62765p81270o85160m95904p12583o43088j96929k73189
7194B1847361J46102K1269n19999k70323J59845J98662K87279L27652M03407O4461
$$ plain form
7184 22665716 22602000 22088566 21318646 20464368 19743988 19027215 18371171 17961992 17380826 16785856
7174 16785856 16597109 16314907 16157464 15914883 15871410 15956442 15962634 15919373 16292066 16714303
7164 16714303 17231764 17817377 18382565 18999078 19756978 20822857 22010974 23387322 25155232
7155 25155232 27034196 29046649 31016806 31602503 30668980 28797729 26804190 25133305
7147 25133305 23556779 21904759 20294676 18720093 17729735 16841780 16032503 15498435 15169744
7138 15169744 14703565 14419005 14564041 14742758 14935567 15055795 15450210 15557555 16011319
7129 16011319 16517465 17229967 18233289 19032765 20202070 21698090 23515702 25416413 27296415
7120 27296415 28146149 27606162 25864096 23714950 21755668 19731877 17727367 16361518
$$ packed form
7184B2665716o3716n13434p69920q54278p20380p16773o56044m09179n81166n94970
7174A6785856j88747k82202j57443k42581m3473Q5032O192m3261L72693M22237
7164A6714303N17461N85613N65188O16513P57900J065879J188117J376348J767910
7155B5155232J878964K012453J970157N85697r33523j871251j993539j670885
7147B5133305j576526j652020j610083j574583r90358q87955q09277n34068l28691
7138A5169744m66179k84560J45036J78717J92809J20228L94415J07345M53764
7129A6011319N06146P12502J003322P99476J169305J496020J817612J900711J880002
7120B7296415Q49734n39987j742066k149146j959282k023791k004510j365849
$$ plain form
7112 16361518 15112441 14095516 13405842 12705266 12049281 11835607 11572558 11323081 11372000
7103 11372000 11141516 10756951 10600507 10723521 10575030 10450248 10335038 10351407 10588580 10768744
7093 10768744 10852936 11410523 12023667 12565067 13081375 13435855 13656742 13104352 12585690 11833961
7083 11833961 11235960 10712100 10296693 9781866 9547800 9383096 9363859 9349454 9426472 9254228
7073 9254228 9041101 8811738 8498888 8290853 8120194 7792587 7255742 7057388 6639083 6580534
7063 6580534 6455785 6379548 6357299 6174798 6188144 6254372 5989489 5967378 5841855 6021768
7053 6021768 6202614 6434819 6650454 6894045 7121040 7401842 7654568 7816036 8330607 8676050
7043 8676050 8745526 8818790 8704246 8628605 8776795 8505714 7889755 7759616 7758985 7444661 7220167
$$ packed form
7112A6361518j249077j016925o89674p00576o55985k13674k63049k49477M8919
7103A1372000k30484l84565j56444J23014j48491j24782j15210J6369K37173J80164
7093A0768744Q4192N57587O13144N41400N16308L54480K20887n52390n18662p51729
7083A1833961n98001n23860m15407n14827k34066j64704j9237j4405P7018j72244
7073I254228k13127k29363l12850k08035j70659l27607n36845j98354m18305n8549
7063F580534j24749p6237k2249j82501J3346O6228k64883k2111j25523J79913
7053F021768J80846K32205K15635K43591K26995K80802K52726J61468N14571L45443
7043H676050O9476P3264j14544p5641J48190k71081o15959j30139o31l14324k24494
$$ plain form
7032 7220167 6996902 6698354 6465095 6161993 5978264 5994165 5710798 5563078 5482195 5457557
7022 5457557 5276560 5305105 5374789 5411921 5575414 5671010 5662002 5877613 6063995 6170528 6235969
7011 6235969 6444091 6509373 6601420 6879153 7035947 6882360 6971847 7259134 6926026 6496983
7001 6496983 6031389 5619969 5290789 4934095 4834451 4698430 4568339 4210463 4203815 4282221
6991 4282221 4223683 4102122 3770035 3654961 3622369 3804250 3638451 3438704 3473172 3672872
6981 3672872 3590899 3608543 3506560 3561729 3484704 3605518 3575139 3702308 4004985 3813571
6971 3813571 3748712 3941199 3615532 3357351 3305704 3141910 3245926 3310542 3081019 3035428
6961 3035428 3088131 3071048 3146560 3205659 3383415 3360262 3248702 3327983 3470403 3232525 3060450
$$ packed form
7032G220167k23265k98548k33259l03102j83729J5901k83367j47720q0883k4638
7022E457557j80997K8545O9684L7132J63493R5596r008K15611J86382J06533O5441
7011F235969K08122O5282R2047K77733J56794j53587Q9487K87287l33108m29043
7001F496983m65594m11420l29180l56694r9644j36021j30091l57876o648P8406
6991D282221n8538j21561l32087j15074l2592J81881j65799j99747L4468J99700
6981C672872q1973J7644j01983N5169p7025J20814l0379J27169L02677j91414
6971C813571o4859J92487l25667k58181n1647j63794J04016O4616k29523m5591
6961C035428N2703j7083P5512N9099J77756k3153j11560P9281J42420k37878j72075
$$ plain form
6950 3060450 3130005 3255704 3181648 3222101 3439035 3454327 3526316 3370616 3178633 3559602
6940 3559602 3711140 3882254 3757524 3698293 3578197 3397780 3413389 3422502 3285569 3343392
6930 3343392 3535423 3395835 3539336 3697705 3456911 3520590 3855716 3763476 3627340 3700328
6920 3700328 3877991 3964459 3948876 3811700 3702359 3728048 3838976 3936463 3897179 3782402
6910 3782402 3723993 3758397 4028478 3952600 4043832 4155896 4184895 4176512 4205031 4431579 4454946
6899 4454946 4594316 4615923 4602020 4769310 5061853 5096403 5045623 5154395 5243518 5552268
6889 5552268 5739322 5900738 6279968 6614060 6972271 7473501 7569603 7189546 7133622 6861982
6879 6861982 6463340 6239324 6064869 6153010 6145876 6118890 5941714 5826383 5664015 5650455
$$ packed form
6950C060450O9555J25699p4056M0453K16934J5292P1989j55700j91983L80969
6940C559602J51538J71114j24730n9231j20096j80417J5609R113j36933N7823
6930C343392J92031j39588J43501J58369k40794O3679L35126r2240j36136P2988
6920C700328J77663Q6468j5583j37176j09341K5689J10928R7487l9284j14777
6910C782402n8409L4404K70081p5878R1232J12064K8999q383K8519K26548K3367
6899D454946J39370K1607j3903J67290K92543L4550n0780J08772Q9123L08750
6889E552268J87054J61416L79230L34092L58211N01230R6102l80057n5924k71640
6879F861982l98642k24016j74455Q8141p134k6986j77176j15331j62368j3560
$$ plain form
6869 5650455 5551659 5612582 5599321 5656637 5790316 6011294 6291376 6302092 6504154 6885249
6859 6885249 7166680 7235493 7693303 8234184 8687428 9275894 10047656 10463908 11419788 12589932
6849 12589932 13803727 14048178 13311812 12175136 10949340 9833380 8989921 8446932 7919654
6840 7919654 7345664 7002750 6924582 6639188 6579126 6741017 6449502 6351882 6346830 6545246
6830 6545246 6453783 6239294 6359093 6657113 6866771 6577957 6394945 6226121 6121412 6025734
6820 6025734 6087963 5851544 5786190 5965205 5924186 5839591 5920330 5992655 5999103 5983049 5912245
6809 5912245 5993889 6040362 5928054 6184395 6305948 6230998 6222921 6232446 6353431 6431406 6521501
6798 6521501 6149893 6075236 6335149 6496132 6679354 6680885 6600650 6624937 6900157 7023616
$$ packed form
6869E650455r8796O0923j3261N7316J33679K20978K80082J0716K02062L81095
6859F885249K81431O8813M57810N40881M53244N88466P71762M16252R55880J170144
6849A2589932J213795K44451p36366j136676j225796j115960q43459n42989n27278
6840G919654n73990l42914p8168k85394o0062J61891k91515r7620n052J98416
6830F545246r1463k14489J19799K98020K09658k88814j83012j68824j04709r5678
6820F025734O2229k36419o5354J79015m1019q4595Q0739P2325O448j6054p0804
6809E912245Q1644M6473j12308K56341J21553p4950q077R525J20985P7975R0095
6798F521501l71608p4657K59913J60983J83222J531q0235K4287K75220J23459
$$ plain form
6788 7023616 7121096 7256134 7314525 7207978 7421460 7701445 7641229 7476160 7665575 8065981
6778 8065981 8319311 8374650 8431175 8718070 8992457 8938716 9153481 9222194 9256643 9698581
6768 9698581 9978051 10004150 10279212 10442217 10670118 10840312 10976151 11235447 11533251 11750204
6758 11750204 11913532 12377583 12839477 13121400 13603273 14208687 14778808 15061810 15606226
6749 15606226 15966009 16407090 16997160 17188446 17251394 17522415 17898439 18481281 19522282
6740 19522282 20491658 22209953 23940254 25690873 27355771 28542768 29660018 31085442
6732 31085442 33059419 35570363 38707322 42277909 46777406 52553954 59975581 66328545
6724 66328545 67427800 64681792 58677772 51293969 44594792 38753568 34561491 31491080
$$ packed form
6788G023616R7480J35038N8391j06547K13482K79985o0216j65069J89415M00406
6778H065981K53330N5339N6525K86895K74387n3741K14765O8713L4449M41938
6768I698581K79470K6099K75062J63005K27901J70194J35839K59296K97804K16953
6758A1750204J63328M64051M61894K81923M81873O05414N70121K83002N44416
6749A5606226L59783M41081N90070J91286O2948K71021L76024N82842J041001
6740A9522282R69376J718295J730301J750619J664898J186997J117250J425424
6732C1085442J973977K510944L136959L570587M499497N776548P421627O352964
6724F6328545J099255k746008o004020p383803o699177n841224m192077l070411
$$ plain form
6716 31491080 29079034 27195597 25858122 24752440 24074804 23579922 23238782 23300085 23497669
6707 23497669 23901646 24390586 24975018 26151170 27316941 28741188 30704762 32920577 33120199
6698 33120199 31881019 29572238 27008191 25110485 23618677 23053522 22228632 21561907 21409248
6689 21409248 21473446 21536631 21442330 21323108 21612565 22054651 22667796 22938671 23015418 23218240
6679 23218240 23785280 24257054 24854417 25402613 25691701 26174579 26941777 27752456 28971291
6670 28971291 29872089 30835744 31710757 32612045 33485844 34268360 35394301 36745532 37710091
6661 37710091 38632795 39456923 40400436 41522365 42472274 43417287 44443814 45679092 46811746
6652 46811746 48165072 49681199 51039250 52636373 54199150 55866811 57649223 59442426
$$ packed form
6716C1491080k412046j883437j337475j105682o77636m94882l41140O1303J97584
6707B3497669M03977M88940N84432J176152J165771J424247J963574K215815J99622
6698C3120199j239180k308781k564047j897706j491808n65155q24890o66725j52659
6689B1409248O4198O3185r4301j19222K89457M42086O13145K70875P6747K02822
6679B3218240N67040M71774N97363N48196K89088M82878P67198Q10679J218835
6670B8971291R00798R63655Q75013R01288Q73799P82516J125941J351231R64559
6661C7710091R22704Q24128R43513J121929R49909R45013J026527J235278J132654
6652D6811746J353326J516127J358051J597123J562777J667661J782412J793203
$$ plain form
6644 59442426 61237452 63172444 65201785 67556221 69500744 71241172 73024737 75241719
6636 75241719 77718053 79904745 82355520 84851450 87520910 90332269 93350588 96361308
6628 96361308 99887336 103661210 107419705 111396033 115952421 120698683 125599269 130173699
6620 130173699 134860567 139346345 143435326 147088835 150286130 153245687 155847189 158211172
6612 158211172 160280310 161923993 164015546 165905088 168202541 171073096 174531424 178588787
6604 178588787 183253723 188327781 194344858 201335748 208757068 216819173 225928126 235595603
6596 235595603 245220045 255140428 264574743 273139192 280238985 284256713 284858660 282465514
6588 282465514 277654982 271245260 264297632 257065448 250003975 243308600 237606901 233104772
$$ packed form
6644E9442426J795026J934992K029341K354436J944523J740428J783565K216982
6636G5241719K476334K186692K450775K495930K669460K811359L018319L010720
6628I6361308L526028L773874L758495L976328M556388M746262M900586M574430
6620A30173699M686868M485778M088981L653509L197295K959557K601502K363983
6612A58211172K069138J643683K091553J889542K297453K870555L458328M057363
6604A78588787M664936N074058O017077O990890P421320Q062105R108953R667477
6596B35595603R624442R920383R434315Q564449P099793M017728O01947k393146
6588B82465514m810532o409722o947628p232184p061473o695375n701699m502129
$$ plain form
6580 233104772 229628825 227318402 226713701 227386167 229057854 232039997 236081289 241176938
6572 241176938 246902334 253348496 260356731 267454855 274091621 279856451 284329285 287093532
6564 287093532 287401398 284574400 277850379 268106264 256820069 244613466 232731112 221553611
6556 221553611 211055932 201643347 192976153 185418001 178693269 172903566 167882653 163604397
6548 163604397 160293105 157106057 154269077 152024930 149802895 147305706 144606948 141776909
6540 141776909 138214840 134486651 130498594 125723613 120269612 114440806 108451815 102301283
6532 102301283 96288673 90571791 85227487 80123152 75309544 70816062 66860681 63079912
6524 63079912 59536348 56617081 53682044 51160322 48986697 46938174 45273069 43589414
$$ packed form
6580B33104772l475947k310423o04701O72466J671687K982143M041292N095649
6572B41176938N725396O446162P008235P098124O636766N764830M472834K764247
6564B87093532L07866k826998o724021r744115j1286195j2206603j1882354j1177501
6556B21553611j0497679r412585q667194p558152o724732n789703n020913m278256
6548A63604397l311292l187048k836980k244147k222035k497189k698758k830039
6540A41776909l562069l728189l988057m774981n454001n828806n988991o150532
6532A02301283o012610n716882n344304n104335m813608m493482l955381l780769
6524F3079912l543564k919267k935037k521722k173625k048523j665105j683655
$$ plain form
6516 43589414 41543760 39941774 38502093 37173451 35959175 34871134 33559088 32602385
6508 32602385 31785056 30887990 30119309 29397346 28443890 27857650 27301629 26515583 25843569
6499 25843569 25110441 24497101 23949081 23344400 22661718 21966502 21527156 21103066 20468382
6490 20468382 20087064 19494878 18960480 18525256 18076020 17808362 17330853 16792505 16458184
6481 16458184 16143291 15738893 15475099 15238872 14856711 14753186 14446064 13939203 13466166
6472 13466166 13031412 12693683 12438444 12160480 11960416 11651089 11289800 11172363 11105334 10788688
6462 10788688 10524303 10299978 10039115 9693909 9413787 9234946 9198430 8963737 8843708 8791832
6452 8791832 8411180 8114887 8181894 7710632 7465256 7490911 7535715 7361533 6979753 6904019
$$ packed form
6516D3589414k045654j601986j439681j328642j214276j088041j312046r56703
6508C2602385q17329q97066p68681p21963r53456n86240n56021p86046o72014
6499B5843569p33128o13340n48020o04681o82682o95216m39346m24090o34684
6490B0468382l81318n92186n34398m35224m49236k67658m77509n38348l34321
6481A6458184l14893m04398k63794k36227l82161j03525l07122n06861m73037
6472A3466166m34754l37729k55239k77964k00064l09327l61289j17437o7029l16646
6462A0788688k64385k24325k60863l45206k80122j78841l6516k34693j20029n1876
6452H791832l80652k96293O7007m71262k45376K5655M4804j74182l81780p5734
$$ plain form
6442 6904019 6652434 6545932 6736174 6608538 6436400 6446014 6253378 6094594 5933110 5597094
6432 5597094 5570840 5643366 5451611 5491546 5356637 5396815 5345859 5007056 4845822 5095265
6422 5095265 4939344 4850928 4771177 4684100 4703619 4890422 4816021 4697124 4670920 4630678 4646417
6411 4646417 4440368 4474539 4267629 4060689 3942704 3945325 3835728 3965262 3888376 3824507
6401 3824507 3708011 3707752 3781462 3634646 3465660 3360349 3285055 3263850 3324783 3326172 3272775
6390 3272775 3090071 3357233 3220221 3042677 3029710 3054881 3211902 3221662 3128828 2949694
6380 2949694 2969538 2877204 2870690 2915397 3052854 3103866 3069549 2825627 2611765 2646658 2700852
6369 2700852 2778319 2681439 2663732 2853830 2770844 2790632 2865407 2755432 2519925 2648892 2957761
$$ packed form
6442F904019k51585j06502J90242j27636j72138R614j92636j58784j61484l36016
6432E597094k6254P2526j91755L9935j34909M0178n0956l38803j61234K49443
6422E095265j55921q8416p9751q7077J9519J86803p4401j18897k6204m0242J5739
6411D646417k06049L4171k06910k06940j17985K621j09597J29534p6886o3869
6401C824507j16496k59P3710j46816j68986j05311p5294k1205O0933J389n3397
6390C272775j82704K67162j37012j77544j2967K5171J57021R760r2834j79134
6380B949694J9844r2334o514M4707J37457N1012l4317k43922k13862L4893N4194
6369B700852P7467r6880j7707J90098q2986J9788P4775j09975k35507J28967L08869
$$ plain form
6358 2957761 2941395 2790987 2717386 2650605 2621355 2541569 2511634 2813147 2648786 2666205 2814919
6347 2814919 2720177 2788866 2867519 2859748 2812988 2892273 2990417 3202903 3154270 2992235 2947107
6336 2947107 2961900 3208260 3306360 3281143 3171593 3146749 3045160 3156361 3119696 3131367 3185672
6325 3185672 3213774 3411873 3181449 3111991 3191488 3206526 3128653 3294290 3325528 3218736 3214789
6314 3214789 3408801 3426958 3343701 3493762 3491696 3695919 3699269 3614771 3835654 4017935 4002799
6303 4002799 3953430 3696199 3734959 3941605 4064901 3857655 3748377 3554998 3640146 3855361
6293 3855361 3915425 3948987 3435431 3418355 3472515 3345163 3646410 3785155 3751945 3755515 3852526
6282 3852526 3712903 3801856 3754191 3807402 3872117 3880124 4241640 4190839 3898276 3912820 3920573
$$ packed form
6358B957761j6366j50408p3601o6781k9250p9786k9935L01513j64361J7419J48714
6347B814919r4742O8689P8653p771m6760P9285R8144K12486m8633j62035m5128
6336B947107J4793K46360R8100k5217j09550k4844j01589J11201l6665J1671N4305
6325C185672K8102J98099k30424o9458P9497J5038p7873J65637L1238j06792l947
6314C214789J94012J8157q3257J50061k066K04223L350q4498K20883J82281j5136
6303D002799m9369k57231L8760K06646J23296k07246j09278j93379Q5148K15215
6293C855361O0064L3562n13556j7076N4160j27352L01247J38745l3210L570R7011
6282C852526j39623Q8953m7665N3211O4715Q007L61516n0801k92563J4544P753
$$ plain form
6271 3920573 3826221 3767750 3739386 3693480 3591132 3476981 3507944 3502492 3543123 3614032 3681303
6260 3681303 3646747 3475367 3437996 3473702 3659680 3488916 3538248 3441430 3536386 3477999 3146119
6249 3146119 3196218 3358897 3303624 3185001 3304782 3285836 3098653 3116851 3199767 3510676
6239 3510676 3510246 3633646 3445924 3250081 3461078 3470138 3589462 3723048 3645571 3627507 3877982
6228 3877982 3723087 3805280 3798388 3976356 4293762 4599738 4804084 4817490 5131070 5397563
6218 5397563 5160063 4684250 4468572 4242149 4062398 4000948 3888199 3794229 3797978 3779462
6208 3779462 3764561 3740846 3692756 3631422 3471743 3660044 3834778 3766076 3603382 3571181 3701987
6197 3701987 3710167 3910568 3876715 3708654 3698977 3526433 3481029 3604620 3632475 3641619 3568691
$$ packed form
6271C920573r4352n8471k8364m5906j02348j14151L0963n452M0631P0909O7271
6260C681303l4556j71380l7371L5706J85978j70764M9332r6818R4956n8387l31880
6249C146119N0099J62679n5273j18623J19781j8946j87183J8198Q2916L10909
6239C510676m30J23400j87722j95843K10997R060J19324J33586p7477j8064K50475
6228C877982j54895Q2193o892J77968L17406L05976K04346J3406L13580K66493
6218E397563k37500m75813k15678k26423j79751o1450j12749r3970L749j8516
6208C779462j4901k3715m8090o1334j59679J88301J74734o8702j62694l2201J30806
6197C701987Q180K00401l3853j68061r677j72544m5404J23591K7855R144p2928
$$ plain form
6186 3568691 3723099 3613899 3522064 3589723 3730273 3766145 3707625 3810851 3808015 3790775 3740138
6175 3740138 3753426 3745330 3918803 4110427 4048380 3998411 3827693 4049678 4106205 3766011 3758670
6164 3758670 3936084 4031551 3930287 3884818 3882707 3934236 3952536 3993697 4138621 3909749 3890941
6153 3890941 3932982 4079699 4130056 3765426 3781893 4065788 3988987 3847418 3851843 3991319 4033357
6142 4033357 4054046 4150213 4098999 3932637 4172400 4357904 4086519 4173331 4113178 4102200 4048097
6131 4048097 4088677 3969372 4045892 4190823 4247979 4143662 4098747 4225079 4174714 4229974 4127708
6120 4127708 4319029 4332234 4231401 4599347 4630826 4503931 4552577 4345809 4364564 4437589
6110 4437589 4457521 4529991 4442848 4341141 4399648 4464850 4442154 4380783 4310683 4240030 4150546
$$ packed form
6186C568691J54408j09200r1835O7659J40550L5872n8520J03226k836j7240n0637
6175C740138J3288q096J73473J91624o2047m9969j70718K21985N6527l40194p341
6164C758670J77414R5467j01264m5469k111N1529J8300M1161J44924k28872j8808
6153C890941M2041J46717N0357l64630J6467K83895p6801j41569M425J39476M2038
6142D033357K0689R6167n1214j66362K39763J85504k71385Q6812o0153j0978n4103
6131D048097M0580j19305P6520J44931N7156j04317m4915J26332n0365N5260j02266
6120D127708J91321J3205j00833L67946L1479j26895M8646k06768J8755P3025
6110D437589J9932P2470q7143j01707N8507O5202k2696o1371p0100p0653q9484
$$ plain form
6099 4150546 4381283 4411962 4414299 4363512 4510139 4656092 4756439 4817349 4584818 4622770 4881831
6088 4881831 4857656 4956164 4820114 4989917 4960672 4972759 4973084 5050793 5071040 5051200 4909806
6077 4909806 4948236 5181073 5078611 5228759 5170192 5292461 5271228 5224552 5281256 5248505 5234807
6066 5234807 5111874 5044135 5296379 5400662 5405380 5594688 5692900 5612656 5636513 5794845 5863612
6055 5863612 5823935 5802993 5741567 5978547 6025595 5887360 5936607 6143449 6285213 6353574 6133356
6044 6133356 6406210 6512289 6587298 6831489 6683656 6702339 6734508 6751748 6749466 6716843 6798357
6033 6798357 6827518 6961980 6895286 7035000 7043404 7025382 7182354 7255647 7541314 7599622 7670848
6022 7670848 7737728 7772029 7963444 8157382 8074536 8106185 8432116 8496750 8713554 8815508
$$ packed form
6099D150546K30737L0679K337n0787J46627J45953J00347O0910k32531L7952K59061
6088D881831k4175R8508j36050J69803k9245J2087L25P7709K0247j9840j41394
6077D909806L8430K32837j02462J50148n8567J22269k1233m6676N6704l2751j3698
6066E234807j22933o7739K52244J04283M718J89308R8212q0244K3857J58332O8767
6055E863612l9677k0942o1426K36980M7048j38235M9247K06842J41764O8361k20218
6044F133356K72854J06079P5009K44191j47833J8683L2169J7240k282l2623Q1514
6033F798357K9161J34462o6694J39714Q404j8022J56972P3293K85667N8308P1226
6022G670848O6880L4301J91415J93938q2846L1649L25931O4634K16804J01954
$$ plain form
6012 8815508 8672087 8743308 8828583 8953589 9164730 9374454 9774994 9756177 9831517 10098159
6002 10098159 10396531 10549580 10467816 10860731 11192595 11039101 11553045 11962892 12047548 12334637
5992 12334637 12388618 12640058 12710492 12948945 13288922 13850303 14217449 14609538 14988037 15217056
5982 15217056 15481377 15780959 16285831 16477625 16740830 17380199 17936206 18498610 19014899
5973 19014899 19570713 20206193 20495907 21118500 21756057 22402113 23319780 23930244 24716228
5964 24716228 25520962 26423590 27343791 28387322 29238738 30292201 31310184 32721454 34107087
5955 34107087 35000516 36475268 38095911 39655156 40925095 42277486 43578653 44792451
5947 44792451 46098371 47652844 49318588 50843176 52286568 53614659 54913590 56403275
$$ packed form
6012H815508j43421P1221Q5275J25006K11141K09724M00540j8817P5340K66642
6002A0098159K98372J53049q1764L92915L31864j53494N13944M09847Q4656K87089
5992A2334637N3981K51440P0434K38453L39977N61381L67146L92089L78499K29019
5982A5217056K64321K99582N04872J91794K63205O39369N56007N62404N16289
5973A9014899N55814O35480K89714O22593O37557O46056R17667O10464P85984
5964B4716228Q04734R02628R20201J043531Q51416J053463J017983J411270J385633
5955C4107087Q93429J474752J620643J559245J269939J352391J301167J213798
5947D4792451J305920J554473J665744J524588J443392J328091J298931J489685
$$ plain form
5939 56403275 57920123 59647634 61664111 63501911 65621857 67781320 69721784 71636856
5931 71636856 73447717 75191928 76661936 78356225 80018008 81234391 82780862 84187569
5923 84187569 85744879 87712446 89552437 91437275 93364579 95325462 97416997 99610330
5915 99610330 101535418 103262606 105324122 107712663 110153210 112774625 115898380 118881772
5907 118881772 122203995 125438079 128118708 130250922 131931483 133333422 134718538 136401900
5899 136401900 137750773 139432546 140980166 142448854 144077170 145623048 147221036 148803928
5891 148803928 150596145 152217838 154011383 155757289 157267648 158851833 161182883 163725964
5883 163725964 166838112 170675130 175150825 179963267 185327156 190975975 196049843 200661886
$$ packed form
5939E6403275J516848J727511K016477J837800K119946K159463J940464J915072
5931G1636856J810861J744211J470008J694289J661783J216383J546471J406707
5923H4187569J557310J967567J839991J884838J927304J960883K091535K193333
5915I9610330J925088J727188K061516K388541K440547K621415L123755K983392
5907A18881772L322223L234084K680629K132214J680561J401939J385116J683362
5899A36401900J348873J681773J547620J468688J628316J545878J597988J582892
5891A48803928J792217J621693J793545J745906J510359J584185K331050K543081
5883A63725964L112148L837018M475695M812442N363889N648819N073868M612043
$$ plain form
5875 200661886 204545480 207772722 210506097 212813608 214584859 216062372 217146540 218169219
5867 218169219 219220102 219648069 219486199 218789723 217532596 216074087 214567952 213153876
5859 213153876 211567577 210574837 209841959 209132176 208798296 208938516 209172787 209656871 210480807
5850 210480807 211471471 212233872 213019029 213409754 213235238 212173046 210720180 208898672 206588962
5841 206588962 204271623 201655740 198543983 194840180 191009012 186756492 182003688 176600315
5833 176600315 170812379 164735772 158775514 153691766 149422122 146392573 143869374 142041757
5825 142041757 140507086 139011757 137551368 136213512 134748629 133018056 131343103 129594251
5817 129594251 127449544 125171321 122971722 120746932 118781008 116703910 114888073 113175062
$$ packed form
5875B00661886L883594L227242K733375K307511J771251J477513J084168J022679
5867B18169219J050883M27967j61870o96476j257127j458509j506135j414076
5859B13153876j586299r92740p32878p09783l33880J40220K34271M84084Q23936
5850B10480807R90664P62401P85157L90725j74516j062192j452866j821508k309710
5841B06588962k317339k615883l111757l703803l831168m252520m752804n403373
5833A76600315n787936o076607n960258n083748m269644l029549k523199j827617
5825A42041757j534671j495329j460389j337856j464883j730573j674953j748852
5817A29594251k144707k278223k199599k224790j965924k077098j815837j713011
$$ plain form
5809 113175062 111872537 110514143 108618626 106316160 103342017 100204126 96794229 93429827
5801 93429827 90374605 87934098 85684289 83263948 81516916 79618797 77780196 75884865
5793 75884865 73968676 71990859 70293722 68544428 66481675 64845393 63553602 62453050
5785 62453050 60958929 59501279 58203423 56986917 55709103 54579823 53155538 51284544
5777 51284544 49446111 47977510 46355093 44450400 43075256 41947476 40705932 39265761
5769 39265761 38093780 36983825 35751081 34527994 33559566 32613954 31734811 30739364 29460091
5760 29460091 28701294 27823559 26696201 25938056 25031616 24228260 23517215 22526471 21654307
5751 21654307 21146388 20752370 20250021 19469590 18994164 18685310 18350563 17923110 17597497
$$ packed form
5809A13175062j302525j358394j895517k302466k974143l137891l409897l364402
5801I3429827l055222k440507k249809k420341j747032j898119j838601j895331
5793G5884865j916189j977817j697137j749294k062753j636282j291791j100552
5785F2453050j494121j457650j297856j216506j277814j129280j424285j870994
5777E1284544j838433j468601j622417j904693j375144j127780j241544j440171
5769C9265761j171981j109955j232744j223087r68428r45612q79143r95447j279273
5760B9460091p58797q77735j127358p58145r06440q03356p11045r90744q72164
5751B1654307n07919l94018n02349p80431m75426l08854l34747m27453l25613
$$ plain form
5742 17597497 17182862 16885169 16645143 16448425 15939969 15791209 15558864 15225081 14795842
5733 14795842 14462366 14270835 14237322 13878966 13639666 13549110 13705982 13525712 13212747 13159618
5723 13159618 13075390 12867205 12454207 12499149 12391253 12291931 12266212 12351082 12094329 12008333
5713 12008333 12030332 11831679 11537125 11476583 11390950 11570847 11453325 11353974 11375671 11414254
5703 11414254 11368798 11378276 11382935 11374610 11310310 11473731 11540284 11334880 11198473 11093790 11155815
5692 11155815 11502146 11392796 11493082 11606185 11550163 11237424 11074815 11261025 11315503 11270653
5682 11270653 11290855 11661106 11626919 11583969 11514976 11543406 11873397 11962672 11956208 12190507 12244678
5671 12244678 12381943 12526257 12702616 13062917 13287327 13449177 13585112 13965396 14181798
$$ packed form
5742A7597497m14635k97693k40026j96718n08456j48760k32345l33783m29239
5733A4795842l33476j91531l3513l58356k39300r0556J56872j80270l12965n3129
5723A3159618q4228k08185m12998M4942j07896r9322k5719Q4870k56753q5996
5713A2008333K1999j98653k94554o0542q5633J79897j17522r9351K1697L8583
5703A1414254m5456R478M659q325o4300J63421O6553k05404j36407j04683O2025
5692A1155815L46331j09350J00286J13103n6022l12739j62609J86210N4478m4850
5682A1270653K0202L70251l4187m2950o8993K8430L29991Q9275o464K34299N4171
5671A2244678J37265J44314J76359L60301K24410J61850J35935L80284K16402
$$ plain form
5662 14181798 14477351 14655822 14974152 15664060 15945153 16482757 17339680 18167327 19001798
5653 19001798 20086466 21098758 22420754 23852204 25431401 27364959 29652984 32367467
5645 32367467 35290608 38841362 42999135 47070137 49436168 49423599 47597150 45539020
5637 45539020 43233147 39968864 36135898 32604983 29668651 27298611 24934569 23269612
5629 23269612 22289892 21139537 20178815 19259463 18413982 17770564 17305701 16694627 16067559
5620 16067559 15682808 15116347 14590680 14274075 13939526 13501561 13162389 12705238 12308674
5611 12308674 12265004 12238255 12083025 12173024 12121600 12089835 12126539 11886868 11719042 11860046
5601 11860046 11994999 12051253 12140698 12130426 12084191 11758577 11542072 11246233 11005190 10783814
$$ packed form
5662A4181798K95553J78471L18330O89908K81093N37604Q56923Q27647Q34471
5653A9001798J084668J012292J321996J431450J579197J933558K288025K714483
5645C2367467K923141L550754M157773M071002K366031j2569j826449k058130
5637D5539020k305873l264283l832966l530915k936332k370040k364042j664957
5629B3269612r79720j150355r60722r19352q45481o43418m64863o11074o27068
5620A6067559l84751n66461n25667l16605l34549m37965l39172m57151l96564
5611A2308674m3670k6749j55230Q9999n1424l1765L6704k39671j67826J41004
5601A1860046J34953N6254Q9445j0272m6235l25614k16505k95839k41043k21376
$$ plain form
5591 10783814 10774851 10493163 10615474 10419958 10330575 10339128 10179056 9968697 9896307 10099066
5581 10099066 9840598 9796573 9921716 9595074 9605672 9452026 9364232 9629746 9578912 9487795
5571 9487795 9654461 9654450 9598426 9682171 9693645 9675946 9552215 9457942 9448187 9453980 9236645 8969352
5559 8969352 9112968 9029583 8790223 8705961 8615927 8704113 8815806 8743212 8576194 8906435
5549 8906435 8532058 8601246 8548488 8226119 8135069 7979363 8074797 7936548 7860320 7897498 7893816
5538 7893816 7870761 7981498 7881435 7985241 7991665 7829084 7896940 7881464 7807129 7870057 7796238
5527 7796238 7593243 7650801 7585469 7296732 7172242 7048661 7211383 7308753 7178885 7127431
5517 7127431 7223653 7312763 7359721 7308399 7194775 6992011 6754468 6880021 6952778 7118767
$$ packed form
5591A0783814q963k81688J22311j95516q9383Q553j60072k10359p2390K02759
5581A0099066k58468m4025J25143l26642J0598j53646q7794K65514n0834r1117
5571I487795J66666j1n6024Q3745J1474j7699j23731r4273r755N793k17335k67293
5559H969352J43616q3385k39360q4262r0034Q8186J11693p2594j67018L30241
5549H906435l74377O9188n2758l22369r1050j55706R5434j38249p6228L7178l682
5538G893816k3055J10737j00063J03806O424j62581O7856j5476p4335O2928p3819
5527G796238k02995N7558o5332k88737j24490j23581J62722R7370j29868n1454
5517G127431R6222Q9110M6958n1322j13624k02764k37543J25553P2757J65989
$$ plain form
5507 7118767 7040627 6962275 6959394 6882770 6664826 6705462 6662087 6954814 7149242 7078857 7024984
5496 7024984 6952040 7069806 7122147 6954107 6819603 6744293 6718664 6760067 6926176 7112664
5486 7112664 7156749 7088617 7043473 7088954 7205998 7324685 7433809 7416719 7441769 7638183 7723577
5475 7723577 8001442 8171005 8289136 8386996 8511336 8734591 9249175 9431681 9982379 10251269
5465 10251269 10428830 10972436 11584503 12178172 12217827 11579971 10687492 9932286 9444220 9208499
5455 9208499 8966634 8803526 8892632 8764425 8862241 8986095 8857706 9013642 8967563 9062655
5445 9062655 9014496 9070642 9184363 9207889 9324344 9420072 9539791 9489898 9708535 9920130
5435 9920130 9779826 9911222 9952641 9879943 9681062 9930812 10047476 10082467 9953115 9728160
$$ packed form
5507G118767p8140p8352k881p6624k17944M0636m3375K92727J94428p0385n3873
5496G024984p2944J17766N2341j68040j34504p5310k5629M1403J66109J86488
5486G112664M4085o8132m5144M5481J17044J18687J09124j7090K5050J96414Q5394
5475G723577K77865J69563J18131R7860J24340K23255N14584J82506N50698K68890
5465A0251269J77561N43606O12067N93669L9655o37856q92479p55206m88066k35721
5455I208499k41865j63108Q9106j28207R7816J23854j28389J55936m6079R5092
5445I062655m8159N6146J13721K3526J16455R5728J19719m9893K18637K11595
5435I920130j40304J31396M1419p2698j98881K49750J16664L4991j29352k24955
$$ plain form
5425 9728160 9850317 9992524 9977583 10280399 10440166 10402381 10561656 10852141 10754158 10815343
5415 10815343 11073062 11263013 11442501 11728300 12058889 12295536 12672782 12912041 13081654
5406 13081654 13343215 13887164 14133076 14095792 13914582 14007226 14200535 14309097 14325293 14564377
5396 14564377 14575670 14714779 14988277 15074245 15223141 15408796 15784586 15950200 15988637 16240110
5386 16240110 16292510 16635767 17054916 17413100 17701745 18020685 18409791 19034383 19361429 19581011
5376 19581011 19986834 20528003 20949528 21483276 21809935 22396858 23040538 23381455 23887788
5367 23887788 24260594 24421511 24775363 25257919 25628522 26054738 26419157 26838837 27327349
5358 27327349 27943676 28295108 28708910 29205336 29568272 29966223 30900686 31462327 32177091
$$ packed form
5425I728160J22157J42207j4941L02816J59767l7785J59275K90485r7983O1185
5415A0815343K57719J89951J79488K85799L30589K36647L77246K39259J69613
5406A3081654K61561N43949K45912l7284j81210R2644J93309J08562J6196K39084
5396A4564377J1293J39109K73498Q5968J48896J85655L75790J65614L8437K51473
5386A6240110N2400L43257M19149L58184K88645L18940L89106O24592L27046K19582
5376A9581011M05823N41169M21525N33748L26659N86923O43680L40917N06333
5367B3887788L72806J60917L53852M82556L70603M26216L64419M19680M88512
5358B7327349O16327L51432M13802M96426L62936L97951R34463N61641P14764
$$ plain form
5349 32177091 32931355 33632639 34469510 35278491 36000693 36568382 37542235 38683541 39794586
5340 39794586 40697621 41726846 42822772 43940798 44986412 46150969 47330373 48483890
5332 48483890 49715570 50817199 52547369 54578759 56691743 59187296 61441123 64006967
5324 64006967 66953054 70029362 72876458 75708502 78783494 81378555 84039254 86528758
5316 86528758 89050538 91455560 93311115 94969439 96386354 97747140 98257925 98095499
5308 98095499 97432114 96078076 94330334 91705210 88757000 86065610 83836492 82150094
5300 82150094 80872342 80259444 80481135 80565340 79911654 77669291 74584154 71642112 68630660
5291 68630660 65530628 62723476 60374298 57898859 55503593 53561529 52032497 50738327
$$ packed form
5349C2177091P54264P01284Q36871Q08981P22202N67689R73853J141306J111045
5340C9794586R03035J029225J095926J118026J045614J164557J179404J153517
5332D8483890J231680J101629J730170K031390K112984K495553K253827K565844
5324F4006967K946087L076308K847096K832044L074992K595061K660699K489504
5316H6528758K521780K405022J855555J658324J416915J360786N10785j62426
5308I8095499o63385j354038j747742k625124k948210k691390k229118j686398
5300H2150094j277752o12898K21691Q4205o53686k242363l085137k942042l011452
5291F8630660l100032k807152k349178k475439k395266j942064j529032j294170
$$ plain form
5283 50738327 49655432 48648534 47947116 47507042 47235307 47172290 47422923 47756115 48325404
5274 48325404 49108894 50011294 51136569 52224149 53388859 55465125 57827430 60458697
5266 60458697 64267646 68817378 71243886 70388397 67282402 63399979 59689182 55508551
5258 55508551 50944498 46439498 42709962 39803292 37566436 35440144 33782610 32379648
5250 32379648 31315947 30432514 29721593 28914099 28572578 28176345 28140927 28305385 28398047 28668929
5240 28668929 28920084 29249511 29694901 30312731 31174527 32494732 34032798 35800253 37423567
5231 37423567 37467560 35927023 33933843 31865731 29613942 27363359 25256010 23523708
5223 23523708 22018721 20920805 20268209 19440828 18697838 18051523 17440205 16648025 16414958
$$ packed form
5283E0738327j082895j006898p01418m40074k71735o3017K50633L33192N69289
5274D8325404P83490R02400J125275J087580J164710K076266K362305K631267
5266F0458697L808949M549732K426508q55489l105995l882423l710797m180631
5258E5508551m564053m505000l729536k906670k236856k126292j657534j402962
5250C2379648j063701q83433p10921q07494l41521l96233l5418J64458R2662K70882
5240B8668929K51155L29427M45390O17830Q61796J320205J538066J767455J623314
5231C7423567M3993j540537j993180k068112k251789k250583k107349j732302
5223B3523708j504987j097916o52596q27381p42990o46315o11318p92180k33067
$$ plain form
5214 16414958 15939787 15598851 15360367 15084788 14853618 14302874 14026834 13929723 13650810 13428211
5204 13428211 13341555 13197950 12858808 12486028 12386555 12376027 12051187 11988720 11906577 11865867
5194 11865867 11514934 11319858 11205049 10982975 10950814 10836154 10755165 10561418 10293857 10206768
5184 10206768 10377904 10033975 9822070 9783779 9683482 9704991 9671872 9715524 9610619 9572759
5174 9572759 9598491 9555632 9350164 9385406 9392378 9270718 9152171 8894886 8935955 9134770 8883747
5163 8883747 8479435 8460470 8467671 8434329 8406421 8155621 8244866 8266015 8166984 8092384 8110456
5152 8110456 8040325 7975250 7805547 7804424 8035138 7873306 7692384 7624271 7806421 7729127 7851756
5141 7851756 7703960 7715494 7790022 7345567 7392858 7515246 7373191 7321208 7204230 7127438
$$ packed form
5214A6414958m75171l40936k38484k75579k31170n50744k76040r7111k78913k22599
5204A3428211q6656j43605l39142l72780r9473j0528l24840o2467q2143m0710
5194A1865867l50933j95076j14809k22074l2161j14660q0989j93747k67561q7089
5184A0206768J71136l43929k11905l8291j00297K1509l3119M3652j04905l7860
5174I572759K5732m2859k05468L5242O972j21660j18547k57285M1069J98815k51023
5163H883747m04312j8965P201l3342k7908k50800Q9245K1149r9031p4600J8072
5152H110456p0131o5075j69703j123K30714j61832j80922o8113J82150p7294J22629
5141G851756j47796J1534P4528m44455M7291J22388j42055n1983j16978p6792
$$ plain form
5131 7127438 7253498 7207249 7135414 7161217 7447880 7360275 7201787 7259838 7259237 7038027 6909128
5120 6909128 7161908 7209422 7001751 7010990 6771276 6921929 7037166 7063217 6982049 7093911
5110 7093911 7110728 6965220 6816598 6580259 6575100 6542341 6537203 6374649 6471733 6543269 6484561
5099 6484561 6526690 6501825 6540489 6536154 6599898 6665638 6580638 6677161 6597409 6575898 6769557
5088 6769557 6983333 6910771 7190777 7108993 7293934 7331048 7400809 7634208 7914429 7983635
5078 7983635 7937292 7820273 7836015 7982468 8177769 8130044 8344224 8276309 8374336 8700078
5068 8700078 8797039 9023461 9268593 9581756 9787159 10067431 10397294 10700535 11063443 11264703
5058 11264703 11777206 12210991 12716215 13149744 13270361 13326305 13414078 13097020 12874403 12745754
$$ packed form
5131G127438J26060m6249p1835K5803K86663q7605j58488N8051o01k21210j28899
5120F909128K52780M7514k07671R239k39714J50653J15237K6051q1168J11862
5110G093911J6817j45508j48622k36339n159l2759n138j62554R7084P1536n8708
5099F484561M2129k4865L8664m335O3744O5740q5000R6523p9752k1511J93659
5088F769557K13776p2562K80006q1784J84941L7114O9761K33399K80221O9206
5078G983635m6343j17019J5742J46453J95301m7725K14180o7915R8027L25742
5068H700078R6961K26422K45132L13163K05403K80272L29863L03241L62908K01260
5058A1264703N12503M33785N05224M33529J20617N5944Q7773l17058k22617j28649
$$ plain form
5048 12745754 12895865 13174663 13505139 13955141 14127093 14407418 14420702 14454593 14485629 14460925
5038 14460925 14239734 14096943 14088607 14165012 14408995 14916164 15315925 15541697 15776102 16177225
5028 16177225 16447500 16857942 17519042 18487433 19410723 20201606 21241359 21590632 21371720
5019 21371720 21022376 20384749 20355530 20361352 20683409 21024669 21651262 22364704 23146093 23898874
5009 23898874 24003928 23804813 23961048 24101294 24202367 24743388 25199342 25785064 26454316
5000 26454316 26643922 27116829 27612104 27892588 27965802 28136867 28256039 28686074 29100309 29412417
4990 29412417 29801095 30261576 30551340 30555581 30681164 31079772 31209992 31482201 32235502 33216973
4980 33216973 33986683 34798739 35882395 37172663 38508279 39892708 41191294 42635568
$$ packed form
5048A2745754J50111K78798L30476M50002J71952K80325J3284L3891L1036k4704
5038A4460925k21191j42791q336P6405K43983N07169L99761K25772K34405M01123
5028A6177225K70275M10442O61100R68391R23290P90883J039753L49273k18912
5019B1371720l49344o37627k9219N822L22057L41260O26593P13442P81389P52781
5009B3898874J05054j99115J56235J40246J01073N41021M55954N85722O69252
5000B6454316J89606M72907M95275K80484P3214J71065J19172M30035M14235L12108
4990B9412417L88678M60481K89764M241J25583L98608J30220K72209P53301R81471
4980C3216973P69710Q12056J083656J290268J335616J384429J298586J444274
$$ plain form
4972 42635568 44238674 45319359 44957596 43545886 41705162 39810001 38066736 36532750
4964 36532750 34673923 33301343 32458790 31605692 30970442 30571379 30526953 30376486 30184710
4955 30184710 30264407 30547732 30749005 31061067 31339726 31722389 32258870 32835154 33251075 33703421
4945 33703421 34025664 34396658 34684426 34599530 34344345 33555763 32606911 31735422 30632542
4936 30632542 29439715 28037430 26802819 25750775 24864329 23883831 23482679 22929886 22606203
4927 22606203 21937272 21680669 21539834 21356778 21230377 21047018 20840180 20386786 19942135
4918 19942135 19655650 19465780 19193430 18878069 18213000 17272877 16576635 16017768 15487462
4909 15487462 14929961 14146260 13282227 12771532 12369775 12008066 11558878 11258239 10988018
$$ packed form
4972D2635568J603106J080685l61763j411710j840724j895161j743265j533986
4964C6532750j858827j372580q42553q53098o35250l99063m4426j50467j91776
4955C0184710P9697K83325K01273L12062K78659L82663N36481N76284M15921M52346
4945C3703421L22243L70994K87768q4896k55185p88582r48852q71489j102880
4936C0632542j192827j402285j234611j052044q86446r80498m01152n52793l23683
4927B2606203o68931k56603j40835j83056j26401j83359k06838m53394m44651
4918A9942135k86485j89870k72350l15361o65069r40123o96242n58867n30306
4909A5487462n57501p83701q64033n10695m01757l61709m49188l00639k70221
$$ plain form
4900 10988018 10618269 10170124 9962684 9787065 9504914 9283982 9104450 8859431 8655533
4891 8655533 8631750 8425910 8291340 8099753 7889278 7465369 7225391 7175690 7213759 6843696
4881 6843696 6633497 6566445 6417907 6292121 6134873 6126733 5808047 5578695 5357048 5379442
4871 5379442 5471791 5326765 4960362 4762950 4672112 4505751 4653539 4578992 4372285 4313642
4861 4313642 4361138 4208470 4191973 4258016 4232211 4051191 4048354 4272321 4202539 4130944 3866496
4850 3866496 3499324 3373476 3461337 3405879 3621070 3624105 3513424 3441848 3038273 3020678 3073287
4839 3073287 3047713 2952786 2821666 2853777 2707454 2720585 2959257 2894790 2962575 3001842 2955414
4828 2955414 2809491 2702891 2637358 2708667 2780385 2497195 2205988 2172405 2343619 2282084
$$ packed form
4900A0988018l69749m48145k07440j75619k82151k20932j79532k45019k03898
4891H655533k3783k05840j34570j91587k10475m23909k39978m9701L8069l70063
4881F843696k10199o7052j48538j25786j57248q140l18686k29352k21647K2394
4871E379442R2349j45026l66403j97412r0838j66361J47788p4547k06707n8643
4861D313642M7496j52668j6497O6043k5805j81020k837K23967o9782p1595k64448
4850C866496l67172j25848Q7861n5458K15191L035j10681p1576m03575j7595N2609
4839C073287k5574r4927j31120L2111j46323J3131K38672o4467O7785L9267m6428
4828B955414j45923j06600o5533P1309P1718k83190k91207l3583J71214o1535
$$ plain form
4818 2282084 2284946 2316581 2201811 2234796 2113966 2075543 2017148 2020890 1845591 1857806 2019291
4807 2019291 1945816 1683343 1528062 1507321 1465672 1639572 1686941 1776477 1653388 1576419 1625938
4796 1625938 1660474 1528911 1548546 1657900 1764963 1576065 1293214 1512707 1512267 1465034 1163490
4785 1163490 1076285 1005698 990392 1048816 905651 1023932 1454620 1323996 875820 863156
4775 863156 837936 1030653 1431439 1228455 1271239 1184035 1234892 1123834 1068637 1302673 1370518
4764 1370518 1076806 1080256 1049992 930311 1083452 1115991 907777 789267 991186 979315
4754 979315 1156577 1164910 1225898 1052368 998102 1161555 889954 806891 681792 818394 814681
4743 814681 1031782 855924 633384 874517 991789 1147122 1053752 1011764 930934 934092 713245
$$ packed form
4818B282084K862L1635j14770L2985j20830l8423n8395L742j75299J2215J61485
4807B019291p3475k62473j55281k0741m1649J73900M7369Q9536j23089p6969M9519
4796A625938L4536j31563J9635J09354J07063j88898k82851K19493m40m7233l01544
4785A163490q7205p0587j5306N8424j43165J18281M30688j30624m48176j2664
4775H63156k5220J92717M00786k02984M2784q7204N0857j11058n5197K34036O7845
4764A370518k93712L450l0264j19681J53141L2539k08214j18510K01919j1871
4754I79315J77262Q333O0988j73530n4266J63453k71601q3063j25099J36602l713
4743H14681K17101j75858k22540K41133J17272J55333r3370m1988q0830L158k20847
$$ plain form
4732 713245 688065 719273 591695 634948 655384 632039 751986 945028 879348 935773 850836
4721 850836 802551 812519 843961 1031083 1120732 1157898 998468 993629 969457 819944 500319
4710 500319 623586 879534 882021 759999 952936 813271 811186 813490 1066539 1079364 1060629
4699 1060629 768999 657281 611758 513703 799539 990426 998301 1206477 1037576 813611
4689 813611 897322 923075 925840 841401 864060 825888 739076 771386 783825 760550 785232 698461
4677 698461 615816 648015 805384 804073 873808 901160 870808 920647 823838 830147 830831 922829
4665 922829 1106868 1093777 797447 626001 591366 769411 722137 565155 486612 496744 577189
4654 577189 728238 758168 766286 766855 724241 749728 696775 770635 540585 444002 633147 631494
$$ packed form
4732G13245k5180L1208j27578M3253K0436k3345J19947J93042o5680N6425q4937
4721H50836m8285R968L1442J87122Q9649L7166j59430m839k4172j49513l19625
4710E00319J23267K55948K487j22022J92937j39665k085K304K53049J2825j8735
4699A060629k91630j11718m5523r8055K85836J90887P875K08176j68901k23965
4689H13611Q3711K5753K765q4439K2659l8172q6812L2310J2439k3275K4682q6771
4677F98461q2645L2199J57369j311O9735K7352l0352M9839r6809O309O84R1998
4665I22829J84039j3091k96330j71446l4635J78045m7274j56982p8543J0132Q0445
4654E77189J51049K9930Q118N69m2614K5487n2953P3860k30050r6583J89145j653
$$ plain form
4642 631494 557602 565896 559228 623713 609513 398142 494227 499583 262748 558095 464106 336475
4630 336475 425886 491379 538466 615741 756878 601071 655832 709086 599133 584704 529598
4619 529598 480317 438083 264176 173548 472571 388268 445556 626426 490498 453016 519488
4608 519488 582563 602746 504925 634033 395871 465758 435235 353611 296109 420138 276481
4597 276481 241411 401875 432031 419414 408982 518876 479047 305937 326887 340411 480639
4586 480639 383861 439704 593917 676968 692155 706749 569592 291934 189345 396130 496888
4575 496888 472065 543452 289223 232211 338869 422031 275160 150499 182917 486025 367801
4564 367801 186581 275056 472940 421465 474784 484622 613530 531031 296758 464785 523796
$$ packed form
4642F31494p3892Q294o668O4485j4200k11371R6085N356k36835K95347r3989j27631
4630C36475Q9411O5493M7087P7275J41137j55807N4761N3254j09953j4429n5106
4619E29598m9281m2234j73907r0628K99023q4303N7288J80870j35928l7482O6472
4608E19488O3075K0183r7821J29108k38162O9887l0523q1624n7502J24029j43657
4597B76481l5070J60464L0156j2617j0432J09894l9829j73110K0950J3524J40228
4586D80639r6778N5843J54213Q3051J5187J4594j37157k77658j02589K06785J00758
4575D96888k4823P1387k54229n7012J06658Q3162j46871j24661L2418L03108j18224
4564C67801j81220Q8475J97884n1475N3319R838J28908q2499k34273J68027N9011
$$ plain form
4553 523796 515694 603362 723135 618029 672484 612427 518851 522556 530231 408604 350977 300102
4541 300102 249338 392796 267152 483488 519258 455016 460959 695876 751418 456118 198128
4530 198128 233395 480146 274110 388666 541847 435705 558579 577778 452806 492628
4520 492628 449168 398775 114973 45549 46192 68071 188423 368812 446592 256845 324713
4509 324713 160060 266713 204031 314435 472705 456463 391346 370055 239717 173565 224095
4498 224095 302531 468733 409713 192996 50689 10276 112806 265636 259487 196305 287368
4487 287368 275909 460721 408198 239393 122962 236396 453145 295756 204061 217246
4477 217246 317574 194231 197343 313228 17106 48165 330571 308644 188407 424745
$$ packed form
4553E23796q102Q7668J19773j05106N4455o0057r3576L705P675j21627n7627n0875
4541C00102n0764J43458j25644K16336L5770o4242N943K34917N5542k95300k57990
4530A98128L5267K46751k06036J14556J53181j06142J22874J9199j24972L9822
4520D92628m3460n0393k83802o9424O43K1879J20352J80389P7780j89747O7868
4509C24713j64653J06653o2682J10404J58270j6242o5117k1291j30338o6152N0530
4498B24095P8436J66202n9020k16717j42307m0413J02530J52830o149o3182R1063
4487B87368j1459J84812n2523j68805j16431J13434K16749j57389r1695J3185
4477B17246J00328j23343L112J15885k96122L1059K82406k1927j20237K36338
$$ plain form
4467 424745 526631 308390 106393 147857 261422 246912 307913 387075 363435 439900 553298
4456 553298 612517 496461 228148 126491 28550 118145 189788 288123 76812 281027 365284
4445 365284 296061 453176 475776 477790 381646 369448 599798 709830 658190 627178 480888
4434 480888 390485 288990 335706 195725 44947 87855 293633 433867 487629 437226 277312
$$ packed form
4467D24745J01886k18241k01997M1464J13565j4510O1001P9162k3640P6465J13398
4456E53298N9219j16056k68313j01657r7941Q9595P1643R8335k11311K04215Q4257
4445C65284o9223J57115K2600K014r6144j2198K30350J10032n1640l1012j46290
4434D80888r0403j01495M6716j39981j50778M2908K05778J40234N3762n0403j59914
$$ [...]
##END NTUPLES=NMR SPECTRUM
##END=
