##TITLE=1H_EC-3305(IV-32)
 CDCl3
 8 sc, 
 7.2.2024
##JCAMPDX= 6.0         $$ Bruker NMR JCAMP-DX V2.0
##DATA TYPE= NMR SPECTRUM
##DATA CLASS= NTUPLES
##ORIGIN= UXNMR, Bruker Analytische Messtechnik GmbH
##OWNER= root
$$ XWIN-NMR		Version 3.5
$$ Wed Feb  7 14:30:24 2024 Russian Standard Time (UT+4h)  she@DPX200
##.OBSERVE FREQUENCY= 200.1313
##.OBSERVE NUCLEUS= ^1H
##.ACQUISITION MODE= SIMULTANEOUS
##.ACQUISITION SCHEME= undefined
##.AVERAGES= 8
##.DIGITISER RES= 18
##SPECTROMETER/DATA SYSTEM= spect
##.PULSE SEQUENCE= zg30
##.SOLVENT NAME= D2O
##.SHIFT REFERENCE= (INTERNAL, D2O, 0, 15.4549)
##AUDIT TRAIL= $$ (NUMBER, WHEN, WHO, WHERE, WHAT)
$$ ##TITLE= Audit trail, XWIN-NMR		Version 3.5
$$ ##JCAMPDX= 5.01
$$ ##ORIGIN= Bruker BioSpin GmbH
$$ ##OWNER= she
$$ F:/spectra/data/she/nmr/H-F/1/pdata/1/auditp.txt
$$ ##AUDIT TRAIL=  $$ (NUMBER, WHEN, WHO, WHERE, WHAT)
(   1,<2024-02-07 14:28:52.79 +0400>,<she>,<DPX200>,
      <created by zg, POWCHK disabled, PULCHK disabled
       configuration hash MD5:
       00 E9 B6 7A A2 85 ED C7 34 08 36 98 17 FE 4E 26
       data hash MD5: 16K
       22 84 4B DA 19 CB 65 0E A9 36 31 D4 20 EE EF A9>)
(   2,<2024-02-07 14:28:55.76 +0400>,<she>,<DPX200>,
      <Start of raw data processing
       efp BC_mod = 2 LB = 0.24 FT_mod = 6 PKNL = 1 PHC0 = -24603.4 PHC1 = 17.45268 SI = 16K 
       data hash MD5: 16K
       2C BA 0C E0 11 0F B3 3D 1D 36 01 71 AF D9 60 AA>)
(   3,<2024-02-07 14:29:21.17 +0400>,<she>,<DPX200>,
      <pk PHC0 = 12.80646 PHC1 = -14 
       data hash MD5: 16K
       4A 6A 8C E0 B3 2D DE CC CC C6 78 76 CD C7 56 8A>)
(   4,<2024-02-07 14:29:24.75 +0400>,<she>,<DPX200>,
      <abs ABSG = 5 
       data hash MD5: 16K
       D5 C5 1B 6E 7F DB 0A 5A 1B 0F EF 7D 4C 13 B8 6D>)
$$ ##END=
$$ 
$$ hash MD5
$$ D0 6C 4F AF A7 F9 33 43 9D 1A 17 8D 6B A9 56 68
##$RELAX= 
##$RELAX= 
##$RELAX= 
##$RELAX= 
##$RELAX= 
##$RELAX= 
$$ Bruker specific parameters
$$ --------------------------
##$DU= <F:/spectra>
##$EXPNO= 1
##$NAME= <H-F>
##$PROCNO= 1
##$TYPE= <nmr>
##$USER= <she>
##$AMP= (0..31)
100 100 100 100 100 100 100 100 100 100 100 100 100 100 100 100 100 100 
100 100 100 100 100 100 100 100 100 100 100 100 100 100 
##$AQSEQ= 0
##$AQ_mod= 1
##$AUNM= <au_zg>
##$AUTOPOS= <>
##$BF1= 200.13
##$BF2= 200.13
##$BF3= 200.13
##$BF4= 200.13
##$BF5= 200.13
##$BF6= 200.13
##$BF7= 200.13
##$BF8= 200.13
##$BYTORDA= 1
##$CFDGTYP= 0
##$CFRGTYP= 5
##$CHEMSTR= <none>
##$CNST= (0..31)
1 1 145 1 1 1 1 1 1 1 1 1 1 1 1 1 1 1 1 1 1 1 1 1 1 1 1 1 1 1 1 1 
##$CPDPRG= <>
##$CPDPRG1= <>
##$CPDPRG2= <>
##$CPDPRG3= <>
##$CPDPRG4= <mlev>
##$CPDPRG5= <mlev>
##$CPDPRG6= <mlev>
##$CPDPRG7= <mlev>
##$CPDPRG8= <mlev>
##$CPDPRGB= <>
##$CPDPRGT= <>
##$D= (0..31)
0 1.2 0 0 0 0 0 0 0 0.06 0 0.03 0 0 0 0 0.0002 0 0 0 0 0 0 0 0 0 0 0 0 
0 0 0 
##$DATE= 1707301732
##$DBL= (0..7)
120 120 120 120 120 120 120 120 
##$DBP= (0..7)
150 150 150 150 150 150 150 150 
##$DBP07= 0
##$DBPNAM0= <>
##$DBPNAM1= <>
##$DBPNAM2= <>
##$DBPNAM3= <>
##$DBPNAM4= <>
##$DBPNAM5= <>
$$ [...]
##$SUBNAM3= <"">
##$SUBNAM4= <"">
##$SUBNAM5= <"">
##$SUBNAM6= <"">
##$SUBNAM7= <"">
##$SUBNAM8= <"">
##$SUBNAM9= <"">
##$SW= 18.0517328524113
##$SWIBOX= (0..15)
0 0 2 0 0 0 0 0 0 0 0 0 0 0 0 0 
##$SW_h= 3612.71676300578
##$TD= 16384
##$TD0= 1
##$TE= 0
##$TE2= 300
##$TE3= 300
##$TEG= 300
##$TL= (0..7)
0 120 120 120 120 120 120 120 
##$TP= (0..7)
150 150 150 150 150 150 150 150 
##$TP07= 0
##$TPNAME0= <>
##$TPNAME1= <>
##$TPNAME2= <>
##$TPNAME3= <>
##$TPNAME4= <>
##$TPNAME5= <>
##$TPNAME6= <>
##$TPNAME7= <>
##$TPOAL= (0..7)
0.5 0.5 0.5 0.5 0.5 0.5 0.5 0.5 
##$TPOFFS= (0..7)
0 0 0 0 0 0 0 0 
##$TUNHIN= 0
##$TUNHOUT= 0
##$TUNXOUT= 0
##$USERA1= <user>
##$USERA2= <user>
##$USERA3= <user>
##$USERA4= <user>
##$USERA5= <user>
##$V9= 5
##$VALIST= <valist>
##$VCLIST= <CCCCCCCCCCCCCCC>
##$VD= 0
##$VDLIST= <DDDDDDDDDDDDDDD>
##$VPLIST= <PPPPPPPPPPPPPPP>
##$VTLIST= <TTTTTTTTTTTTTTT>
##$WBST= 1024
##$WBSW= 4
##$XGAIN= (0..3)
0 0 0 0 
##$XL= 0
##$YL= 0
##$YMAX_a= 415590
##$YMIN_a= -632162
##$ZGOPTNS= <>
##$ZL1= 120
##$ZL2= 120
##$ZL3= 120
##$ZL4= 120
##$ABSF1= 15.66646
##$ABSF2= -2.385393
##$ABSG= 5
##$ABSL= 3
##$ALPHA= 0
##$AQORDER= 0
##$ASSFAC= 0
##$ASSFACI= 0
##$ASSFACX= 0
##$ASSWID= 0
##$AUNMP= <proc_1d>
##$AZFE= 0.1
##$AZFW= 0.1
##$BCFW= 0
##$BC_mod= 2
##$BYTORDP= 0
##$COROFFS= 0
##$CY= -3
##$DATMOD= 1
##$DC= 0
##$DFILT= <>
##$DTYPP= 0
##$F1P= 0
##$F2P= 0
##$FCOR= 1
##$FTSIZE= 16384
##$FT_mod= 6
##$GAMMA= 0
##$GB= 0
##$INTBC= 1
##$INTSCL= 3.70164e-10
##$ISEN= 128
##$LB= 0.24
##$LEV0= 0
##$LPBIN= 0
##$MAXI= 10000
##$MC2= 0
##$MEAN= 0
##$ME_mod= 0
##$MI= 1.114404
##$NCOEF= 0
##$NC_proc= -6
##$NLEV= 6
##$NOISF1= 3.799351
##$NOISF2= 2.8
##$NSP= 0
##$NTH_PI= 0
##$NZP= 0
##$OFFSET= 15.45491
##$PC= 1
##$PHC0= -24590.59
##$PHC1= 3.452681
##$PH_mod= 1
##$PKNL= yes
##$PPARMOD= 0
##$PSCAL= 0
##$PSIGN= 0
##$REVERSE= no
##$SF= 200.130013366288
##$SI= 16384
##$SIGF1= 3
##$SIGF2= 2
##$SINO= 5.538805
##$SIOLD= 16384
##$SREGLST= <1H.CDCl3>
##$SSB= 0
##$STSI= 16384
##$STSR= 0
##$SW_p= 3612.71676300578
##$SYMM= 0
##$S_DEV= 0
##$TDeff= 16384
##$TDoff= 0
##$TI= <>
##$TILT= no
##$TM1= 0
##$TM2= 0
##$TOPLEV= 0
##$USERP1= <user>
##$USERP2= <user>
##$USERP3= <user>
##$USERP4= <user>
##$USERP5= <user>
##$WDW= 1
##$XDIM= 16384
##$YMAX_p= 355698468
##$YMIN_p= -281858
$$ End of Bruker specific parameters
$$ ---------------------------------
##NTUPLES= NMR SPECTRUM
##VAR_NAME=  FREQUENCY,     SPECTRUM/REAL,   SPECTRUM/IMAG
##SYMBOL=    X,             R,               I
##VAR_TYPE=  INDEPENDENT,   DEPENDENT,       DEPENDENT
##VAR_FORM=  AFFN,          ASDF,            ASDF
##VAR_DIM=   16384,         16384,           16384
##UNITS=     HZ,            ARBITRARY UNITS, ARBITRARY UNITS
##FACTOR=    0.220516191357247, 1,           1
##FIRST=     3092.99140057503, 0,            0
##LAST=      -519.725362430754, 0,           0
##MIN=       -519.725362430754, -281858,     0
##MAX=       3092.99140057503, 355698468,    0
$$ Real data points
##PAGE= N=1
##DATA TABLE= (X++(R..R)), XYDATA
$$ [...]
10333 -76697 -57346 -30888 -117645 -115067 -37085 -153659 -122794 -68798 -23546 -105824 -78497 -95795
10321 -95795 -116090 -92425 -118266 -97426 -126292 -77714 -111243 -47041 -47752 -119753 -56644 -67136
10309 -67136 -104789 -80981 -72301 -8841 290 35979 -65379 -118582 -167819 -199673 -204204 -121849
10297 -121849 -150561 -80110 -95359 -100981 -31643 -35045 -56367 -45546 -138881 -87735 -111294 -154540
10285 -154540 -245492 -229453 -136172 -173743 -193977 -171893 -229486 -156654 -170318 -115325 -143652
10274 -143652 -152948 -54195 -21220 -63110 -80455 -25874 47748 -47727 -76601 -191273 -125604
10263 -125604 24263 -61049 -38763 -35685 -113003 -167186 -141214 -57229 -93528 -127592 -182817
10252 -182817 -228151 -141267 -71209 -66769 -93454 -98012 -96434 -149197 -17902 -8972 -31880 -28688
10240 -28688 -83207 -63912 -21239 -15348 -20417 38126 -29649 -95089 832 67531 41776 32622
10228 32622 21441 25204 15508 -55500 -57218 -30864 -94086 -109165 -121933 -98107 -84655 -2580
10216 -2580 -49816 -26511 4362 -43221 -55725 38781 54766 62629 -13308 -17002 -5887 -70399
10204 -70399 7363 60473 45091 -68953 -55735 -1971 5614 30283 45531 -59964 -118087
10193 -118087 -115722 -114962 -53210 -88114 -155393 -176121 -117224 -151668 -124069 -58098 -122949 -130724
10181 -130724 -138306 -179826 -132106 -153823 -107352 -91072 -19432 128665 102953 13946 24078
10170 24078 -75973 -204781 -200650 -152123 -114057 -128839 -189124 -62190 -111783 -123015 -178626
10159 -178626 -157564 -118462 -90929 -138594 -48748 -102368 -23791 -11319 -178799 -156662 -124998
10148 -124998 -56472 1324 31163 -17854 -48173 -74981 28425 -10741 -74793 -120723 -118388
10137 -118388 -43036 -20879 -162269 -269813 -124408 -74071 -174506 -79292 -76374 -164368 -151805
10126 -151805 -98916 -101369 -112479 -91550 -122463 -150946 3306 -16807 -121176 -156316 -223774
10115 -223774 -145319 -192007 -189008 -149142 -77218 -46301 -151642 -176628 -185588 -55094 -67336
10104 -67336 -46027 -12649 -97788 -60890 32482 -23233 -81969 -99361 -90347 -143425 -145166 -126349
10092 -126349 -122241 -95924 -6392 -33084 29283 -64513 -123815 -26831 -9997 -60727 -32044 16303
10080 16303 33298 -16607 -126089 -100062 -144176 -145582 -121897 -90372 -131368 -155526 -113168 -122306
10068 -122306 -182266 -89405 -39851 -108077 -68749 -134582 -163254 -161130 -63215 -42140 -143040
10057 -143040 -28705 8570 -30979 -86570 1487 -26959 -67203 -114741 -214263 -108486 -9458
10046 -9458 -37392 -71085 -16023 -77077 -143028 -126311 -108230 -136371 -166937 -207580 -133117 -34139
10034 -34139 8996 47678 47151 -51139 -48907 52073 14538 -28629 -10039 -28182 -16081 -109114
10022 -109114 -110473 -147622 -99222 -54345 -34084 -72412 39888 27090 -133543 -133506 -100361 -32817
10010 -32817 -11549 17580 -31516 -94484 -66665 -42213 -52838 -86817 -183125 -62659 40058
9999 40058 -14178 -58192 -153692 -121906 -37534 -71705 -142400 -129832 -154811 -81776 56706 42558
9987 42558 -1965 -41570 -33936 -39791 -38971 -77167 -44406 -50188 -34152 -90495 -61299 -83905 -21566
9974 -21566 -88304 -106125 -213689 -209209 -170303 -124528 -28391 -44349 -73604 -28238 -90314 -122841
9962 -122841 -109919 -147061 -126583 -137162 -121884 -161780 -174107 -144675 -99784 -35683 28517 24368
9950 24368 -65252 -143373 -101656 -134340 -78684 -64426 -133368 -149071 -125789 23817 -40251 -106198
9938 -106198 -78859 -37603 -102502 -131503 -76214 -59337 -89419 -39757 103951 -4588 -73803
9927 -73803 -94580 -3793 -6331 -51093 -122160 -50184 77040 63014 -13542 -84120 -140372 -110889
9915 -110889 -45986 -20047 -128146 -102743 88312 152011 46236 -31351 -60846 -183225 20413
9904 20413 -15396 -36716 -3829 7117 -56498 -108054 -74388 -62860 -56940 -24381 -23805 -180117
9892 -180117 -114921 -28889 11331 -14107 -33040 -84590 -52483 -104849 -40703 -29182 -25966 2912
9880 2912 16051 -32576 -68239 -22576 -69627 -97337 -135404 -101709 -156562 -147165 -189994 -109884
9868 -109884 -86723 -108630 -9403 103328 91287 -43892 -16490 -12909 15803 75415 57686
9857 57686 -40848 -146293 -113343 -24490 40403 -42739 -19290 -99501 -147540 -118896 -100886 -132571
9845 -132571 -117692 -116839 -136505 -50421 -81056 -80515 -56504 6848 -56598 -25663 -94833 -482
9833 -482 -42178 -136106 -51542 14195 16234 66587 75361 79871 94251 44018 23882 71231 1785
9820 1785 87669 84882 42154 102783 72837 -31057 -7972 -59759 -178299 -92732 -102046 -129399
9808 -129399 -108406 -145734 -142933 -173062 -220880 -156932 -169714 -126256 -164103 -108853 -86006 -77354
9796 -77354 -98702 -61682 -65675 -71659 -10466 81240 74158 -68886 -126253 -106362 68119 56366
9784 56366 -33145 -75971 -46868 -63849 -149326 -141157 -75501 -47755 60169 75154 10012 58605
9772 58605 26968 21326 -3026 13433 24636 -51539 -78502 -62108 -61395 -4355 -4598 71905 94174
9759 94174 21749 52232 142694 108089 42127 24795 50930 7837 -1766 28050 14005 23711
9747 23711 11375 24388 30089 110933 22263 2363 10479 22402 -14663 -22592 -19897 -22229 40767
9734 40767 105235 170232 128495 151208 136360 107250 156566 295503 157654 171078 165062 196799
9722 196799 221987 230337 132204 111828 220893 118803 150993 64021 87901 144384 71424
9711 71424 139222 126846 169655 141164 157525 228677 253058 229723 107062 173971 201419 82159
9699 82159 184012 241203 243833 262608 248760 224224 272567 302657 216802 205533 228586 165379
9687 165379 189725 294551 257955 175823 235828 275716 276820 228939 154109 113960 215298
9676 215298 231481 186337 93484 127142 241741 325441 298996 210067 176377 212957 345075
9665 345075 200773 203602 201374 269382 261684 278871 374031 486037 563969 537227 381653 352612
9653 352612 312369 390004 397279 409833 502611 556302 560663 640252 609096 495409 433358 447574
9641 447574 553148 535499 539335 465590 502994 635861 528599 502641 522093 523362 410112
9630 410112 378524 492793 429975 416406 478784 529341 418919 371606 398260 413993 418302
9619 418302 528618 531905 423756 527972 598137 623702 624276 531250 539932 493872 578634 594129
9607 594129 633321 608306 624285 572966 545364 503868 467808 477284 474127 549651 507382 560848
9595 560848 541607 481016 446936 399126 372477 394602 440732 383532 343981 499514 446175
9584 446175 432425 528888 507253 466148 415814 381966 417376 298146 262738 291424 315879
9573 315879 235820 301934 245509 339805 308114 328820 365940 364811 355673 309824 389838 335966
9561 335966 275380 309344 355388 407857 415912 345150 385361 478253 450573 432483 394119 368292
9549 368292 490219 431045 429169 389186 413073 405518 389901 460750 421857 347592 486240 575093
9537 575093 532453 480953 485348 448423 446865 487873 480465 429530 438955 521552 635077 556951
9525 556951 564427 525679 537240 663938 703210 633828 640358 655876 607586 603603 595411 646309
9513 646309 712255 695154 699346 721328 798496 737531 752262 699291 752198 734078 713989 820178
9501 820178 922794 874680 907667 964206 918888 969233 893885 897431 873666 853221 924975 937877
9489 937877 1065309 1021756 1112244 1052143 963449 1132757 1084023 1154268 1175473 1205795 1189964
9478 1189964 1229309 1335956 1370496 1412664 1414409 1431799 1469718 1481009 1558825 1572843 1539685
9467 1539685 1569908 1614503 1634239 1689368 1617831 1731813 1874613 1915924 1910195 1947258 1908492
9456 1908492 1900573 1961814 1997888 2039044 2226842 2357608 2355303 2427392 2484148 2403904 2519333
9445 2519333 2630930 2712417 2780863 2901057 2968514 3071477 3131676 3231820 3346935 3330507
9435 3330507 3399390 3576271 3629051 3711365 3845243 3895593 4004870 4130794 4339190 4371083
9425 4371083 4391372 4538341 4642581 4722638 4977653 4929646 4903104 4984247 5114015 5238221
9415 5238221 5254697 5203143 5302713 5294759 5283948 5201215 5176543 5154792 5207369 5187997 5098202 5125083
9403 5125083 4894659 4911401 4857729 4886209 4916902 4886328 4664486 4479087 4231721 4083710
9393 4083710 4131789 3983891 3817710 3763127 3725761 3705377 3599577 3438876 3373969 3379628 3195339
9382 3195339 2969399 2915718 2917571 2880866 2747810 2664793 2622723 2652612 2589906 2634332 2573801
9371 2573801 2533059 2397715 2337991 2283532 2141067 2129601 2110761 2100263 2042666 1947580 1757840
9360 1757840 1791500 1718394 1690909 1691634 1687126 1576493 1555188 1542795 1606822 1648122 1634173 1688611
9348 1688611 1592780 1527006 1472882 1556812 1554896 1493970 1449343 1327509 1208700 1297913 1257172
9337 1257172 1284423 1316041 1419520 1448626 1389737 1341444 1281040 1281168 1238326 1225928 1134806 1146758
9325 1146758 1163391 1101096 967757 866251 943148 920744 907271 948629 893942 870919 909298
9314 909298 910361 760736 802385 852726 814983 778839 778613 761677 679204 689352 652089 588422
9302 588422 599644 690427 761309 730534 630447 596500 655548 581176 562549 706299 742240
9291 742240 635406 582717 561327 480371 508971 535132 602249 585273 658325 641068 516483
9280 516483 543983 588776 691981 698096 592212 464315 546502 554454 539226 514793 555622
9269 555622 564488 549362 571898 608734 640352 498962 384960 445370 554721 492833 525394
9258 525394 450040 366044 397516 435309 421035 529445 534166 607476 606588 544735 644388 635412
9246 635412 637249 625822 643449 703429 677204 644779 627023 673829 643037 656286 582619 596893
9234 596893 692225 703417 759376 744383 762960 731953 682855 689006 649181 743721 653580 660806
9222 660806 652919 613566 631419 734526 690332 646191 678962 635040 706768 739334 785268 764545
9210 764545 939909 879864 806300 844392 747829 766348 829353 839412 807820 897104 914026
9199 914026 880528 905253 813812 784162 744495 875606 925465 1031941 1023385 1020078 969960 859148
9187 859148 885035 937702 865063 827297 938470 866948 908262 948969 895871 824752 864813
9176 864813 956290 957748 1033926 1082624 1167313 1128029 1110729 1161655 1193001 1187854 1118424 1102237
9164 1102237 1193936 1199942 1142801 1148977 1209566 1262602 1197440 1134984 1114700 1104080 1144124 1093649
9152 1093649 1171167 1266316 1314719 1380621 1285251 1226201 1298310 1260113 1251764 1278835 1331060 1322691
9140 1322691 1309600 1275433 1312858 1292248 1481929 1562191 1535910 1640241 1634592 1555341 1619443
9129 1619443 1575010 1448749 1437714 1365197 1423144 1558083 1515389 1530597 1561014 1601989 1661498
9118 1661498 1798478 1937501 2047256 2210571 2248314 2437095 2496156 2487007 2502728 2451120 2466828
9107 2466828 2469811 2428359 2417784 2379165 2410499 2305390 2274677 2206165 2158464 2129508 2095831
9096 2095831 2057794 1875895 1804332 1713320 1703895 1643950 1614295 1626449 1698767 1825156 1768297
9085 1768297 1689456 1769072 1881750 1940998 2054317 1958908 2002372 2082434 2102724 2090609 2198255
9074 2198255 2241930 2215177 2059368 2156017 2225948 2274409 2214380 2272121 2371374 2354851 2266153
9063 2266153 2324213 2324276 2281263 2413209 2389584 2336994 2405970 2389072 2284690 2274649 2233712 2204541
9051 2204541 2236322 2288024 2363146 2322554 2275861 2255909 2308114 2312697 2327051 2454945 2399181
9040 2399181 2407776 2516659 2490460 2529676 2514628 2549706 2633593 2754986 2713165 2728930 2903796
9029 2903796 2970041 3047064 3000419 3074054 3048828 2994572 3061485 3061309 3066027 3079455 3213238 3187216
9017 3187216 3261279 3346082 3450558 3579209 3690075 3789315 3800315 3795865 3904884 3898286 3815710
9006 3815710 3831371 3719339 3685470 3857386 3978969 3938173 3924650 3968291 4024016 3916292 4048667
8995 4048667 4138377 4164970 4219717 4284002 4427041 4553849 4488784 4537975 4608370 4732332 4759195
8984 4759195 4792517 4852281 4911387 4973164 5043389 5138974 5290222 5363095 5561423 5639157 5720393
8973 5720393 5860630 6205828 6386824 6588160 6777395 6877020 7020343 7235583 7340324 7626689
8963 7626689 7797305 8050117 8332045 8614896 8834855 9137791 9450965 9791728 10058656 10297014
8953 10297014 10461730 10721983 10804357 11044930 11276771 11657970 11963780 12414582 12864907 13460518
8943 13460518 13929674 14452636 14839874 15500045 16047941 16766258 17549092 18694853 20093622
8934 20093622 21943362 23943480 26405914 29826680 34903623 41426526 51145642 63335295
8926 63335295 76980929 85829341 76860801 62595655 49046072 39107135 33091182 29071051
8918 29071051 26232229 24083830 22534041 21166790 20114597 19272469 18760953 18464970 18304821
8909 18304821 18086345 17921434 17849045 17776033 17606460 17587669 17433162 17434014 17671309 17988264
8899 17988264 18287509 18580972 19135777 19728348 20361057 21403006 22615900 24316520 26526140
8890 26526140 29368700 32482227 35676174 37555787 37944979 36719455 34183475 31541266
8882 31541266 29344769 27709419 26804740 26362532 26204340 26387860 26579035 26768155 27359424
8873 27359424 28275363 29770851 31960847 34902031 38298730 41145725 42342131 42191278
8865 42191278 40497472 37798810 34993657 32698223 31160697 30239784 29636195 29488616 29864627
8856 29864627 30459148 31716197 33463887 35748499 38559257 41632553 45186010 48866355
8848 48866355 52140295 53931173 54204816 52547996 49190885 45534763 42263655 39575675
8840 39575675 37608033 36263038 35383231 35196363 35381848 36107865 37561410 39591185 42396038
8831 42396038 45431209 48890416 52503523 55162480 56075489 55525016 53074212 49547778
8823 49547778 45922013 42521806 39797057 37650383 36069316 35113661 34822413 34979623 35738412
8814 35738412 37108198 38973028 40862314 42902001 45257239 47721747 50569682 52854312
8806 52854312 53968725 54140485 52918497 51174055 49895023 49384068 49825687 51491006 54449123
8797 54449123 58011225 61188283 62462454 61690255 59271810 55574204 51673477 48280915
8789 48280915 45429932 43524007 42677591 42181695 41690062 40687919 38967827 36855446 34273805
8780 34273805 31719070 29522549 27754084 26399157 25478621 24836118 24448595 24406097 24546666
8771 24546666 24915524 25611259 26643610 28239232 30379004 33260925 36685803 39868330
8763 39868330 41854463 42349526 41524893 39524065 37682457 36733264 37066129 38563304 41358482
8754 41358482 44861630 48321598 50261566 50082981 47677162 43647198 39140955 35118979
8746 35118979 32156276 30289347 29270653 28789294 28204969 27187092 25781679 23993149
8738 23993149 22005818 19986458 18158643 16710933 15356906 14110432 13185005 12490059
8730 12490059 11824581 11390780 11004830 10590884 10226584 9893143 9653004 9519330 9130014
8721 9130014 8913312 8818904 8524461 8197099 8189716 8120967 7851034 7707362 7486396 7389221
8711 7389221 7278072 7141823 6922029 6829292 6790377 6604631 6421193 6302881 6190756 6094063
8701 6094063 6110968 5929694 5761949 5648948 5579178 5476188 5384479 5470861 5462979 5412849 5352087
8690 5352087 5336528 5220515 5126803 5142320 5180743 5211634 5196835 5100975 5180466 5210095 5086418
8679 5086418 5049228 5037451 5052310 5231369 5244533 5211811 5153777 5131676 5126995 5213609 5137127
8668 5137127 5183795 5309257 5317611 5225406 5304578 5312525 5255240 5292276 5320360 5387907 5519564
8657 5519564 5532524 5593234 5702890 5758302 5826522 5941769 6061270 6123319 6148643 6276989 6467927
8646 6467927 6611426 6682485 6670969 6708568 6900014 7035354 7202787 7292218 7457607 7606215
8636 7606215 7694582 7861720 8046354 8257402 8384970 8508389 8760361 8913213 9010219 9192366
8626 9192366 9409437 9620068 9812662 10168601 10514308 11040150 11583073 12291761 13030786 14014297
8616 14014297 15178447 16808901 18869222 21245720 23675777 25642798 26129985 24980027
8608 24980027 23120328 21581252 20634065 20457687 20986453 21996703 23556513 25112920 26628433
8599 26628433 27287880 26487389 24748230 22791912 21367560 20500791 20122186 20066169 20016246
8590 20016246 19739523 19031250 18437839 18013579 17853566 18178355 18670672 19873811 21285028
8581 21285028 22425922 23287097 23531490 23576322 23873358 24522567 25895676 28028394 30895040
8572 30895040 34576726 38380380 41122769 42425034 41896948 39412854 36336812 33635188
8564 33635188 32014962 31723395 32530806 34190767 36295643 37961691 38558806 37942616 36179306
8555 36179306 33483056 30611034 28375175 26801910 25708555 24885199 24221637 23273953 22168818
8546 22168818 21243779 20551044 20469241 20730422 21331552 22153727 22912207 23386631 23598642 23189395
8536 23189395 22414731 21602319 21143086 21318237 22222711 23947812 25774482 27422065 28084476
8527 28084476 27283781 25613368 23500331 21587522 20342902 19800979 19884414 20265811 21034093
8518 21034093 21867213 22156794 21498851 19992152 18091668 16366771 15248710 14570249 14097735
8509 14097735 13877359 13557295 13049074 12490156 12005728 11658614 11391601 11367945 11575568 11896253
8499 11896253 12174512 12122753 11753605 11011821 10029284 9283068 8569143 8153312 7957656 7814852
8489 7814852 8081142 8246028 8199676 8027489 7601637 7214964 6914475 6683266 6376161 6047103
8479 6047103 5721068 5495649 5318732 5115894 4931223 4678092 4543322 4522693 4486331 4487275
8469 4487275 4441823 4402050 4346491 4371522 4458338 4373694 4191106 4111003 4084178 3875337 3695277
8458 3695277 3529303 3389705 3349053 3214757 3109319 3019064 2902074 2894845 2954614 3007161 3066560
8447 3066560 3035794 2826939 2759125 2679859 2563585 2533805 2480086 2419104 2310803 2262938 2354568
8436 2354568 2265258 2197488 2252954 2289538 2264571 2195049 2113753 2172448 2189853 2092782 2024370
8425 2024370 1991110 1856327 1733937 1638653 1693452 1853587 1785132 1720794 1628673 1625851 1653481
8414 1653481 1632258 1572670 1512003 1501482 1385188 1355838 1418659 1497892 1368954 1335369 1378855
8403 1378855 1274062 1267044 1354011 1365690 1310807 1242759 1252699 1354162 1289443 1225956 1269529
8392 1269529 1244761 1109461 1128355 1260295 1223629 1248743 1289623 1209897 1185183 1171067 1141887
8381 1141887 1178110 1152118 1092556 1035612 945502 996607 884271 936484 955525 844942 789883
8370 789883 863756 816159 789676 729608 711049 698414 757124 750065 718923 671907 754952 877963
8358 877963 832137 864001 906267 820839 741919 694291 712394 775294 817190 747371 822506 868539
8346 868539 793828 725508 755794 733846 678186 823269 651541 690018 730475 616746 612768
8335 612768 569382 619403 747594 680104 721194 715337 647837 641952 647081 700541 712324 723377
8323 723377 802286 759606 758652 714228 741146 803227 821635 840034 868996 790740 719930 819039
8311 819039 853120 847855 935253 917502 894019 872752 882773 880406 932588 930359 859566 804516
8299 804516 810082 848922 766988 798340 922992 932947 980959 993266 970469 1034059 1058976 1062335
8287 1062335 1084984 1062459 1058347 989921 1001993 1053255 1089292 1086654 1080444 1103083 1110751 1077017
8275 1077017 1074387 1141575 1076802 1055066 1186262 1295922 1393690 1391470 1342386 1256578 1175686
8264 1175686 1233725 1218681 1151509 1084210 1050965 1063386 1162892 1121298 1072078 1073678 1248204
8253 1248204 1237794 1192797 1316216 1286211 1274091 1303865 1367969 1362651 1334715 1307940 1305494 1218954
8241 1218954 1134630 1181695 1127468 987434 839185 860220 920005 911494 914324 1033643 1047198
8230 1047198 1060796 1001625 989001 816891 723224 745704 763889 772247 697111 750567 805015
8219 805015 779652 724270 673484 774369 727706 559271 564466 616822 660653 775929 732078
8208 732078 751398 674102 706794 784642 871861 891286 961380 902170 913323 975775 876786 881925
8196 881925 726309 843508 964895 607754 -52095 876176 1244427 1253753 1332014 1218060
8186 1218060 1242406 1279738 1243484 1163151 1107825 1127226 1035313 1030426 1132385 1152880 1195708
8175 1195708 1077064 1035413 997439 1055914 1088822 1036991 1021969 984574 938127 1185297 1233479
8164 1233479 1221848 1224933 1195640 1070660 1009006 935704 1015107 819179 838276 880872 872402
8153 872402 961036 916893 965137 1022152 908524 1071890 1212756 1300193 1255691 1262574 1255130
8142 1255130 1069303 1037639 998881 966780 1016215 938442 868814 957344 1064042 1108729 1053101
8131 1053101 1006492 1003761 1025250 913527 780644 716570 711745 672225 697526 729543 660443
8120 660443 596437 536876 591110 455289 473369 615547 591451 532234 484726 422535 379526
8109 379526 407410 415375 448822 440575 490918 602998 541440 416267 454709 428544 431578 403966
8097 403966 420430 436558 441913 427685 431348 513475 475947 371620 381274 377986 313638 271472
8085 271472 237766 272008 279714 176740 164984 155842 224034 137601 188026 229591 227463 214763
8073 214763 217854 53131 77571 93637 77927 156814 193170 80672 -15475 907 62500
8062 62500 39019 33425 193198 227211 100217 84741 134676 72735 50168 56782 122288 66019
8050 66019 122030 97823 -27669 -15545 64927 34810 -1576 -6741 8497 17221 -3322 -1368
8038 -1368 -30986 23817 16985 96022 132231 65181 139950 62037 61274 -18597 -107883 9647
8026 9647 -37640 -22397 110722 50995 53792 58345 -7125 2698 -25304 -100054 -40824 97471
8014 97471 234707 180849 7868 15485 59117 155575 133612 113372 59316 6749 97984 157531
8002 157531 -13194 -64684 -28541 -37004 -26551 -14414 110838 120520 30340 -33263 -105915 -53121
7990 -53121 76952 41702 81721 16040 68053 62214 29262 25447 22058 21202 -37231 16722 101291
7977 101291 20638 76840 70511 -41466 -57647 -33322 -94626 -79882 -85872 7672 17220 72653
7965 72653 109030 53265 -96157 -55229 35724 -18349 75201 22383 -20331 56095 113026 151
7953 151 23080 37855 78240 196772 195261 115905 79286 92862 105020 53027 69607 55392
7941 55392 110904 139798 71698 83198 156893 126816 126270 168020 191898 251527 192306 186726
7929 186726 159120 236087 270648 208707 203466 236759 264146 282736 267730 241472 305862 318121
7917 318121 312521 432470 401607 410979 585362 645079 638588 685112 650489 657531 720278 768591
7905 768591 786529 674564 669907 743341 678103 627288 695897 715903 697058 550023 480203
7894 480203 517674 503556 449895 429458 375033 401186 383444 416610 393971 335512 382847 328543
7882 328543 257118 308040 403025 416758 376667 359313 332238 387299 462163 489184 530642 586444
7870 586444 633653 734978 724381 759494 717233 718155 818597 757211 719475 684831 691662 699315
7858 699315 685235 755268 685831 713266 645839 653145 655520 490112 522941 620006 500412 499954
7846 499954 439666 395731 275852 233491 333114 340161 409644 394226 403498 311478 200686 241610
7834 241610 316010 229159 257406 275069 248591 266084 122721 107731 209042 117460 166607
7823 166607 226758 178136 141277 166832 234545 142262 201593 160368 227884 205338 203799 181223
7811 181223 200855 244027 119236 168167 166238 230737 251154 114575 183969 39114 217912
7800 217912 435196 219857 344977 427493 440626 285032 270794 192386 302376 342743 489153
7789 489153 426433 443654 437406 380899 413612 424325 405881 477993 390166 357910 246282 160144
7777 160144 321213 375054 265267 125935 166872 248192 233498 213963 289799 273815 275711
7766 275711 282523 315068 372738 299295 185197 238208 199804 126084 266699 342479 281780
7755 281780 241839 212504 201490 252007 311082 422407 314165 266903 311096 274636 257679
7744 257679 264108 329382 337357 392406 371273 363390 416745 447624 322675 267009 328591 286364
7732 286364 247772 233397 220977 294882 345504 358000 303201 261448 261763 333835 210851 296615
7720 296615 319380 291838 273819 351251 214408 161091 135020 64577 82580 148379 145838 139847
7708 139847 168398 186183 225661 160719 188158 180600 158534 184582 174538 257586 286068 115697
7696 115697 187180 191247 34139 35951 147370 237081 219442 152966 209913 197224 196145 131983
7684 131983 191909 157274 126382 131215 106265 119986 132013 231287 198364 158909 57456 26619
7672 26619 40082 45049 62991 96359 108765 133382 75943 44120 13394 5303 72701 216481
7660 216481 255644 231563 246984 213684 210298 150704 124694 152322 110721 59836 168194 149404
7648 149404 138762 127716 127181 21457 7323 79500 116403 100755 131494 144766 10124 22041
7636 22041 -15183 -2429 23438 41906 47538 52935 123824 134170 -3465 -16475 -57290 14173
7624 14173 6638 -81416 -21339 16921 75380 56348 14614 -28738 90237 39927 20671 -12212
7612 -12212 -119316 -145469 -37284 -76372 -96898 -63562 -133075 -99744 -61013 -81140 -75498 -51955
7600 -51955 -42389 37730 -49631 101834 4617 -119298 -50175 -9303 13596 104389 94375 96894
7588 96894 56049 86752 161492 183917 196243 79490 127057 43716 88812 131511 174011 78730
7576 78730 68228 144402 81781 65652 113066 112173 179688 184047 56019 72095 166178 104306
7564 104306 118546 71646 94687 110207 186445 131553 142421 194017 170686 103438 109473 179924
7552 179924 74426 74680 72744 159500 197155 301577 289078 272632 238841 163005 212260 158839
7540 158839 212027 202302 183231 211137 243513 223432 241738 331287 323036 357000 293052 197251
7528 197251 129932 49804 195584 223284 188220 168449 50834 102293 86767 62598 94273
7517 94273 123535 213561 231353 178866 225543 170107 198435 151669 191127 262594 274534 333789
7505 333789 282173 227477 233858 102273 205997 243391 245459 207792 296893 265618 256729 346315
7493 346315 328528 295303 364670 420953 403664 346817 225315 357130 403256 317193 275402
7482 275402 303742 275297 343049 326159 368220 314856 385030 466567 354026 318840 270227
7471 270227 264260 377494 433265 457638 436197 444217 533312 507622 459212 516274 522158 377610
7459 377610 370200 520329 557685 509648 517443 525051 596940 580666 502592 447723 465683 455482
7447 455482 498599 516108 476148 478538 457693 491330 387645 319483 289393 412777 495577
7436 495577 427400 429142 465476 531212 487873 506320 580778 537740 457844 454593 494179 380358
7424 380358 337623 440976 410018 372774 415506 459854 527988 462409 472487 411466 522909
7413 522909 449156 393912 433397 389821 324930 278598 255259 211067 161039 186507 117971 165387
7401 165387 230619 150585 245189 186809 229920 241299 183707 245503 151337 161514 175841 154830
7389 154830 235226 212211 121627 -8215 64508 117122 71893 107176 173394 164412 117052 60094
7377 60094 100025 6316 46383 47537 -30223 21635 -11028 29759 15929 53815 183437 140415
7365 140415 61250 58076 157053 47342 -13546 -19800 -96763 -126750 -27210 -3438 -31838 -34019
7353 -34019 116943 72755 -45079 -84540 -73207 73535 5000 -90293 -131752 -167683 -115231
7342 -115231 -105700 -65587 -119768 -118532 -130261 -105896 -11753 -138334 -196856 -172057 -148545 -102496
7330 -102496 -727 37822 67602 -1700 -94475 -83787 20279 -10242 -151008 -123519 -103166
7319 -103166 -160234 -133662 -118186 -197563 -138028 -53831 -108884 -11495 -26313 -74587 -23235 -67999
7307 -67999 -132712 -69941 -54581 -110616 -69125 -69390 -60035 37865 -7799 -12095 13125 -50961 -111884
7294 -111884 -105230 -60725 -39410 -134188 -133038 -60814 -75922 -141073 -141211 -131890 -157356 -63660 -79130
7281 -79130 -181874 -193300 -161537 -121852 -121504 -59046 -70715 -23513 54753 3882 -24277 -22940
7269 -22940 67121 -19495 -24259 -84432 -102517 -62454 -81835 -53994 -31111 -2405 -60072 -22637
7257 -22637 -7897 -64477 13237 -40368 -114835 -89994 -92054 -95691 -68634 -4282 48721 24391
7245 24391 6815 141969 24599 -43506 -17659 -106486 -37310 92166 6142 50868 93437
7234 93437 136100 172408 158974 115722 19884 4394 20220 -32141 -91377 -38394 -17146 22895
7222 22895 90708 21797 74800 71719 49940 82223 51251 27488 39099 34631 -58207 9099
7210 9099 7604 -26042 18246 4865 40437 6880 109348 127109 87075 6125 -173994 -157883
7198 -157883 -67721 -21840 -17240 -27680 52548 116226 49090 22611 113725 101002 39314 7440
7186 7440 -70271 -2100 23078 39385 29109 -13542 -105518 -61467 -143084 -135754 -101852 -46400
7174 -46400 6058 -46113 -43010 -73849 -152526 -43553 5497 -6147 -776 29443 -80423 -166962
7162 -166962 -201437 -40849 -11766 -16551 89950 56095 87558 8213 -75344 28632 6398
7151 6398 -42275 -105763 -112421 -13920 -25615 7073 -76521 -30691 13505 65374 -28392 -67705
7139 -67705 -71115 -10923 -2201 -74301 -100551 -127052 -49116 9313 90950 133564 -4423 32380
7127 32380 103255 34528 58585 134319 114743 -46078 44139 87917 13474 -92959 -119756
7116 -119756 -79267 -50372 -25914 13169 36897 -1780 7487 -48297 1157 55099 35249 55484
7104 55484 77059 21542 18192 48044 -14635 -62711 -77351 -146336 -76059 -16682 -25224 -27547
7092 -27547 -18591 1915 36214 12809 23344 12164 -28758 -47567 -78860 -37785 48691 77913
7080 77913 53363 31870 11974 -47856 -100644 -124470 -78504 -89329 -61287 -896 -62065 31179
7068 31179 56555 29369 -1776 89601 78894 54319 82261 36852 52894 81153 33103 -40030
7056 -40030 -10000 -59232 10597 26325 51560 121821 129560 66920 33897 -43169 -77115 84791
7044 84791 -1177 73439 -396 23606 60445 -6709 35778 90684 199907 79042 -34280
7033 -34280 -159686 -26526 45402 -67460 -70383 34438 12859 -92619 -129908 4338 2988
7022 2988 10272 -7913 -5099 28144 30846 63814 505 20400 43714 67440 74457 -72497 -30299
7009 -30299 -79154 -24506 29851 19633 -28544 -32406 -98781 -74538 45437 62243 269 -162451
6997 -162451 -192295 -61641 54022 12403 -8816 77114 -23009 -20982 54090 12777 48241
6986 48241 -96101 -65027 -32602 31706 -44036 2034 75038 19578 66535 57368 -14862 48177
6974 48177 -42078 -30247 -48340 86333 67363 51892 -20379 -15946 71655 92706 18928 -29863
6962 -29863 -89170 -63056 -33943 -17860 -6596 -89080 -28758 19791 102476 161440 78297 32070
6950 32070 174278 140649 90467 62159 53776 72239 27620 127324 111425 71930 152280 109685
6938 109685 102280 -32947 -137295 -34264 59791 57536 176319 147568 99752 116091 95269
6927 95269 107082 41869 31250 50694 84238 -76873 -113397 -57193 34854 165136 36973
6916 36973 -14436 10773 54807 118850 106176 -49643 6821 16306 56217 131898 127840 45713
6904 45713 52285 119202 106768 169165 131172 155091 130343 98746 69664 65867 117293 102285
6892 102285 160985 217430 166835 130225 92091 155188 191367 108501 134286 105888 57559 111502
6880 111502 119983 61761 115080 48296 125716 162909 249142 233327 123884 113996 61811 -72722
6868 -72722 45450 134244 209231 179288 151902 261278 212987 201272 191016 240477 258627
6857 258627 262138 150954 170528 173432 109088 243198 195823 142365 100407 52302 170660
6846 170660 249978 154262 130095 99757 84602 103692 102971 278657 201399 159849 170619 144325
6834 144325 96481 127598 219094 283437 239511 127551 121957 133355 171511 193793 187446 182983
6822 182983 128615 96193 140592 214136 145712 117115 130922 88746 142555 202689 182762 176369
6810 176369 91714 122930 232168 184396 225199 245832 235258 260592 195847 244951 193992
6799 193992 167960 247568 126036 117922 111623 49432 89028 204658 267783 230408 247764 185349
6787 185349 202917 250061 313813 352695 342037 377646 350340 359536 408447 370004 323948 375522
6775 375522 328595 348649 408171 363902 366435 295598 324716 248042 292144 321786 314571 247244
6763 247244 340034 463350 380111 323867 228914 240305 197886 174619 255444 322089 291528
6752 291528 273709 265590 212057 134779 210736 279625 293222 310208 321578 301362 227657 191587
6740 191587 226647 231722 169165 214475 361538 294380 381935 311862 255888 250577 307156 348944
6728 348944 322867 405426 459094 487095 460234 491675 378074 346813 470470 391834 356455
6717 356455 417200 325248 406447 350780 346606 371304 403728 404491 335549 406684 407415 402086 439793
6704 439793 364592 407754 466676 474824 531357 450611 338860 367384 305949 443684 451680 355284
6692 355284 435606 426963 390861 393507 387334 313635 389616 543785 592631 488256 496702 441653
6680 441653 307465 318484 485708 446626 464948 475743 450980 487856 423617 458910 595595
6669 595595 628461 620719 577204 587408 548918 522236 517178 613342 547437 528924 564111 506009
6657 506009 496833 468260 443363 601668 634296 590989 632146 609666 714344 697707 686589
6646 686589 632439 655460 729166 707442 698000 738730 778000 797323 763434 792314 841455 837746
6634 837746 803864 755880 772630 741448 791817 902648 957379 879256 884591 943571 968771 930173
6622 930173 931722 1097158 1080829 1052224 1151364 1251608 1267933 1174971 1110372 1145274 1134142
6611 1134142 977038 916503 927541 1007173 1090366 999056 945214 993122 1004365 966362 902569
6600 902569 794785 873242 847732 755231 760262 845706 811001 831654 864213 747468 787074
6589 787074 991040 997700 910781 800749 929701 999356 909707 874206 877735 715860 694413
6578 694413 797072 839811 908770 813874 733007 781849 715274 768807 901449 836297 850993
6567 850993 890813 841645 811336 863569 854017 841705 873593 885555 822700 914834 983868 867408
6555 867408 921956 916711 1045536 1079272 1039322 1134856 1164463 1197635 1134592 1065697 1080008 1085970
6543 1085970 1051850 1113554 1134795 1090652 1076886 1041163 1101351 1095255 1016827 980827 984504 1092898
6531 1092898 1097957 1077523 1069264 1199558 1159856 1095284 1130276 1059657 1067624 1062145 1091493 1130922
6519 1130922 1121796 1111057 1190713 1243826 1116468 1101023 1011046 1064407 983593 892886 1005046
6508 1005046 1074740 1080390 1123364 1098174 1116022 1188709 1100983 983017 985168 953965 1047933 908400
6496 908400 821644 840241 827825 817708 865083 903694 872323 930989 860970 899626 997548 932790
6484 932790 975113 939196 895056 907227 912354 908679 848035 933471 949876 989825 1111030 1065370
6472 1065370 1102653 977365 935728 941565 1041420 1181080 1158950 1203530 1200865 1265769 1307020
6461 1307020 1255038 1134789 1013030 968847 1034204 1041006 1098698 1032270 1039467 1040387 1189301 1202456
6449 1202456 1275422 1345529 1331423 1309469 1292263 1376438 1273239 1438748 1506695 1493290 1573293
6438 1573293 1566473 1530114 1548729 1598517 1553408 1515413 1611659 1621539 1443698 1503901 1578782 1592397
6426 1592397 1601724 1718621 1728134 1757953 1768786 1850865 1881514 1938472 1933229 1879210 1905262 1959329
6414 1959329 1990427 1855896 1869502 1909163 1959232 1913148 1901278 1940726 1867370 1968579 2000543
6403 2000543 2014013 1950536 2113559 2100753 2178669 2271930 2314051 2522236 2670218 2643678 2454829
6392 2454829 2568704 2483790 2343109 2341055 2294291 2288197 2240817 2229210 2177776 2171729 2141952 2210650
6380 2210650 2205518 2123447 2190517 2255542 2390780 2470402 2474462 2504653 2473106 2601990 2736203
6369 2736203 2763055 2832993 2858039 2967043 2895174 2784214 2756019 2724757 2662146 2558099 2627729
6358 2627729 2672376 2642070 2755466 2717643 2793009 2830569 2928516 3078687 3109334 3197644 3277179
6347 3277179 3320988 3351362 3443885 3597395 3804903 3953384 3802032 3805463 3780588 3713357 3689924
6336 3689924 3613544 3638200 3790560 3784200 3835914 3809447 3777920 3808985 3891268 3880105 4113609
6325 4113609 4234434 4402892 4621411 4723871 4845668 4999056 4985229 4984506 5017172 4905957
6315 4905957 4813549 4771805 4783353 4746202 4793805 4769133 4782634 4794173 4840430 4796874 4941892
6304 4941892 5083130 5173856 5316352 5471209 5544697 5582214 5715230 5799210 5990972 6094116
6294 6094116 6137448 6219824 6282099 6365649 6365284 6438647 6581751 6707745 6798048 6972219 7135741
6283 7135741 7313648 7519951 7534430 7657175 7729124 7851202 7982280 7889998 7957944 7978294
6273 7978294 8014627 8160491 8375800 8491451 8643418 8773825 8914837 9060454 9259824 9546006
6263 9546006 9856140 10166434 10534266 10913158 11111565 11303127 11475999 11609437 11657619 11838566
6253 11838566 12046770 12155212 12442166 12663703 12960726 13239353 13499644 13799518 14087552
6244 14087552 14299560 14565585 14829511 15294204 15745304 16009360 16374233 16932399 17382401
6235 17382401 17852994 18264446 18755377 19306294 19919002 20696872 21399813 22100730 22794855
6226 22794855 23381713 24124421 24982146 25891628 26972518 28190583 29629398 31109664 32869836
6217 32869836 35002450 37621700 41026302 45562445 51100939 57882153 65178770 71653762
6209 71653762 74177306 71089478 65344316 59691154 55564660 53243083 52555366 53235512
6201 53235512 55125150 58335597 62776531 68032700 72682656 74675498 74162658 73650695
6193 73650695 74729353 78042318 82921964 87196584 88518304 85615647 79877951 74255939
6185 74255939 70530354 69384746 70181942 72197262 73998335 73367126 70034350 66116491
6177 66116491 63123534 61667758 61764306 63383334 66424493 71375091 77996948 85021493
6169 85021493 90395356 90374176 84581893 76667410 69463739 64231562 60990631 59351173
6161 59351173 58966821 59515603 61289673 63886827 67017690 69483385 70267255 69157274 66195405
6152 66195405 62130988 58142702 54573983 51773444 49534902 48016742 46983314 46388798
6144 46388798 46168645 46372972 47086322 48256390 49906950 52031292 54624481 57318442 60276612
6135 60276612 63759537 68345878 74303075 81776628 90356596 98812351 104979638 106817615
6127 106817615 103119248 94676545 84304103 74716841 66902729 61047249 56666655 53201169
6119 53201169 50501453 48168366 46098149 44448490 43390552 42849725 42701643 42790937 43228283
6110 43228283 43850848 44951760 46738599 49347615 52718532 56698433 60840141 63937118
6102 63937118 64994788 63195052 59040990 53594087 48127496 43301106 39300642 36172679
6094 36172679 33679622 31689876 29945857 28299658 27041515 25905690 24968474 24426006
6086 24426006 24065998 23883856 23806927 23794902 23386699 22517598 21629367 20586662 19541905
6077 19541905 18703221 17900637 17163755 16532231 16075545 15711798 15352025 15028780 14843794
6068 14843794 14798048 14770304 14858516 15052169 15443695 15893759 16602807 17418466 18459767 19741373
6058 19741373 21184777 22470702 23464928 23605859 22640529 21018436 18976563 17102027 15562970
6049 15562970 14374129 13438829 12781024 12216540 11723016 11263267 10759093 10612750 10564243
6040 10564243 10479617 10323449 10396115 10564844 10725996 11188457 11703405 12302898 12842750 13430004
6030 13430004 14009535 14269696 13964285 13139537 12215312 11233293 10168360 9246811 8551079
6021 8551079 7965460 7454147 7140237 6856891 6556220 6330775 6135470 5867312 5703045 5607673
6011 5607673 5457188 5383339 5266825 5112068 4951707 4825783 4641502 4530322 4541536 4430511
6001 4430511 4403992 4300682 4179799 4018344 4075248 4005560 3796728 3796428 3875906 3900722 3971020
5990 3971020 3959260 3913151 3794325 3652206 3589220 3730552 3705347 3489635 3427408 3447473 3361933
5979 3361933 3232561 3154274 3072198 3102749 3070509 3015722 3019763 2981531 3012328 3075412 3159946
5968 3159946 3166297 3119820 3120182 3067633 3111297 3092667 3019533 3062561 3085193 3033868 2959606 2935021
5956 2935021 2939597 2933701 2867044 2830449 2891428 3049579 3103118 3104977 3103484 3109369 3089103 3014741
5944 3014741 3029135 3007127 2982906 3052217 3017659 3072413 3098327 3076017 2969682 2907464 2851284
5933 2851284 2860770 2910698 2838157 2907789 2858494 2830140 2857627 2980579 2989116 2797202 2785613
5922 2785613 2863089 2710529 2762881 2852056 2994103 2984799 2906793 2948070 2970040 2944929 2882506
5911 2882506 2903081 2965056 3059271 3056494 3070885 3136475 3236269 3266222 3188335 3080099 3089944 3119548
5899 3119548 3010163 3035769 3197858 3097280 3050691 3137576 3291324 3248640 3265338 3309021 3332279
5888 3332279 3441591 3448981 3555188 3473359 3437938 3455102 3521900 3561107 3682573 3678208 3710650
5877 3710650 3714055 3702480 3852019 4029624 3943109 3963402 4077115 4175954 4257752 4422659 4494453
5866 4494453 4506435 4649133 4691532 4675124 4780534 4776522 4714485 4672301 4684931 4743763 4802712
5855 4802712 4778761 4796093 4950501 5017473 5093724 5247600 5318711 5256447 5329404 5457627 5469277
5844 5469277 5506555 5632680 5602475 5673298 5828998 5972826 6262485 6320692 6311409 6322705 6344558
5833 6344558 6312999 6141001 6124269 6190182 6185553 6210186 6305436 6331383 6418790 6448374 6594151
5822 6594151 6676906 6632561 6635630 6573350 6650510 6919736 7149586 7250892 7338573 7472963 7598463
5811 7598463 7895336 7961193 7941777 7884849 7883551 7834299 7815908 8043909 8097321 8175183 8238894
5800 8238894 8304428 8621139 8729463 8804721 8959834 9157979 9373469 9571334 9764268 9954580
5790 9954580 10171628 10370851 10481637 10600766 10754459 10797480 10861510 11066395 11275345 11408150
5780 11408150 11500922 11587943 11813011 11988129 12080933 12308006 12576756 12736333 13142183 13586097
5770 13586097 13827771 14200492 14578935 15002065 15288558 15567808 15954636 16280946 16532690
5761 16532690 16806438 17095895 17306662 17435615 17908832 18357119 18845187 19342951 19956337
5752 19956337 20475934 20862003 21098232 21186470 21465711 21713299 22166442 22528335 23024680 23669538
5742 23669538 24352248 25178307 26026091 26872611 27807206 28945184 30094539 31408097 32916239
5733 32916239 34634142 36726233 39450839 42802418 46700499 51358510 56683666 62457337
5725 62457337 67941020 72189965 73891407 72449468 68371537 63065877 57931965 53622602
5717 53622602 50392628 48148939 46774156 45985506 45661608 45955634 46544510 47373832 48308879
5708 48308879 49651852 51347127 53486207 56251680 59874634 64776329 70902630 78852941
5700 78852941 88506575 98873676 108476853 113460681 111326658 103443970 92769524 81974146
5692 81974146 72674813 65242183 59537330 55311464 52138180 49835358 48356673 47543425
5684 47543425 47160246 47050303 47039790 47160939 47348435 47561387 48052792 48940358 50397302
5675 50397302 52683777 55698005 59054836 62420953 64871266 65325530 63465645 59723511
5667 59723511 55201400 50877864 47165579 44311732 42265598 40753780 39608067 38604638
5659 38604638 37990162 37612425 37456103 37533026 37546354 37644123 37692836 37777859 37822631 37912069 38110586
5648 38110586 38284302 38495558 38923290 39465170 40126174 41011877 42000322 43303018 44716075
5639 44716075 46299759 48016029 50047481 52455753 55224474 58427093 62198220 66555917
5631 66555917 71662255 77571666 84405231 91840973 98392209 100662220 96714044 89675811
5623 89675811 82905368 77904683 75086493 74236955 74978913 77052317 80624280 85226156
5615 85226156 89987990 92760839 92658945 91750713 91967658 94665184 100164729 107770427 116175822
5606 116175822 122430862 123490808 119239714 112416076 106440105 102870597 101894372 102520074
5598 102520074 102573595 100207540 96886582 94238032 92834452 92500258 92969289 94474594 97716611
5589 97716611 102841540 109797252 117635098 124068989 125348665 120743740 113991204 107799722
5581 107799722 103689182 101755841 101262836 101241210 100838344 100377409 100177462 99622548 98160032
5572 98160032 96622037 95949235 96886113 99630478 103330861 107341361 110398704 111985874
5564 111985874 112974331 113692670 114658720 116539812 118766631 120223214 119258454 117090469 115746574
5555 115746574 116767545 120585222 126147457 131306949 133999523 134128318 131923374 126674086
5547 126674086 118355558 109030116 100467154 93795813 89004931 85790292 84070388 83276381
5539 83276381 83315912 84044500 85620947 88307147 92299278 97852010 105089016 113180980 120681966
5530 120681966 125559474 126984607 125865763 122804792 117244609 110511032 104525267 100567714
5522 100567714 98941280 98378421 97120241 93377654 87874257 82467894 78287722 75919295
5514 75919295 74791018 74352311 73520420 71692726 69401949 67608990 66933718 67401836 68718109
5505 68718109 69383315 68132047 65250632 62010880 58977992 56143727 53343661 50680166
5497 50680166 48717031 47355210 46426561 45380632 43643683 41472597 39218670 37301408
5489 37301408 36047700 35395702 34866373 34032341 32566594 30547425 28372171 26298003 24499503
5480 24499503 23043814 22037143 21164606 20324783 19476819 18708968 17999680 17483213 17057387
5471 17057387 16704593 16388993 16078828 15904546 15720818 15475365 15277282 15170482 14890754
5462 14890754 14716950 14569817 14344213 14332473 14239666 14100023 14056014 13999584 13986565 13908777
5452 13908777 13803838 13679644 13671832 13563640 13457920 13452743 13358778 13330182 13272148 13193972 13183838
5441 13183838 13175114 13304145 13341356 13435805 13640872 13938786 14320064 14887284 15509742 16157844
5431 16157844 16815114 17754002 18932446 20564241 22489228 24982050 28114749 32211013
5423 32211013 36647949 40820158 42911083 41225508 36795027 31391043 26606791 22937609
5415 22937609 20090224 17928540 16194996 14794124 13723926 12779618 12078722 11499068 10999301
5406 10999301 10639209 10389474 10107670 9942895 9581999 9332946 9136100 8922125 8881874 8706855
5396 8706855 8582051 8384363 8190874 8080420 7859321 7708957 7570247 7452627 7426937 7317270
5386 7317270 7269072 7454258 7518495 7302258 7303994 7255158 7201096 7215233 7204477 7317721 7239230
5375 7239230 7372209 7477043 7637163 7652985 7840314 8093746 8362648 8655634 8982423 9584015
5365 9584015 10294130 10970747 11330640 11435664 11090127 10553906 9882722 9238009 8736954 8339706
5355 8339706 8103280 7894902 7815631 7813441 7625894 7596553 7585032 7636921 7665389 7725215 7864325
5344 7864325 8038860 8294079 8626611 8952373 9507596 10204743 10930685 11877212 12988268
5335 12988268 14378092 15770401 17508557 19474525 21131180 21591804 20673478 18664371
5327 18664371 16495272 14505093 12853087 11511026 10448845 9636571 8989418 8565930 8257042
5318 8257042 8062522 7872230 7708934 7645963 7619635 7736856 7844144 7825495 7967762 8293790
5308 8293790 8624529 8948517 9416829 10114204 11068083 12240132 13872869 15836426 18123597
5299 18123597 20209963 21170269 20613817 18916724 16607097 14297126 12481393 11068210
5291 11068210 10070601 9266837 8530212 7988296 7596174 7176098 6910518 6827080 6714059 6657242
5281 6657242 6559195 6453286 6315488 6273006 6301555 6360320 6489275 6504310 6621873 6904751
5271 6904751 7275694 7730434 8346501 9114722 9749420 10070561 10129023 9826758 9242396 8590793
5261 8590793 7954995 7400626 7113646 6895806 6852939 6752271 6646761 6533371 6418785 6197455
5251 6197455 6131732 6001721 5782224 5531931 5343587 5188229 5087926 4918670 4887474 4889309
5241 4889309 4745519 4670163 4735848 4679678 4715009 4781167 4792060 4812268 4792684 4729234 4800533
5230 4800533 4974346 5160558 5386907 5524953 5593751 5740019 5999202 6193416 6261107 6295013
5220 6295013 6299942 6225127 6108112 5985234 5856420 5619594 5560040 5433096 5381208 5316644 5178659
5209 5178659 5053066 4944846 4763568 4720542 4547953 4340701 4245086 4388421 4349847 4464709
5199 4464709 4455336 4608748 4716727 4796204 4953881 5000946 5060769 5157921 5263596 5258517 5438819
5188 5438819 5639605 5780273 5928862 6008006 5948998 5751023 5504435 5381719 5309346 5195722
5178 5195722 5060701 4938752 4843890 4792200 4863626 4795922 4733908 4625233 4458810 4361855 4455678
5167 4455678 4352232 4475824 4483167 4486196 4602872 4665647 4632835 4612306 4588781 4698202 4637998
5156 4637998 4736589 4948861 5005861 5097887 5196008 5170026 5179756 5222487 5235030 5164222 5097188
5145 5097188 5008100 5077455 5078487 5165601 5253464 5445695 5613858 5713297 5824360 6006580 6080563
5134 6080563 6239654 6397922 6588575 6805078 7124954 7438802 7558455 7604055 7560098 7593517
5124 7593517 7615487 7702336 7817700 7810300 7964183 8212082 8345977 8549552 8585510 8614945 8752756
5113 8752756 9045084 9167436 9496082 9792858 9929424 9923332 10185974 10472038 11002577 11397178
5103 11397178 11690061 11842184 11665662 11345485 11209867 11169098 11082913 11057127 11166830 11268539
5093 11268539 11339264 11436783 11719839 11851020 12132975 12359500 12536473 12610566 12923535 13057642
5083 13057642 13348409 13650785 13953311 14182744 14510328 14806147 15206825 15435467 15909575
5074 15909575 16208652 16540991 16919976 17564547 17968444 18493039 19088409 19678449 20229363
5065 20229363 21050446 21892156 22839896 23744258 24818765 25865404 26718637 27264447 27789242
5056 27789242 28293754 29037328 29635220 30389521 30925418 31494538 32105741 32977657 33742333
5047 33742333 34886684 36120632 37624716 38739081 39949935 41208393 42584737 44041237
5039 44041237 45879091 48024592 51018585 54508875 58512683 62941830 68707487 75575538
5031 75575538 83888329 93624854 106294436 123073560 146595807 177748445 221572684
5024 221572684 272223867 325419824 355698468 320942975 260100421 200329494 154147559
5017 154147559 123856095 102722758 87746638 76652136 68103770 61204167 55528467
5010 55528467 51108115 47666704 44894054 42956916 41228693 39940973 38674727 37872991
5002 37872991 37125933 36291358 35072966 33685711 32075041 30506663 28956262 27624694
4994 27624694 26123760 24816552 23662872 22768884 21924042 21319664 20734133 20206301 19758086
4985 19758086 19655927 19323666 19144244 18686606 18256605 17984539 17709073 17519001 17523632 17520549
4975 17520549 17631549 17802131 18035432 18219514 18081695 17289235 16465063 15720208 15349315
4966 15349315 14922646 14626146 14423118 14387230 14287115 14314739 14325301 14481253 14601674 14566815
4956 14566815 14335710 14147276 13784977 13742200 13544800 13513605 13395127 13416752 13277121 13246640
4946 13246640 13229338 13172507 13230149 13362302 13408804 13630505 13715972 13777178 13842397 13973609 14031800
4935 14031800 14149583 14281216 14648448 14903683 15178109 15345616 15444248 15639442 15928554 16267553
4925 16267553 16531233 16661091 16780787 16910778 17159513 17438386 17899880 18513564 19427720
4916 19427720 20375305 21309202 21863406 22433898 23016750 23778874 24794549 26424097 28431149
4907 28431149 31420878 35339281 40941819 47362520 54272206 58137378 55234338 49207308
4899 49207308 41899554 35691490 31398088 28411704 26378542 25015360 24077589 23528009
4891 23528009 23231410 23110380 23027334 23501217 24046439 24701373 25628029 27095599 29074858
4882 29074858 31693052 34510159 36951857 36636492 33979092 30982234 28382520 26704130
4874 26704130 25678248 24965877 24543947 24472089 24318508 24262072 24425124 24599102 24762435 25051133
4864 25051133 25540248 26092702 26673650 27426711 28112091 28594077 29207832 29954910 30824987
4855 30824987 31794544 33013360 34306266 35581075 37031919 38533768 40078939 41710241
4847 41710241 43622270 45802642 47989764 50222092 52477274 54686114 56608930 58240544
4839 58240544 59512084 60569601 61335673 62097162 62664870 63074059 63412558 63642054 63910618
4830 63910618 64192547 64611589 65427124 66436576 67826560 69537521 71714627 74451387 77472984
4821 77472984 80490051 83788651 87228023 90685180 94050356 97429899 100696434 103435667
4813 103435667 105320209 106057282 105844614 104952009 103627656 102046480 100123890 98049330
4805 98049330 95885124 93677429 91721044 90425606 89744079 89753527 90271729 91193595 92586731
4796 92586731 94353461 96599959 99227623 102188925 105533673 108887090 111997440 114986334
4788 114986334 117921538 120549629 122306309 123021258 122444992 120583152 117908790 114984863
4780 114984863 112176738 109690654 107453408 105753493 104624259 103837001 103581044 103566338 104013560
4771 104013560 104530329 105147741 106087712 107315223 108738958 110571107 112416759 113928994
4763 113928994 115162265 115892327 116332158 116917771 117505410 117660269 117147735 115774812 113761776
4754 113761776 111612224 109487239 107411110 105548934 103687520 101675919 99910341 98487543
4746 98487543 97325380 96283770 95062205 93636170 91957744 90184315 88482916 86930886
4738 86930886 85450301 83981927 82361569 80731868 78872087 77104264 75230037 73082462
4730 73082462 70803289 68348878 65720645 63370409 60922514 58569736 56073102 53510408
4722 53510408 51047341 48645912 46187325 43943767 41730448 39666537 37534033 35484097
4714 35484097 33551758 31714806 30174567 28811182 27659921 26814572 26103368 25655624 25368832
4705 25368832 25172654 24965269 24589629 23508464 21923442 20281327 18920609 17648106 16737980
4696 16737980 16053354 15281406 14719141 14239523 13803550 13347611 12874061 12556849 12246410
4687 12246410 11953388 11684656 11381771 10927418 10604727 10512880 10175373 9941482 9731575 9439819
4677 9439819 9064018 8865494 8667849 8469623 8243982 8029136 7887298 7725680 7556794 7378481
4667 7378481 7249027 7107907 6935554 6938057 6757361 6585052 6507799 6466996 6202921 6026311
4657 6026311 6055145 5917136 5745405 5509477 5405639 5339467 5318834 5184394 5118836 5088331
4647 5088331 4981352 4990924 4963595 4824149 4656476 4577483 4541702 4575797 4547410 4433027 4364086
4636 4364086 4418743 4299316 4248833 4121127 4108111 4066333 4058987 3963370 3900411 3886229 3781635
4625 3781635 3745302 3734215 3766818 3656843 3656924 3626612 3540662 3629369 3627668 3581757 3587688 3479185
4613 3479185 3436931 3348611 3291687 3273467 3303807 3323718 3253748 3276491 3270101 3302250 3111974
4602 3111974 3140997 3198772 3283711 3189423 3172677 3175953 3169556 3148660 3083180 3140711 3168626 3119875
4590 3119875 3115646 3196216 3222354 3031489 2986507 2967376 2992818 2935088 2870540 2833159 2891040
4579 2891040 2842208 2744090 2742874 2818113 2895850 2892110 2829040 2845213 2926599 2810691 2833232 2890717
4567 2890717 2757211 2767660 2815485 2746279 2736338 2698757 2637467 2652843 2623894 2584412 2583531 2566180
4555 2566180 2675830 2659942 2605589 2533386 2621699 2648025 2748208 2560317 2587509 2701546 2691781
4544 2691781 2558712 2564396 2551394 2478293 2565998 2575278 2621591 2672504 2679639 2606608 2535532 2518342
4532 2518342 2479468 2577652 2699264 2807805 2848980 2809419 2788738 2831913 2761250 2751142 2727601
4521 2727601 2601927 2578263 2722782 2781775 2639528 2700519 2782629 2692737 2649520 2689748 2767942
4510 2767942 2750101 2726123 2714606 2647853 2568418 2642857 2839790 2912276 2853302 2924448 2896849
4499 2896849 2962564 3007545 3074064 3051884 3073006 3067231 2973921 2936838 2967991 2878052 2898147 2963790
4487 2963790 2959979 2927868 2796239 2811841 2797498 2902890 2871569 3019413 3096511 3144805 3106466
4476 3106466 3096956 3104883 3216340 3239463 3199467 3307456 3406051 3409670 3418428 3588098 3645369 3702338
4464 3702338 3857637 3874424 3721166 3800850 3845948 3713864 3624494 3677831 3709723 3589100 3591235
4453 3591235 3641490 3665781 3664143 3668204 3734348 3739859 3614061 3558310 3634552 3641784 3658131 3697878
4441 3697878 3654794 3742924 3768030 3711973 3705957 3780607 3886604 3901372 3878307 3952222 3899130
4430 3899130 4033602 4079326 4039434 4066576 3972293 3964383 3943902 4000046 4031261 4086485 4049028
4419 4049028 4086119 4045528 4106325 4087772 4067261 4104257 4202193 4258876 4278935 4340390 4226338
4408 4226338 4177852 4165977 4305704 4403829 4497272 4516437 4606561 4744420 4793057 4752311 4692002
4397 4692002 4658206 4599356 4631514 4676804 4667716 4661602 4618050 4700364 4784254 4756227 4795479 4744027
4385 4744027 4726793 4736811 4704732 4739236 4789258 4758579 4775057 4867269 4932278 4885995 4892748 4904024
4373 4904024 4955982 5014971 5023268 4999524 4963266 5061715 5088829 5080578 5055075 5135008 5288596 5274691
4361 5274691 5247852 5336323 5394494 5498749 5421656 5454055 5357055 5355671 5306328 5326366 5330803 5236674
4349 5236674 5302270 5248602 5158340 5122179 5166058 5236771 5189813 5100327 5113279 5139141 5100152
4338 5100152 5168790 5201704 5179155 5246598 5270647 5300035 5202958 5203564 5171037 5082970 5056479 4962602
4326 4962602 4930917 4894705 4829128 4823413 4853623 4815834 4862550 4927055 4827495 4786908 4910154
4315 4910154 4827831 4787295 4878544 4849429 4912681 5014714 4969977 4775249 4780119 4800551 4859291
4304 4859291 4863253 4938460 4910637 4919547 4905290 4829692 4909261 4879385 4992235 5030951 4992511 5064756
4292 5064756 4997589 5016018 4973079 5006294 5063750 5074399 5151216 5217980 5173089 5141126 5181993
4281 5181993 5229775 5237328 5190321 5184246 5207156 5067226 5076443 5328100 5373769 5269907 5350252
4270 5350252 5398156 5454108 5418689 5430658 5625025 5743109 5644966 5719805 5843916 5734741 5852449
4259 5852449 5988812 6090005 6118944 6253217 6378130 6355458 6404353 6464379 6550971 6680124
4249 6680124 6654266 6675018 6695486 6736022 6904163 6937213 7069089 7070966 7007353 7113756 7218637
4238 7218637 7285113 7333308 7450128 7607554 7643267 7749120 7926735 7945514 8081324 8282834
4228 8282834 8359177 8381317 8583785 8790732 9022352 9082243 9177748 9329401 9368021 9353720 9519640
4217 9519640 9678958 9669114 9648234 9794655 9860382 9968294 10126579 10169909 10234249 10314264 10448574
4206 10448574 10453161 10667967 10841582 10891487 10966801 11173969 11364520 11607422 11809979 11967516
4196 11967516 12093955 12253410 12312153 12465695 12626502 12871260 13056510 13213039 13425908 13550303
4186 13550303 13791065 13956888 14084089 14222803 14364354 14507063 14720598 14888788 15119481
4177 15119481 15455072 15757548 16117299 16462393 16820813 17254977 17543685 17883608 18179356
4168 18179356 18613320 18933332 19313215 19676656 20051175 20560383 21093521 21616017 22149111
4159 22149111 22682182 23222727 23837937 24400789 25019722 25673714 26157623 26620784 26980538
4150 26980538 27338511 27828332 28246015 28657714 29229767 29839086 30600308 31437481 32433429
4141 32433429 33463829 34528956 35751171 36621289 37512938 38402516 39179286 40011330 40746162
4132 40746162 41586631 42569402 43439051 44394130 45227918 45995675 46781859 47574988 48416503
4123 48416503 49281027 50008902 50669117 51308529 51896126 52664246 53596591 54975735 56821367
4114 56821367 58814159 60961135 63190806 65021641 66264918 67001547 67164175 67289841 67288288
4105 67288288 67481496 68041195 68555919 69114716 69674181 70289300 70901450 71745070 72763494
4096 72763494 73778520 74645969 75335952 75721434 75978280 76437265 77192659 78264678 79785655
4087 79785655 81766931 84307230 87175872 90064309 92448750 94379876 95821020 96883497
4079 96883497 97964318 99019605 100074591 101283579 102241955 103032824 103852781 104706329 105676188
4070 105676188 106238348 106787404 107338705 107991812 108877928 110096315 111503146 113212687 114879255
4061 114879255 116084063 117092777 117865608 118361717 118592531 118193386 117679669 117082883 116565030
4052 116565030 116495354 116735355 117097668 117267971 117502986 117845629 117952397 117659492 116988765
4043 116988765 115807378 114694481 113731767 112956627 112202018 111399432 110535964 109488893 108613760
4034 108613760 107644848 106110243 103646275 100317278 96564462 92857345 89587216 87022648
4026 87022648 85034444 83611865 82640687 82068713 81607940 80990592 80109143 79152174 77975098
4017 77975098 76737946 75339452 73864199 72267619 70897105 69621139 68252623 66921837
4009 66921837 65646955 64847797 64243345 63871906 63427577 62686803 61253862 59227311 57014586
4000 57014586 54694017 52686322 50976437 49671103 48588814 47773551 47151233 46329422 45519925
3991 45519925 44544052 43334464 42210324 41329707 40386956 39437527 38604693 37844505 36986930
3982 36986930 36005666 35272553 34550105 33669143 32914651 32080197 31051700 29826194 28755603
3973 28755603 27663646 26727130 25918025 25243131 24707968 24213761 23641658 23151507 22643376
3964 22643376 22122913 21635889 21230936 20783347 20183966 19643590 19003652 18363471 17679219
3955 17679219 17087650 16457053 16007988 15651558 15312299 15059823 14617195 14294627 13933314
3946 13933314 13576892 13307229 13134308 12844731 12612869 12422782 12145840 12010551 11855717
3937 11855717 11618140 11543650 11534176 11368886 11343390 11274659 11171901 11046522 10954604 10803457
3927 10803457 10762392 10649638 10529252 10441247 10348308 10344367 10242666 10115553 9926105 9765489
3917 9765489 9568034 9365249 9187876 9111522 9002344 8917121 8931426 8895543 8852144 8768761 8741054
3906 8741054 8643100 8585461 8571413 8589601 8515082 8415100 8370708 8400135 8442893 8487398 8411634
3895 8411634 8308274 8344862 8331996 8383814 8376544 8363139 8328343 8324722 8327292 8314420 8283370 8212215
3883 8212215 8107309 8164168 8168567 8157753 8005422 7849160 7694202 7678912 7726959 7600013 7558157
3872 7558157 7522280 7450214 7459166 7536075 7506306 7507026 7421526 7401555 7470632 7605853 7548044 7462035
3860 7462035 7446890 7300724 7121732 7053102 6961465 6994932 6934727 6891680 6926192 6950729 6887798
3849 6887798 6797599 6775214 6857686 6863504 6786981 6808916 6660055 6620115 6576042 6509473 6501066 6525010
3837 6525010 6525997 6607507 6539941 6474118 6495856 6419419 6349007 6277928 6217839 6188455 6275775 6269712
3825 6269712 6245427 6164933 6103008 6098756 6241621 6361260 6329235 6327049 6400241 6464134 6367416
3814 6367416 6366014 6299452 6138419 6213487 6351468 6304352 6297153 6402864 6501089 6582823 6591616
3803 6591616 6618813 6700284 6543976 6490932 6436254 6366134 6351833 6221594 6081471 6054332 6129147
3792 6129147 6036210 6080771 6134680 6169626 6170663 6208655 6223215 6247246 6316328 6263881 6245246 6312635
3780 6312635 6334347 6371696 6317787 6274600 6193046 6152450 6164391 6053545 5968231 5905338 5924422
3769 5924422 5965546 5906295 6010455 6061302 5975282 5943303 5846053 5861846 5908655 5851099 5829755
3758 5829755 5806112 5764750 5741640 5760914 5882374 5943496 5977643 5914591 5980083 5870162 5906149
3747 5906149 5834995 5903403 5996352 5952317 5874218 5736213 5669260 5596942 5606076 5684933 5634523
3736 5634523 5558781 5565723 5565862 5502494 5494887 5440763 5336374 5421673 5405654 5317752 5297852 5187411
3724 5187411 5105109 5203638 5202789 5173736 5124025 5119792 5098631 5184914 5252106 5255673 5238524 5139598
3712 5139598 5154118 5202885 5224589 5204451 5123090 5077160 5037961 4945469 4844605 4896488 4932743
3701 4932743 4964865 4977711 4903659 4950496 4970333 4934972 4913160 4899136 4758512 4719915 4798358
3690 4798358 4831098 4907926 4897041 4871288 4819132 4745685 4716531 4718308 4775314 4895166 4822369
3679 4822369 4735077 4756646 4940618 4953213 4919881 4933736 4896371 4834865 4872723 4909990 4937021
3668 4937021 4884068 4866985 4978149 5153048 5159733 5168869 5201427 5094793 5096979 5183244 5236548
3657 5236548 5270764 5226056 5189974 5195965 5194874 5233443 5246383 5323563 5367968 5349571 5417570 5469099
3645 5469099 5440330 5424576 5502176 5497848 5587366 5591688 5642155 5686722 5748426 5789387 5767132 5805127
3633 5805127 5915313 6044813 6140970 6402770 6376435 6326364 6393114 6432255 6356685 6359941 6452078
3622 6452078 6597856 6765793 6854639 6913573 6846159 6790669 6906616 6822225 6857225 6856184 6948240
3611 6948240 6919845 6848981 6894189 7004507 6991536 7120218 7210853 7299598 7334866 7314996 7441068
3600 7441068 7570488 7701755 7804385 7896261 7904079 8031067 8182292 8294545 8366516 8444453
3590 8444453 8633322 8805469 8891925 9017006 9193273 9305608 9366625 9443159 9512296 9539919
3580 9539919 9502219 9500436 9523319 9539102 9613265 9718296 9842158 9854166 10014278 10079079 10209173
3569 10209173 10368733 10532981 10711305 10811038 10936040 11069488 11243825 11363563 11462451 11719701
3559 11719701 11991935 12208068 12418854 12611609 12876070 13061136 13374270 13601471 13921682
3550 13921682 14083575 14252159 14391675 14522908 14724612 14975536 15150602 15338445 15582494
3541 15582494 15798570 15958509 16268510 16528466 16724915 17027309 17272057 17492069 17776280
3532 17776280 18080251 18384086 18696464 19052960 19403498 19744795 20207941 20585489 20983909
3523 20983909 21514130 22104237 22793895 23333954 24064955 24649301 25048580 25526153 26042242
3514 26042242 26554983 27131687 27866511 28589750 29545914 30575923 31663098 32923209 34429307
3505 34429307 35957257 37542179 39262756 41007857 43020918 45005574 46884706 48560060
3497 48560060 49914923 50835931 51237204 50792760 49785394 48367098 46647166 44719810 42885816
3488 42885816 41137390 39771874 38688234 37483819 36494446 35704511 35360341 35671672 36396620
3479 36396620 37761645 39574769 41192494 41967355 41201998 39391377 36942650 34600611
3471 34600611 32599392 30790348 29175398 27711404 26618391 25774399 24937162 24230813 23696294
3462 23696294 23285744 23054526 22768377 22573576 22461888 22531953 22881285 23192800 23735900 24349872
3452 24349872 25094360 25949516 27039369 28773080 31383557 34872579 39107090 43591439
3444 43591439 47020468 46748753 43901342 39834910 35357642 30981349 27126408 24103559
3436 24103559 21745019 20019219 18761816 17814304 17031961 16321325 15767642 15337906 15092141
3427 15092141 14764381 14560809 14327950 14263813 14438674 14490144 14691451 15009933 15314767 15654366
3417 15654366 16310461 17224867 18703303 20494183 22490237 24145405 24456817 23259097 21400135
3408 21400135 19026879 16835427 14988105 13489489 12433037 11674941 10977719 10449570 10144428
3399 10144428 9767591 9391954 9014824 8855650 8617361 8435336 8129099 7887591 7889959 7719808
3389 7719808 7592496 7447689 7344157 7074845 6999592 6935376 6711720 6610613 6590214 6538965
3379 6538965 6428396 6300046 6215890 6056621 6095922 5993884 5921393 5896715 5823099 5721015
3369 5721015 5701914 5702716 5586055 5502622 5396462 5356500 5381913 5388701 5292964 5209877 5117383 5117217
3357 5117217 5166673 5064729 5039082 4954875 4876621 4879811 4944801 4855694 4818860 4830782 4863518
3346 4863518 4881406 4769535 4774891 4661845 4612877 4672027 4651155 4654893 4643061 4580057 4508034
3335 4508034 4569581 4601685 4465926 4387144 4391181 4356686 4348749 4376517 4385163 4349816 4286873 4202164
3323 4202164 4215414 4280351 4248330 4184372 4099683 4056722 4078116 4120329 4147457 4135872 4092380
3312 4092380 4088457 4098918 4097348 4109229 4098257 4043967 4045184 4020993 4065425 4051219 3983810 3934326
3300 3934326 4006784 3941186 3937063 3880542 3825029 3842249 3894374 3943191 3946631 3859674 3794347 3828473
3288 3828473 3782679 3727571 3724805 3670573 3683039 3798905 3770734 3782482 3814626 3842180 3941179
3277 3941179 4024334 3947219 3923381 4042653 4069877 4026105 3957938 3925696 3930653 4150174 4118988
3266 4118988 4227900 4286309 4270964 4322574 4388062 4430307 4410701 4527566 4523418 4640903 4761150
3255 4761150 4843091 4865987 5018005 5072845 5050123 5148989 5209996 5314917 5440458 5510226 5618024
3244 5618024 5837440 5958471 6164652 6448410 6664313 6896432 7118517 7351190 7381939 7347402
3234 7347402 7239007 7180888 7095329 7044761 7058356 7219757 7534937 7745994 8061674 8231233
3224 8231233 8329656 8263827 8082719 7891005 7676071 7636057 7409430 7538183 7705384 7700687
3214 7700687 7878148 8114356 8227811 8185487 8284335 8642133 9186560 9625035 10233256 10695588
3204 10695588 10896321 11021162 10844405 10469917 10164021 9965286 9974288 10061052 10264516 10710155
3194 10710155 11196598 11653016 11935802 11931287 11762113 11510971 11250987 11106692 11055336 11094616
3184 11094616 11290863 11352241 11462992 11480359 11452148 11471891 11531138 11712905 11811049 12041530
3174 12041530 12290680 12475620 12603316 12696853 12789244 12962971 13155554 13252223 13347741 13546093
3164 13546093 13818263 14291211 14787065 15323958 15904276 16528558 17097416 17555308 17798805
3155 17798805 17867313 17792474 17447657 16804523 16058495 15371132 14743245 14315831 14031827 13714932
3145 13714932 13629350 13560436 13553964 13665239 13729889 13864527 14072402 14351876 14610919 14776346
3135 14776346 15015905 15271138 15573897 15762000 15981159 16144425 16214715 16106873 16016284 15651434
3125 15651434 15242660 14894149 14466555 13945547 13450565 12945143 12389157 12048376 11696068
3116 11696068 11345783 10980521 10929612 10938724 10786291 10747158 10763110 10691169 10647167 10569870 10573090
3105 10573090 10455339 10279860 10095544 9835494 9514181 9260165 8832426 8401967 7932600
3096 7932600 7661107 7353443 7040998 6761147 6469930 6364059 6261359 5900942 5625643 5469996
3086 5469996 5357446 5256377 5105835 4987193 4951991 4874738 4783649 4705629 4500313 4531883
3076 4531883 4477358 4274667 4171256 4093098 3962898 3864652 3813622 3640795 3593934 3454686
3066 3454686 3348434 3298527 3191505 3181993 3135579 3010179 2975888 2932652 2865943 2805997 2753391
3055 2753391 2659933 2472983 2405966 2371612 2306198 2340544 2345540 2259069 2276263 2229647 2168157
3044 2168157 2201393 2157449 2055844 2021534 2017773 1922121 1879705 1973079 1820477 1806456 1834331
3033 1834331 1829727 1821748 1720101 1613958 1551549 1605606 1544126 1501938 1419781 1516157 1457457
3022 1457457 1402717 1439127 1326773 1324469 1294894 1283173 1247622 1233614 1099976 1061635 1028782
3011 1028782 999734 1020462 1035259 1019168 1014140 1022393 990624 994775 1010351 1039396 959918 945618
2999 945618 903876 845993 877532 852848 780945 833051 902499 833497 680641 689541 728036 765043
2987 765043 722650 648310 657954 635246 708802 660148 573590 545256 583898 525341 505792 601192
2975 601192 501002 487976 489891 491633 521233 476322 631519 546983 458759 539898 517262 470452
2963 470452 392357 426522 434385 416360 431480 375866 432301 445999 461760 415684 417234 476679
2951 476679 510095 481186 424143 368016 372266 315967 279920 323078 393918 367326 345176 383488
2939 383488 412983 470857 539897 337406 222841 222471 215503 237551 310425 295595 236967 220364
2927 220364 236008 243182 240590 289834 289196 270947 215280 286816 301166 230576 256256 224227
2915 224227 195095 243784 281992 331385 297346 328327 259291 185946 156640 153973 83843 84370
2903 84370 134182 104535 146467 167472 139924 197607 161437 95142 100409 156672 101118 100812
2891 100812 237096 178059 206082 251690 164379 92911 85044 214186 211126 253976 161428 95421
2879 95421 189666 141696 88407 81445 112722 137364 130517 207842 128871 181259 284686 323989
2867 323989 160310 130073 181178 139816 82670 36644 64725 78574 234643 277690 211818
2856 211818 174728 97770 101760 95381 164993 100261 44645 59353 115097 104770 107583 138516
2844 138516 166899 122155 79307 74727 32191 88752 76399 102745 166121 58185 20629 81627
2832 81627 75327 129869 132294 34931 -11323 45393 29970 -85649 -4602 -1129 -23728 -58388
2820 -58388 -28258 -52769 -78421 17261 14099 7889 -85720 44090 42610 -65443 -97261 -5134
2808 -5134 24818 24164 59296 6416 -101845 -74630 -26070 49929 21923 34598 10455 52025
2796 52025 8018 14388 -50331 -35031 92700 41662 -28268 -22970 -132947 -51062 -25979 -135938
2784 -135938 -116431 -51167 82496 52939 -24557 -67191 -174097 -98648 -111374 -128645 -82164
2773 -82164 -123859 -176653 -78414 -89593 -65028 -96701 -86105 -25644 -65990 1959 -54432 -86556
2761 -86556 -54310 -20726 -99211 -113309 -154289 -205803 -241108 -178727 -69026 61048 53406 -3812
2749 -3812 -6687 -28298 -117682 -53851 51531 -42214 -92687 -68330 -63406 -66686 -60528 -118539 -169428
2736 -169428 -110178 -110899 -133430 -148813 -175954 -132608 -110319 -128632 -151399 -106203 -128971 -188820
2724 -188820 -150846 -58855 -129236 -88269 -49803 -160118 -170741 -154645 -153794 -110153 -115401 -167393
2712 -167393 -56679 -51073 -42166 -73930 -42335 -83910 35266 -20237 -109668 -81194 -77354 -51098
2700 -51098 -52739 -42742 -22440 -162644 -198747 -178671 -207233 -106002 -25547 -45677 -124039 -186710
2688 -186710 -95985 -52373 -100021 -79006 -114715 -59339 -75877 -150276 -161394 -180110 -188863 -152092
2676 -152092 -110881 -77819 -37259 -120115 -263510 -250668 -259738 -152141 -125442 -113203 -54345
2665 -54345 -163653 -135320 -90616 -77825 -30479 -176541 -229281 -72628 -82732 -156562 -114728
2654 -114728 -192673 -277131 -207248 -235660 -198525 -163911 -82680 -52128 -54788 -41825 -117183 -128404
2642 -128404 -125576 -52690 -89564 -102334 -91585 -59640 -36776 -103434 -23871 34301 -55746 -36115
2630 -36115 -70552 -39938 6031 -16983 -49790 -128537 -109298 -71514 -55435 -100542 -157217 -214010
2618 -214010 -186857 18242 -2847 -97816 -30797 -65496 -80779 -119673 -140292 -169401 -142226
2607 -142226 -53758 -121390 -235031 -150580 -161395 -185190 -177302 -70021 -35049 -139341 -82134
2596 -82134 -118146 -128266 -135905 -121090 -63328 -107507 -49400 -116005 -160933 -59655 -55752 -23724
2584 -23724 -83380 -30206 -96772 -135711 -180010 -177758 -201391 -114434 -36202 -67090 -135653 -206871
2572 -206871 -155872 -68203 26611 -28564 44853 -46032 -79747 -32169 -43425 -128017 -149068 -134624
2560 -134624 -79660 90649 -158100 -144742 -107209 -91405 -35594 -47356 13807 -10080 -18700
2549 -18700 -63856 37593 -58969 -52352 -69305 -93035 -53711 -11810 15647 -108363 -128273 -66478
2537 -66478 -60804 -101621 -116643 -159881 -115666 -105448 -127456 -89210 -57417 -66255 -27530 -90260
2525 -90260 -78653 -17504 -116657 -154979 -52605 -140621 -112846 -72250 -89219 26063 101258
2514 101258 89244 52069 65157 7936 55870 87430 49438 -39411 11652 99816 65442 113124
2502 113124 68286 14908 93393 11181 54689 118945 68351 153275 200674 114358 66704 29107
2490 29107 20709 76638 145256 40132 29322 4202 56522 130076 48531 58731 97236 106265
2478 106265 53871 75940 138185 202389 108968 34482 58259 25846 -40 185680 166209
2467 166209 157974 147041 195919 248896 187140 95970 168423 260645 348400 292585 278920 340428
2455 340428 360406 311956 338383 426597 427735 365100 343671 430817 540976 602511 554069 492598
2443 492598 426899 456947 520930 458097 433657 561689 625450 603315 613402 566735 562894 648762
2431 648762 528516 574273 630502 679534 713443 724544 751463 843303 819562 805182 819344
2420 819344 907877 780877 856841 929050 912001 944354 1057666 1099424 1147914 1217970 1284480
2409 1284480 1352017 1255680 1284001 1367022 1295497 1361914 1494742 1497349 1545727 1725962 1752900
2398 1752900 1921096 1949335 1997585 2015351 2130064 2193769 2275611 2447326 2552046 2510066 2694925
2387 2694925 2721065 2784655 2836273 2827005 2825374 2889349 3076511 3360864 3522778 3702671 3837736
2376 3837736 4034114 4259869 4574275 4891158 5385967 5704931 5936873 6226867 6606553 7303504
2366 7303504 8028257 8960375 10171761 11878950 14135145 17206768 21391927 27347621 34241821
2357 34241821 39064000 34666863 27102538 20225305 15239878 12124010 9826704 8357880
2349 8357880 7129374 6269326 5535626 4956155 4580459 4342641 4161036 4039679 3647034
2340 3647034 3398524 3084182 2720608 2388542 2263239 2091262 1950413 1842850 1841482 1783664
2330 1783664 1708723 1548675 1392162 1246170 1218270 1114521 1021418 1060895 945847 853696
2320 853696 870485 836857 805197 702668 737130 762681 756159 737885 687585 658185 597101 506327
2308 506327 600863 622252 621211 593527 559086 406743 412507 428886 387948 367677 454430 390087
2296 390087 403254 322017 304167 279447 310891 360439 367335 266872 172811 124326 161386 277750
2284 277750 261068 127123 131875 121046 99161 22883 100993 179557 160858 66385 70329 68887
2272 68887 -1094 70090 45459 170044 114583 111994 104285 52756 104368 37742 -13380 -9656
2260 -9656 23980 2238 8389 20484 16310 -68702 72474 138357 79247 -77829 -74478 -52701
2248 -52701 -71524 49641 54625 92469 76341 44835 99654 64187 -32636 -64305 -60869 -3939
2236 -3939 70704 48879 33178 62666 91071 17229 -8444 71454 -43248 -77879 -103173 -146455
2224 -146455 -84115 -55177 -34280 59249 8764 -56033 -37172 -7203 -69738 -22121 30776 50945
2212 50945 123687 54728 -105252 -84110 -134916 -145018 -162414 -100977 -36226 -126636 -24576
2201 -24576 28257 -70947 -28838 24174 32381 39602 24330 29230 -9669 -122755 54904 10403
2189 10403 -35508 -85374 -121773 10013 29793 -75280 -161663 -96336 -28019 -104807 -73105
2178 -73105 -23241 12121 -42660 -85814 -143163 -112114 -130424 -119790 13563 -74207 -99661 -76120
2166 -76120 -74727 -39117 39775 -23895 -24488 -4661 -36189 30362 54896 -27349 -50105 -47773 -57802
2153 -57802 -14482 -17560 -56588 58928 26440 8896 51689 -36450 -17989 29793 -179970 -116153
2141 -116153 58693 43357 16351 10955 -35232 -98360 -115117 -142574 -100213 -85362 -153916 -131440
2129 -131440 -172638 -147589 -139384 -104194 -201774 -281176 -192701 -57823 -83780 -89753 -47523 -141700
2117 -141700 -110054 -95240 -89321 -81044 -12286 -54468 -53693 -85922 -117589 -104727 -139165 -223447
2105 -223447 -198225 -79359 -25689 -8177 -47076 -47194 -150072 -155306 -74060 -117987 -124810 -100548
2093 -100548 -66219 29405 112538 191761 103798 67512 39864 436 -3788 -122177 -77326 -10195
2081 -10195 -49528 -62847 -91846 -131406 -76944 -211088 -210491 -147058 -110836 -73577 -88205 -81009
2069 -81009 -112282 -198749 -165254 -153774 -181524 -162077 -39971 36635 -46988 -65465 -1002 -102610
2057 -102610 -89804 -16443 -42494 -2868 -80040 -160419 -171578 -149923 -120425 -66932 -163983 -167346
2045 -167346 -181800 -210581 -195462 -89652 -48516 -156013 -76975 -113017 -227854 -120605 -173172
2034 -173172 -81698 -40704 -54542 -94090 -72290 -60288 -195978 -158176 -121613 -135963 7944
2023 7944 57884 10582 -39313 -63936 -47503 -143814 -134427 -60151 -39080 -15426 -5468 -24290
2011 -24290 28701 14037 -43373 -37151 13721 4778 -45074 -124904 -63499 -115383 -145791 -177261
1999 -177261 -156065 -122854 -202946 -166451 -72235 -126932 -125203 -115955 -65867 -7038 -42760 23065
1987 23065 -19759 -76799 -17323 -126508 -101314 -52020 -101286 -83788 -168701 -56024 -60797 -73081
1975 -73081 -162789 -116091 -65206 -42212 -40682 -150758 -63536 60354 65469 2796 -70736 -95200
1963 -95200 -173316 -141958 -95248 -175794 -135575 -128090 -25119 -14110 -66195 -93013 -43206 -41503
1951 -41503 -140640 -157129 -105002 -46695 -91905 -72746 -80869 -161783 -281858 -243911 -189394 -129304
1939 -129304 -79582 -37724 -57823 -89287 -41495 -37308 -83139 -181608 -121890 -57115 -66684 -45164
1927 -45164 -58842 -118276 19941 -17618 -21466 -46615 -183847 -173315 -90171 -100928 -121595 -227153
1915 -227153 -202329 -168332 -163188 -113232 -81897 -28849 -52885 -46247 -81695 -35256 -64577 -104138
1903 -104138 -115349 -85980 -16047 -64462 -40883 -24078 -74458 -87452 -135364 -186006 -64339
1892 -64339 -12367 -47795 26513 -108474 -104515 -59225 15930 48141 -43772 -75693 -31015 -78658
1880 -78658 -68075 -48973 -45447 -53123 -91136 -2136 -23574 -82171 -76747 -62684 -98851 -132936
1868 -132936 -132606 -89338 -98473 -56927 -9694 59700 4194 -106351 -172580 -139002 -68463 -50969
1856 -50969 -41099 -25659 1650 -37381 -38326 -20559 17625 -45419 -130050 -82198 19234 30058
1844 30058 -48273 -96994 -52385 -68261 -193594 -142960 4073 49471 -83401 -149313 -127345
1833 -127345 -100729 -115484 -144816 -142345 -178167 -102807 -92971 -73875 5911 145125 131483 40906
1821 40906 -65301 -166093 -142015 -52090 -31635 -58861 -108609 -110654 -27691 -58089 -27506 18588
1809 18588 18634 -78224 -91477 4167 24997 -73752 -24214 -67709 37573 9278 10297 94604
1797 94604 -4890 -490 756 41014 63092 82802 -27008 -35640 9718 -42155 -26392 -73686
1785 -73686 -95058 -47329 23095 -17999 -43756 -13389 48402 31806 -10946 -51748 -125594 -79808
1773 -79808 -69517 -33991 -33427 -31173 14517 8320 -32336 -25581 -94856 -108324 -107902 -129564 -132457
1760 -132457 -36096 -48980 8991 -53049 -122375 -139549 -113054 -96758 -71462 -42523 -99417 -88293
1748 -88293 -57483 -7345 29621 -10439 -73894 -63626 -48903 54069 25026 -33598 -24836 -43096
1736 -43096 -25362 -76746 18763 -39130 -184387 -146176 -93364 -32323 -9740 -90296 -136797 -118765
1724 -118765 -44809 -3963 -58817 -93988 -33074 -153871 -197357 -81685 -95281 -68833 -82149
1713 -82149 -55263 -104527 -117090 -155698 -92767 -10402 16366 91073 -1901 70425 79535 -26769
1701 -26769 19212 -32285 17201 -50026 -33031 59671 6900 -48240 -161299 -129263 -131175 -111814
1689 -111814 -135737 -108217 -14896 -92246 -101103 -60478 -74187 -46748 -98355 -61409 -64437 21663
1677 21663 -32055 -109118 -71412 -55056 -11284 -6134 28818 38417 218064 71950 -10722 -89937
1665 -89937 -92680 -121390 -149276 -85619 56149 -6018 -75426 17176 55104 36853 -45356 -43418
1653 -43418 -40001 -16593 19573 -18782 -65967 -149092 -79552 -79483 -989 60775 20004 -114523
1641 -114523 -164832 -148678 -212817 -132726 -63655 14904 -102912 -79965 971 -27302 -12538
1630 -12538 -6813 -79475 -55604 26147 167406 8964 -29070 10340 -45588 -25366 55538 66935
1618 66935 29419 -37048 -56582 10738 -59841 -64000 -44563 8999 44560 26203 -83739 -93194
1606 -93194 -49076 46872 2 -31244 -43953 35457 117039 105764 144768 56968 99751 80873
1594 80873 15799 70927 10483 -133206 -157651 -117361 -84302 -49635 -35150 -74815 -128415 -72246
1582 -72246 -34959 -162550 -130656 -28472 53096 93726 -46861 -30793 -27165 -140549 -35575
1571 -35575 25868 10833 -35242 -72006 -37310 4003 -95987 -122633 -68613 -115842 -101506 -88641
1559 -88641 -147013 -33129 -19465 -14271 13530 -36929 -25970 -16033 11236 13919 27900 -32319
1547 -32319 -38761 21908 51232 -15690 -2157 -28892 -117078 -98055 -19839 22987 -38995 -59293
1535 -59293 -58307 96849 70197 33538 -57051 -35774 40259 76513 -41480 -41195 13276 38227
1523 38227 14242 -29275 38021 12219 45186 -25426 -120884 -123246 -76354 -33612 17257 150789
1511 150789 97104 -1596 -4341 15346 -79824 -200249 -141484 -2132 -60900 -133639 -58475
1500 -58475 -68172 -20598 6605 38833 101959 127898 13960 -42598 -96951 -38341 -64732 -68572
1488 -68572 -94982 -95521 -12227 118036 73752 42034 77155 45174 15634 -51827 -45161 -62138
1476 -62138 -119866 -10706 -8759 18567 46592 33853 -4437 11408 55694 -36599 -101634 -49727
1464 -49727 54682 108222 57627 66412 -54756 -59050 -20542 -63939 -58677 -142962 -8681 10378
1452 10378 -90621 -59843 16397 41780 19132 -5654 -14409 -19990 -65016 1911 25228 -49554
1440 -49554 -56775 -32258 -8375 -17209 -81486 -82453 -44233 -29287 -75583 -112801 -10148 -36763
1428 -36763 1363 36906 -40882 -22719 -71741 5323 157926 123358 112666 54423 -153935
1417 -153935 -215236 -81061 -19373 41588 52601 21099 -60534 -120378 -121310 -2149 -72010 -30888
1405 -30888 66863 -11869 21005 7 -13866 -72779 -68221 9818 12059 26215 125466 80342
1393 80342 17987 -100743 -54072 -1197 15819 14462 -20794 -35269 -67986 -68025 8524 -11769
1381 -11769 -19260 15621 91758 94094 -4059 -14027 -89341 -12752 -26093 25833 19606 5601 -89631
1368 -89631 -111980 -88110 -19332 23528 27832 56047 26248 69673 150116 25385 31210 49576
1356 49576 43412 -51878 -62876 53990 13855 -20741 47847 39212 -11051 -9441 -22757 47810
1344 47810 71235 114095 211759 175864 -41407 -7648 45735 21387 20726 -9342 -4260 -57107
1332 -57107 -34826 -69132 -15611 35233 82410 106625 18691 -20189 -9170 18202 48208 46529
1320 46529 80800 -2687 80654 8264 -73449 -13893 71372 125707 6424 5830 31001 20010
1308 20010 -11298 66781 85153 78399 25295 85913 3728 -6448 15942 49833 52390 124478
1296 124478 -16691 -47254 -42369 -34317 31657 48960 5775 20575 71368 -20311 48429 -79167
1284 -79167 -30550 -110703 -114488 33225 124073 78441 33894 137571 119716 26238 -43600 66194
1272 66194 64922 29074 23926 76850 43242 52952 -14142 -31353 -53159 -136982 -170035 -41011
1260 -41011 23867 -31540 3268 30034 -22186 46510 33406 26085 -37595 18825 122517 82575
1248 82575 70952 140195 92662 86157 116841 -49996 -26308 -20231 -50173 89446 10048 -117325
1236 -117325 -71580 2529 97077 95817 118275 5237 58984 84969 14997 38206 31916 13091
1224 13091 11064 54371 -22216 -26504 32733 47909 24758 -80329 -10369 68574 110426 24201
1212 24201 -27269 -27716 32272 -12895 -78013 -89388 -49578 26651 46081 -7678 -33482 120752
1200 120752 41575 32215 -32130 6123 114910 226 5035 -33608 64012 36726 -21523 -121606
1188 -121606 -58646 -70105 -66755 -30871 -114354 -66334 11358 16422 53514 153544 131084 -859
1176 -859 -75055 -29166 88362 124372 78271 29091 -8788 -25530 20447 -5519 46890 21970
1164 21970 10985 81700 76497 76536 67882 -808 -45857 -34844 33524 81527 72264 68033 21834
1151 21834 -27252 -68853 -87001 -10890 39723 9986 -1525 -15182 -60105 -17256 34157 62484
1139 62484 51764 20996 20715 -7851 42656 94119 113478 40808 35274 90733 69870 -35033
1127 -35033 16903 19497 50193 21412 58439 130935 122035 -22015 -120558 -142275 -98601 -51633
1115 -51633 65539 60569 25031 51381 123649 69467 -52267 -57159 -16293 5323 -66824 -29215
1103 -29215 -20073 36938 15110 -27053 -18622 -21616 -33282 -137072 -173882 -97269 29833 43750
1091 43750 126663 26044 -40470 -19006 90478 95601 -98428 -62369 36936 115018 100520
1080 100520 41586 80173 2982 66208 8940 -6554 -17521 22038 65915 -53763 43895
1069 43895 28199 21732 96892 96314 32730 105853 21278 30590 25685 27644 58745 58758 16470 -36726
1055 -36726 49757 64879 109811 104378 -30845 -28994 -71758 101451 45393 -4294 69895 78973
1043 78973 110676 81855 94857 129006 68121 771 -19351 -36124 60419 65723 -119333 -101569
1031 -101569 66436 11571 -27135 -2025 -27540 -11525 22168 44023 75826 48190 55986 13913
1019 13913 -72307 -68837 139719 89207 28990 51388 128729 100120 89858 75723 -17265 67863
1007 67863 112838 127654 13727 21487 99354 42162 115869 28753 -84323 32684 79593
996 79593 121682 131023 92256 80770 109135 121905 153438 118138 3416 34566 71375 125382
984 125382 154578 78605 113698 67605 92346 15248 18520 23383 1928 -6389 -11904 54478 89229
971 89229 65029 27883 23162 -64 -29728 128849 109991 42148 37703 130801 167203 122869
959 122869 -70256 -73845 60093 59082 -18461 -42521 -86756 -53407 130499 79790 -2853 45411
947 45411 92742 -41417 -2808 -1803 23737 -148 34669 13800 -14981 42455 58124 16441
935 16441 -1277 -133881 -64916 -43263 -104370 40356 11112 8090 19184 60613 104732 94313
923 94313 147017 116196 164358 55849 40511 79146 41608 6583 -7579 120743 104793 6808
911 6808 61896 102826 41761 -28626 -1906 -30014 -26841 34267 -1560 75056 82009 25619 -31480
898 -31480 -95931 -77927 -72578 -107035 -151868 -66946 73579 55700 -5901 -10131 -46440 -5251
886 -5251 59543 91274 29459 51275 5582 95035 70497 91383 51323 -354 110683 112775
874 112775 2859 -64210 9471 82639 33372 -48368 -45545 36810 31643 20621 97755 27756
862 27756 59462 99266 67172 21315 49131 13617 145693 124834 95283 81207 48216 27349
850 27349 34064 23355 57717 24051 -45277 -85004 -15006 -76745 -51332 -10252 5235 14041
838 14041 -47395 -102611 -35683 41470 -16348 91924 108295 82877 44703 138792 97263 40392
826 40392 136436 157886 144368 88090 71391 14849 -5139 7014 33420 59979 101894 97962
814 97962 61888 125545 66894 30498 63331 63766 52809 449 -22231 -73106 -35974 29164
802 29164 38546 24015 -69228 -42105 -7813 -7055 -53340 -58196 6561 75385 96829 85555 44585
789 44585 -33736 1999 87090 206597 233803 255741 222167 144290 71654 53386 33433 29182
777 29182 32705 60305 67950 -23597 4593 55128 135150 136058 98750 107839 85644 43496 7894
764 7894 -66964 -55866 -9919 -1967 -1313 21538 45964 96256 36759 -11216 45262 33207 107680
751 107680 89055 60135 43592 -15027 29950 48199 -32517 -37276 2305 106024 81489 44569
739 44569 -1238 47067 12891 43273 13841 56633 97337 94871 78745 40503 148758 88252
727 88252 81274 48349 38627 -18245 -32543 19649 17556 35431 70677 -33332 -40002 75620
715 75620 39283 10865 -28494 -25735 2243 34255 49315 -19125 142688 129074 168334 115535
703 115535 149051 174451 96057 119466 137854 3383 34762 98032 66783 -52327 -67861
692 -67861 42248 86473 118906 110954 17026 110283 95823 -34482 -11837 -3820 -3942 46680
680 46680 50417 43230 13126 94581 68583 94699 100940 23855 72982 146200 118822 108267 104384
667 104384 36464 102954 64923 141161 119697 21353 19456 10555 -69189 -34682 21148 20602 -39289
654 -39289 -79627 -142187 7177 26548 -22513 24302 -24076 -33501 75095 82583 -26127 -124287
642 -124287 -12533 -73549 -91725 -38675 25228 23768 33931 41079 89935 112652 10335 -6230
630 -6230 104581 96681 123235 119836 135426 195041 198320 201247 85888 87402 84252 53841 -9640
617 -9640 48045 13128 55039 64705 -70483 -49501 5862 29353 37510 28113 -41112 -15693 19124
604 19124 98249 12416 -56644 16635 -25105 18095 30714 68527 26485 -16061 19092 63432
592 63432 75818 42682 94706 15837 -72493 -130179 -73906 -55170 3973 -42809 -120639 -26305
580 -26305 27978 64312 93799 -13804 -33551 -48405 -139494 -29559 -10554 -8728 -26398 -74088
568 -74088 -126669 25892 -3978 76076 120790 67809 9936 85478 133231 79460 38874 -34796
556 -34796 -19909 27043 23977 202 104007 95001 66912 7402 -9952 23695 25856 21006 61685
543 61685 51737 50479 -44262 -67622 1521 -37133 85073 65678 114562 141556 18369 -24772
531 -24772 4592 15950 52185 107525 -22234 -28559 13529 19685 11877 -11306 -9652 12301 -100485
518 -100485 -88471 5406 -3470 21543 1573 29023 5583 -19141 -47468 52334 66737 -6417
506 -6417 -108122 -14579 -46763 -66401 -77704 -150700 -31861 -55612 -56233 -87861 -44366 2850
494 2850 60200 -27748 -127652 -66969 13186 37809 52860 94632 89217 58129 86651 11749
482 11749 42802 100192 90120 43907 66500 22836 -18619 27903 21 33275 60183 30338
470 30338 73460 130797 -28253 -96818 -100604 -32142 -28157 -29373 -7105 44066 14353 -86989
458 -86989 -22349 -57343 -53586 -34340 -74175 -57675 -28530 46879 48171 -31844 -83133 -167971
446 -167971 -118215 -35341 8266 55333 55014 65265 48514 -30950 -8619 -83381 -127164 -22827
434 -22827 -7275 59385 65104 124254 34377 86146 86706 101396 64049 -16002 12548 -54361 -152823
421 -152823 -73441 56236 22688 -83485 -101011 -61247 -88328 -3206 -10106 -55521 -16479 3453
409 3453 28567 95551 -53276 441 23902 192959 74494 48513 181773 162065 77336
398 77336 -28006 -85619 43763 -25870 -63990 36085 -88667 -1791 -18579 93447 44390
387 44390 56969 -11767 -72600 -15681 79509 132773 -8757 87278 205921 123910 103326 44266
375 44266 103249 57634 -25637 8554 67232 45055 85346 108180 41021 69859 26817 132211
363 132211 91217 24355 2656 2243 -13194 -106726 -99668 -42608 -123061 -71326 -23610 -45096
351 -45096 36440 65387 -5139 64798 111205 51564 67406 31494 20351 -9352 -21195 60188
339 60188 178893 141198 85570 70486 51077 92659 111200 27187 -41223 37323 65581 37609
327 37609 91554 111539 62027 32318 -23289 26009 77319 50655 33332 -1796 11044 65615
315 65615 89049 -15318 -12472 -2356 -18873 80549 70077 67981 132034 59775 -595 76867
303 76867 94550 62339 -148727 -123278 22226 35916 22634 -79415 24834 73377 88352
292 88352 -83376 -84144 11587 29196 22022 -46253 9954 -58260 -24977 59406 22798 98088
280 98088 38460 -12145 -49321 -15284 90414 75222 26438 15142 59388 49660 44041 -61948
268 -61948 -19184 100138 60278 48061 90968 82649 -38920 -127163 -133372 -62048 31026 35662
256 35662 -9859 -24639 -16552 -17906 14642 96629 -27798 48942 68636 -59275 8795 8517
244 8517 -38878 -71503 33445 86694 86490 72745 32664 -2167 -17134 -79462 -49540 11448
232 11448 -66128 -44501 122813 32881 21484 86927 96419 82921 57606 4345 -34237 -42422
220 -42422 55187 156795 22576 92334 84242 110274 132757 77293 -4074 17376 53598 28385
208 28385 86717 18127 29235 42414 -53252 55775 6368 -61866 36512 -36669 -63711 13561
196 13561 34376 1974 71837 38280 44050 -16437 16270 5615 16457 30096 5964 25306
184 25306 22856 -43501 -79201 -54360 -11706 -692 -47236 29830 52210 85565 55685 76597
172 76597 94747 22470 75206 71861 -42857 -36425 99865 73772 -16656 -46445 24069 55236
160 55236 -40042 -106853 -71324 6761 -4647 -48036 -54952 82646 101983 -45678 -24409 96823
148 96823 122372 40269 -51545 -44547 39652 26041 -62488 5841 -65595 5536 86079 57142
136 57142 -9296 -4474 -40343 -60608 -33889 16994 -58146 -121445 -50931 30763 55615 45931
124 45931 37887 49232 34301 -21195 -39773 -34440 46501 -55399 -28827 36318 28133 5746
112 5746 87693 54901 -22382 -16113 -28897 -19225 53591 65401 49401 72074 50328 -5434 45260
99 45260 84311 -30235 -49518 -42333 -43161 -41437 35565 75620 4417 -5311 -3016 -34343 -137836
86 -137836 -129922 -27137 33361 6263 40273 12359 31873 106710 94096 10752 -132404 -70814
74 -70814 -42562 -44001 -28150 -26993 -5877 2753 -26312 -58174 1366 -17662 16361 -48236 -24174
61 -24174 33882 15258 -33000 -84783 -67180 -16628 34706 -39348 -23809 -5320 -34103 -99118
49 -99118 -68782 -61875 -116926 -36152 19322 30733 49382 108253 93845 2118 2227 31605 -5388
36 -5388 48688 75310 -7273 32516 73261 55096 12795 82428 54765 -18646 -31926 39263
24 39263 123364 56778 51823 -5782 -105053 -93504 -20560 49521 68003 27738 -47424 -90673
12 -90673 -58763 31044 43142 34491 -5520 -6686 -67719 -109149 -102082 -28900 -16140 -61575
0 -61575
$$ Imaginary data points
##PAGE= N=2
##DATA TABLE= (X++(I..I)), XYDATA
16383 -1501725 -1434576 -1342116 -1365132 -1457158 -1403188 -1349735 -1309852 -1260248 -1263276 -1313281 -1229830
16372 -1229830 -1175567 -1144391 -1118246 -1087733 -1106235 -1049809 -1008988 -1022630 -1033035 -972267 -870967
16361 -870967 -841175 -827809 -788071 -724685 -745337 -694265 -639347 -625990 -526788 -554029 -649074
16350 -649074 -580138 -535618 -528783 -481981 -560482 -478715 -408686 -387935 -357973 -301169 -276920 -230572
16338 -230572 -207056 -252306 -198647 -129666 -150977 -128957 -51207 -9916 19261 -78203 -8729
16327 -8729 47057 116085 181150 132835 125202 172933 207089 300416 297877 283855 300041 308158
16315 308158 353189 348088 421208 407514 437625 583019 618468 596821 546398 552015 575848 579517
16303 579517 621474 637039 673775 728342 728170 795494 767501 799885 906173 820307 794412 900367
16291 900367 936326 938101 948689 951918 1011737 1131912 1117563 1121953 1167206 1199537 1227647 1232086
16279 1232086 1199940 1189350 1202718 1235274 1235186 1282102 1422578 1453045 1461720 1381592 1416213 1399519
16267 1399519 1390065 1456026 1481044 1478568 1514430 1524591 1561438 1569103 1527841 1581711 1584284 1640079
16255 1640079 1675008 1677073 1673759 1756164 1816634 1751556 1775470 1702259 1754017 1814075 1762032 1833639
16243 1833639 1831616 1849955 1969767 2051582 1996939 1900148 1913698 1936070 1971826 2001897 2105986
16232 2105986 2055292 2062187 2160745 2165338 2164213 2101957 2136244 2158153 2169105 2172010 2087442 2130249
16220 2130249 2246591 2235722 2282787 2275681 2355762 2452250 2350258 2354511 2403656 2395856 2352483
16209 2352483 2318897 2360731 2338514 2488594 2487239 2485507 2474265 2537279 2458809 2410542 2475016
16198 2475016 2446155 2481924 2567306 2564969 2540226 2634891 2590818 2530253 2551261 2559287 2571774 2623577
16186 2623577 2578598 2627057 2554369 2495376 2525644 2561374 2596376 2641332 2651769 2646843 2664343
16175 2664343 2695971 2644084 2633799 2667884 2630953 2720676 2692169 2681780 2737726 2782652 2742924
16164 2742924 2677767 2657722 2821476 2836423 2803181 2810119 2794865 2696043 2698485 2653323 2712172
16153 2712172 2776194 2640236 2713656 2759746 2755591 2772166 2872612 2860342 2866957 2879474 2910827
16142 2910827 2822420 2863877 2939881 2905708 2934873 2953698 2860926 3007885 2973295 2950546 2991383
16131 2991383 2947217 2928487 2950771 3022367 2969869 2880948 2978769 3005518 2915651 2914377 2891057
16120 2891057 2976458 3007254 2922951 2912488 2887403 2920269 2989262 3066692 3060605 2969002 3034267
16109 3034267 2980328 3031453 2947160 2898330 3009246 3068777 3106071 3087993 3089445 3198816 3184097
16098 3184097 3058559 3034808 3116592 3141344 3102553 3028809 3032153 2991388 3008704 3152471 3137764
16087 3137764 3164186 3136949 3116192 3075768 3011395 3036598 3067983 2997738 3023890 3121996 3189105
16076 3189105 3109477 3044898 2965099 3068277 3066229 3053806 3034381 3011294 2914805 2870593 3013058
16065 3013058 3045752 3088781 3119655 3109956 3009389 3078270 3163240 3154898 3148202 3113972 3121064 3133971
16053 3133971 3187181 3116111 3121998 3059505 3079744 3138596 3161990 3095543 3078659 3132185 3064386
16042 3064386 3102121 2990448 3154179 3128715 3103480 3057554 3098416 3211393 3168451 3158719 3139974
16031 3139974 2997986 2976262 3079131 3107120 3123040 3117620 3047578 3064731 3081455 3189836 3227847
16020 3227847 3174455 3149787 3157372 3051012 3077437 3053920 3142338 3211410 3171376 3118932 3028120
16009 3028120 3072304 3186920 3264362 3257005 3194022 3120457 3131922 3073645 3093348 3115803 3101075
15998 3101075 3109471 3107274 3032277 3063347 3112041 3141497 3155843 3161279 3126418 3034670 3060855 3075363
15986 3075363 3092782 3047493 3091789 3140342 3051250 3074152 3049023 2951526 3011785 3095979 3150623
15975 3150623 3260200 3215033 3089252 2994184 3096599 3073707 3127315 3152914 3155104 3097020 3066191
15964 3066191 3027435 3035173 3088387 3091539 3090019 2995595 2944342 2959205 2998676 3041950 3151488 3142031
$$ [...]
##END NTUPLES=NMR SPECTRUM
##END=
