##TITLE=1H_EC-3305(IV-31)
 CDCl3
 8 sc, 
 6.2.2024
##JCAMPDX= 6.0         $$ Bruker NMR JCAMP-DX V2.0
##DATA TYPE= NMR SPECTRUM
##DATA CLASS= NTUPLES
##ORIGIN= UXNMR, Bruker Analytische Messtechnik GmbH
##OWNER= root
$$ XWIN-NMR		Version 3.5
$$ Tue Feb  6 13:45:55 2024 Russian Standard Time (UT+4h)  she@DPX200
##.OBSERVE FREQUENCY= 200.1313
##.OBSERVE NUCLEUS= ^1H
##.ACQUISITION MODE= SIMULTANEOUS
##.ACQUISITION SCHEME= undefined
##.AVERAGES= 8
##.DIGITISER RES= 18
##SPECTROMETER/DATA SYSTEM= spect
##.PULSE SEQUENCE= zg30
##.SOLVENT NAME= D2O
##.SHIFT REFERENCE= (INTERNAL, D2O, 0, 15.4461)
##AUDIT TRAIL= $$ (NUMBER, WHEN, WHO, WHERE, WHAT)
$$ ##TITLE= Audit trail, XWIN-NMR		Version 3.5
$$ ##JCAMPDX= 5.01
$$ ##ORIGIN= Bruker BioSpin GmbH
$$ ##OWNER= she
$$ F:/spectra/data/she/nmr/H-F/1/pdata/1/auditp.txt
$$ ##AUDIT TRAIL=  $$ (NUMBER, WHEN, WHO, WHERE, WHAT)
(   1,<2024-02-06 13:44:41.29 +0400>,<she>,<DPX200>,
      <created by zg, POWCHK disabled, PULCHK disabled
       configuration hash MD5:
       00 E9 B6 7A A2 85 ED C7 34 08 36 98 17 FE 4E 26
       data hash MD5: 16K
       58 87 33 01 79 97 A1 64 3F 4F 4E BC AE 2A CC 2E>)
(   2,<2024-02-06 13:44:43.62 +0400>,<she>,<DPX200>,
      <Start of raw data processing
       efp BC_mod = 2 LB = 0.24 FT_mod = 6 PKNL = 1 PHC0 = -24594.17 PHC1 = 11.05268 SI = 16K 
       data hash MD5: 16K
       B7 7A 5D 6E 62 6D D8 E5 41 0F 5B D0 E0 BB 35 18>)
(   3,<2024-02-06 13:44:59.84 +0400>,<she>,<DPX200>,
      <pk PHC0 = 1.444501 PHC1 = -1.4 
       data hash MD5: 16K
       FE 3A 93 E5 A5 D5 C3 75 6C 30 99 AE D4 2D CD BC>)
(   4,<2024-02-06 13:45:05.09 +0400>,<she>,<DPX200>,
      <abs ABSG = 5 
       data hash MD5: 16K
       57 3E 06 81 2F 4B AD 69 4C 2C 3A AD C4 F5 BB 4F>)
$$ ##END=
$$ 
$$ hash MD5
$$ 72 A3 5B FB 86 CD FE 80 CF 8B B2 5B 91 6D 5D A3
##$RELAX= 
##$RELAX= 
##$RELAX= 
##$RELAX= 
##$RELAX= 
##$RELAX= 
$$ Bruker specific parameters
$$ --------------------------
##$DU= <F:/spectra>
##$EXPNO= 1
##$NAME= <H-F>
##$PROCNO= 1
##$TYPE= <nmr>
##$USER= <she>
##$AMP= (0..31)
100 100 100 100 100 100 100 100 100 100 100 100 100 100 100 100 100 100 
100 100 100 100 100 100 100 100 100 100 100 100 100 100 
##$AQSEQ= 0
##$AQ_mod= 1
##$AUNM= <au_zg>
##$AUTOPOS= <>
##$BF1= 200.13
##$BF2= 200.13
##$BF3= 200.13
##$BF4= 200.13
##$BF5= 200.13
##$BF6= 200.13
##$BF7= 200.13
##$BF8= 200.13
##$BYTORDA= 1
##$CFDGTYP= 0
##$CFRGTYP= 5
##$CHEMSTR= <none>
##$CNST= (0..31)
1 1 145 1 1 1 1 1 1 1 1 1 1 1 1 1 1 1 1 1 1 1 1 1 1 1 1 1 1 1 1 1 
##$CPDPRG= <>
##$CPDPRG1= <>
##$CPDPRG2= <>
##$CPDPRG3= <>
##$CPDPRG4= <mlev>
##$CPDPRG5= <mlev>
##$CPDPRG6= <mlev>
##$CPDPRG7= <mlev>
##$CPDPRG8= <mlev>
##$CPDPRGB= <>
##$CPDPRGT= <>
##$D= (0..31)
0 1.2 0 0 0 0 0 0 0 0.06 0 0.03 0 0 0 0 0.0002 0 0 0 0 0 0 0 0 0 0 0 0 
0 0 0 
##$DATE= 1707212680
##$DBL= (0..7)
120 120 120 120 120 120 120 120 
##$DBP= (0..7)
150 150 150 150 150 150 150 150 
##$DBP07= 0
##$DBPNAM0= <>
##$DBPNAM1= <>
##$DBPNAM2= <>
##$DBPNAM3= <>
##$DBPNAM4= <>
$$ [...]
##$SUBNAM3= <"">
##$SUBNAM4= <"">
##$SUBNAM5= <"">
##$SUBNAM6= <"">
##$SUBNAM7= <"">
##$SUBNAM8= <"">
##$SUBNAM9= <"">
##$SW= 18.0517328524113
##$SWIBOX= (0..15)
0 0 2 0 0 0 0 0 0 0 0 0 0 0 0 0 
##$SW_h= 3612.71676300578
##$TD= 16384
##$TD0= 1
##$TE= 0
##$TE2= 300
##$TE3= 300
##$TEG= 300
##$TL= (0..7)
0 120 120 120 120 120 120 120 
##$TP= (0..7)
150 150 150 150 150 150 150 150 
##$TP07= 0
##$TPNAME0= <>
##$TPNAME1= <>
##$TPNAME2= <>
##$TPNAME3= <>
##$TPNAME4= <>
##$TPNAME5= <>
##$TPNAME6= <>
##$TPNAME7= <>
##$TPOAL= (0..7)
0.5 0.5 0.5 0.5 0.5 0.5 0.5 0.5 
##$TPOFFS= (0..7)
0 0 0 0 0 0 0 0 
##$TUNHIN= 0
##$TUNHOUT= 0
##$TUNXOUT= 0
##$USERA1= <user>
##$USERA2= <user>
##$USERA3= <user>
##$USERA4= <user>
##$USERA5= <user>
##$V9= 5
##$VALIST= <valist>
##$VCLIST= <CCCCCCCCCCCCCCC>
##$VD= 0
##$VDLIST= <DDDDDDDDDDDDDDD>
##$VPLIST= <PPPPPPPPPPPPPPP>
##$VTLIST= <TTTTTTTTTTTTTTT>
##$WBST= 1024
##$WBSW= 4
##$XGAIN= (0..3)
0 0 0 0 
##$XL= 0
##$YL= 0
##$YMAX_a= 538160
##$YMIN_a= -822928
##$ZGOPTNS= <>
##$ZL1= 120
##$ZL2= 120
##$ZL3= 120
##$ZL4= 120
##$ABSF1= 15.45051
##$ABSF2= -2.601339
##$ABSG= 5
##$ABSL= 3
##$ALPHA= 0
##$AQORDER= 0
##$ASSFAC= 0
##$ASSFACI= 0
##$ASSFACX= 0
##$ASSWID= 0
##$AUNMP= <proc_1d>
##$AZFE= 0.1
##$AZFW= 0.1
##$BCFW= 0
##$BC_mod= 2
##$BYTORDP= 0
##$COROFFS= 0
##$CY= -3
##$DATMOD= 1
##$DC= 0
##$DFILT= <>
##$DTYPP= 0
##$F1P= 0
##$F2P= 0
##$FCOR= 1
##$FTSIZE= 16384
##$FT_mod= 6
##$GAMMA= 0
##$GB= 0
##$INTBC= 1
##$INTSCL= 3.70164e-10
##$ISEN= 128
##$LB= 0.24
##$LEV0= 0
##$LPBIN= 0
##$MAXI= 10000
##$MC2= 0
##$MEAN= 0
##$ME_mod= 0
##$MI= 1.114404
##$NCOEF= 0
##$NC_proc= -6
##$NLEV= 6
##$NOISF1= 3.799351
##$NOISF2= 2.8
##$NSP= 0
##$NTH_PI= 0
##$NZP= 0
##$OFFSET= 15.4461
##$PC= 1
##$PHC0= -24592.72
##$PHC1= 9.65268
##$PH_mod= 1
##$PKNL= yes
##$PPARMOD= 0
##$PSCAL= 0
##$PSIGN= 0
##$REVERSE= no
##$SF= 200.130015130728
##$SI= 16384
##$SIGF1= 3
##$SIGF2= 2
##$SINO= 5.538805
##$SIOLD= 16384
##$SREGLST= <1H.CDCl3>
##$SSB= 0
##$STSI= 16384
##$STSR= 0
##$SW_p= 3612.71676300578
##$SYMM= 0
##$S_DEV= 0
##$TDeff= 16384
##$TDoff= 0
##$TI= <>
##$TILT= no
##$TM1= 0
##$TM2= 0
##$TOPLEV= 0
##$USERP1= <user>
##$USERP2= <user>
##$USERP3= <user>
##$USERP4= <user>
##$USERP5= <user>
##$WDW= 1
##$XDIM= 16384
##$YMAX_p= 496862210
##$YMIN_p= -289216
$$ End of Bruker specific parameters
$$ ---------------------------------
##NTUPLES= NMR SPECTRUM
##VAR_NAME=  FREQUENCY,     SPECTRUM/REAL,   SPECTRUM/IMAG
##SYMBOL=    X,             R,               I
##VAR_TYPE=  INDEPENDENT,   DEPENDENT,       DEPENDENT
##VAR_FORM=  AFFN,          ASDF,            ASDF
##VAR_DIM=   16384,         16384,           16384
##UNITS=     HZ,            ARBITRARY UNITS, ARBITRARY UNITS
##FACTOR=    0.220516191357247, 1,           1
##FIRST=     3091.22827373836, 0,            0
##LAST=      -521.48848926742, 0,            0
##MIN=       -521.48848926742, -289216,      0
##MAX=       3091.22827373836, 496862210,    0
$$ Real data points
##PAGE= N=1
##DATA TABLE= (X++(R..R)), XYDATA
$$ [...]
$$ plain form
8008 -76982 -47657 54793 -38617 -34492 34684 -56009 -106985 -31794 10982 -109784 -78957 7313
7996 7313 -18382 -121026 -162938 -93360 -152961 1150 125191 145631 90419 30641 20032
7985 20032 22360 23684 22767 1604 73365 -24217 35409 21686 -72329 -82267 -100538 -46720 23356
7972 23356 -19680 32414 21605 39852 -3607 -49010 24387 31126 61028 149340 131674 1087
7960 1087 -13370 -62130 8644 64016 20330 20367 52081 153491 103167 36593 70402 41017
7948 41017 31611 -2739 49147 133129 224476 226582 184731 127201 119089 118864 121329 114576 160171
7935 160171 167907 183891 243282 399205 306984 274439 358174 338520 453744 386012 317965
7924 317965 367368 459389 475796 494002 516563 559690 753770 781456 872242 917552 935376
$$ packed form
8008g6982K9325J02450r3410M125O9176r0693n0976P5191M2776j20766L0827Q6270
7996G313k5695j02644m1912O9578n9601J54111J24041K0440n5212n9778j0609
7985B0032K328J324r17k1163P1761r7582N9626j3723r4015r938j8271N3818P0076
7972B3356m3036N2094j0809J8247m3459m5403P3397O739K9902Q8312j7666j30587
7960A087j4457m8760P0774N5372m3686L7L1714J01410n0324o6574L3809k9385
7948D1017r406l4350N1886Q3982R1347K106m1851n7530q112k25K465o753M5595
7935A60171P736J5984N9391J55923r2221l2545Q3735j9654J15224o7732o8047
7924C17965M9403R2021J6407J8206K2561M3127J94080K7686R0786M5310J7824
$$ plain form
7913 935376 972969 938436 861289 875326 904746 1006162 960989 882477 926826 928324 939649 959671
7901 959671 858485 830041 875246 776186 672104 609062 574991 528574 498752 482647 495819
7890 495819 497896 501223 538790 460569 459908 563835 623778 572656 529473 547647 578175 584101
7878 584101 554139 701750 806819 840113 909154 929157 951835 965985 1013136 993897 1013389
7867 1013389 1014572 896230 926765 1012756 1016805 1020383 1014569 811070 890336 945337 885116 809295
7855 809295 682492 610096 598135 640936 595848 543470 427001 512799 463488 291842 327199
7844 327199 351284 397602 355912 340429 299218 265434 278195 246297 272739 357450 420122 349705
7832 349705 324559 365600 291165 413483 365601 254648 257705 308185 357436 260614 199603
$$ packed form
7913I35376L7593l4533p7147J4037K9420J01416m5173p8512M4349J498J1325K0022
7901I59671j01186k8444M5205r9060j04082o3042l4071m6417k9822j6105J3172
7890D95819K077L327L7567p8221o61J03927N9943n1122m3183J8174L0528N926
7878E84101k9962J47611J05069L3294O9041K0003K2678J4150M7151j9239J9492
7867A013389J183j18342L0535Q5991M049L578n814k03499P9266N5001o0221p5821
7855H09295j26803p2396j1961M2801m5088n2378j16469Q5798m9311j71646L5357
7844C27199K4085M6318m1690j5483m1211l3784J2761l1898K6442Q4711O2672p0417
7832C49705k5146M1041p4435J22318m7882j10953L057N0480M9251r6822o1011
$$ plain form
7821 199603 209224 143306 187009 200957 160359 206272 292249 261167 261710 335672 320246 365531
7809 365531 447006 403010 407735 365465 270246 279339 332405 412832 439494 483286 504166 513166
7797 513166 347363 281195 403684 465114 470647 462618 438098 436064 492686 433190 413845 390059
7785 390059 339309 334306 381531 439613 372170 282989 354339 352536 349196 281479 277861 316220
7773 316220 350503 349807 258867 222473 222242 258068 318072 297982 268150 405032 371031 452244
7761 452244 301141 312789 339419 351400 497386 482981 413384 397504 342740 349310 391973
7750 391973 429857 456726 378631 470984 436924 481940 481510 384614 274959 310490 430833 344219
7738 344219 339302 407168 333872 274938 254457 240283 265539 357943 361314 268135 199937 96179
$$ packed form
7821A99603R621o5918M3703J3948m0598M5913Q5977l1082N43P3962j5426M5285
7809C65531Q1475m3996M725m2270r5219R093N3066Q0427K6662M3792K0880R000
7797E13166j65803o6168J22489O1430N533q029k4520k034N6622n9496j9345k3786
7785C90059n0750n003M7225N8082o7443q9181P1350j803l340o7717l618L8359
7773C16220L4283o96r0940l6394k31L5826O0004k0090k9832J36882l4001Q1213
7761D52244j51103J1648K6630J1981J45986j4405o9597j5880n4764O570M2663
7750C91973L7884K6869p8095R2353l4060M5016m30r6896j09655L5531J20343q6614
7738C44219m917O7866p3296n8934k0481j4174K5256R2404L371r3179o8198j03758
$$ plain form
7726 96179 186885 153102 98921 286379 251835 205459 179380 222934 240202 246954 372470 279061
7714 279061 209210 196917 180367 248991 347722 306411 248088 192788 186436 198671 328708 362983
7702 362983 236615 232589 212993 166372 231226 358076 342420 213122 234375 243923 316908
7691 316908 382022 399233 245885 225313 282657 336173 337965 308984 258665 226327 198234 129591
7679 129591 251534 258888 160303 292211 291285 217003 219383 210444 133434 123328 215467 175221
7667 175221 195457 226969 236635 146120 152598 85938 136509 254177 256372 218948 117208 168790
7655 168790 157493 121903 52561 102464 124686 39531 -31503 -34843 -5783 18208 62293 -17639
7643 -17639 -55737 -4463 70344 -42412 -37513 13275 5554 -5430 7926 -25833 19796 48321
$$ packed form
7726I6179R0706l3783n4181J87458l4544m6376k6079M3554J7268O752J25516r3409
7714B79061o9851j2293j6550O8624R8731m1311n8323n5300o352J2235J30037L4275
7702C62983j26368m026j9596m6621O4854J26850j5656j29298K1253R548P2985
7691C16908O5114J7211j53348k0572N7344N3516J792k8981n0319l2338k8093o8643
7679A29591J21943P354r8585J31908r26p4282K380q939p7010j0106R2139m0246
7667A75221K0236L1512R666r0515O478o6660N0571J17668K195l7424j01740N1582
7655A68790j1297l5590o9342M9903K2222q5155p1034l340K9060K3991M4085p9932
7643a7639l8098N1274P4807j12756M899N0788p721j0984J3356l3759M5629K8525
$$ plain form
7631 48321 32557 148101 151239 58790 -17946 -64728 -11109 98721 22863 -65185 -13594 -28699
7619 -28699 -36711 46644 94935 102737 91324 42231 68059 7604 -19732 -53620 14056 15149
7607 15149 -34569 -23661 -26033 19909 153649 37600 24876 21371 8506 61771 45304 -1047
7595 -1047 46156 42585 41517 -4522 -48778 20369 17485 75919 117792 54360 125354 163876 82911
7582 82911 51972 75605 61533 117163 194234 177503 140333 68204 122770 258633 200936 147489
7570 147489 65924 107828 147893 117545 130875 136557 59605 72310 52843 84221 157544 235848
7558 235848 206066 101160 191192 137053 167425 218746 259729 230035 265080 267252 353773 351784
7546 351784 245284 239788 236091 159715 224941 215334 222398 253690 274460 203438 228388 191592
$$ packed form
7631D8321j5764J15544L138r2449p6736m6782N3619J09830p5858q8048N1591j5105
7619b8699q012Q3355M8291P802j1413m9093K5828o0455k7336l3888O7676J093
7607A5149m9718J0908k372M5942J33740j16049j2724l505j2865N3265j6467m6351
7595a047M7203l571j068m6039m4256O9147k884N8434M1873o3432P0994L8522q0965
7582H2911l0939K3633j4072N5630P7071j6731l7170p2129N4566J35863n7697n3447
7570A47489q1565M1904M0065l0348J3330N682p6952J2705j9467L1378P3323P8304
7558B35848k9782j04906R0032n4139L0372N1321M0983k9694L5045K172Q6521j989
7546C51784j06500n496l697p6376O5226r607P064L1292K0770p1022K4950l6796
$$ plain form
7534 191592 152500 121116 107565 104065 201055 188332 232394 260595 346398 272264 321808 301554
7522 301554 322148 346190 188780 204409 183679 180920 212204 201594 219032 203497 162322 269294
7510 269294 287543 180529 270088 305246 166541 215933 328316 409622 441083 367039 366953 450333
7498 450333 449675 407538 399764 443082 553164 531316 573770 680318 572225 643415 690724 584549
7486 584549 489771 448389 531526 646281 534997 482965 550862 487380 522911 523534 513199 497941
7474 497941 464417 488153 497326 596917 574134 629118 726902 756094 614372 715751 761116
7463 761116 712644 839336 944878 812490 772080 802313 756208 654216 594533 751160 796104
7452 796104 677914 651767 577638 634142 664780 692467 708768 630804 633938 655314 601210 557207
$$ packed form
7534A91592l9092l1384j3551l500R6990j2723M4062K8201Q5803p4134M9544k0254
7522C01554K0594K4042j57410J5629k0730k759L1284j0610J7438j5535m1175J06972
7510B69294J8249j07014Q9559L5158j38705M9392J12383Q1306L1461p4044q6Q3380
7498D50333o58m2137p774M3318J10082k1848M2454J06548j08093P1190M7309j06175
7486E84549r4778m1382Q3137J14755j11284n2032O7897o3482L5531O23j0335j5258
7474D97941l3524K3736R173R9591k2783N4984R7784K9192j41722J01379M5365
7463G61116m8472J26692J05542j32388m0410L0233m6105j01992n9683J56627M4944
7452G96104j18190k6147p4129N6504L0638K7687J6301p7964L134K1376n4104m4003
$$ plain form
7440 557207 590360 603713 540316 475477 499275 543757 547827 566807 624010 652890 668044 521185
7428 521185 506610 580223 564486 531861 484948 474507 481130 584317 525026 554155 474583 376515
7416 376515 361209 267825 287222 316654 325117 293398 310699 298978 252639 272934 207754 267984
7404 267984 307539 313313 274603 277054 279590 255127 279706 247793 253201 281956 346471 290289
7392 290289 191929 122107 205173 232949 91805 70066 114200 69399 76280 59563 148617 68525
7380 68525 69152 28057 -34555 -7006 28504 2188 -16894 -2646 93757 87655 8402 39898
7368 39898 65326 -21174 -114597 -137196 -121655 -75371 -96656 -74367 -77623 -89607 -19902 15384
7356 15384 -21062 -138899 -163950 -111858 -40722 5585 -133044 -190557 -187006 -166858 -150286 -68651
$$ packed form
7440E57207L3153J3353o3397o4839K3798M4482M070J8980N7203K8880J5154j46859
7428E21185j4575P3613j5737l2625m6913j0441O623J03187n9291K9129p9572r8068
7416C76515j5306r3384J9397K9432Q463l1719J7301j1721m6339K0295o5180O0230
7404B67984L9555N774l8710K451K536k4463K4579l1913N408K8755O4515n6182
7392B90289r8360o9822Q3066K7776j41144k1739M4134m4801O881j6717Q9054q0092
7380F8525O27m1095o2612K7549L5510k6316j9082J4248R6403o102p9253L1496
7368C9898K5428q6500r3423k2599J5541M6284k1285K2289l256j1984O9705L5286
7356A5384l6446j17837k5051N2092P1136M6307j38629n7513L551K0148J6572Q1635
$$ plain form
7344 -68651 -93987 -41151 -10658 -54796 -122028 -163625 -196317 -169504 -104267 -140048 -50948 -21585
7332 -21585 -81597 -82762 -87255 -203818 -209581 -136319 -92708 -77740 -6928 18695 -82508 -43031
7320 -43031 9845 -15569 -41246 -20449 18416 -72872 -125282 -81595 -80527 -82810 -114312 -114759 -48626
7307 -48626 -58652 -107279 -157072 -204303 -100110 -69271 -147244 -44715 -30543 29696 -65672
7296 -65672 24043 79761 51503 -77531 -151856 -81883 -60535 -24295 -24863 -11779 -89777 -95962
7284 -95962 -200017 -81961 -125360 -134764 -209177 -167965 -88081 -76606 -79170 -57722 -43577 -33905
7272 -33905 -34142 -73793 -21237 -21584 -1995 -16708 -9270 -92846 -62962 -39389 -44255 3555 30366
7259 30366 22982 -87641 -112141 -73266 -89672 -99277 -75793 -170678 -215974 -139813 -91375 -127971
$$ packed form
7344f8651k5336N2836L0493m4138o7232m1597l2692K6813O5237l5781Q9100K9363
7332b1585o0012j165m493j16563n763P3262M3611J4968P0812K5623j01203L9477
7320d3031N2876k5414k5677K0797L8865r1288n2410M3687J068k283l1502m47O6133
7307d8626j0026m8627m9793m7231J04193L0839p7973J02529J4172O0239r5368
7296f5672Q9715N5718k8258j29034p4325O9973K1348L6240n68J3084p7998o185
7284i5962j04055J18056m3399r404p4413M1212P9884J1475k564K1448J4145R672
7272c3905k37l9651N2556l47J9589j4713P438q3576K9884K3573m866M7810K6811
7259C0366p384j10623k4500L8875j6406r605K3484r4885m5296P6161M8438l6596
$$ plain form
7247 -127971 -78606 -33564 -70495 -3680 -91146 -91129 -8972 -110636 -102795 -95143 -113998 -78110
7235 -78110 -73720 -154099 -122918 -91657 -104547 -45742 -189744 -159498 -63459 -6327 -87570 -20943
7223 -20943 -63954 -28541 -57728 36879 53809 -65831 -25414 -6526 -95823 -101762 -73304 -62738
7211 -62738 -41008 -101200 -89794 -105716 33116 70522 -22196 -95964 -1114 -61964 10000 38571
7199 38571 19426 -82190 -10629 44747 66107 69346 11208 -94112 -159728 -107759 -129899 -101706
7187 -101706 -47457 -10053 -89056 -7750 58687 -59872 -160294 -158227 -100907 -135451 63386
7176 63386 100392 56448 44878 2016 45648 -70331 -72834 22795 83539 53617 85106 13434
7164 13434 -61667 -60799 -63453 -26215 119678 164355 94803 16488 -5147 31221 10387 -70857
$$ packed form
7247a27971M9365M5042l6931O6815q7466J7Q2157j01664P841P652j8855L5888
7235g8110M390q0379L1181L1261j2890N8805j44002L0246R6039N7132q1243O6627
7223b0943m3011L5413k9187R4607J6930j19640M0417J8888q9297n939K8458J0566
7211f2738K1730o0192J1406j5922J38832L7406r2718p3768R4850o0850P1964K8571
7199C8571j9145j01616P1561N5376K1360L239n8138j05320o5616N1969k2140K8193
7187a01706N4249L7404p9003Q1306O6437j18559j00422K067N7320l4544J98837
7176F3386L7006m3944j1570m2862M3632j15979k503R5629O0744k9922L1489p1672
7164A3434p5101Q68k654L7238J45893M4677o9552p8315k1635L6368k0834q1244
$$ plain form
7152 -70857 -191293 -200651 -104614 72003 167241 103606 43912 -35883 -104036 -89101 -28438 -107898
7140 -107898 -98329 -17635 48000 29100 85156 120987 19872 -52289 -35869 -29520 -78674 63896
7128 63896 60365 161240 197930 100144 31330 25061 -64773 -45940 -14353 11539 26287 82247
7116 82247 85824 52318 309 11816 112323 35234 -36185 36898 136038 64139 -82086 -128999
7104 -128999 33744 -15293 -62804 -81122 -75395 -49204 -94743 19411 27507 -15351 -148969
7093 -148969 -114181 11083 -40355 -39098 -40068 43987 -16458 -42748 82696 104741 111057 80378
7081 80378 47409 44672 48069 -18113 370 72252 -47657 70582 45966 10722 75656 45449
7069 45449 99667 158205 127938 165120 201620 238857 141898 3806 -24866 -21305 27580 28259
$$ packed form
7152g0857j20436r358R6037J76617R5238o3635n9694p9795o8153J4935O0663p9460
7140a07898R569Q0694O5635j8900N6056L5831j01115p2161J6420O349m9154J42570
7128F3896l531J00875L6690r7786o8814o269q9834J8833L1587K5892J4748N5960
7116H2247L577l3506n2009J1507J00507p7089p1419P3083R9140p1899j46225m6913
7104a28999J62743m9037m7511j8318N727K6191m5539J14154Q096m2858j33618
7093a48969L4788J25264n1438J257r70Q4055o0445k6290J25444K2045O316l0679
7081H0378l2969k737L397o6182J8483P1882j19909J18239k4616l5244O4934l0207
7069D5449N4218N8538l0267L7182L6500L7237r6959j38092k8672L561M8885O79
$$ plain form
7057 28259 85880 130571 44051 -70301 -82895 -55443 3152 104526 16263 19177 6030 -63529
7045 -63529 -98068 -175635 -127108 -86341 -37029 -21155 41136 90619 91386 29473 49467 6581
7033 6581 -60493 -133422 -117955 -8514 -596 58366 81888 -53553 -120867 -8413 36663 -31643
7021 -31643 -44290 129022 114222 74685 65074 -5569 24880 88901 4790 19792 90900 71927
7009 71927 64334 37552 -10854 82033 82575 51807 34754 25183 -1252 19447 -53394 37607 91535
6996 91535 -36472 -82490 -90692 -107073 -107452 -22070 21993 19886 -88533 -42669 -130377 -145392
6984 -145392 -80610 -75650 -89320 37492 76480 91022 76909 -9558 -28578 24898 38549 13591
6972 13591 101169 77591 31610 21259 -25448 39344 -68719 -41408 15947 12783 519 888
$$ packed form
7057B8259N7621M4691q6520j14352j2594K7452N8595J01374q8263K914j3147o9559
7045f3529l4539p7567M8527M0767M9312J5874O2291M9483P67o1913J9994m2886
7033F581o7074p2929J5467J09441P918N8962K3522j35441o7314J12454M5076o8306
7021c1643j2647J73312j4800l9537r611p0643L0449O4021q4111J5002P1108j8973
7009G1927p593k6782m8406R2887N42l0768j7053r571k6435K0699p2841R1001N3928
6996I1535j28007m6018q202j6381l79Q5382M4063k107j08419M5864q7708j5015
6984a45392O4782M960j3670J26812L8988J4542j4113q6467j9020N3476J3651k4958
6972A3591Q7578k3578m5981j0351m6707O4792j08063K7311N7355l164j2264L69
$$ plain form
6960 888 -15799 -44695 -101951 -48708 -2968 58602 69028 17295 68497 73174 23230 -1813
6948 -1813 -23508 69457 64562 -18187 -77852 -8746 31703 93751 63160 -34176 128544 38767
6936 38767 49525 -35136 -49743 63935 -21863 -32489 -69518 -12207 -12846 -38285 29240 -15144
6924 -15144 -62366 -66988 35956 44037 188263 135388 121454 105837 46372 -4554 79202 103047
6912 103047 96251 148520 134851 57548 63162 103494 37472 190558 164419 121797 32840 49243
6900 49243 74547 86212 55813 51579 46619 -424 79987 78477 186179 275821 211696 119442
6888 119442 76494 128325 173053 29754 82951 102296 82689 132203 22076 72247 80473
6877 80473 120551 106873 44598 100428 117038 180520 274311 173945 128837 83461 73838 90343
$$ packed form
6960H88j6687k8896n7256N3243M5740O1570J0426n1733N1202M677m9944k5043
6948a813k1695R2965m895q2749n9665O9106M0449O2048l0591r7336J62720q9777
6936C8767J0758q4661j4607J13678q5798j0626l7029N7311o39k5439O7525m4384
6924a5144m7222m622J02944Q081J44226n2875j3934j5617n9465n0926Q3756K3845
6912A03047o796N2269j3669p7303N614M0332o6022J53086k6139m2622q8957J6403
6900D9243K5304J1665l0399m234m960m7043Q0411j510J07702Q9642o4125r2254
6888A19442m2948N1831M4728j43299N3197J9345j9607M9514j10127N0171Q226
6877H0473M0078j3678o2275N5830J6610O3482R3791j00366m5108m5376r623J6505
$$ plain form
6865 90343 147993 93170 87970 128579 117989 175758 132411 137016 104691 108991 246586 178005
6853 178005 142070 139593 94897 195664 48771 113308 116124 72286 43545 82257 73039 126090
6841 126090 100761 84259 25973 63137 58958 38326 30690 35492 197545 232667 195907 151844
6829 151844 132451 87380 108528 105450 230352 146175 190222 187716 92811 102034 154172 20211
6817 20211 40751 25367 105618 132272 -37349 -18332 9632 95476 12658 62684 127278 146093
6805 146093 211370 261157 262351 216147 146887 134372 138207 249571 196591 101959 105703 107573
6793 107573 103074 214769 208515 59025 137309 181962 44983 55964 136047 242750 210969
6782 210969 242205 145607 203 76090 26044 88409 130395 165405 244421 176686 172914 154562
$$ packed form
6865I0343N7650n4823n200M0609j0590N7769m3347M605l2325M300J37595o8581
6853A78005l5935k477m4696J00767j46893O4537K816m3838k8741L8712r218N3051
6841A26090k5329j6502n8286L7164m179k0632p636M802J62053L5122l6760m4063
6829A51844j9393m5071K1148l078J24902q4177M4047k506r4905R223N2138j33961
6817B0211K0540j5384Q0251K6654j69621J9017K7964Q5844q2818N0026O4594J8815
6805A46093O5277M9787J194m6204o9260j2515L835J11364n2980r4632L744J870
6793A07573m499J11695o254j49490P8284M4653j36979J0981Q0083J06703l1781
6782B10969L1236r6598j45404P5887n0046O2365M1986L5010P9016o7735l772j8352
$$ plain form
6770 154562 98876 102363 105484 63525 203340 168530 70519 161337 85319 173309 132627 161315
6758 161315 157276 101981 6381 139529 176983 163053 167394 90366 149843 133959 55565 54453
6746 54453 154892 217221 258084 245792 314400 410973 329399 314204 360156 411111 397022 418591
6734 418591 395870 401484 360779 346654 406637 383229 339081 428294 488133 332107 206215
6723 206215 299838 347673 515780 459546 317327 341234 304339 280162 302636 384670 477119
6712 477119 509586 397803 378232 436602 509312 536115 568197 520934 444745 548293 657437
6701 657437 610622 554797 494416 601368 587537 493221 461804 447286 437143 507102 521457
6690 521457 540236 605359 628962 588603 604759 660564 634634 563577 529516 510089 593418 635714
$$ packed form
6770A54562n5686L487L121m1959J39815l4810r8011R0818p6018Q7990m0682K8688
6758A61315m039n5295r5600J33148L7454j3930M341p7028N9477j5884p8394j112
6746E4453J00439O2329M0863j2292O8608R6573q1574j5195M5952N0955j4089K1569
6734D18591k2721N614m0705j4125N9983k3408m4148Q9213N9839j56026j25892
6723B06215R3623M7835J68107n6234j42219K3907l6895k4177K2474Q2034R2449
6712D77119L2467j11783j9571N8370P2710K6803L2082m7263p6189J03548J09144
6701F57437m6815n5825o0381J06952j3831r4316l1417j4518j0143O9959J4355
6690E21457J8779O5123K3603m0359J6156N5805k5930p1057l4061j9427Q3329M2296
$$ plain form
6678 635714 608442 713459 824049 838370 829362 730392 696893 833116 897957 956313 856539
6667 856539 881293 850563 892007 992647 864234 893726 1088949 1117760 1116123 1159829 1132404
6656 1132404 1251062 1353174 1313051 1414583 1521948 1535822 1561373 1446267 1607582 1739117
6646 1739117 1919448 1909986 1943920 1971139 2063380 2164495 2205392 2165519 2220584 2175737 2143989
6635 2143989 2166585 2159914 2133299 1998683 2018227 2071184 2129270 1960376 1810276 1783613 1811662
6624 1811662 1892800 1935165 1827723 1826419 1786273 1804510 1737296 1471060 1416949 1343429 1279539
6613 1279539 1207965 1001382 979095 961883 1075869 1024782 973044 981841 934746 925146 903171
6602 903171 954134 914247 820974 934787 927039 832712 882864 934505 949198 889261 842057 782636
$$ packed form
6678F35714k7272J05017J10590J4321r008r8970l3499J36223O4841N8356r9774
6667H56539K4754l0730M1444J00640j28413K9492J95223K8811j637M3706k7425
6656A132404J18658J02112m0123J01532J07365J3874K5551j15106J61315J31535
6646A739117J80331r462L3934K7219R2241J01115M0897l9873N5065m4847l1748
6635B143989K2596o671k6615j34616J9544N2957N8086j68894j50100k6663K8049
6624A811662Q1138M2365j07442j304m0146J8237o7214k66236n4111p3520o3890
6613A279539p1574k06583k2287j7212J13986n1087n1738Q797m7095r600k1975
6602I03171N0963l9887r3273J13813p748r4327N0152N1641J4693n9937m7204n9421
$$ plain form
6590 782636 781776 825540 827736 791169 798310 704564 702410 778504 736287 770873 757467 773752 782044
6577 782044 854334 735372 690610 771767 774988 746980 769096 843354 813141 868033 889615 957851
6565 957851 908698 920422 925574 914587 932130 890296 924520 777181 859066 886563 922494 927422
6553 927422 949395 1043763 1137529 1076734 1139689 1330963 1453468 1470645 1407464 1349290 1215411
6542 1215411 1189823 1233264 1241574 1160283 1168130 1115057 1153634 1277794 1291730 1224618 1228347 1257354
6530 1257354 1333209 1397203 1363407 1376985 1454489 1520085 1515490 1377373 1370280 1337759 1354658 1348583
6518 1348583 1343078 1412257 1341111 1259430 1292010 1230494 1208912 1306318 1346691 1321319 1335628 1340504
6506 1340504 1389622 1438066 1487241 1385063 1326998 1334490 1175815 1121570 1080347 1105893 1111924
$$ packed form
6590G82636q60M3764K196l6567P141r3746k154P6094m2217L4586j3406J6285Q292
6577G82044P2290j18962m4762Q1157L221k8008K2116P4258l0213N4892K1582O8236
6565I57851m9153J1724N152j0987J7543m1834L4224j47339Q1885K7497L5931M928
6553I27422K1973R4368R3766o0795O2955J91274J22505J7177o3181n8174j33879
6542A215411k5588M3441Q310q1291P847n3073L8577J24160J3936o7112L729K9007
6530A257354P5855O3994l3796J3578P7504O5596m595j38117p093l2521J6899o075
6518A348583n505O9179p1146q1681L2580o1516k1582R7406M0373k5372J4309M876
6506A340504M9118M8444M9175j02178n8065P492j58675n4245m1223K5546O031
$$ plain form
6495 1111924 1169474 1055660 939315 959925 1073035 1098498 1080024 1110600 1121969 1149358 1050511
6484 1050511 1035660 923832 964497 988224 899308 999827 1052479 1009936 1070701 1114586 1091497
6473 1091497 1050411 1074152 1146468 1130617 1225677 1293158 1330652 1268788 1322825 1301923 1306470 1542326
6461 1542326 1444487 1372065 1386651 1392289 1318073 1306104 1308469 1336668 1334294 1313799 1330763 1376803
6449 1376803 1410701 1389483 1500799 1595308 1576799 1551366 1605585 1611350 1670871 1707266 1746635
6438 1746635 1861728 1984700 1872175 1839798 1890605 1821081 1818551 1859685 1826235 1810585 1849434
6427 1849434 1859747 1826519 1807642 1836033 1718949 1742643 1713721 1794645 1916894 1839783 1898900
6416 1898900 1987964 2035929 2150112 2200338 2190099 2107540 2093379 2117420 2058122 2112565 2064418
$$ packed form
6495A111924N7550j13814j16345K0610J13110K5463j8474L0576J1369K7389r8847
6484A050511j4851j11828M0665K3727q8916J00519N2652m2543O0765M3885k3089
6473A091497m1086K3741P2316j5851R5060O7481L7494o1864N4037k0902M547K35856
6461A542326r7839p2422J4586N638p4216j1969K365K8199k374k0495J6964M6040
6449A376803L3898k1218J11316R4509j8509k5433N4219N765N9521L6395L9369
6438A746635J15093J22972j12525l2377N0807o9524k530M1134l3450j5650L8849
6427A849434J0313l3228j8877K8391j17084K3694k8922Q0924J22249p7111N9117
6416A898900Q9064M7965J14183N0226j0239q2559j4161K4041n9298N4443m8147
$$ plain form
6405 2064418 2093367 2101097 2103296 2183941 2204648 2215319 2308686 2261113 2277437 2267783 2216737 2273550
6393 2273550 2372566 2506129 2723110 2801463 2816764 2926517 2952622 2787221 2731181 2682152 2532241
6382 2532241 2446536 2430501 2516052 2619340 2587127 2483396 2569529 2619160 2734852 2758872 2883023
6371 2883023 2976475 3034548 3009853 3052415 3192604 3316089 3363006 3427132 3369148 3448045 3529395
6360 3529395 3528177 3556920 3434739 3415349 3444312 3559900 3549876 3479652 3630783 3646468 3713376
6349 3713376 3792979 3854787 3963862 4046325 4090654 4115795 4238122 4386201 4579646 4665110 4932816
6338 4932816 5022606 5207184 5236311 5129115 5094498 5113787 5045332 4971357 4875984 4809432 4836406
6327 4836406 4863196 4861604 4991184 5034186 5111497 5404530 5586078 5846998 6088180 6194606
$$ packed form
6405B064418K8949P730K199Q0645K0707J0671R3367m7573J6324r654n1046N6813
6393B273550R9016J33563K16981P8353J5301J09753K6105j65401n6040m9029j49911
6382B532241q5705j6035Q5551J03288l2213j03731Q6133M9631J15692K4020J24151
6371B883023R3452N8073k4695M2562J40189J23485M6917O4126n7984P8897Q1350
6360C529395j218K8743j22181j9390K8963J15588j0024p0224J51131J5685O6908
6349C713376P9603O1808J09075Q2463M4329K5141J22327J48079J93445Q5464K67706
6338D932816Q9790J84578K9127j07196l4617J9289o8455p3975r5373o6552K6974
6327D836406K6790j592J29580M3002P7311K93033J81548K60920K41182J06426
$$ plain form
6317 6194606 6263052 6446854 6592916 6687136 6650321 6685800 6538126 6397406 6346802 6283087 6223551
6306 6223551 6256837 6213236 6281011 6406974 6408266 6401862 6434199 6580307 6650527 6875299 6990624
6295 6990624 7206723 7408129 7612402 7686777 7711831 7781192 7832333 7937308 7880679 8004385
6285 8004385 8090665 8136355 8278575 8370783 8473198 8635486 8792301 9002571 9203624 9516033
6275 9516033 9831909 10179720 10371919 10405713 10568644 10842923 10967496 11215381 11412487 11496612
6265 11496612 11637980 11754234 11897086 12153887 12464728 12814815 13102514 13378320 13635635
6256 13635635 13867892 14301971 14797522 15210828 15566133 16041952 16379597 16748946 17124134
6247 17124134 17389328 17586396 17882239 18148193 18475710 18819885 19185004 19646457 20132875
$$ packed form
6317F194606O8446J83802J46062R4220l6815L5479j47674j40720n0604o3715n9536
6306F223551L3286m3601O7775J25963J292o404L2337J46108P0220K24772J15325
6295F990624K16099K01406K04273P4375K5054O9361N1141J04975n6629J23706
6285H004385Q6280M5690J42220R2208J02415J62288J56815K10270K01053L12409
6275I516033L15876L47811J92199L3794J62931K74279J24573K47885J97106Q4125
6265A1496612J41368J16254J42852K56801L10841L50087K87699K75806K57315
6256A3635635K32257M34079M95551M13306L55305M75819L37645L69349L75188
6247A7124134K65194J97068K95843K65954L27517L44175L65119M61453M86418
$$ plain form
6238 20132875 20699404 21127571 21587502 22191152 22755166 23326877 24085242 24838055 25587517
6229 25587517 26509661 27453438 28527599 29421331 30375573 31435847 32641144 33798069 35098491
6220 35098491 36662559 38347632 40359961 42792054 45797143 49759469 54756489 61157720
6212 61157720 69160537 78912952 90141484 98907600 100491028 95502528 87541789 79634826
6204 79634826 74044657 70854006 69864461 70748945 73408044 77896862 84193005 91618094
6196 91618094 97333232 99053257 98927680 99417706 101800830 107136688 114570571 120338074
6188 120338074 120637936 115042608 106693872 99266747 94585580 93197948 95175737 99078340
6180 99078340 101216969 98910227 93563318 87831062 83774144 82160958 83001514 86193561
$$ packed form
6238B0132875N66529M28167M59931O03650N64014N71711P58365P52813P49462
6229B5587517R22144R43777J074161Q93732R54242J060274J205297J156925J300422
6220C5098491J564068J685073K012329K432093L005089L962326M997020O401231
6212F1157720Q002817R752415J1228532Q766116J583428m988500p960739p906963
6204G9634826n590169l190651r89545Q84484K659099M488818O296143P425089
6196I1618094N715138J720025j25577M90026K383124N335858P433883N767503
6188A20338074K99862n595328q348736p427125m681167j387632J977789L902603
6180I9078340K138629k306742n346909n732256m056918j613186Q40556L192047
$$ plain form
6172 86193561 91190719 98315651 107631075 117840925 123898313 121294586 112324255 101582329
6164 101582329 92057537 85142396 80897523 78625488 78116351 78878658 81020378 84501717
6156 84501717 88681965 92541208 94846991 94531159 91394535 86430390 80775650 75570108
6148 75570108 71261387 68099654 65598531 63803038 62548413 61870406 61826319 62489176 63826068
6139 63826068 65672740 68262655 71497882 75362935 79950000 85461913 92165597 100367578
6131 100367578 110390628 122005071 133738837 143122906 146886987 142905838 132351767
6124 132351767 118766296 105412511 94117785 85457701 78814074 73737075 69379900 65661780
6116 65661780 62344585 59854230 58046793 57070890 56814672 57025258 57818719 59088193 60968366
$$ packed form
6172H6193561M997158P124932R315424J0209850O057388k603727q970331j0741926
6164A01582329r524792o915141m244873k272035n09137P62307K141720L481339
6156H4501717M180248L859243K305783l15832l136624m964145n654740n205542
6148G5570108m308721l161733k501123j795493j254625o78007m4087O62857J336892
6139F3826068J846672K589915L235227L865053M587065N511913O703684Q201981
6131A00367578J0023050J1614443J1733766R384069L764081l981149j0554071
6124A32351767j3585471j3353785j1294726q660084o643627n076999m357175l718120
6116F5661780l317195k490355j807437r75903k56218K10586P93461J269474J880173
$$ plain form
6107 60968366 63464310 66963949 71575945 77016235 82739572 87346084 89188366 87246226
6099 87246226 81993098 74923486 67471823 60662330 54993349 50576932 46882485 43776594
6091 43776594 41100151 38919115 37033315 35488292 34223632 33319220 32898956 32652663 32417145
6082 32417145 31884255 31000993 29771247 28334729 27067920 25769476 24626295 23659038 22824159
6073 22824159 22095632 21489526 20981771 20677001 20419007 20312419 20243530 20311974 20511055 20826013
6063 20826013 21290110 22057028 23141660 24581532 26355886 28379095 30274618 31755617
6055 31755617 32391796 31638684 29723199 27156730 24523786 22163258 20275873 18848219
6047 18848219 17683313 16832473 16127245 15460692 14928692 14533012 14280095 14167098 14171292 14200768
$$ packed form
6107F0968366K495944L499639M611996N440290N723337M606512J842282j942140
6099H7246226n253128p069612p451663o809493n668981m416417l694447l105891
6091D3776594k676443k181036j885800j545023j264660r04412m20264k46293k35518
6082C2417145n32890q83262j229746j436518j266809j298444j143181r67257q34879
6073B2824159p28527o06106n07755l04770k57994j06588o8889O8444J99081L14958
6063B0826013M64097P66918J084632J439872J774354K023209J895523J480999
6055C1755617O36179p53112j915485k566469k632944k360528j887385j427654
6047A8848219j164906q50840p05228o66553n32000l95680k52917j12997M194K9476
$$ plain form
6037 14200768 14447130 14744961 15164240 15742526 16493160 17384118 18351799 19100388 19471990
6028 19471990 19190268 18301345 17120611 15685102 14292305 13065195 12107003 11242201 10551475
6019 10551475 9981108 9431390 9069576 8735743 8352257 7950074 7679373 7426106 7336536 7222380
6009 7222380 7034005 6819059 6678563 6505860 6275025 6107579 5975285 5841066 5841758 5716539
5999 5716539 5507124 5517298 5432241 5309828 5222692 5199099 5082277 4970610 4893451 4851275 4696759
5988 4696759 4586881 4619341 4494110 4453167 4370050 4340631 4250613 4194437 4147948 4064994 4095979
5977 4095979 4029565 3961304 3879627 3789700 3732578 3685895 3735288 3769766 3725044 3818500 3638234
5966 3638234 3613397 3654456 3572592 3631230 3644099 3576637 3536171 3626253 3542656 3462211 3523433
$$ packed form
6037A4200768K46362K97831M19279N78286P50634Q90958R67681P48589L71602
6028A9471990k81722q88923j180734j435509j392797j227110r58192q64802o90726
6019A0551475n70367n49718l61814l33833l83486m02183k70701k53267q9570j14156
6009G222380j88375k14946j40496j72703k30835j67446j32294j34219O92j25219
5999E716539k09415J0174q5057j22413q7136k3593j16822j11667p7159m2176j54516
5988D696759j09878L2460j25231m0943q3117k9419r0018n6176m6489q2954L0985
5977D095979o6414o8261q1677q9927n7122m6683M9393L4478m4722R3456j80266
5966C638234k4837M1059q1864N8638J2869o7462m0466R0082q3597q0445O1222
$$ plain form
5955 3523433 3469600 3436875 3398171 3422145 3506119 3545545 3638518 3697441 3752740 3825378 3678820
5944 3678820 3540391 3558041 3529246 3514978 3436388 3518575 3505865 3481995 3489354 3518955 3600780
5933 3600780 3641720 3614902 3511870 3492877 3478633 3632668 3603275 3688024 3891419 3839748 3966212
5922 3966212 3897887 3807182 3830612 3851245 3890702 3905971 3861784 3750206 3750721 3794142 3819750 3829766
5910 3829766 3830036 3941044 3895618 3940667 4089439 4088782 4079207 4002544 4143459 4045827 3872989 3983821
5898 3983821 3975337 3975169 3911589 3989371 4102856 4175955 4264185 4297024 4341442 4290353 4403290 4473549
5886 4473549 4497038 4581120 4581334 4688530 4663475 4588245 4646260 4675236 4606787 4670772 4691302 4760892
5874 4760892 4760545 4648745 4766464 4867656 4966041 5091792 5207903 5281698 5478937 5560171 5643968
$$ packed form
5955C523433n3833l2725l8704K3974Q3974L9426R2973N8923N5299P2638j46558
5944C678820j38429J7650k8795j4268p8590Q2187j2710k3870P359K9601Q1825
5933C600780M0940k6818j03032j8993j4244J54035k9393Q4749K03395n1671J26464
5922C966212o8325r0705K3430K0633L9457J5269m4187j11578N15M3421K5608J0016
5910C829766K70J11008m5426M5049J48772o57r575p6663J40915r7632j72838J10832
5898C983821q484j68o3580P7782J13485P3099Q8230L2839M4418n1089J12937P0259
5886D473549K3489Q4082K14J07196k5055p5230N8015K8976o8449O3985K0530O9590
5874D760892l47j11800J17719J01192R8385J25751J16111P3795J97239Q1234Q3797
$$ plain form
5863 5643968 5726380 5771297 5826827 5906234 5857380 5813598 5841675 5856793 5917788 6044974 6245704
5852 6245704 6262614 6217929 6318087 6391716 6411476 6346763 6332265 6300977 6304092 6422682 6654449
5841 6654449 6701803 6799816 6983241 7261687 7396130 7454548 7485355 7522481 7626914 7582145 7566511
5830 7566511 7629933 7649912 7611485 7696024 7767056 7794696 7943348 8095779 8138906 8134595 8120822
5819 8120822 8198301 8268214 8402339 8577373 8796500 8800902 8932120 9214719 9347963 9336489
5809 9336489 9415052 9483872 9625716 9643653 9708997 9718043 9777868 9862296 10086899 10274186 10491550
5798 10491550 10636609 10878641 11160722 11340344 11670647 11928648 12190956 12345475 12684394
5789 12684394 12961346 13211029 13355969 13510378 13613366 13787223 13847529 14045005 14182686 14341965
$$ packed form
5863E643968Q2412M4917N5530P9407m8854m3782K8077J5118O0995J27186K00730
5852F245704J6910m4685J00158P3629J9760o4713j4498l1288L115J18590K31767
5841F654449M7354R8013J83425K78446J34443N8418L0807L7126J04433m4769j5634
5830G566511O3422J9979l8427Q4539P1032K7640J48652J52431M3127m311j3773
5819H120822P7479O9913J34125J75034K19127M402J31218K82599J33244j1474
5809I336489P8563O8820J41844J7937O5344R046N9825Q4428K24603J87287K17364
5798A0491550J45059K42032K82081J79622L30303K58001K62308J54519L38919
5789A2684394K76952K49683J44940J54409J02988J73857O0306J97476J37681J59279
$$ plain form
5779 14341965 14611827 14850845 15007084 15411438 15714054 16014428 16391440 16760910 17269972
5770 17269972 17546664 18033502 18488917 18925886 19338929 19715452 20087487 20449727 20770019
5761 20770019 21044919 21330208 21592441 21923549 22377722 22887071 23494483 24151506 24967046
5752 24967046 25673764 26522104 27459469 28156577 28812680 29330583 29598337 29992870 30511035
5743 30511035 31119960 32025805 32940925 33911271 34953341 36167021 37388550 38789303 40358891
5734 40358891 42112010 44268641 47018646 50395328 54496120 59619656 65846524 73354383
5726 73354383 81936361 90682617 97679685 101040438 99719857 94401368 87041532 79824346
5718 79824346 73647189 69108933 65830203 63583086 62379492 61972684 62208676 62639556 63429634
$$ packed form
5779A4341965K69862K39018J56239M04354L02616L00374L77012L69470N09062
5770A7269972K76692M86838M55415M36969M13043L76523L72035L62240L20292
5761B0770019K74900K85289K62233L31108M54173N09349O07412O57023Q15540
5752B4967046P06718Q48340R37365O97108O56103N17903K67754L94533N18165
5743C0511035O08925R05845R15120R70346J042070J213680J221529J400753J569588
5734D0358891J753119K156631K750005L376682M100792N123536O226868P507859
5726G3354383Q581978Q746256O997068L360753j320581n318489p359836p217186
5718G9824346o177157m538256l278730k247117j203594m06808K35992M30880P90078
$$ plain form
5709 63429634 64436451 65734636 67643165 70118864 73805597 78922956 85710387 94641377
5701 94641377 106121928 120080415 135495049 148968710 155327164 152325898 141684104
5694 141684104 127169538 112572173 99914501 89752673 81867595 75775177 71333790
5687 71333790 68092811 65795409 64543796 63937113 63425620 63003378 62638443 62496672 62718245
5678 62718245 63526523 65121424 67578502 70824511 74940403 79664647 84155377 87308898
5670 87308898 87729444 84979182 79829331 73744370 67957176 63075130 59184769 56284534
5662 56284534 54043200 52157004 50865004 49874960 49210924 48787687 48593985 48403262 48286365
5653 48286365 48241527 48230743 48238617 48290014 48543961 48889408 49398068 50029222 50774739 51696574
$$ packed form
5709F3429634J006817J298185J908529K475699L686733N117359O787431Q930990
5701I4641377J1480551J3958487J5414634J3473661O358454l001266j0641794
5694A41684104j4514566j4597365j2657672j0161828p885078o092418m441387
5687G1333790l240979k297402j251613o06683n11493m22242l64935j41771K21573
5678F2718245Q08278J594901K457078L246009M115892M724244M490730L153521
5670H7308898M20546k750262n149851o084961n787194m882046l890361k900235
5662E6284534k241334j886196j292000r90044o64036m23237j93702j90723j16897
5653D8286365m4838j0784P874N1397K53947L45447N08660O31154P45517R21835
$$ plain form
5643 51696574 52799488 54203235 55693733 57213124 58930908 61012246 63584334 66644021
5635 66644021 69920112 73507680 77339613 81364384 85879755 91294699 98243211 107143731
5627 107143731 118289254 129710780 135572630 132493508 124102393 114556612 106689465 101904721
5619 101904721 99904203 100115360 102293406 106713845 113082588 120258178 125024969 125973889
5611 125973889 125284669 125791742 129422266 136745553 146922135 157893282 165753298 166793192
5603 166793192 161107436 152178443 143771466 138584551 137610027 139579332 140811925 138830085
5595 138830085 134744202 130573170 127167245 125306771 125664352 128064685 132721876 139766728
5587 139766728 149711094 161184431 170982103 173821501 169035582 161216216 153642719 148294510
$$ packed form
5643E1696574J102914J403747J490498J519391J717784K081338K572088L059687
5635F6644021L276091L587568L831933M024771M515371N414944O948512Q900520
5627A07143731J1145523J1421526N861850l079122q391115r545781p867147m784744
5619A01904721k000518K11157K178046M420439O368743P175590M766791R48920
5611A25973889o89220N07073L630524P323287J0176582J0971147P860016J039894
5603A66793192n685756q928993q406977n186915r74524J969305J232593j981840
5595A38830085m085883m171032l405925j860474L57581K400333M657191P044852
5587A39766728R944366J1473337R797672K839398m785919p819366p573497n348209
$$ plain form
5579 148294510 145039760 142859355 141469712 141322531 141751297 141389528 140188860 139442306 140220026
5570 140220026 142875553 146696892 149959122 150948472 149340585 146564192 144326384 143995450
5562 143995450 146244663 150408450 154904623 157216105 156430408 154716341 154672633 157915254
5554 157915254 164736872 172903838 179040775 181847796 181773341 177816129 168947436 156914153
5546 156914153 144357773 133335007 125064534 119312645 115447610 112881781 111470592 111177114
5538 111177114 112130440 114923097 119444664 126576273 136265816 148042019 159837006 168331059
5530 168331059 172309693 172628481 169668921 163159560 154379367 145642221 138996221 135642669
5522 135642669 134458672 132623285 127850923 120367005 112493244 105945506 101638084 99649741
$$ packed form
5579A48294510l254750k180405j389643j47181M28766l61769j200668p46554P77720
5570A40220026K655527L821339L262230R89350j607887k776393k237808l30934
5562A43995450K249213M163787M496173K311482p85697j714067m3708L242621
5554A57915254O821618Q166966O136937K807021p4455l957212q868693j2033283
5546A56914153j2556380j1022766q270473n751889l865035k565829j411189k93478
5538A11177114R53326K792657M521567P131609R689543J1776203J1794987Q494053
5530A68331059L978634L18788k959560o509361q780193q737146o646000l353552
5522A35642669j183997j835387m772362p483918p873761o547738m307422j988343
$$ plain form
5514 99649741 98851152 97562167 95021504 91708462 88696369 86847373 86756325 88094934 89586632
5505 89586632 89155167 86587688 83175707 79550736 76147740 72444441 68947409 66070125
5497 66070125 64096894 62677916 61294249 59140017 56172682 52957960 50205931 48204268
5489 48204268 46807200 46061975 45214232 43696039 41244589 38307274 35377477 32896931
5481 32896931 30967327 29155627 27759388 26540217 25405756 24655661 23897224 23219602 22561811
5472 22561811 22105121 21671790 21221198 20820268 20498629 20250402 20052437 19735406 19577160
5463 19577160 19410822 19260915 19035345 18900286 18763756 18456451 18259182 18120878 17928003
5454 17928003 17782600 17536689 17390676 17304141 17090276 16965230 16769583 16654014 16586771 16562603
$$ packed form
5514I9649741p98589j288985k540663l313042l012093j848996r1048J338609J491698
5505H9586632m31465k567479l411981l624971l402996l703299l497032k877284
5497F6070125j973231j418978j383667k154232k967335l214722k752029k001663
5489D8204268j397068p45225q47743j518193k451450k937315k929797k480546
5481C2896931j929604j811700j396239j219171j134461p50095p58437o77622o57791
5472B2561811m56690m33331m50592m00930l21639k48227j97965l17031j58246
5463A9577160j66338j49907k25570j35059j36530l07305j97269j38304j92875
5454A7928003j45403k45911j46013q6535k13865j25046j95647j15569o7243k4168
$$ plain form
5444 16562603 16475286 16505707 16600835 16839110 17167647 17463504 17791366 18257147 18855013 19585733
5434 19585733 20517698 21433716 22479114 23874931 25587299 27699720 30658183 34512280
5426 34512280 39421187 45271620 51803356 57039395 58330788 54850259 48605556 41554813
5418 41554813 35156049 30282897 26731474 23909326 21576798 19648771 18115099 16848928
5410 16848928 15835053 15081294 14419035 13852748 13308857 12909044 12602097 12240635 11983271
5401 11983271 11924083 11682472 11528449 11273550 10897689 10560032 10289986 10104375 9851176 9626680
5391 9626680 9525716 9397350 9357697 9299812 9252598 9080899 8919928 8880957 8839768 8858254 8766666
5380 8766666 8752976 8907935 8849249 8964071 9159508 9281797 9429599 9496377 9599325 9814081
$$ packed form
5444A6562603q7317L0421R5128K38275L28537K95857L27862M65781N97866P30720
5434A9585733R31965R16018J045398J395817J712368K112421K958463L854097
5426C4512280M908907N850433O531736N236039J291393l480529o244703p050743
5418D1554813o398764m873152l551423k822148k332528j928027j533672j266171
5410A6848928j013875p53759o62259n66287n43891l99813l06947l61462k57364
5401A1983271n9188k41611j54023k54899l75861l37657k70046j85611k53199k24496
5391I626680j00964j28366l9653n7885m7214j71699j60971l8971m1189J8486r1588
5380H766666j3690J54959n8686J14822J95437J22289J47802O6778J02948K14756
$$ plain form
5370 9814081 10146787 10530099 11002002 11690112 12470296 13400107 14274052 14765451 14748687 14171993
5360 14171993 13265810 12405179 11609299 10905747 10411463 10169454 9840981 9653753 9524710
5351 9524710 9348210 9348134 9384176 9615470 9684011 9783418 10056364 10330527 10517259 10718259 11253530
5340 11253530 11850301 12559708 13547662 14716819 16403154 18737019 21571228 24615300 27574953
5331 27574953 29800148 29976742 28183280 25167616 21807347 18793270 16474351 14774278
5323 14774278 13429053 12513885 11766321 11033026 10542938 10205889 10103278 9956883 9716965
5314 9716965 9690372 9808981 9929100 10082050 10344121 10651011 11030678 11493582 12160615 13030451
5304 13030451 14298499 16062496 18357333 21356704 24804745 27781495 28987757 27995576
$$ packed form
5370I814081L32706L83312M71903O88110P80184R29811Q73945M91399j6764n76694
5360A4171993r06183q60631p95880p03552m94284k42009l28473j87228j29043
5351I524710j76500p6L6042K31294O8541R9407K72946K74163J86732K01000N35271
5340A1253530N96771P09407R87954J169157J686335K333865K834209L044072K959653
5331B7574953K225195J76594j793462l015664l360269l014077k318919j700073
5323A4774278j345225r15168p47564p33295m90088l37049j02611j46395k39918
5314I716965k6593J18609J20119J52950K62071L06890L79667M62904O67033Q69836
5304A3030451J268048J763997K294837K999371L448041K976750J206262r92181
$$ plain form
5296 27995576 25402213 21927229 18611552 15977305 14069233 12660645 11665377 10806748
5288 10806748 10083030 9571792 9192613 8848790 8640551 8431260 8299975 8313951 8297558 8245694
5278 8245694 8202996 8161107 8310933 8510928 8616989 8780722 9180867 9527986 10183472 10971176
5268 10971176 12003819 13033916 13476998 13564254 13077485 12192191 11271358 10428740 9862166
5259 9862166 9515306 9258757 9149870 8969512 8684451 8498201 8244011 7913687 7602725 7359889
5249 7359889 7218632 7052110 6894340 6698372 6662253 6530726 6427582 6354406 6428462 6347646
5239 6347646 6359497 6333501 6217910 6126835 6090825 6106425 6136796 6168543 6290450 6513360 6658378
5228 6658378 6959076 7268412 7661094 7987157 8220185 8417141 8399392 8340601 8264742 7995681
$$ packed form
5296B7995576k593363l474984l315677k634247j908072j408588r95268q58629
5288A0806748p23718n11238l79179l43823k08239k09291j31285J3976j6393n1864
5278H245694m2698m1889J49826J99995J06061J63733M00145L47119O55486P87704
5268A0971176J032643J030097M43082Q7256m86769q85294r20833q42618n66574
5259I862166l46860k56549j08887j80358k85061j86250k54190l30324l10962k42836
5249G359889j41257j66522j57770j95968l6119j31527j03144p3176P4056q0816
5239F347646J1851k5996j15591r1075l6010J5600L0371L1747J21907K22910J45018
5228F658378L00698L09336L92682L26063K33028J96956j7749n8791p5859k69061
$$ plain form
5218 7995681 7678546 7416323 7226506 7176193 7064064 6956095 6762770 6593814 6510562 6341011
5208 6341011 6111288 5840173 5774680 5747785 5659625 5699855 5755534 5790568 5840466 5831405 5881543
5197 5881543 6001827 6143708 6308376 6555172 6722779 6934956 7133694 7416587 7675169 7829692
5187 7829692 7890696 7813335 7701888 7439178 7199262 6972281 6813106 6607249 6386459 6388291
5177 6388291 6224668 6021396 5968641 5927089 5831959 5692348 5662108 5612182 5660604 5498568 5469831
5166 5469831 5415104 5416300 5467826 5543960 5636001 5577086 5566588 5713565 5871300 6053393 6377975
5155 6377975 6558449 6741941 6800030 6742390 6672560 6603523 6623503 6530758 6456334 6505040 6421961
5144 6421961 6411745 6510285 6581918 6582348 6568723 6502373 6619765 6713030 6804351 6970548 7078525
$$ packed form
5218G995681l17135k62223j89817n0313j12129j07969j93325j68956q3252j69551
5208F341011k29723k71115o5493k6895q8160M0230N5679L5034M9898r061N0138
5197E881543J20284J41881J64668K46796J67607K12177J98738K82893K58582J54523
5187G829692O1004p7361j11447k62710k39916k26981j59175k05857k20790J832
5177F388291j63623k03272n2755m1552r5130j39611l0240m9926M8422j62036k8737
5166E469831n4727J196N1526P6134R2041n8915j0498J46977J57735J82093L24582
5155F377975J80474J83492N8089n7640o9830o9037J9980r2745p4424M8706q3079
5144F421961j0216R8540P1633M30j3625o6350J17392R3265R1321J66197J07977
$$ plain form
5133 7078525 7250533 7510513 7767654 8023574 8389102 8893859 9402291 9741953 9590317 9391493
5123 9391493 9153165 9110276 9259605 9387570 9549201 9968848 10414674 10760045 10782729 10844673
5113 10844673 10962385 11016224 11121670 11324000 11611927 11957725 12301380 12587113 12853308 13081386
5103 13081386 13148396 13280679 13448944 13569022 13651883 13687041 13696581 13761935 13784355 13896850 14008811
5092 14008811 13882712 13885082 13928735 14098698 14363682 14638136 14948592 15131150 15301131 15683698
5082 15683698 16048511 16380959 16760412 17167360 17488358 17881219 18241086 18596550 18883935
5073 18883935 19356987 19817063 20301206 20823738 21565496 22343514 22991992 23792837 24601804
5064 24601804 25394667 26326834 27201070 28251257 29384285 30675955 31973771 33162856 33884442
$$ packed form
5133G078525J72008K59980K57141K55920L65528N04757N08432L39662j51636j98824
5123I391493k38328m2889J49329J27965J61631M19647M45826L45371K2684O1944
5113A0844673J17712N3839J05446K02330K87927L45798L43655K85733K66195K28078
5103A3081386O7010J32283J68265J20078Q2861L5158R540O5354K2420J12495J11961
5092A4008811j26099K370M3653J69963K64984K74454L10456J82558J69981L82567
5082A5683698L64813L32448L79453M06948L20998L92861L59867L55464K87385
5073A8883935M73052M60076M84143N22532P41758P78018O48478Q00845Q08967
5064B4601804P92863R32167Q74236J050187J133028J291670J297816J189085P21586
$$ plain form
5055 33884442 34148406 34569052 35311174 36111551 37151425 38231177 39153865 40024630 41164309
5046 41164309 42216699 43499826 45039039 46782664 48622654 50553039 52628023 55082617
5038 55082617 57671864 60626008 63806058 67611802 71819954 76728027 82373603 89289627
5030 89289627 97465185 107230697 119455196 136084514 159213251 191673902 234897232
5023 234897232 292132345 367853209 457464156 496862210 450261066 371598406 289304144
5016 289304144 221909906 177964591 148279544 126513851 109702448 96155518 85462803
5009 85462803 77232599 70700565 65476625 61263273 58109923 55568315 53825515 52877247
5001 52877247 52496785 52026074 51224118 49542097 47287049 44852260 42533309 40267913 38274866
$$ packed form
5055C3884442K63964M20646P42122Q00377J039874J079752R22688Q70765J139679
5046D1164309J052390J283127J539213J743625J839990J930385K074984K454594
5038E5082617K589247K954144L180050L805744M208152M908073N645576O916024
5030H9289627Q175558R765512J2224499J6629318K3128737L2460651M3223330
5023B34897232N7235113P5720864Q9610947L9398054m6601144p8662660q2294262
5016B89304144o7394238m3945315k9685047k1765693j6811403j3546930j0692715
5009H5462803q230204o532034n223940m213352l153350k541608j742800r48268
5001E2877247l80462m70711q01956j682021k255048k434789k318951k265396j993047
$$ plain form
4992 38274866 36497567 34848413 33258331 31954063 30808996 29932066 29055579 28330428 27584767
4983 27584767 27026643 26399134 25567305 24672395 23985843 23342246 22631379 22102560 21730782
4974 21730782 21494235 21330225 21366488 21487293 21540913 21347854 20865678 20166869 19481425 19017875
4964 19017875 18656761 18237830 18040013 17936743 17781212 17755584 17768664 17830388 17743046 17657681
4954 17657681 17628858 17481009 17539107 17549099 17519382 17414616 17270614 17210683 17045183 16954200 16910608
4943 16910608 17080621 17139131 17235563 17432448 17647720 17830518 17927413 18187905 18334837 18579591
4933 18579591 18948051 19301798 19522353 19752642 19998565 20216022 20645861 21159972 21541971
4924 21541971 21602293 21925375 22211570 22561612 23099772 23709484 24464511 25449542 26616006
$$ packed form
4992C8274866j777299j649154j590082j304268j145067q76930q76487p25151p45661
4983B7584767n58124o27509q31829q94910o86552o43597p10867n28819l71778
4974B1730782k36547j64010L6263J20805N3620j93059m82176o98809o85444m63550
4964A9017875l61114m18931j97817j03270j55531k5628J3080O1724q7342q5365
4954A7657681k8823j47849N8098R992k9717j04766j44002n9931j65500r0983m3592
4943A6910608J70013N8510R6432J96885K15272J82798R6895K60492J46932K44754
4933A8579591L68460L53747K20555K30289K45923K17457M29839N14111L81999
4924B1541971O0322L23082K86195L50042N38160O09712P55027R85031J166464
$$ plain form
4915 26616006 27805974 28543986 29063035 29601532 30194325 31137402 32590099 34834319 38117356
4906 38117356 42622585 48524393 56352093 66714927 77550155 80587487 74312973 64426378
4898 64426378 54230248 46310788 41054763 37547533 35099418 33332035 32130910 31243437
4890 31243437 30742993 30527580 30413202 30635959 31123156 32003872 33226753 35039071 37447975
4881 37447975 40718240 44992482 49956817 52016570 49655155 45764532 41808341 38759308
4873 38759308 36985595 35854944 35094825 34691785 34563399 34542033 34629161 34775816 35147539
4864 35147539 35688224 36409829 37135046 38099699 39277355 40450629 41739329 43084362 44671267
4855 44671267 46447591 48387467 50367833 52615397 54952913 57421373 60049876 62862918
$$ packed form
4915B6616006J189968P38012N19049N38497N92793R43077J452697K244220L283037
4906C8117356M505229N901808P827700J0362834J0835228L037332o274514r886595
4898F4426378j0196130p919460n256025l507230k448115j767383j201125q87473
4890C1243437n00444k15413j14378K22757M87197Q80716J222881J812318K408904
4881C7447975L270265M274242M964335K059753k361415l890623l956191l049033
4873C8759308j773713j130651p60119m03040j28386k1366Q7128J46655L71723
4864C5147539N40685P21605P25217R64653J177656J173274J288700J345033J586905
4855D4671267J776324J939876J980366K247564K337516K468460K628503K813042
$$ plain form
4847 62862918 65713296 68740209 71615358 74187527 76507541 78404737 79910515 81190718
4839 81190718 82230207 83130809 83808656 84317225 84668167 84978559 85468195 86059974 86868449
4830 86868449 87899712 89566188 91692774 94150836 97197107 100774871 104697658 108929072
4822 108929072 113414600 118160034 123171318 128172998 132820942 136783265 139619081 141295086
4814 141295086 141812022 141528264 140654117 139331118 137627986 135704209 133257215 130383147
4806 130383147 127575780 125023237 123217524 122226039 122161533 123018609 124932290 127517230 130794223
4797 130794223 134557514 138644040 142929693 147479933 152200758 157183593 162014607 166351625
4789 166351625 169308761 170469644 169847880 167920409 165277959 162612353 160101882 157824906
$$ packed form
4847F2862918K850378L026913K875149K572169K320014J897196J505778J280203
4839H1190718J039489R00602O77847N08569L50942L10392M89636N91779Q08475
4830H6868449J031263J666476K126586K458062L046271L577764L922787M231414
4822A08929072M485528M745434N011284N001680M647944L962323K835816J676005
4814A41295086N16936k83758q74147j322999j703132j923777k446994k874068
4806A30383147k807367k552543j805713r91485o4506Q57076J913681K584940L276993
4797A30794223L763291M086526M285653M550240M720825M982835M831014M337018
4789A66351625K957136J160883o21764j927471k642450k665606k510471k276976
$$ plain form
4781 157824906 155867231 153924320 151936968 150073557 148824979 147982250 147622744 147764880
4773 147764880 148612051 149994478 151838886 154006568 156159181 158117771 159901861 161646539
4765 161646539 163132574 164498337 165578864 165854154 165036362 163101323 160630691 157821410
4757 157821410 154960302 152275262 150006935 147817938 145635774 143424130 141148858 138985829
4749 138985829 137181763 135628418 134115432 132389192 130256904 127814854 125247138 122705483
4741 122705483 120229858 117806359 115436801 113096236 110315818 107177614 103784526 100087846
4733 100087846 96303680 92398275 88803268 85537238 82398370 79428855 76317432 73160788
4725 73160788 70125718 66938965 63705895 60529135 57539118 54676328 51880042 49041285
$$ packed form
4781A57824906j957675j942911j987352j863411j248578q42729l59506J42136
4773A47764880Q47171J382427J844408K167682K152613J958590J784090J744678
4765A61646539J486035J365763J080527K75290q17792j935039k470632k809281
4757A57821410k861108k685040k268327k188997k182164k211644k275272k163029
4749A38985829j804066j553345j512986j726240k132288k442050k567716k541655
4741A22705483k475625k423499k369558k340565k780418l138204l393088l696680
4733A00087846l784166l905405l595007l266030l138868k969515l111423l156644
4725G3160788l035070l186753l233070l176760k990017k862790k796286k838757
$$ plain form
4717 49041285 46226842 43721421 41139897 38984231 37155798 35493151 33929084 32659035
4709 32659035 31759983 30793254 30039735 29698598 29701897 30073926 30427661 30612307 30082917 28456736
4699 28456736 26423579 24383651 22618256 21411577 20412956 19576212 18921366 18296091 17659286
4690 17659286 17100203 16578308 16032863 15537428 15081369 14794029 14424697 14167152 13805261
4681 13805261 13462851 13039689 12785809 12453395 12223367 11943752 11613064 11394636 11175637
4672 11175637 10971092 10770894 10541274 10265045 10042130 9776740 9648285 9413477 9228764
4663 9228764 8992888 8741240 8610095 8331573 8131709 8102648 7953638 7810521 7633457 7506692
4653 7506692 7450579 7342442 7113636 6995696 6842344 6668883 6655919 6620156 6550553 6377066
$$ packed form
4717D9041285k814443k505421k581524k155666j828433j662647j564067j270049
4709C2659035q99052r66729p53519l41137L299L72029L53735J84646n29390j626181
4699B8456736k033157k039928j765395j206679r98621q36744o54846o25275o36805
4690A7659286n59083n21895n45445m95435m56059k87340l69332k57545l61891
4681A3805261l42410m23162k53880l32414k30028k79615l30688k18428k18999
4672A1175637k04545k00198k29620k76229k22915k65390j28455k34808j84713
4663I228764k35876k51648j31145k78522j99864k9061j49010j43117j77064j26765
4653G506692n6113j08137k28806j17940j53352j73461j2964l5763o9603j73487
$$ plain form
4643 6377066 6132340 6031906 5999376 5912851 5764609 5670139 5633403 5559267 5529779 5363999 5319927
4632 5319927 5289058 5212294 5121386 4983806 4884659 4800985 4780469 4759593 4765026 4761813 4669290 4551461
4620 4551461 4520557 4496869 4586643 4591702 4522217 4393173 4405471 4291408 4348994 4342029 4359935
4609 4359935 4388432 4288120 4252952 4233867 4131572 4071757 4092088 3992663 3882340 3820486 3805149
4598 3805149 3744944 3726963 3651891 3609776 3760553 3716582 3653767 3754952 3723617 3808439 3816548
4587 3816548 3700846 3571536 3517849 3455495 3421652 3447260 3395651 3320607 3247006 3310396 3306321
4576 3306321 3294984 3363244 3411546 3379864 3359801 3326109 3295099 3306242 3224197 3307098 3208113
4565 3208113 3140092 3044757 3148200 3182750 3252879 3164614 3183672 3152293 3111883 3091381 3115659
$$ packed form
4643F377066k44726j00434l2530q6525j48242r4470l6736p4136k9488j65780m4072
4632E319927l0869p6764r0908j37580r9147q3674k0516k0876N433l213r2523j17829
4620D551461l0904k3688Q9774N059o9485j29044J2298j14063N7586o965J7906
4609D359935K8497j00312l5168j9085j02295n9815K0331r9425j10323o1854j5337
4598C805149o0205j7981p5072m2115J50777m3971o2815J01185l1335Q4822Q109
4587C816548j15702j29310n3687o2354l3843K5608n1609p5044p3601O3390m075
4576C306321j1337O8260M8302l1682k0063l3692l1010J1143q2045Q2901r8985
4565C208113o8021r5335J03443L4550P0129q8265J9058l1379m0410k0502K4278
$$ plain form
4554 3115659 3149492 3100706 3076274 3062507 3171462 3190239 3214313 3103765 3066181 3166875 3197135
4543 3197135 3101144 3140576 3026140 3090198 2998840 2920437 3007457 3067583 3010314 3046778 3116522
4532 3116522 3139360 3192299 3108187 3012906 3182833 3222681 3189273 3282718 3304818 3234238 3214472
4521 3214472 3215244 3201527 3270560 3254645 3240754 3189788 3095938 3084933 3082688 3179982 3238085 3116367
4509 3116367 3168043 3231227 3238766 3266129 3352323 3276963 3302681 3284001 3338601 3407575 3347175 3398680
4497 3398680 3449832 3447939 3394710 3427784 3395408 3422275 3491924 3413753 3486446 3460672 3373744 3408206
4485 3408206 3467399 3436896 3342964 3301143 3402090 3398769 3449808 3583712 3620715 3677234 3740685
4474 3740685 3778574 3753198 3795066 3735922 3873379 3958350 3941814 3878274 3849319 3887743 3912592
$$ packed form
4554C115659L3833m8786k4432j3767J08955J8777K4074j10548l7584J00694L0260
4543C197135r5991L9432j14436O4058r1358p8403Q7020O0126n7269L6464O9744
4532C116522K2838N2939q4112r5281J69927L9848l3408R3445K2100p0580j9766
4521C214472P72j3717O9033j5915j3891n0966r3850j1005k245R7294N8103j21718
4509C116367N1676O3184P539K7363Q6194p5360K5718j8680N4600O8974o0400N1505
4497C398680N1152j893n3229L3074l2376K6867O9649p8171P2693k5774q6928L4462
4485C408206N9193l0503r3932m1821J00947l321N1039J33904L7003N6519O3451
4474C740685L7889k5376M1868n9144J37457Q4971j6536o3540k8955L8424K4849
$$ plain form
4463 3912592 3902604 3935120 3908167 3979816 4018376 4132152 4050989 4018462 4153234 4151499 4089262
4452 4089262 4022296 4076914 4101011 4064825 4043375 4132214 4175203 4178209 4063550 3992075 4079782
4441 4079782 4144146 4071541 4042959 4095198 4043628 4060274 4125339 4137906 4159036 4177758 4301643
4430 4301643 4305323 4241628 4304124 4336433 4312489 4304219 4316487 4478850 4543319 4537440 4619248 4685696
4418 4685696 4707494 4792012 4886271 4870219 4845471 4856091 4917717 5028677 5160672 5219510 5324075
4407 5324075 5451929 5563121 5582976 5621778 5667803 5500904 5424366 5465823 5582313 5460920
4397 5460920 5500557 5635790 5660602 5671645 5669601 5716729 5779026 5760459 5704827 5739951 5746350 5744353
4385 5744353 5752679 5853965 5942958 5876755 5762120 5804558 5872130 5862988 5874027 5836052 5965525
$$ packed form
4463C912592r988L2516k6953P1649L8560J13776q1163l2527J34772j735o2237
4452D089262o6966N4618K4097l6186k1450Q8839M2989L006j14659p1475Q7707
4441D079782O4364p2605k8582N2239n1570J6646O5065J2567K1130J8722J23885
4430D301643L680o3695O2496L2309k3944q270J2268J62363O4469n879Q1808O6448
4418D685696K1798Q4518R4259j6052k4748J0620O1626J10960J31995N8838J04565
4407E324075J27854J11192J9855L8802M6025j66899p6538M1457J16490j21393
4397E460920L9637J35233K4812J1043k044M7128O2297j8567n5632L5124O399j997
4385E744353Q326J01286Q8993o6203j14635M2438O7572r142J1039l7975J29473
$$ plain form
4374 5965525 6050132 6030516 5988267 6125894 6205378 6162159 6340973 6498388 6464895 6415052 6518506
4363 6518506 6495687 6559983 6457656 6438401 6532854 6515496 6486022 6440046 6368197 6375753 6415377
4352 6415377 6399482 6276717 6124237 6078159 6160793 6285652 6266160 6319310 6317611 6228097 6326664
4341 6326664 6362073 6277314 6238075 6270678 6354894 6302902 6323252 6220042 6090944 6190569 6273517
4330 6273517 6166063 6142112 6084955 6178966 6158907 6113511 6069492 6012554 6018054 6018169 6010366 6012295
4318 6012295 6155314 6202437 6215516 6229447 6086766 5958422 5915556 5964552 6037609 5948489 5882936
4307 5882936 5879486 5829874 5862841 5851216 5884592 5877067 5816785 5884394 5866346 5981408 5924640 5897610
4295 5897610 5868452 5843721 5909215 5936373 6015594 6100071 6116050 6133792 6067358 6152717 6118019
$$ packed form
4374E965525Q4607j9616m2249J37627P9484m3219J78814J57415l3493m9843J03454
4363F518506k2819O4296j02327j9255R4453j7358k9474m5976p1849P556L9624
4352F415377j5895j22765j52480m6078Q2634J24859j9492N3150j699q9514R8567
4341F326664L5409q4759l9239L2603Q4216n1992K0350j03210j29098R9625Q2948
4330F273517j07454k3951n7157R4011k0059m5396m4019n6938N500J15p803J929
4318F012295J43019M7123J3079J3931j42681j28344m2866M8996P3057q9120o5553
4307E882936l450m9612L2967j1625L3376p525o0282O7609j8048J15062n6768k7030
4295E897610k9158k4731O5494K7158P9221Q4477J5979J7742o6434Q5359l4698
$$ plain form
4284 6118019 6158729 6137520 6133910 6125473 6170479 6288755 6239130 6292604 6306626 6438837 6410644
4273 6410644 6331217 6507173 6510396 6563834 6732543 6687876 6647948 6795244 7001904 7091558 7114003
4262 7114003 7260060 7436352 7478711 7485591 7576657 7602690 7711619 7826608 7955626 8015391 8164820
4251 8164820 8327559 8479051 8489597 8587997 8615218 8609279 8640783 8790964 8841074 8928934 9038767
4240 9038767 9125292 9143194 9089758 9308268 9340502 9567956 9717607 9886358 10202310 10336548
4230 10336548 10322532 10407400 10577111 10780508 11052741 11283932 11367362 11522026 11702011 11877544
4220 11877544 12044101 12108149 12175974 12359899 12499611 12604441 12700727 12854775 13007380 13170563
4210 13170563 13208787 13342765 13346711 13507368 13708364 13921584 14056846 14184235 14401794 14640787
$$ packed form
4284F118019M0710k1209l610q437M5006J18276m9625N3474J4022J32211k8193
4273F410644p9427J75956L223N3438J68709m4667l9928J47296K06660Q9654K2445
4262G114003J46057J76292M2359O880R1066K6033J08929J14989J29018N9765J49429
4251H164820J62739J51492J0546R8400K7221n939L1504J50181N0110Q7860J09833
4240I038767Q6525J7902n3436K18510L2234K27454J49651J68751L15952J34238
4230A0336548j4016Q4868J69711K03397K72233K31191Q3430J54664J79985J75533
4220A1877544J66557O4048O7825J83925J39712J04830R6286J54048J52605J63183
4210A3170563L8224J33978L946J60657K00996K13220J35262J27389K17559K38993
$$ plain form
4200 14640787 14829925 15064975 15269309 15512725 15721042 15872145 16041512 16267217 16455260
4191 16455260 16643092 16852698 17066146 17389585 17847428 18052861 18346606 18617500 18782607
4182 18782607 18931528 19252291 19547434 19788253 20229356 20662204 21126857 21593869 22119543
4173 22119543 22702384 23272817 23807348 24470857 24985308 25607769 26197807 26824439 27655103
4164 27655103 28514662 29393000 30281301 31101287 31885511 32589994 33266530 33736439 34275831
4155 34275831 34768981 35245328 35663473 36127054 36742475 37486425 38304559 39307623 40518672
4146 40518672 41886239 43268084 44758505 46127016 47354601 48429832 49559270 50553328
4138 50553328 51633924 52873563 54024064 55278731 56635466 57944100 59230519 60338210
$$ packed form
4200A4640787J89138K35050K04334K43416K08317J51103J69367K25705J88043
4191A6455260J87832K09606K13448L23439M57843K05433K93745K70894J65107
4182A8782607J48921L20763K95143K40819M41103M32848M64653M67012N25674
4173B2119543N82841N70433N34531O63509N14451O22461N90038O26632Q30664
4164B7655103Q59559Q78338Q88301Q19986P84224P04483O76536M69909N39392
4155C4275831M93150M76347M18145M63581O15421P43950Q18134J003064J211049
4146D0518672J367567J381845J490421J368511J227585J075231J129438R94058
4138E0553328J080596J239639J150501J254667J356735J308634J286419J107691
$$ plain form
4130 60338210 61535284 62648976 63663402 64676721 65678026 66647365 67549342 68564011
4122 68564011 69655347 71233195 73210997 75646642 78461623 81423871 84134372 86308201
4114 86308201 87650179 88324903 88645920 88939725 89358132 89861735 90500792 91255153 91878642
4105 91878642 92557697 93482560 94570034 95630496 96991285 98218355 99203861 100047746 100731006
4096 100731006 101331971 101918508 102937482 104450411 106719342 109583772 113141028 117166740
4088 117166740 121244934 124925400 127762398 129994460 131607367 133122556 134856198 136417636
4080 136417636 137760025 138785286 139828907 140888490 142092748 143203253 144070833 144605292
4072 144605292 145010620 145468803 146299834 147716433 149750674 152485876 155892908 159263965
$$ packed form
4130F0338210J197074J113692J014426J013319J001305R69339R01977J014669
4122F8564011J091336J577848J977802K435645K814981K962248K710501K173829
4114H6308201J341978O74724L21017K93805M18407N03603O39057P54361O23489
4105I1878642O79055R24863J087474J060462J360789J227070R85506Q43885O83260
4096A00731006O00965N86537J018974J512929K268931K864430L557256M025712
4088A17166740M078194L680466K836998K232062J612907J515189J733642J561438
4080A36417636J342389J025261J043621J059583J204258J110505Q67580N34459
4072A44605292M05328M58183Q31031J416599K034241K735202L407032L371057
$$ plain form
4064 159263965 161934151 163562499 163964585 163547780 162818120 161982789 161292950 160888603 161040536
4055 161040536 161819501 162810671 163750213 164081647 163995659 163514789 162965929 162411641 161664565
4046 161664565 160618594 159432063 158100424 156635617 154836304 152967082 151317649 149898951
4038 149898951 148590429 147032101 144352272 140477131 135716616 130706843 126265280 122518757
4030 122518757 119636001 117641092 116247201 115269473 114325024 113172263 111641627 109762873
4022 109762873 107835376 105739070 103569724 101399978 99362992 97503743 95736342 94306577
4014 94306577 93185269 92148169 91296359 90467235 89428197 87818173 85435850 82702679
4006 82702679 79715802 76715342 74034417 71795034 69861899 68267898 66917927 65710017
$$ packed form
4064A59263965K670186J628348M02086m16805p29660q35331o89839m04347J51933
4055A61040536P78965R91170R39542L31434q5988m80870n48860n54288p47076
4046A61664565j045971j186531j331639j464807j799313j869222j649433j418698
4038A49898951j308522j558328k679829l875141m760515n009773m441563l746523
4030A22518757k882756j994909j393891r77728r44449j152761j530636j878754
4022A09762873j927497k096306k169346k169746k036986j859249j767401j429765
4014I4306577j121308j037100q51810q29124j039038j610024k382323k733171
4006H2702679k986877l000460k680925k239383j933135j594001j349971j207910
$$ plain form
3998 65710017 64433834 63228238 61810025 60248019 58894216 57449695 56198444 54968999
3990 54968999 53716103 52578733 51606308 50801827 49925660 48975701 48135070 47016228 45851452
3981 45851452 44654026 43321545 42017249 40837279 39936033 39377117 39139262 39067841 38916401
3972 38916401 38704456 37993573 36891845 35751546 34719362 34014527 33248511 32183728 30890131
3963 30890131 29362825 27804352 26402943 25061082 23837924 22800446 21894636 21111400
3955 21111400 20334958 19714069 19088196 18529762 18052263 17450401 17043035 16657140 16211015
3946 16211015 15768742 15433583 15113678 14830530 14510381 14226123 14010071 13806025 13711598 13580576
3936 13580576 13454633 13429407 13368185 13117880 12874645 12700271 12542102 12496818 12442175 12286520
$$ packed form
3998F5710017j276183j205596j418213j562006j353803j444521j251251j229445
3990E4968999j252896j137370r72425q04481q76167r49959q40631j118842j164776
3981D5851452j197426j332481j304296j179970r01246n58916k37855p1421j51440
3972C8916401k11945p10883j101728j140299j032184p04835p66016j064783j293597
3963C0890131j527306j558473j401409j341861j223158j037478r05810p83236
3955B1111400p76442o20889o25873n58434m77499o01862m07366l85895m46125
3946A6211015m42273l35159l19905k83148l20149k84258k16052k04046r4427j31022
3936A3580576j25943k5226o1222k50305k43235j74374j58169m5284n4643j55655
$$ plain form
3926 12286520 12165743 12091720 12058480 11771991 11554667 11238637 11142432 11070876 10833630 10550113
3916 10550113 10381485 10347114 10156489 9993915 9935726 9836504 9814174 9835490 9725189 9689009
3906 9689009 9631105 9487795 9479838 9548692 9460315 9443469 9498662 9451203 9422854 9529249 9596942
3895 9596942 9718715 9614733 9620008 9744113 9705183 9680604 9826510 9794783 9653163 9621118 9493717
3884 9493717 9484410 9605558 9521254 9339079 9295487 9139387 8967047 8874074 8907412 8905079 8880629
3873 8880629 8822513 8627041 8508085 8427350 8351582 8452229 8567488 8633665 8772642 8803859
3863 8803859 8755468 8732733 8758203 8636621 8570586 8516963 8435745 8222727 8237183 8247159 8228120
3852 8228120 8256873 8198113 8162893 8116850 8084158 7946798 7860948 7817678 7809272 7778400 7712343
$$ packed form
3926A2286520j20777p4023l3240k86489k17324l16030r6205p1556k37246k83517
3916A0550113j68628l4371j90625j62574n8189r9222k2330K1316j10301l6180
3906I689009n7904j43310p957O8854q8377j6846N5193m7459k8349J06395O7693
3895I596942J21773j03982N275J24105l8930k4579J45906l1727j41620l2045j27401
3884I493717r307J21148q4304j82175m3592j56100j72340r2973L3338k333k4450
3873H880629n8116j95472j18956q0735p5768J00647J15259O6177J38977L1217
3863H803859m8391k2735K5470j21582o6035n3623q1218k13018J4456R976j9039
3852H228120K8753n8760l5220m6043l2692j37360q5850m3270q406l0872o6057
$$ plain form
3841 7712343 7711061 7628809 7635791 7668238 7547528 7384602 7363094 7256064 7152346 7194364 7246750
3830 7246750 7267546 7279850 7335694 7368465 7379996 7344247 7464783 7490471 7570073 7636825 7749073
3819 7749073 7676394 7615943 7552266 7424383 7459612 7510989 7636691 7639107 7584265 7608025 7677538
3808 7677538 7668092 7814388 7877309 7814546 7648899 7529348 7452400 7388706 7311959 7208681 7172349
3797 7172349 7241975 7248061 7322158 7298615 7326838 7313519 7233459 7306105 7432719 7439588 7480675 7535590
3785 7535590 7533389 7478608 7462100 7448352 7507356 7556143 7402437 7407860 7273161 7128263 7156965
3774 7156965 7128498 7145713 7190421 7128247 7161949 7103254 7126315 7036861 6986021 6878870 6872431
3763 6872431 6944144 6802573 6755941 6896327 6898691 6926847 6937283 7110486 7077230 7062805 7098697
$$ packed form
3841G712343j282q2252O982L2447j20710j62926k1508j07030j03718M2018N2386
3830G246750K0796J2304N5844L2771J1531l5749J20536K5688P9602O6752J12248
3819G749073p2679o0451o3677j27883L5229N1377J25702K416n4842K3760O9513
3808G677538r446J46296O2921o2763j65647j19551p6948o3694p6747j03278l6332
3797G172349O9626O086P4097k3543K8223j3319q0060P2646J26614O869M1087N4915
3785G535590k201n4781j6508j3748N9004M8787j53706N423j34699j44898K8702
3774G156965k8467J7215M4708o2174L3702n8695K3061q9454n0840j07151o439
3763F872431P1713j41571m6632J40386K364K8156J0436J73203l3256j4425L5892
$$ plain form
3752 7098697 7082416 6986737 7055502 6985788 6998873 6932870 6858456 6741649 6706463 6651102 6564012
3741 6564012 6491309 6388072 6448882 6442245 6356793 6283759 6267972 6111779 6126355 6148588 6218695
3730 6218695 6085474 5941194 5899408 5896391 5900837 5989851 5958604 5958981 6000048 6113635 6133725 6146376
3718 6146376 6241464 6241846 6161461 6128233 6144798 6121502 6043017 6023098 5903895 5828571 5890570 5799110
3706 5799110 5712396 5705464 5675193 5655329 5700467 5708839 5715749 5687104 5626274 5632870 5642168 5561853
3694 5561853 5507203 5656543 5682497 5751632 5776300 5714960 5662728 5639262 5603253 5445623 5439478
3683 5439478 5542755 5490035 5585735 5488526 5604177 5608099 5403126 5423795 5489973 5619527 5703069
3672 5703069 5666023 5703380 5646246 5608461 5776061 5739802 5761424 5832546 5969845 6051616 6091467
$$ packed form
3752G098697j6281r5679O8765o9714J3085o6003p4414j16807l5186n5361q7090
3741F564012p2703j03237O0810o637q5452p3034j5787j56193J4576K2233P0107
3730F218695j33221j44280m1786l017M446Q9014l1247L77M1067J13587K0090J2651
3718F146376R5088L82q0385l3228J6565k3296p8485j9919j19203p5324O1999r1460
3706E799110q6714o932l0271j9864M5138Q372O910k8645o0830O596R298q0315
3694E561853n4650J49340K5954O9135K4668o1340n2232k3466l6009j57630o145
3683E439478J03277n2720R5700r7209J15651L922k04973K0669O6178J29554Q3542
3672E703069l7046L7357n7134l7785J67600l6259K1622P1122J37299Q1771L9851
$$ plain form
3661 6091467 6189480 6255666 6232300 6310226 6462755 6709446 6919993 7004762 6980755 6780551 6621438
3650 6621438 6545986 6464139 6362161 6484741 6480619 6310915 6354502 6527571 6437567 6491484 6551919
3639 6551919 6676014 6772623 6911900 6984444 7025493 7155937 7416017 7632693 7729420 7782429
3629 7782429 7767155 7698994 7656916 7673813 7774422 7918057 8020354 7971795 7803288 7860923 7688089
3618 7688089 7808232 7822651 7769860 7740051 7797692 7812821 7845720 8020109 8234599 8351209 8342867
3607 8342867 8353093 8490320 8546375 8558956 8611550 8741095 8920000 9167121 9497958 9605357
3597 9605357 9587221 9754502 9908459 9971272 10179799 10450365 10604684 10865605 11026389 11098801
3587 11098801 11151922 11095998 11092883 11077877 11101498 11066410 11136561 11113146 11196049 11256583 11357375
$$ packed form
3661F091467R8013O6186k3366P7926J52529K46691K10547Q4769k4007k00204j59113
3650F621438p5452q1847j01978J22580m122j69704M3587J73069r0004N3917O0435
3639F551919J24095R6609J39277P2544M1049J30444K60080K16676R6727N3009
3629G782429j5274o8161m2078J6897J00609J43635J02297m8559j68507N7635j72834
3618G688089J20143J4419n2791k9809N7641J5129L2899J74389K14490J16610q342
3607H342867J0226J37227N6055J2581N2594J29545J78905K47121L30837J07399
3597I605357j8136J67281J53957O2813K08527K70566J54319K60921J60784P2412
3587A1098801N3121n5924l115j5006K3621l5088P0151k3415Q2903O0534J00792
$$ plain form
3576 11357375 11481104 11428678 11586116 11795887 11967626 12100493 12253625 12568398 12876779 13028094
3566 13028094 13207187 13427516 13748776 13939458 14229246 14623575 14826259 15179827 15659203
3557 15659203 15939563 16251317 16443367 16717980 16912259 17089757 17381507 17502771 17764629
3548 17764629 18014303 18213968 18565066 18782773 19047155 19404040 19642835 19813917 20074314
3539 20074314 20317602 20721216 21164636 21562159 22084818 22547893 23020479 23493361 24081308
3530 24081308 24795399 25457771 26180136 26830517 27719034 28613877 29460217 30560558 31764623
3521 31764623 32928355 33974230 35094833 36266006 37649388 39161080 40790789 42481128
3513 42481128 44363581 46425018 48460874 50429227 52358232 53886948 55213701 56089473
$$ packed form
3576A1357375J23729n2426J57438K09771J71739J32867J53132L14773L08381J51315
3566A3028094J79093K20329L21260J90682K89788L94329K02684L53568M79376
3557A5659203K80360L11754J92050K74613J94279J77498K91750J21264K61858
3548A7764629K49674J99665L51098K17707K64382L56885K38795J71082K60397
3539B0074314K43288M03614M43420L97523N22659M63075M72586M72882N87947
3530B4081308P14091O62372P22365O50381Q88517Q94843Q46340J100341J204065
3521C1764623J163732J045875J120603J171173J383382J511692J629709J690339
3513D2481128J882453K061437K035856J968353J929005J528716J326753Q75772
$$ plain form
3505 56089473 56381015 55937713 54905542 53277116 51255592 49005080 46789255 44879787
3497 44879787 43152609 41678546 40509189 39459073 38740031 38286827 37975791 37783076 37527789
3488 37527789 37220459 36894641 36823308 37168398 38087184 39697188 42051061 44994272 48135105
3479 48135105 50293720 50252133 48324157 45142812 41853132 39063022 36615842 34574991
3471 34574991 32843391 31128505 29639996 28446507 27576850 26867544 26380578 26084093 25861419
3462 25861419 25779785 25867294 26102680 26391767 26818998 27432654 28135063 29030609 30183339 31744452
3452 31744452 34003618 37172506 41714471 47683214 54585385 60318556 62140520 59536204
3444 59536204 53916570 47188677 40844580 35462997 31229805 27882727 25484477 23592109
$$ packed form
3505E6089473K91542m43302j032171j628426k021524k250512k215825j909468
3497D4879787j727178j474063j169357j050116p19042m53204l11036j92715k55287
3488C7527789l07330l25818p1333L45090R18786J610004K353873K943211L140833
3479D8135105K158615m1587j927976l181345l289680k790110k447180k040851
3471C4574991j731600j714886j488509j193489q69657p09306m86966k96485k22674
3462B5861419q1634Q7509K35386K89087M27231O13656P02409Q95546J152730J561113
3452C1744452K259166L168888M541965N968743O902171N733171J821964k604316
3444E9536204n619634o727893o344097n381583m233192l347078k398250j892368
$$ plain form
3436 23592109 22082030 20881894 19855491 19154219 18545122 18000360 17605083 17292030 17185129
3427 17185129 17124942 17127770 17330377 17622188 17928643 18264986 18884427 19779180 20973729 22852126
3417 22852126 25268926 28190713 30818931 32118160 31342982 28914817 25617704 22293345
3409 22293345 19453746 17289396 15682313 14563569 13662804 12949461 12260753 11653436 11106629
3400 11106629 10635962 10272549 9990649 9812490 9663673 9537533 9247224 9048716 8827875
3391 8827875 8675923 8542632 8371159 8203341 8090236 8004066 7938896 7809030 7696364 7560878
3381 7560878 7440785 7342223 7290162 7128221 7039619 6985822 6948072 6821392 6761566 6697928 6513097
3370 6513097 6378939 6269872 6242264 6209881 6119682 6050868 6039175 5997285 5990451 5966389 5816584
$$ packed form
3436B3592109j510079j200136j026403p01272o09097n44762l95277l13053j06901
3427A7185129o0187K828K02607K91811L06455L36343O19441Q94753J194549J878397
3417B2852126K416800K921787K628218J299229p75178k428165l297113l324359
3409B2293345k839599k164350j607083j118744r00765p13343o88708o07317n46807
3400A1106629m70667l63413k81900j78159j48817j26140k90309j98508k20841
3391H827875j51952j33291j71473j67818j13105q6170o5170j29866j12666j35486
3381G560878j20093r8562n2061j61941q8602n3797l7750j26680n9826o3638j84831
3370F513097j34158j09067k7608l2383r0199o8814j1693m1890o834k4062j49805
$$ plain form
3359 5816584 5730874 5690449 5735717 5675807 5612036 5541696 5582919 5523465 5485423 5474798 5470671 5432533
3347 5432533 5389082 5392135 5323277 5306902 5360902 5262086 5213420 5252835 5030378 5040330 5038138 5016870
3335 5016870 4982744 4967914 4895149 5009527 4897201 4835233 4730944 4695622 4573245 4525958 4509481
3324 4509481 4568981 4570210 4491799 4474193 4498968 4450979 4381741 4455133 4504703 4456315 4437599 4459390
3312 4459390 4360536 4299852 4271081 4301749 4201471 4235530 4349855 4356048 4274134 4279601 4289047 4238664
3300 4238664 4130001 4138731 4211904 4272790 4189432 4173601 4126238 4216302 4181531 4060711 4090481
3289 4090481 4193201 4262512 4279837 4188627 4122413 4055529 4062891 4101608 4175609 4233373 4223118
3278 4223118 4217367 4289925 4356716 4344607 4390888 4465461 4411801 4509388 4587287 4659385 4755089 4777544
$$ packed form
3359E816584q5710m0425M5268n9910o3771p0340M1223n9454l8042j0625m127l8138
3347E432533m3451L053o8858j6375N4000r8816m8666L9415k22457R952k192k1268
3335E016870l4126j4830p2765J14378j12326o1968j04289l5322j22377m7287j6477
3324D509481N9500J229p8411j7606K4775m7989o9238P3392M9570m8388j8716K1791
3312D459390r8854o0684k8771L0668j00278L4059J14325O193q1914N467R446n0383
3300D238664j08663Q730P3173O0886q3358j5831m7363R0064l4771j20820K9770
3289D090481J02720O9311J7325r1210o6214o6884P362L8717P4001N7764j0255
3278D223118n751P2558O6791j2109M6281P4573n3660R7587P7899P2098R5704K2455
$$ plain form
3266 4777544 4980449 5060321 5064385 5069232 5154260 5269806 5396976 5421783 5511827 5645631 5771503
3255 5771503 5944507 6073050 6254886 6387958 6607068 6718177 6909671 7201383 7500642 7910421
3245 7910421 8312931 8530339 8742613 8807039 8550415 8307271 8112381 8047215 7983967 8019916
3235 8019916 8085826 8219169 8577761 9028839 9255113 9455409 9596549 9540666 9447698 9348972
3225 9348972 9118602 8957531 8915664 8936465 9043995 9221012 9426098 9704292 9952559 10334407
3215 10334407 10687982 11232337 11848716 12576628 13132930 13429883 13477442 13122676 12785297 12374039
3205 12374039 12118161 12069786 12265010 12627906 13160779 13751976 14469896 15233511 15790397 15830694
3195 15830694 15603388 15350961 15120453 14711949 14563418 14549002 14429751 14362107 14388154 14511391
$$ packed form
3266D777544K02905P9872M064M847Q5028J15546J27170K4807R0044J33804J25872
3255E771503J73004J28543J81836J33072K19110J11109J91494K91712K99259M09779
3245G910421M02510K17408K12274O4426k56624k43144j94890o5166o3248L5949
3235H019916O5910J33343L58592M51078K26274K00296J41140n5883r2968r8726
3225I348972k30370j61071m1867K0801J07530J77017K05086K78194K48267L81848
3215A0334407L53575N44355O16379P27912N56302K96953M7559l54766l37379m11258
3205A2374039k55878m8375J95224L62896N32873N91197P17920P63615N56886M0297
3195A5830694k27306k52427k30508m08504j48531j4416j19251o7644K6047J23237
$$ plain form
3185 14511391 14598959 14697349 14922994 15133923 15399362 15663468 15846425 16183933 16447888 16592716
3175 16592716 16807183 17134833 17351384 17784117 18174246 18770408 19461806 20239258 21296816
3166 21296816 22283183 23145449 23691766 23612670 22972121 22048316 20924696 19913019 18997414
3157 18997414 18174857 17601947 17117221 16710086 16577171 16507918 16468089 16522411 16617050 16845051
3147 16845051 17008518 17211512 17492649 17818655 18072057 18351541 18616913 18921846 19176547
3138 19176547 19264963 19226834 19150275 18921957 18510116 18123877 17642316 17042878 16381626 15751385
3128 15751385 15149457 14669864 14213901 13724604 13326475 13165838 13015877 12781519 12723079 12722096
3118 12722096 12617391 12578696 12414845 12317998 12130390 11974740 11748138 11472419 11196505 10807931
$$ packed form
3185A4511391Q7568R8390K25645K10929K65439K64106J82957L37508K63955J44828
3175A6592716K14467L27650K16551M32733L90129N96162O91398P77452J057558
3166B1296816R86367Q62266N46317p9096o40549r23805j123620j011677r15605
3157A8997414q22557n72910m84726m07135j32915o9253l9829N4322R4639K28001
3147A6845051J63467K02994K81137L26006K53402K79484K65372L04933K54701
3138A9176547Q8416l8129p6559k28318m11841l86239m81561n99438o61252o30241
3128A5751385o01928m79593m55963m89297l98129j60637j49961k34358n8440r83
3118A2722096j04705l8695j63851r6847j87608j55650k26602k75719k75914l88574
$$ plain form
3108 10807931 10385845 9964002 9607618 9158387 8727612 8275221 7923391 7636911 7312358
3099 7312358 7075500 6831999 6619975 6394397 6065798 5925263 5789298 5576305 5378119 5400011
3089 5400011 5393957 5284398 5172673 5096477 4926934 4829767 4755456 4647794 4459960 4305927
3079 4305927 4231012 4091772 3954132 3863414 3711486 3530991 3576458 3461674 3357027 3391864
3069 3391864 3369721 3150889 3089179 3072406 2926706 2852615 2678307 2660960 2795427 2804247 2702543
3058 2702543 2599228 2579378 2602968 2499040 2420470 2480216 2383409 2275660 2238700 2284589 2321444
3047 2321444 2267548 2125520 2057497 2131399 2061583 2029394 1943446 1738001 1772148 1759499 1694900
3036 1694900 1677167 1660593 1630625 1553877 1596604 1609021 1589995 1510754 1508448 1544657 1521966 1563124
$$ packed form
3108A0807931m22086m21843l56384m49231m30775m52391l51830k86480l24553
3099G312358k36858k43501k12024k25578l28599j40535j35965k12993j98186K1892
3089E400011o054j09559j11725p6196j69543r7167p4311j07662j87834j54033
3079D305927p4915j39240j37640r0718j51928j80495M5467j14784j04647L4837
3069C391864k2143k18832o1710j6773j45700p4091j74308j7347J34467Q820j01704
3058B702543j03315j9850K3590j03928p8570N9746r6807j07749l6960M5889L6855
3047B321444n3896j42028o8023P3902o9816l2189q5948k05445L4147j2649o4599
3036A694900j7733j6574k9968p6748M2727J2417j9026p9241k306L6209k2691M1158
$$ plain form
3024 1563124 1550769 1531107 1519015 1475533 1386625 1398452 1370670 1296355 1246761 1277785 1295523
3013 1295523 1185510 1104752 1014217 1064489 1120491 940683 969730 975317 1045845 1026633 942368
3002 942368 840495 853997 915616 933041 996886 932078 979452 917047 875128 862652 875704
2991 875704 813936 755484 813658 754797 675614 709594 758234 779743 729148 627727 636875 642676
2979 642676 688504 630918 587567 681728 617047 583296 570945 544874 496181 473601 458532 586608
2967 586608 633023 620530 577197 509504 436364 488491 498555 566638 617701 662783 666982 644044
2955 644044 544344 581148 625004 628092 656044 553918 531761 430052 513161 508775 524737 393243
2943 393243 463808 513277 482769 484645 388030 413665 426706 483394 464024 419177 464813 449505
$$ packed form
3024A563124j2355j9662j2092m3482q8908J1827k7782p4315m9594L1024J7738
3013A295523j10013q0758r0535N0272N6002j79808K9047N587P0528j9212q4265
3002I42368j01873J3502O1619J7425O3845o4808M7374o2405m1919j2476J3052
2991H75704o1768n8452N8174n8861p9183L3980M8640K1509n0595j01421R148N801
2979F42676M5828n7586m3351R4161o4681l3751j2351k6071m8693k2580j5069J28076
2967E86608M6415j2493m3333o7693p3140N2127J0064O8083N1063M5082M199k2938
2955F44044r9700L6804M3856L088K7952j02126k2157j01709Q3109m386J5962j31494
2943C93243P0565M9469l0508J876r6615K5635J3041N6688j9370m4847M5636j5308
$$ plain form
2931 449505 381264 430616 335440 343215 456502 395217 330742 393912 503639 435604 380714
2920 380714 353524 344794 351281 288550 302956 442661 461771 392467 384608 417306 418582 395613
2908 395613 424789 318934 247804 241923 328894 383556 317365 334589 402416 328125 301417 302908
2896 302908 257327 305100 392528 415045 285650 358366 385636 337865 255826 238334 319976
2885 319976 350242 272675 269363 340619 360754 282027 276780 339729 309294 305927 279004 286829
2873 286829 335135 216541 216094 208023 180453 278751 264852 219476 190316 108787 105030 244741
2861 244741 296251 308882 275810 173546 192130 249936 183669 312825 238829 172628 236717
2850 236717 243872 145038 163367 193328 274529 235116 218948 244094 229632 271044 167653 150798
$$ packed form
2931D49505o8241M9352r5176P775J13287o1285o4475O3170J09727o8035n4890
2920C80714k7190q730O487o2731J4406J39705J9110o9304p859L2698J276k2969
2908C95613K9176j05855p1130n881Q6971N4662o6191J7224O7827p4291k6708J491
2896C02908m5581M7773Q7428K2517j29395P2716K7270m7771q2039j7492Q1642
2885C19976L0266p7567l312P1256K0135p8727n247O2949l0435l367k6923P825
2873B86829M8306j18594m47q071k7570R8298j3899m5376k9160q1529l757J39711
2861B44741N1510J2631l3072j02264J8584N7806o6267J29156p3996o6201O4089
2850B36717P155r8834J8329K9961Q1201l9413j6168K5146j4462M1412j03391j6855
$$ plain form
2838 150798 111968 34497 97231 178864 209639 160443 183012 258283 183002 105789 137720 123874
2826 123874 80145 28765 97880 118394 40067 58429 6705 44784 111178 87404 55832 19247
2814 19247 72381 104299 17705 -6582 58164 70572 88474 70726 41502 198970 119205 103460
2802 103460 51462 68534 178632 108737 1678 -49813 35468 104935 55120 88996 83498
2791 83498 121633 92539 45279 -9773 -5332 62426 29858 -25177 -44241 -94806 -81000 -72667
2779 -72667 32721 -34414 6116 78093 26068 -26645 3400 -28763 -62565 27458 -34284 -48468
2767 -48468 22151 7863 34884 27599 -18665 24508 26771 114622 -42422 -60679 -38729 -44930
2755 -44930 30928 66620 -11033 -50469 -135749 1732 -32361 -52522 18524 46836 17649 53561
$$ packed form
2838A50798l8830p7471O2734Q1633L0775m9196K2569P5271p5281p7213L1931j3846
2826A23874m3729n1380O9115K0514p8327J8362n1724L8079O6394k3774l1572l6585
2814A9247N3134L1918q6594k4287O4746J2408J7902j7748k9224J57468p9765j5745
2802A03460n1998J7072J10098o9895j07059n1491Q5281O9467m9815L3876n498
2791H3498L8135k9094m7260n5052M441O7758l2568n5035j9064n0565J3806Q333
2779g2667J05388o7135M0530P1977n2025n2713L0045l2163l3802R0023o1742j4184
2767d8468P0619j4288K7021p285m6264M3173K263Q7851j57044j8257K1950o201
2755d4930P5858L5692p7653l9436q5280J37481l4093k0161P1046K8312k9187L5912
$$ plain form
2743 53561 52706 11733 115701 160637 165963 94317 94675 96266 45286 -10332 33468 -10145 -147313
2730 -147313 -51482 -11985 -106612 -56253 31249 77179 48948 -17640 12015 43777 63649 -52966
2718 -52966 -49952 -3052 -41264 -37887 -24496 1135 24709 83989 -34116 -36563 -66585 -4712
2706 -4712 -15646 -318 60807 -86236 -78805 -89822 -103751 -43824 -8083 41874 -13374 6589
2694 6589 35068 -113434 -141211 -44061 -65074 -101388 -73311 -30246 28912 82381 -19992 -40021
2682 -40021 -101006 -95801 -127818 -146626 -138480 -149986 -53610 -34934 -26611 -111073 -152690 -137458
2670 -137458 -84173 -56594 44478 29998 -5614 16196 -18760 -122321 -109672 -123343 -166850
2659 -166850 -158549 -60445 50056 10503 34289 51632 -66978 -239561 -208073 -212285 -225997
$$ packed form
2743E3561q55m0973J03968M4936N326p1646L58J591n0980n5618M3800m3613j37168
2730a47313R5831L9497r4627N0359Q7502M5930k8231o6588K9655L1762J9872j16615
2718e2966L014M6900l8212L377J3391K5631K3574N9280j18105k447l0022O1873
2706d712j0934J5328O1125j47043P431j1017j3929N9927L5741M9957n5248J9963
2694F589K8479j48502k7777R7150k1013l6314K8077M3065N9158N3469j02373k0029
2682d0021o0985N205l2017j8808Q146j1506R6376J8676Q323q4462m1617J5232
2670a37458N3285K7579J01072j4480l5612K1810l4956j03561J2649j3671m3507
2659a66850Q301R8104J10501l9553K3786J7343j18610j72583L1488m212j3712
$$ plain form
2648 -225997 -217475 -105099 -121761 -95470 49618 -48045 -45450 -41966 27626 63421 54648 150192
2636 150192 126376 203284 160398 112026 127454 42660 -14852 100189 75352 -39388 -64693
2625 -64693 41080 72886 98899 63201 18239 62856 42928 49513 30834 -54995 -71601 -77404
2613 -77404 -91426 -113244 -188528 -158223 -44317 13212 946 -2333 -35975 -107239 -111798 -71187
2601 -71187 -1577 27811 53240 -1234 -145141 -82346 -158034 -90453 -33963 -112616 -231676
2590 -231676 -139404 -27658 -44401 -320 16494 -17336 70497 -56930 -223760 -139947 -68210
2579 -68210 -36532 -24491 -46591 33051 37143 22456 -111873 -179155 -207566 -170398 -80110 -14061
2567 -14061 56134 33463 -22111 1780 -32907 4616 -31706 -29050 -87111 -88643 -74105 -6097
$$ packed form
2648b25997Q522J12376j6662K6291J45088r7663K595L484O9592L5795q773R5544
2636A50192k3816P6908m2886m8372J5428q4794n7512J15041k4837j14740k5305
2625f4693J05773L1806K6013l5698m4962M4617j9928O585j8679q5829j6606n803
2613g7404j4022k1818p5284L0305J13906N7529j2266l279l3642p1264m559M0611
2601g1187O9610K9388K5429n4474j43907O2795p5688O7581N6490p8653j19060
2590b31676R2272J11746j6743M4081J6814l3830Q7833j27427j66830Q3813P1737
2579f8210L1678J2041k2100P9642M092j4687j34329o7282k8411L7168R0288O6049
2567a4061P0195k2671n5574K3891l4687L7523l6322K656n8061j532J4538O8008
$$ plain form
2555 -6097 -31972 -108975 -142332 -169672 -55246 7070 20621 67139 74908 -10477 -70912 25911
2543 25911 -12775 -72754 -45953 44720 178578 140513 101856 -31300 -2726 13249 -37111
2532 -37111 -65180 11152 54950 93832 16573 64484 45532 -9232 -58904 -16519 68591 82676
2520 82676 51869 71065 71176 63966 19788 38903 33247 79989 40116 64513 154875 128891 70196
2507 70196 227946 133769 71163 71869 1926 -100321 -34635 7083 122651 89658 80250 65176
2495 65176 94910 119685 110140 124494 143668 144268 162866 87052 54237 21547 29131 50493 44137
2482 44137 120150 131077 182660 161969 188894 90634 113300 128187 163337 170122 215341 117201
2470 117201 160568 204647 254082 168973 167543 221814 215688 225269 296094 335340 305421 328481
$$ packed form
2555f097k5875p7003l3357k7340J14426O2316J3551M6518P769q5385o0435R6823
2543B5911l8686n9979K6801R0673J33858l8065l8657j33156K8574J5975n0360
2532c7111k8069P6332M3798L8882p7259M7911j8952n4764m9672M2385Q5110J4085
2520H2676l0807J9196J11p210m4178J9115n656M6742l9873K4397R0362k5984n8695
2507G0196J57750r4177o2606P06o9943j02247O5686M1718J15568l2993r408j5074
2495F5176K9734K4775r545J4354J9174O00J8598p5814l2815l2690P584K1362o356
2482D4137P6013J0927N1583k0691K6925r8260K2666J4887L5150O785M5219r8140
2470A17201M3367M4079M9435q5109j430N4271o126R581P0825L9246k9919K3060
$$ plain form
2458 328481 365176 410470 447719 372495 381586 410309 473465 504164 532979 541514 494686 566861
2446 566861 460753 447100 599664 676532 723543 712440 696519 618970 646123 619291 643376
2435 643376 645186 592432 602074 634112 672712 744772 759816 754805 823344 779505 757230 715191
2423 715191 721955 811259 867707 905713 945577 1050421 1076381 1061932 1065693 1115886 1167644 1344761
2411 1344761 1258967 1384882 1539322 1511240 1501504 1556504 1601885 1692517 1797828 1794974 1976459
2400 1976459 2047289 2070192 2094977 2079336 2176163 2193564 2248872 2431618 2529669 2569782 2750949
2389 2750949 2843674 2984824 3126176 3369869 3700154 3960643 4311817 4683742 4979747 5229073
2379 5229073 5443970 5762922 6168715 6632608 7179049 8089932 9374200 11303392 13914319
$$ packed form
2458C28481L6695M5294L7249p5224R091K8723O3156L0699K8815Q535m6828P2175
2446E66861j06108j3653J52564P6868M7011j1103j5921p7549K7153k6832K4085
2435F43376J810n2754R642L2038L8600P2060J5044n011O8539m3839k2275m2039
2423G15191O764Q9304N6448L8006L9864J04844K5960j4449L761N0193N1758J77117
2411A344761q5794J25915J54440k8082r736N5000M5381R0632J05311k854J81485
2400A976459P0830K2903K4785j5641R6827J7401N5308J82746R8051M0113J81167
2389B750949R2725J41150J41352K43693L30285K60489L51174L71925K96005K49326
2379E229073K14897L18952M05793M63893N46441R10883J284268J929192K610927
$$ plain form
2370 13914319 17336934 21888869 28001712 32895586 34072736 31803928 26643389 20653498
2362 20653498 15629117 12421035 10331313 8830134 7448906 6519557 5732604 5144971 4757065
2353 4757065 4549341 4286127 4027842 3732952 3439766 3209521 2991719 2621837 2486180 2413465
2343 2413465 2236982 2209214 2212475 2072356 1840993 1723783 1592029 1451678 1517233 1408901
2333 1408901 1333554 1323205 1287934 1120282 1057995 1019257 940439 806416 792444 877167 875577
2322 875577 912353 788951 752637 743403 651962 531811 479725 520849 516784 598449 620173 592791
2310 592791 509462 447850 439480 437614 507575 477695 458661 471745 345108 415323 369982 262325
2298 262325 271605 241549 306793 352316 291797 225213 297505 310621 263914 232171 244299 147577
$$ packed form
2370A3914319L422615M551935O112843M893874J177150k268808n160539n989891
2362B0653498n024381l208082k089722j501179j381228r29349p86953n87633l87906
2353D757065k07724k63214k58285k94890k93186k30245k17802l69882j35657p2715
2343B413465j76483k7768L261j40119k31363j17210j31754j40351O5555j08332
2333A408901p5347j0349l5271j67652o2287l8738p8818j34023j3972Q4723j590
2322H75577L6776j23402l6314r234r1441j20151n2086M1124m065Q1665K1724k7382
2310E92791q3329o1612q370j866O9961k9880j9034J3084j26637P0215m5341j07657
2298B62325R280l0056O5244M5523o0519o6584P2292J3116m6707l1743J2128r6722
$$ plain form
2286 147577 153918 113814 132012 111766 160392 142076 136800 196272 212622 124624 99132 183739
2274 183739 193748 127620 62219 72194 151848 114143 121430 107422 219964 254281 176872 65578
2262 65578 -15805 16330 89817 59233 28163 124051 170128 129722 86929 22259 51095 102930
2250 102930 144248 110461 79773 217189 136814 36301 89748 99220 55872 744 -22428
2239 -22428 4008 10884 24779 45556 8260 26000 46829 61877 46380 43505 48384 -78526
2227 -78526 -119129 -99500 -41013 -15909 -29670 -6283 -39988 -66175 -21992 -77808 22168 51156
2215 51156 60577 52170 -80833 -178152 -178553 -121957 -26594 -10393 -6994 -49665 -121275 -133564 -85968
2202 -85968 -77339 -66656 -72577 -87770 -18766 -69879 -86197 -99916 -19457 -22070 -82785 -111990
$$ packed form
2286A47577O341m0104J8198k0246M8626j8316n276N9472J6350q7998k5492Q4607
2274A83739J0009o6128o5401R975P9654l7705P287j4008J12542L4317p7409j11294
2262F5578q1383L2135P3487l0584l1070R5888M6077m0406m2793o4670K8836N1835
2250A02930M1318l3787l0688J37416q0375j00513N3447R472m3348n5128k3172
2239b2428K6436O876J3895K0777l7296J7740K0829J5048j5497k875M879j26910
2227g8526m0603J9629N8487K5104j3761K3387l3705k6187M4183n5816R9976K8988
2215E1156R421q407j33003r7319m01N6596R5363J6201L399m2671p1610j2289M7596
2202h5968Q629J0683n921j5193O9004n1113j6318j3719Q0459k613o0715k9205
$$ plain form
2190 -111990 -77243 -81036 -98217 -105383 -140174 -75399 31550 47463 2310 -34199 -56622 -81327
2178 -81327 -114094 -14202 33961 54847 46850 -49022 -22608 -78572 -39533 -1916 -101279 -85238
2166 -85238 -144963 -140769 -36921 -23347 -67451 -77493 -109922 -132142 -119968 -160870 -81681 14177
2154 14177 87010 -26777 -113978 -94913 -171527 -133139 -21026 -47138 -80770 -77861 -65133 -59014
2142 -59014 -72277 -103745 -69684 -67879 19452 -40522 -84837 -68318 -104798 -142528 -143561 -140898
2130 -140898 -84676 -65423 -61578 -16125 20365 -34268 45626 41272 -24765 -93027 -53569 -49078
2118 -49078 -97648 34512 -79505 -25505 -72138 -85401 11122 40713 -66241 -116508 -233775
2107 -233775 -78132 61695 89087 -751 -18045 -35958 5678 -91615 -65666 2899 1530
$$ packed form
2190a11990L4747l793j7181p166l4791O4775J06949J5913m5153l6509k2423k4705
2178h1327l2767R9892M8163K0886p997r5872K6414n5964L9039L7617r9363J6041
2166h5238n9725M194J03848J3574m4104j0042l2429k2220J2174m0902P9189R5858
2154A4177P2833j13787q7201J9065p6614L8388J12113k6112l3632K909J2728O119
2142e9014j3263l1468L4061J805Q7331n9974m4315J6519l6480l7730j033K663
2130a40898N6222J9253L845M5453L6490n4633P9894m354o6037o8262L9458M491
2118d9078m8570J32160j14017N4000m6633j3263R6523K9591j06954n0267j17267
2107b33775J55643J39827K7392q9838j7294j7913M1636r7293K5949O8565j369
$$ plain form
2096 1530 -23058 32278 45095 -27321 -35286 -30282 -46871 -166869 -148643 -131897 -146607 -19427
2084 -19427 -658 -56375 -163049 -177303 -153018 -101617 30113 7920 53449 32225 992
2073 992 22209 -8556 73814 -73511 -220909 -242064 -197572 535 -84374 -85704 -107804 -116331
$$ packed form
2096A530k4588N5336J2817p2416p965N004j6589j19998J8226J6746j4710J27180
2084a9427J8769n5717j06674j4254K4285N1401J31730k2193M5529k1224l1233
2073I92K1217l0765Q2370j47325j47398k1155M4492J98107q4909j330k2100q527
$$ [...]
##END NTUPLES=NMR SPECTRUM
##END=
