##TITLE=1H_EC-3305(IV-21)
 CDCl3
 8 sc, 
 5.2.2024
##JCAMPDX= 6.0         $$ Bruker NMR JCAMP-DX V2.0
##DATA TYPE= NMR SPECTRUM
##DATA CLASS= NTUPLES
##ORIGIN= UXNMR, Bruker Analytische Messtechnik GmbH
##OWNER= root
$$ XWIN-NMR		Version 3.5
$$ Mon Feb  5 14:10:17 2024 Russian Standard Time (UT+4h)  she@DPX200
##.OBSERVE FREQUENCY= 200.1313
##.OBSERVE NUCLEUS= ^1H
##.ACQUISITION MODE= SIMULTANEOUS
##.ACQUISITION SCHEME= undefined
##.AVERAGES= 8
##.DIGITISER RES= 18
##SPECTROMETER/DATA SYSTEM= spect
##.PULSE SEQUENCE= zg30
##.SOLVENT NAME= D2O
##.SHIFT REFERENCE= (INTERNAL, D2O, 0, 15.4505)
##AUDIT TRAIL= $$ (NUMBER, WHEN, WHO, WHERE, WHAT)
$$ ##TITLE= Audit trail, XWIN-NMR		Version 3.5
$$ ##JCAMPDX= 5.01
$$ ##ORIGIN= Bruker BioSpin GmbH
$$ ##OWNER= she
$$ F:/spectra/data/she/nmr/H-F/1/pdata/1/auditp.txt
$$ ##AUDIT TRAIL=  $$ (NUMBER, WHEN, WHO, WHERE, WHAT)
(   1,<2024-02-05 14:08:28.53 +0400>,<she>,<DPX200>,
      <created by zg, POWCHK disabled, PULCHK disabled
       configuration hash MD5:
       00 E9 B6 7A A2 85 ED C7 34 08 36 98 17 FE 4E 26
       data hash MD5: 16K
       77 8E 13 3A D9 60 D6 F4 99 69 27 2D 8E CC 26 69>)
(   2,<2024-02-05 14:08:30.70 +0400>,<she>,<DPX200>,
      <Start of raw data processing
       efp BC_mod = 2 LB = 0.24 FT_mod = 6 PKNL = 1 PHC0 = -24591.26 PHC1 = 7.65268 SI = 16K 
       data hash MD5: 16K
       8D 0D 70 E9 C1 25 47 D5 BC 8C 20 D2 99 F4 44 5E>)
(   3,<2024-02-05 14:08:45.46 +0400>,<she>,<DPX200>,
      <pk PHC0 = 0.1515617 PHC1 = -2.4 
       data hash MD5: 16K
       0F 73 41 59 4F E3 6F 77 DC 37 57 7D CB 65 9A D5>)
(   4,<2024-02-05 14:08:49.15 +0400>,<she>,<DPX200>,
      <abs ABSG = 5 
       data hash MD5: 16K
       DC 09 33 38 D1 02 E6 03 0F 42 EF 38 0E C7 EA 4D>)
$$ ##END=
$$ 
$$ hash MD5
$$ 69 6D 22 C9 A1 3D 69 54 FA A5 EB 4A C9 BC A7 1D
##$RELAX= 
##$RELAX= 
##$RELAX= 
##$RELAX= 
##$RELAX= 
##$RELAX= 
$$ Bruker specific parameters
$$ --------------------------
##$DU= <F:/spectra>
##$EXPNO= 1
##$NAME= <H-F>
##$PROCNO= 1
##$TYPE= <nmr>
##$USER= <she>
##$AMP= (0..31)
100 100 100 100 100 100 100 100 100 100 100 100 100 100 100 100 100 100 
100 100 100 100 100 100 100 100 100 100 100 100 100 100 
##$AQSEQ= 0
##$AQ_mod= 1
##$AUNM= <au_zg>
##$AUTOPOS= <>
##$BF1= 200.13
##$BF2= 200.13
##$BF3= 200.13
##$BF4= 200.13
##$BF5= 200.13
##$BF6= 200.13
##$BF7= 200.13
##$BF8= 200.13
##$BYTORDA= 1
##$CFDGTYP= 0
##$CFRGTYP= 5
##$CHEMSTR= <none>
##$CNST= (0..31)
1 1 145 1 1 1 1 1 1 1 1 1 1 1 1 1 1 1 1 1 1 1 1 1 1 1 1 1 1 1 1 1 
##$CPDPRG= <>
##$CPDPRG1= <>
##$CPDPRG2= <>
##$CPDPRG3= <>
##$CPDPRG4= <mlev>
##$CPDPRG5= <mlev>
##$CPDPRG6= <mlev>
##$CPDPRG7= <mlev>
##$CPDPRG8= <mlev>
##$CPDPRGB= <>
##$CPDPRGT= <>
##$D= (0..31)
0 1.2 0 0 0 0 0 0 0 0.06 0 0.03 0 0 0 0 0.0002 0 0 0 0 0 0 0 0 0 0 0 0 
0 0 0 
##$DATE= 1707127707
##$DBL= (0..7)
120 120 120 120 120 120 120 120 
##$DBP= (0..7)
150 150 150 150 150 150 150 150 
##$DBP07= 0
##$DBPNAM0= <>
##$DBPNAM1= <>
##$DBPNAM2= <>
##$DBPNAM3= <>
##$DBPNAM4= <>
$$ [...]
##$SUBNAM3= <"">
##$SUBNAM4= <"">
##$SUBNAM5= <"">
##$SUBNAM6= <"">
##$SUBNAM7= <"">
##$SUBNAM8= <"">
##$SUBNAM9= <"">
##$SW= 18.0517328524113
##$SWIBOX= (0..15)
0 0 2 0 0 0 0 0 0 0 0 0 0 0 0 0 
##$SW_h= 3612.71676300578
##$TD= 16384
##$TD0= 1
##$TE= 0
##$TE2= 300
##$TE3= 300
##$TEG= 300
##$TL= (0..7)
0 120 120 120 120 120 120 120 
##$TP= (0..7)
150 150 150 150 150 150 150 150 
##$TP07= 0
##$TPNAME0= <>
##$TPNAME1= <>
##$TPNAME2= <>
##$TPNAME3= <>
##$TPNAME4= <>
##$TPNAME5= <>
##$TPNAME6= <>
##$TPNAME7= <>
##$TPOAL= (0..7)
0.5 0.5 0.5 0.5 0.5 0.5 0.5 0.5 
##$TPOFFS= (0..7)
0 0 0 0 0 0 0 0 
##$TUNHIN= 0
##$TUNHOUT= 0
##$TUNXOUT= 0
##$USERA1= <user>
##$USERA2= <user>
##$USERA3= <user>
##$USERA4= <user>
##$USERA5= <user>
##$V9= 5
##$VALIST= <valist>
##$VCLIST= <CCCCCCCCCCCCCCC>
##$VD= 0
##$VDLIST= <DDDDDDDDDDDDDDD>
##$VPLIST= <PPPPPPPPPPPPPPP>
##$VTLIST= <TTTTTTTTTTTTTTT>
##$WBST= 1024
##$WBSW= 4
##$XGAIN= (0..3)
0 0 0 0 
##$XL= 0
##$YL= 0
##$YMAX_a= 522114
##$YMIN_a= -783450
##$ZGOPTNS= <>
##$ZL1= 120
##$ZL2= 120
##$ZL3= 120
##$ZL4= 120
##$ABSF1= 15.43177
##$ABSF2= -2.620079
##$ABSG= 5
##$ABSL= 3
##$ALPHA= 0
##$AQORDER= 0
##$ASSFAC= 0
##$ASSFACI= 0
##$ASSFACX= 0
##$ASSWID= 0
##$AUNMP= <proc_1d>
##$AZFE= 0.1
##$AZFW= 0.1
##$BCFW= 0
##$BC_mod= 2
##$BYTORDP= 0
##$COROFFS= 0
##$CY= -3
##$DATMOD= 1
##$DC= 0
##$DFILT= <>
##$DTYPP= 0
##$F1P= 0
##$F2P= 0
##$FCOR= 1
##$FTSIZE= 16384
##$FT_mod= 6
##$GAMMA= 0
##$GB= 0
##$INTBC= 1
##$INTSCL= 3.70164e-10
##$ISEN= 128
##$LB= 0.24
##$LEV0= 0
##$LPBIN= 0
##$MAXI= 10000
##$MC2= 0
##$MEAN= 0
##$ME_mod= 0
##$MI= 1.114404
##$NCOEF= 0
##$NC_proc= -6
##$NLEV= 6
##$NOISF1= 3.799351
##$NOISF2= 2.8
##$NSP= 0
##$NTH_PI= 0
##$NZP= 0
##$OFFSET= 15.45051
##$PC= 1
##$PHC0= -24591.11
##$PHC1= 5.25268
##$PH_mod= 1
##$PKNL= yes
##$PPARMOD= 0
##$PSCAL= 0
##$PSIGN= 0
##$REVERSE= no
##$SF= 200.130014247738
##$SI= 16384
##$SIGF1= 3
##$SIGF2= 2
##$SINO= 5.538805
##$SIOLD= 16384
##$SREGLST= <1H.CDCl3>
##$SSB= 0
##$STSI= 16384
##$STSR= 0
##$SW_p= 3612.71676300578
##$SYMM= 0
##$S_DEV= 0
##$TDeff= 16384
##$TDoff= 0
##$TI= <>
##$TILT= no
##$TM1= 0
##$TM2= 0
##$TOPLEV= 0
##$USERP1= <user>
##$USERP2= <user>
##$USERP3= <user>
##$USERP4= <user>
##$USERP5= <user>
##$WDW= 1
##$XDIM= 16384
##$YMAX_p= 444184180
##$YMIN_p= -397656
$$ End of Bruker specific parameters
$$ ---------------------------------
##NTUPLES= NMR SPECTRUM
##VAR_NAME=  FREQUENCY,     SPECTRUM/REAL,   SPECTRUM/IMAG
##SYMBOL=    X,             R,               I
##VAR_TYPE=  INDEPENDENT,   DEPENDENT,       DEPENDENT
##VAR_FORM=  AFFN,          ASDF,            ASDF
##VAR_DIM=   16384,         16384,           16384
##UNITS=     HZ,            ARBITRARY UNITS, ARBITRARY UNITS
##FACTOR=    0.220516191357247, 1,           1
##FIRST=     3092.11079144295, 0,            0
##LAST=      -520.605971562826, 0,           0
##MIN=       -520.605971562826, -397656,     0
##MAX=       3092.11079144295, 444184180,    0
$$ Real data points
##PAGE= N=1
##DATA TABLE= (X++(R..R)), XYDATA
$$ [...]
7992a1522J1484N1564L452l709j31837k9572O0241K5412J01086o3867p5971Q5147
7980B1908J8078J728O0515q5284R1840o6357l3310P0108m0228k2179q9760J6310
7968e6631J6100P2341K2984l0236J2665q391m5217J073J49147k0520l9722k5263
7956D8330m4408J32717L386J0832L4607k0333m1644l493j7395K3602L5574o336
7944A55439q7171J0051O8029K1556q6734m826L6091J4820L4547j6060R1495K1495
7932B58732K387Q919m320J7206k3717J28471J03774k5594j00262l4173N2607P1465
7920D55495O192m7525R2820L4417J08095N5262N0252L116O7822R4016o8880j1346
7908H39736K6997J0588J18148m9961j21367j6910P1528K0600L4878j01932q4420
$$ plain form
7992 -11522 -38 51526 54978 51269 -80568 -110140 -49899 -24487 76599 12732 -63239 21908
7980 21908 39986 41714 102229 16945 108785 42428 9118 79226 38998 16819 -72941 -56631
7968 -56631 -40531 31810 54794 24558 37223 28832 -16385 -15312 133835 113315 73593 48330
7956 48330 3922 136639 140025 150857 185464 165131 123487 119994 102599 126201 161775 155439
7944 155439 68268 78319 146348 167904 81170 76344 112435 127255 161802 145742 237237 258732
7932 258732 261119 270038 265718 282924 259207 387678 491452 465858 365596 331423 384030 455495
7920 455495 461687 414162 506982 541399 649494 704756 755008 758124 825946 919962 851082 839736
7908 839736 866733 877321 995469 945508 824141 807231 878759 899359 934237 832305 747885
7897G47885o7689N780O620k4984m1982j30675m8477O298P6820q917l6194j5208
7885D69277j8249l8237l8803N2394l2681L0757O9662Q135K6609M1470J8394J3375
7873F02103L6877O2487O4351k1825O0347R0034O0144q5297J4428q0030O0009j9783
7861H43845M0843j1196j24981J9047R2542k8704j32633l6167k1609j18684j0754
7850E11549J208l8603p5638j9712k6013k933p0071p5918J0064l9930q299O2860
7838B28564N5406M516O9492K888o0732r0523J3634M3040K5739j4270k1394p9831
7826A76529L9285L437K6568R7263n5350m6061N0983N1331j64912q7770j7552M2793
7814A16544O0017Q363K1616l7529k3768k0670m6389R9324p6835M3722L9641P4618
$$ plain form
7897 747885 680196 685976 692596 667612 625630 494955 446478 452776 529596 520679 484485 469277
7885 469277 451028 412791 373988 426382 393701 424458 494120 502255 528864 570334 588728 602103
7873 602103 638980 701467 765818 743993 804340 894374 954518 869221 883649 803619 863628 843845
7861 843845 884688 873492 748511 767558 860100 831396 698763 662596 640987 522303 511549
7850 511549 512757 474154 398516 378804 352791 349858 279787 203869 213933 174003 165704 228564
7838 228564 283970 288486 357978 360866 300134 209611 223245 266285 292024 277754 256360 176529
7826 176529 215814 219251 245819 343082 287732 241671 292654 343985 179073 91303 73751 116544
7814 116544 176561 184924 206540 169011 145243 124573 78184 177508 100673 144395 184036 258654
7802B58654O4150o9212j9984J08006l78165o4494L75502J5046Q5461j02586J40721
7791D13099j01990O0930M9311R675j2008J07041k8408l4878m8240k2108o6835
7780C25589o6325m7336N139J25145L8214N435j81128k7132J36020o6853K2192
7769B68960l5790k2325k1435L0503K7435q4056O8598P0057j9185K9753j1151O5541
7757C66905j4394l7172Q6456j07374L2828M1853J14340q7624q6166j860p543K8036
7745C28285k9560J9016J9279l7668m413J05762J6622r2993o2794r932J02132q2524
7733B71212k6781J5952N6408J6148j48732k089L7984o6611o490J3614l3760R7059
7721B23914j1639m8152J21589o0096j1997p0228n39j4082K8597J4117O2668K5737
$$ plain form
7802 258654 322804 253592 233608 341614 -36551 -101045 274457 289503 374964 272378 413099
7791 413099 311109 372039 421350 431025 419017 526058 497650 462772 414532 392424 325589
7780 325589 259264 211928 217067 342212 380426 385861 204733 177601 313621 246768 268960
7769 268960 233170 210845 189410 219913 247348 163292 231890 301947 282762 312515 301364 366905
7757 366905 352511 315339 401795 294421 327249 369102 483442 395818 309652 307792 300249 328285
7745 328285 298725 317741 337020 299352 294939 400701 417323 324330 261536 251604 353736 271212
7733 271212 244431 260383 316791 332939 184207 182118 220102 153491 147001 160615 126855 223914
7721 223914 212275 164123 285712 225616 213619 143391 142852 128770 157367 171484 234152 259889
7709B59889n0377q5659K8555j2386n2102J10469m6936n9379R4046k9277l1051
7698A25792J3410j15152K7693J29272P0480m714J9968n5929L613j03748J24927
7687B35612L2137q5093j7158J3776j3273J0258m5489j34802J53326O1547N0293
7676B61134k5457O380k8390n7819J5674m4513l3909O245R164J5594K3631M9176
7664A96910j01611K669J04613M7123m0724p605Q8806q8778q2744r1301k2643M0605
7652D5320Q324q2179J11349P5583j6472O0444K1156j17890j49356K7495j2055
7641b8281p5655N1375l080M6874Q2228K6234K1303J4095j524o1711m2074M279
7629C4063l8513K254N0029j00877l562l6364M211K8427j4689j8124J3870P2482
$$ plain form
7709 259889 209512 123853 152408 140022 87920 198389 151453 92074 186120 156843 125792
7698 125792 139202 24050 51743 181015 251495 246781 266749 210820 214433 110685 235612
7687 235612 267749 182656 165498 179274 166001 176259 130770 -4032 149294 210841 261134
7676 261134 235677 242057 213667 155848 171522 127009 93100 99345 108509 124103 147734 196910
7664 196910 95299 97968 202581 249704 208980 201375 290181 201403 118659 27358 4715 45320
7652 45320 53644 -28535 82814 158397 141925 202369 223525 105635 -43721 -16226 -28281
7641 -28281 -103936 -52561 -55641 -8767 73461 99695 120998 135093 133569 71858 29784 34063
7629 34063 -4450 -2196 47833 -53044 -56606 -92970 -88759 -60332 -75021 -93145 -79275 -6793
7617f793L4425K3596q8915q9659j1224L4925O9164J30776k4044j48164k2235N6628
7605d1520P3799N3436j0141M0125q6874o6110K1720K6553j9777N1079k3927m7628
7593b9265J42556o7821K5692L0791j35641N8571O527J5228l6113K2370O2995P9409
7581A75299M4329j62546n7218R5481L1094o7505J38618J3428q0918o830J0780
7570A34012J8658l1848n8089M2377M4756q1462j0300k7612K6137k9660L6131k6984
7558C6116Q5331P2177L6063q802q3504n8402l1381o1039J04741Q0965N4977q38
7546B26404j27198J8735N7528k3066R4990j887J4270N1464j903q3797j26644M602
7534A03498n6379J55128j2162r184j2774L0149p7396Q9866p3689q9416M2837m235
$$ plain form
7617 -6793 27632 51228 -37687 -127346 -138570 -103645 -34481 96295 72251 -75913 -98148 -41520
7605 -41520 32279 85715 75574 115699 28825 -37285 -15565 10988 -8789 42290 18363 -29265
7593 -29265 113291 45470 71162 101953 -33688 24883 31410 46638 10525 32895 95890 175299
7581 175299 219628 57082 -136 95345 126439 58934 197552 210980 130062 123232 134012
7570 134012 152670 120822 62733 105110 149866 68404 58104 30492 56629 26969 63100 36116
7558 36116 121447 193624 229687 220885 137381 78979 47598 -13441 91300 172265 227242 226404
7546 226404 99206 117941 175469 152403 247393 245506 259776 311240 309337 225540 98896 103498
7534 103498 47119 202247 190085 180901 168127 198276 120880 210746 137057 47641 90478 86243
7522H6243P5274R2902k3161O5920j7068n863p4380q7619J6844M5349P5895J8526
7510B68862r8863m1434K466P8550m1931O859O8830J8395R6062o7984n3647l6893
7498A99272L1490N2937Q6587K017L5016L0911j7066l0428o378J25670q8566o350
7486D15112M3447n1875k9688N4730K2418j02030k003J4970J5656M5729N4061P564
7474D88091m908J0150r368J0578k8131K1736J9384N2542l3946p0644J65501k5015
7462E95970Q492n632L9509K0522J2954R6541K3912r1581j14395m4873M4572K5950
7450F11941M8467l9984P646k0101J3682j77378M2228Q4222m5105J3011p5914K1760
7438D84475L9830j0670N5474r8396p0168N5072J3792j7518R7641k3015q413r1282
$$ plain form
7522 86243 161517 254419 231258 297178 280110 274247 199867 112248 129092 174441 250336 268862
7510 268862 169999 128565 131031 209581 167650 174509 243339 261734 357796 289812 236165 199272
7498 199272 230762 283699 370286 372303 407319 438230 421164 390736 384358 510028 421462 415112
7486 415112 458559 406684 376996 431726 454144 352114 350111 365081 380737 426466 480527 488091
7474 488091 483183 493333 483965 494543 466412 488148 507532 560074 526128 455484 620985 595970
7462 595970 604462 598830 638339 658861 671815 768356 792268 700687 586292 541419 585991 611941
7450 611941 660408 620424 628070 607969 621651 444273 486501 570723 525618 538629 462715 484475
7438 484475 524305 513635 569109 470713 400545 455617 469409 451891 549532 526517 518104 426822
7426D26822n5306Q3046N9073m7084n6871O0025k0073k2426l0251J18939q4619
7415D31275q7102J8797O4124L3387j41393l5702M7732q8609K6295k9162l0753
7404B08889O3628N8586o2554o9655M7261r71k6656N5314j09056M6940m0833M7492
7392B18385L3679l8444o2119M184M5885r0710m7415K5395K0999l6292j13987P3528
7380C3088O9965r8510m0957K9807R9357p853P040k3688o7014o6511N8660j26871
7368a33487R924O8375j6738P4086Q5642p9955j4087K9463l9094o3794k694L2881
7356d9478o0712N337Q3473P0700p282n2823K2827m584l7854j4717j34921R9266
7344h0768Q6969j17803o3285L469J79400k0000P110j48832l4002M8052J4104J4151
$$ plain form
7426 426822 371516 454562 513635 466551 409680 469705 449632 427206 396955 515894 431275
7415 431275 344173 362970 427094 460481 319088 283386 331118 242509 268804 239642 208889
7404 208889 272517 331103 268549 198894 246155 245184 218528 273842 164786 211726 170893 218385
7392 218385 252064 213620 151501 155685 201570 110860 63445 88840 109839 73547 -40440 33088
7380 33088 103053 4543 -36414 -6607 92750 84897 91937 68249 1235 -65276 -6616 -133487
7368 -133487 -123563 -55188 -71926 2160 87802 7847 -6240 23223 -15871 -79665 -82359 -49478
7356 -49478 -110190 -104853 -21380 49320 42038 -10785 12042 7458 -30396 -45113 -180034 -80768
7344 -80768 6201 -111602 -174887 -171418 7982 -12018 -4908 -153740 -187742 -139690 -125586 -111435
7332a11435o2208J17772n7949K9980j52892n5374J06747j6122O1706J10817j22398
7321a51356m278R2548J07053m2821r2836m8756n1005Q2301O052p1R8349o795q4534
7308i6149r5415P1517m9254L7639M3684l3360l9185J5828Q8617l4732j9835K8839
7296h1806L222m6725N1161l3223K4904m9648N0282n6163M4361N3387j03300p2528
7284b16076n0205J01722R4564r9309o4535J24603m2165M5436R2521K6974k4207
7273a0677n9065l4112j3345Q2625J6504j4893l3572L1250k6373M5708K0477k8735
7261b4208L2883K0487j7291n962j05556l3838N4790k5801q5134l0634J12780P2850
7249c4634J0888k0655O1386M2788j56372M5180q956p9839O1427K8965o0008j1934
$$ plain form
7332 -111435 -173643 -55871 -113820 -83840 -236732 -292106 -185359 -201481 -139775 -28958 -151356
7321 -151356 -155634 -63086 43967 1146 -91690 -140446 -191451 -109150 -103098 -103169 -4820 -11615 -96149
7308 -96149 -191564 -120047 -169301 -131662 -87978 -121338 -160523 -144695 -56078 -90810 -110645 -81806
7296 -81806 -78584 -125309 -74148 -107371 -82467 -132115 -81833 -137996 -93635 -40248 -143548 -216076
7284 -216076 -266281 -164559 -69995 -169304 -233839 -109236 -151401 -105965 -13444 13530 -10677
7273 -10677 -69742 -103854 -117199 -34574 -18070 -32963 -66535 -35285 -61658 -15950 4527 -24208
7261 -24208 8675 29162 11871 5909 -99647 -133485 -78695 -104496 -189630 -220264 -107484 -34634
7249 -34634 -23746 -44401 16985 59773 -96599 -51419 -60375 -140214 -78787 -49822 -109830 -121764
7237a21764J13653L3599q4573j12312K31162N5243p8688j0584M7035o2578k4090
7226a3897M0056n2608J4827J0981q7464j0072L3022k0556o5465o4135L0372M2892
7214a42047J04917Q7232k1173j3680O5719o5657k5445j27149Q0177Q6609o6141
7203c6638J05948J0227p5957p5581j2883j4384K4879Q8191l0919j68676L6734
7192a49059J27493q1492M7289n6650K6728Q3228m9477L0987q513O3830L0032j6838
7180D7558N2321k5452o6057K4077o8387o6681M0953k5076m5193K7617J05101K1353
7168B2134q6543n628L0423j9776K0722O233n1534K6474N1258P2744o5410J9032
7156B0129L3395p2912r5855J0979R6160j60823O3241K09506m0800n9223l291l9667
$$ plain form
7237 -121764 -8111 25488 -59085 -171397 59765 115008 36320 25736 72771 10193 -13897
7226 -13897 26159 -26449 -11622 -641 -88105 -98177 -65155 -85711 -151176 -215311 -184939 -142047
7214 -142047 -37130 50102 28929 15249 80968 15311 -10134 -137283 -57106 29503 -36638
7203 -36638 69310 79537 3580 -72001 -84884 -99268 -74389 13802 -17117 -185793 -149059
7192 -149059 -21566 -103058 -55769 -112419 -85691 -2463 -51940 -20953 -29466 34364 64396 47558
7180 47558 99879 74427 8370 32447 -35940 -102621 -61668 -86744 -131937 -104320 781 22134
7168 22134 -64409 -70037 -39614 -59390 -38668 -32435 -83969 -57495 -6237 66507 1097 20129
7156 20129 53524 -19388 -115243 -104264 -8104 -168927 -105686 103820 63020 3797 506 -39161
7144c9161k4522j3575R860O9485j9705J04434M3731j07819m1556n0804n0887l2613
7132a53132J76144N5121j00326P8583m5395M1044J29376n5053m0909j10049m724
7121b9320L977k8161k0688P1906m0768N4308L0505J464J5289j357o7058M280R1220
7108H5597m0575l3748m3197L6932m1080K865o477J32747L7423M1553j13580l9589
7096A8871L5347p7152r391o914K699J1737n112Q4200o564o301N211J0428j7645
7083C9414j1426P7310j12407k8868M1191j1414j3853L6518O3095j772j01221J8068
7071e365L7777o7940J35414K5687L9507j10012l458L9233m805J978k7290O1107
7059A21833m7501K2828n6964j1234K0615Q1629N8937r797J4663p591l2136n0916
$$ plain form
7144 -39161 -63683 -77258 -67398 2087 -17618 86816 130547 22728 -18828 -69632 -120519 -153132
7132 -153132 23012 78133 -22193 56390 10995 52039 181415 126362 85453 -24596 -29320
7121 -29320 -25343 -53504 -74192 -2286 -43054 11254 41759 43223 58512 57155 -9903 -5623 85597
7108 85597 45022 11274 -31923 5009 -36071 -33206 -39683 93064 130487 172040 58460 18871
7096 18871 54218 -22934 -32325 -39239 -36540 -24803 -29915 54285 47721 41420 46631 57059 39414
7083 39414 27988 105298 -7109 -35977 5214 -6200 -20053 16465 79560 77788 -23433 -5365
7071 -5365 32412 -35528 99886 125573 165080 55068 51610 90843 86038 88016 60726 121833
7059 121833 74332 97160 40196 28962 49577 131206 190143 180346 195009 187418 155282 104366
7047A04366o2294m0185K6790J1258R614n6615l9100J4696j0746J299J3551m403
7035c1769m3315j4079N7871K8706j11796P5686j0261O6475M2878o0239O448r3729
7023h7124O8819O879k3358k4682j3936l1090m4856J91469k2228m763Q4149k9179
7011G0100j03677L906O5265m5643Q255n0071Q2245j19860J02879P7482L2211J0981
6999A34073j14511Q100q3784J9279K6081N2871n5274J5631j9282O7315o1972M246
6987g227O492l4103M8147l9956L789l2839n9201R6822m3617M1592M5552l2788
6975g337L4136L5177p3512r4203m6969J62373M0280J5501J4010j06405o133j9597
6963e2679k152L9129l5207J30789R6920k9547N541k8211j0810m0962j4150M2366
$$ plain form
7047 104366 42072 1887 28677 39935 49549 -7066 -46166 -31470 -42216 -40917 -27366 -31769
7035 -31769 -75084 -89163 -31292 -2586 -114382 -38696 -48957 17518 60396 157 6605 -87124
7023 -87124 -18305 -11426 -34784 -59466 -73402 -104492 -149348 42121 19893 15130 99279 70100
7011 70100 -33577 -29671 35594 -10049 -1794 -51865 30380 -89480 13399 90881 123092 134073
6999 134073 19562 27662 -56122 -36843 -10762 42109 -13165 2466 -16816 50499 -11473 -7227
6987 -7227 -735 -34838 13309 -26647 -22858 -55697 -114898 -18076 -61693 -20101 25451 -7337
6975 -7337 26799 61976 -11536 -105739 -152708 9665 49945 65446 79456 -26949 -33082 -52679
6963 -52679 -54831 -15702 -50909 79880 176800 147253 152794 124583 113773 72811 58661 101027
6951A01027k7875L6149N8384o6715L1880n690o1490M256Q654k2084L0485Q25R4787
6938A82593j19904k4382M9446k2932K777k2920K0046l1012p2146p0391J5823J24610
6926C1608K4589l0606n5049O2990l7336J5094p612M0120k165m0410Q6380l6321
6914E1282M9261Q3109l7049M0482q5435j5491r346Q5397l0262j16441J42672O1412
6902B19591l4428j05449K170M9257Q630m9789l6169Q9411J3280k4124p1435n2486
6890H459J31165J0398m5230l4498j5697J83404o6520r2251M657J7869M01N3097
6878A55254l6247L7626j11270M005p8528Q1158O6849j06l3170Q7614L4681n2705
6866A55161m4458p2224Q4819j01616M7040m0942J15932l8673K1416K5802k8912
$$ plain form
6951 101027 73152 109301 167685 100970 132850 127160 65670 69926 78580 56496 86981 87806 182593
6938 182593 62689 38307 87753 64821 67598 44678 64724 33712 -38434 -108825 -93002 31608
6926 31608 56197 25591 -29458 33532 -3804 11290 3678 43798 41633 1223 87603 51282
6914 51282 100543 183652 146603 187085 101650 86159 76813 162210 131948 15507 158179 219591
6902 219591 185163 79714 81884 131141 139771 89982 53813 143224 156504 132380 60945 8459
6890 8459 139624 150022 104792 70294 54597 238001 171481 79230 83887 101756 102157 155254
6878 155254 119007 156633 45363 49368 -29160 51998 118847 118741 85571 173185 207866 155161
6866 155161 110703 38479 123298 21682 68722 27780 143712 105039 126455 152257 123345
6855A23345o7677M6444M1109k4450m3165j10671j5698J51292J2570q2925O9949
6844A00123K6155J2296N9473K9250r9668o7300M6730o4536P354M6801J69001q0431
6832A85248J8936L6761j36205L4958J10740M6450j25579j74612J41934j831n0577
6821H6223r175k236M328K1139j7839Q737j8740L1458M0858q0715K2594m0498M6026
6808I2160L5501n8399l8256Q4743J09540j11903k2718M9984k1573J2106J8257
6797A49442R9739q7662j02242O2621l7309P0142M1828R787j3758o1636J3256l9765
6785A04443k8501n9507J10713Q0996l8360j8663J243N2294m3641q7423J24845
6774A98439J9037M8010l8876j01162N1329L3664L5692J1812q3244r7393P2839
$$ plain form
6855 123345 55668 102112 143221 118771 75606 -35065 -50763 100529 113099 30174 100123
6844 100123 126278 138574 198047 227297 127629 60329 107059 42523 49877 96678 265679 185248
6832 185248 204184 240945 104740 139698 250438 296888 171309 -3303 138631 136800 86223
6821 86223 77048 74812 79140 100279 82440 91177 72437 103895 144753 64038 86632 46134 92160
6808 92160 127661 69262 31006 115749 225289 113386 90668 140652 119079 131185 149442
6797 149442 249181 161519 59277 121898 84589 154731 196559 206346 192588 130952 144208 104443
6785 104443 75942 16435 127148 208144 169784 151121 152364 204658 161017 73594 198439
6774 198439 217476 265486 226610 125448 176777 210441 246133 257945 174701 77308 150147
6763A50147L4999n7697Q683m565K3371K8824J1114p7066M2034M5352j4068N9352
6751B50480j03261m926K8935Q2351n1159l3278J72786m6386l2437q1150q1057
6740A00898Q4595J7799N0111l4202l6025k1083J8815N3829N2992J7384M0852K5632
6728C71597l3446j56209m8056J27608m107l3611J7115Q3580O4843l033m4881J8751
6716C60151P9683o9764j0742L4949N5089L2444m4306N1952R41q448k3416L228
6704D61761r1115r550J04764K3625j56637O1467K5439R7118o1786k58o5640M2256
6692D31444k9540o2230M6079J66159J7001p9164p8587L3589K4831j6813R0485
6681E43254m3528L4807M1636J0528o8857O3300J23926n9737q0044J38460j333
$$ plain form
6763 150147 185146 127449 136132 131567 154938 183762 194876 117810 159844 205196 191128 250480
6751 250480 147219 142293 171228 253579 202420 169142 341928 295542 263105 181955 100898
6740 100898 185493 203292 253403 219201 183176 162093 180908 234737 287729 305113 345965 371597
6728 371597 338151 181942 133886 261494 257387 223776 240891 324471 389314 386281 341400 360151
6716 360151 439834 370070 359328 394277 449366 481810 437504 489456 490397 481949 458533 461761
6704 461761 370646 361096 465860 489485 332848 394315 419754 516872 455086 454828 389188 431444
6692 431444 401904 339674 385753 551912 568913 489749 411162 444751 469582 452769 543254
6681 543254 499726 534533 576169 586697 517840 581140 705066 645329 565285 703745 702412
6670G02412j1259O0309K7636j12287J1746O8657O9646P5214N391q8575l6136J74575
6658I47329o1296J6895R4432K3614o7435K0508J58083P9991j9086J066o0425n6468
6646A077208J13833J29930k2530J1937N6092m6011J30133L805R3155J9027P5700
6635A642279J02560K2960j5437Q3121J27308j130q1019n8968Q5439J13367M744
6624B025224n8687n0500L9654J15444L1604J3688N9324J4310j11342j67037j93715
6613A717967n3137j5010j24234j8778n7558l8860k05646o2746L2072R8040j37380
6602A134730K572o6997J1142K0529k4421n7050l4911P5846L3372L256p8318P5320
6590A095070M304p6890J03882m3744O530K82L3066L1118k3960j3509k9598p450
$$ plain form
6670 702412 691153 751462 779098 666811 678557 747214 816860 892074 897465 808890 772754 947329
6658 947329 886033 902928 997360 1020974 953539 974047 1132130 1212121 1193035 1194101 1133676 1077208
6646 1077208 1191041 1320971 1298441 1310378 1366470 1320459 1450592 1454397 1547552 1566579 1642279
6635 1642279 1744839 1767799 1752362 1835483 1962791 1961661 1880642 1821674 1907113 2020480 2025224
6624 2025224 1966537 1916037 1955691 2071135 2102739 2116427 2175751 2190061 2078719 1911682 1717967
6613 1717967 1664830 1649820 1525586 1506808 1449250 1410390 1204744 1141998 1174070 1272110 1134730
6602 1134730 1137302 1070305 1081447 1101976 1077555 1020505 985594 1061440 1094812 1098068 1019750 1095070
6590 1095070 1099374 1022484 1126366 1082622 1089152 1089434 1122500 1153618 1129658 1116149 1086551 1079101
6578A079101j6855r7780n8930P090O2981m953o3053O2816m7627O2084K9129J04199
6566A118202m3498R071r9708K0146j9323k0886O7356L8071j89010j12946M6755
6555H14230P2298J65967J8830n6527K4332K2341M7140O6551K5640Q8208j1300
6544A277710Q1272m2508k346L1185o1880r877m3941K4601N9105k7112l997M6725
6532A328937N3329M1123q716O5536m6310K4677J1724R8365n788l5922j05455K1711
6520A443211Q172L7648l2949M5871M3273o8853j01630k8113O4298l9345m4883
6509A326700o253L2072J63983m2923j12892J66246k8108l4321j26208Q3749O1124
6498A483169o5699p0678r5470k6629m5307K6630l4606J08752j7122M0408l460
$$ plain form
6578 1079101 1062246 964466 905536 912626 975607 970654 907601 970417 922790 984874 1014003 1118202
6566 1118202 1074704 1083775 984067 1004213 984890 964004 1031360 1069431 880421 767475 814230
6555 814230 886528 1052495 1071325 1014798 1039130 1061471 1108611 1175162 1200802 1289010 1277710
6544 1277710 1358982 1316474 1314128 1345313 1283433 1273556 1229615 1254216 1313321 1286209 1282212 1328937
6532 1328937 1382266 1423389 1414673 1480209 1433899 1458576 1470300 1568665 1562877 1526955 1421500 1443211
6520 1443211 1451383 1489031 1456082 1501953 1545226 1476373 1374743 1346630 1410928 1371583 1326700
6509 1326700 1320447 1352519 1516502 1473579 1360687 1526933 1498825 1464504 1338296 1422045 1483169
6498 1483169 1417470 1346792 1251322 1224693 1179386 1206016 1171410 1280162 1263040 1303448 1299988
6487A299988j3922p3107J0633l0491j5511m4071K5582m3053j13534J68097p5219
6476A095392K0235n9493J9740K4239M572L0899L7277J413N3252K572n470J3923
6464A238551J07801K2084k3701l2835o2717O243k4927N2585L5022R3662P628l6023
6452A383373M2706o2371R2716m2622k0883J68971M7195j0892k3276N4810J7731
6441A647458J00860K1596L7145O0183J00000Q2649q3958k602K5265l7521n7215
6430A893860P3652j54348k277K2679K6183N5983j8399O7354M4785J19723O6067
6419B195262K1436N2252N9521K9314O4141R471N7728q9783j7520L564m2298J0232
6407B353320M8963L7973R5244k9130j30683L5391J2612J22410Q037N7393L7914
$$ plain form
6487 1299988 1286066 1212959 1223592 1193101 1177590 1133519 1159101 1116048 1002514 1170611 1095392
6476 1095392 1115627 1056134 1075874 1100113 1104685 1135584 1172861 1174274 1227526 1230098 1224628 1238551
6464 1238551 1346352 1368436 1344735 1311900 1249183 1255426 1230499 1283084 1318106 1411768 1419396 1383373
6452 1383373 1426079 1363708 1456424 1413802 1392919 1561890 1609085 1598193 1574917 1629727 1647458
6441 1647458 1748318 1769914 1807059 1867242 1967242 2049891 1965933 1963331 1988596 1951075 1893860
6430 1893860 1967512 1813164 1810887 1833566 1859749 1915732 1897333 1964687 2009472 2129195 2195262
6419 2195262 2216698 2268950 2328471 2357785 2421926 2431397 2489125 2399342 2381822 2385386 2343088 2353320
6407 2353320 2402283 2440256 2535500 2506370 2375687 2411078 2423690 2546100 2554137 2611530 2649444
6396B649444P4009J49129R7217J18032L6488J23414J05726j09796j4014j00500
6386C129149m3762j01326l5992k9743M6994o135L1916J4664j22622L6149Q9336
6375C008628O7126J08298N0888J17765L9536J5091J32596J22076Q5965k4419J46403
6364C869953P0642O5502O0455j11013r2830K0385j42537N382R2961J96816Q8789
6353D124505q0186N7664Q4240J17765M2373N3452J88712J10066K0684L06852J68258
6342E194385J88409J34653J97356K21390J07844K58645K40766L38033L46958K94458
6332G522897J39926k61391m20310j62614k37720j35720J1925J44452K48815K60063
6322G110323M20544M58224L54420J29009P6899J36770J06596K32576K77386J60619
$$ plain form
6396 2649444 2723453 2872582 2969799 3087831 3124319 3247733 3353459 3243663 3229649 3129149
6386 3129149 3085387 2984061 2948069 2918326 2965320 2959185 2991101 3005765 2883143 2919292 3008628
6375 3008628 3075754 3184052 3234940 3352705 3392241 3407332 3539928 3662004 3747969 3723550 3869953
6364 3869953 3940595 4006097 4066552 3955539 3862709 3883094 3740557 3745939 3838900 4035716 4124505
6353 4124505 4044319 4101983 4186223 4303988 4346361 4399813 4588525 4698591 4719275 5026127 5194385
6342 5194385 5382794 5517447 5714803 5936193 6044037 6302682 6543448 6881481 7228439 7522897
6332 7522897 7662823 7401432 6981122 6818508 6580788 6445068 6456993 6601445 6850260 7110323
6322 7110323 7530867 7989091 8343511 8472520 8549419 8686189 8792785 9025361 9302747 9463366
6312I463366n2649k22321m18207l23556k25324m1874Q1872K34668K45580Q1581
6302H823136k00779r2079j39089l8060J63822J18506K75857L98493N27535N03421
6292A0340763L68858q8441m23549l29671l49506j68440k01959j60124k0423k8379
6282H939129O8746J33959J76553K19280K52378K60893K66729M0040Q3966N2011
6272A0493684j3926N7637J13714O7952J40064J98380J81540K34539K45030R9324
6262A1817938J31320K75700L79337L81270L07670M33260K49172L11201M32013
6253A4718881L86343L67755J64214J91400K05287K22170L64254L15023L23543
6244A7258870L01868L00950M26614L68073L27355M05231M68220N26000N15566
$$ plain form
6312 9463366 9410717 9188396 8770189 8446633 8221309 8179435 8261307 8495975 8741555 8823136
6302 8823136 8622357 8530278 8391189 8353129 8516951 8635457 8911314 9309807 9837342 10340763
6292 10340763 10709621 10621180 10197631 9867960 9518454 9350014 9148055 8987931 8967508 8939129
6282 8939129 9007875 9141834 9318387 9537667 9790045 10050938 10317667 10357707 10441673 10493684
6272 10493684 10479758 10537395 10651109 10719061 10859125 11057505 11239045 11473584 11718614 11817938
6262 11817938 11949258 12224958 12604295 12985565 13293235 13726495 13975667 14286868 14718881
6253 14718881 15105224 15472979 15637193 15828593 16033880 16256050 16620304 16935327 17258870
6244 17258870 17560738 17861688 18288302 18656375 18983730 19388961 19857181 20383181 20898747
6235B0898747N44222N82747N86942N45098P06579N99722O26064Q59601R20832
6226B6870554R66284P56201Q76495R61282J075322J201041J379531J426664J843157
6217C7356531K003473K364584K990097L693969M788379O033966P582569R245022
6209G6058590R616084N951154r88392o475704p767452o546291m236288k059069
6201F3552632o8050J630121L243515N054807O554782O741128M121354M95046j153446
6192I0171889J88070K893224N644135O672944L880116j689790o557138p960341
6184I3243109o189496l284941j85209K489567L377610J042391l054051n148242
6176H2290738m468246k640237m56345J307257L131049N114771P214708R195370
$$ plain form
6235 20898747 21442969 22025716 22612658 23157756 23864335 24464057 25090121 25949722 26870554
6226 26870554 27836838 28593039 29469534 30430816 31506138 32707179 34086710 35513374 37356531
6217 37356531 39360004 41724588 44714685 48408654 53197033 59230999 66813568 76058590
6209 76058590 85674674 91625828 90637436 84161732 76394280 69847989 65611701 63552632
6201 63552632 63484582 65114703 68358218 73413025 79967807 86708935 90830289 91325335 90171889
6192 90171889 90359959 93253183 98897318 105570262 109450378 107760588 101203450 93243109
6184 93243109 87053613 83768672 83583463 86073030 89450640 90493031 87438980 82290738
6176 82290738 77822492 75182255 74725910 76033167 79164216 84278987 91493695 100689065
6168A00689065Q741081L320807m770164r576694r848121p980089n255960k810805
6160G2509120j059079M20640J617218K910619L827967L777067K294707j4173k708355
6151H3575731m518025n192633m904211l908324l139775k381459j665744j030793
6143E6834767o44508n5017N70587J137593J768898K527992L022771L502482L939467
6134G2605032M698877N616648O857550Q668204J0218371J0709044R128949M547890
6126A33050565k395257q909671j2365632j2618464j0735740q182562o001034m659067
6118F7183138l824595l225690k758996k169525j601563j010870m07472J96842
6110E2381269O13690J096527J496059K023550K747423L838398M786986N193442
$$ plain form
6168 100689065 109430146 112750953 107980789 98404095 88555974 80575885 75319925 72509120
6160 72509120 71450041 71870681 73487899 76398518 80226485 84003552 86298259 86284086 83575731
6151 83575731 79057706 73865073 68960862 65052538 61912763 59531304 57865560 56834767
6143 56834767 56190259 56135242 56705829 57843422 59612320 62140312 65163083 68665565 72605032
6134 72605032 77303909 82920557 89778107 98446311 108664682 119373726 128502675 133050565
6126 133050565 130655308 121745637 109380005 96761541 86025801 77843239 71842205 67183138
6118 67183138 63358543 60132853 57373857 55204332 53602769 52591899 52184427 52381269
6110 52381269 52994959 54091486 55587545 57611095 60358518 64196916 68983902 74177344
6102G4177344M315156K147318j108324m503482o526052o948574o365350n241714
6094D9946322m190507l274881k706683k351996k172629j761811j431389j197914
6086C0858512r41627n78577k71171k47444k14625m93978q59372j169087j275551
6077B4807080j199181j112372r56775r85694q50781p45645n79763n29817l64421
6068A7482631j46043r9166K1216M9040L15527L95349L80510O84848R63081J115102
6058B1162095J427984J546985J478846J171819K57836q78124j783005k330822
6050B2053614k071987j898867j522019j194619r43240o46311l92137m67958l86627
6041A2529849k46664j30332l4038J3090R9401O2723J79119K96271M61743P01152
$$ plain form
6102 74177344 78492500 80639818 79531494 75028012 68501960 61553386 55188036 49946322
6094 49946322 45755815 42480934 39774251 37422255 35249626 33487815 32056426 30858512
6086 30858512 29916885 29338308 29067137 28819693 28605068 28111090 27251718 26082631 24807080
6077 24807080 23607899 22495527 21538752 20553058 19702277 18956632 18376869 17847052 17482631
6068 17482631 17336588 17237422 17258638 17307678 17623205 18018554 18399064 19083912 20046993 21162095
6058 21162095 22590079 24137064 25615910 26787729 27045565 26167441 24384436 22053614
6050 22053614 19981627 18082760 16560741 15366122 14422882 13776571 13384434 12916476 12529849
6041 12529849 12283185 12152853 12118815 12131905 12231306 12294029 12473148 12769419 13231162 13932314
6031A3932314P54813O11150O09004K10209k56549o05845j150702j232020j104293
6022A1768081j026863q22042o23164n17729m36422k80994l69550k14694k52505
6013G224118k69561j20670j49843l12829j13372j71266j67544k04096j53273p1480
6003E490184j03369r5717j16987J1396K3736j40300k9583j44323m9705J488m1345
5992D805475j34061j05597k6709k5493j32772j76543j00145j10342J09208o6911
5982D036110l0568n7988l0235q9835o0485l9553j00634k4540j7596l4752J7690
5971C567614j367O7903l3944n3001l4558N1828K3548L1865K9615l6298j78618
5960C434587o1419J0146l8718p9673m3459N797J13449l1405k1061R7352k290J5836
$$ plain form
6031 13932314 14687127 15298277 15907281 16117490 15860941 15255096 14104394 12872374 11768081
6022 11768081 10741218 9919176 9296012 8778283 8341861 8060867 7691317 7476623 7224118
6013 7224118 6954557 6833887 6684044 6371215 6257843 6086577 5919033 5714937 5561664 5490184
6003 5490184 5386815 5291098 5174111 5185507 5209243 5068943 5039360 4895037 4845332 4846820 4805475
5992 4805475 4671414 4565817 4539108 4513615 4380843 4204300 4104155 3993813 4103021 4036110
5982 4036110 4005542 3947554 3917319 3827484 3766999 3727446 3626812 3602272 3584676 3549924 3567614
5971 3567614 3566247 3634150 3600206 3547205 3512647 3564475 3588023 3619888 3649503 3613205 3434587
5960 3434587 3373168 3383314 3344596 3264923 3221464 3227261 3340710 3309305 3288244 3385596 3383306 3399142
5948C399142R4066O5046P5225j3075k5655j13364o9349k7149l6213j7829k4777
5937C306068J14478J34887k2009j14503R334O3887M4893m3568m3084M7417l3149
5926C464651J18268J01074j9679O7923n7948J4216l5124K082R1757o199K105K6475
5914C769601N00L5938q1934o8140J08699j0748J2101K25544j7816R1493J42823
5903D208061L4683n2669n8578l4222j1160j21817J55595J16847N1165N2418n4072
5892D286251J28799l5544M3091J01727L8827l7051K0014j3301J04510J40284k3991
5881D753616l0171Q4921L6379M6446J30161K7372O510Q1162J96753Q1360m8922
5870E365587l1615J64671J44630R3391J38942n252J55823J63071Q0204J55931
$$ plain form
5948 3399142 3493208 3558254 3633479 3620404 3594749 3481385 3412036 3384887 3348674 3330845 3306068
5937 3306068 3420546 3555433 3533424 3418921 3428255 3492142 3537035 3493467 3450383 3497800 3464651
5926 3464651 3582919 3683993 3664314 3732237 3674289 3688505 3653381 3655463 3747220 3741021 3743126 3769601
5914 3769601 3770101 3806039 3724105 3655965 3764664 3753916 3766017 3991561 3973745 4065238 4208061
5903 4208061 4242744 4190075 4131497 4097275 4086115 3964298 4119893 4236740 4287905 4340323 4286251
5892 4286251 4415050 4379506 4422597 4524324 4563151 4526100 4546114 4532813 4637323 4777607 4753616
5881 4753616 4723445 4808366 4844745 4891191 5021352 5048724 5055234 5136396 5333149 5414509 5365587
5870 5365587 5333972 5498643 5643273 5736664 5875606 5870354 6026177 6189248 6269452 6425383
5860F425383j48663k4075N7942p217L5276J21424J51132K520j5232Q6919J66532
5849F851941R1979P318J11011M9499m8110J40053O4652J34409Q4350R6963J65634
5838G749699K00779K76818K20357J68729n2676o8619j32109j91298J9525J7031
5828H208236J29087J56943K0726J59619L0321P6087J0062K8058J05117J60783
5818I085039J68550J96964J02183R5601K27629K81537K16911J05063J44895K8683
5808A0653055J13179n837Q1864J22203M6044R0466J13007J99820J55687K34480
5798A1803968K22667K64838L03835L80751L48185M56733L14105L67589L36204
5789A4798875K52850K25391L32441M17273L86806M13498N91296P58762O90159
$$ plain form
5860 6425383 6276720 6252645 6310587 6303370 6338646 6460070 6611202 6613722 6598490 6685409 6851941
5849 6851941 6943920 6951238 7062249 7111748 7063638 7203691 7268343 7402752 7487102 7584065 7749699
5838 7749699 7950478 8227296 8447653 8616382 8563706 8495087 8362978 8171680 8191205 8208236
5828 8208236 8337323 8494266 8514992 8674611 8704932 8781019 8791081 8819139 8924256 9085039
5818 9085039 9253589 9450553 9552736 9648337 9875966 10157503 10374414 10479477 10624372 10653055
5808 10653055 10766234 10760397 10842261 10964464 11010508 11100974 11213981 11413801 11569488 11803968
5798 11803968 12026635 12291473 12595308 12976059 13324244 13780977 14095082 14462671 14798875
5789 14798875 15051725 15277116 15609557 16026830 16413636 16827134 17418430 18177192 18867351
5780A8867351N22840k6821j65285k00588O4859J83764L27948N82702O84074N78049
5770B1418893O25476O90474N76269M36013M12621M74957L64375L76120N22309
5761B5897507N38133N17286J79665J14168J53532K09067M15862P83732O73883
5752B9482835R58810Q02495O87802O41415L74586L40961K85492N60971P57182
5743C4892549J131447J251037J278766J045759Q41457O57273O41324O96570R03525
5734D3339707J144994J438958J964532K577491L157032L963944N018333O078449
5726F8683440P194173P807714P219650M944076J082658k844096n521116o617772
5718H1948727o201475m997153l536512k404670j541165r07377l16900L29030P34837
$$ plain form
5780 18867351 19390191 19363370 19198085 18997497 19062356 19246120 19574068 20156770 20840844 21418893
5770 21418893 22044369 22734843 23311112 23747125 24159746 24634703 24999078 25375198 25897507
5761 25897507 26435640 26952926 27132591 27246759 27400291 27609358 28025220 28808952 29482835
5752 29482835 30441645 31244140 31931942 32573357 32947943 33288904 33574396 34135367 34892549
5743 34892549 36023996 37275033 38553799 39599558 40441015 41098288 41739612 42436182 43339707
5734 43339707 44484701 45923659 47888191 50465682 53622714 57586658 62604991 68683440
5726 68683440 75877613 83685327 90904977 95849053 96931711 94087615 88566499 81948727
5718 81948727 75747252 70750099 67213587 64808917 63267752 62360375 62043475 62372505 63107342
5709F3107342R48620J147639J628861J981959K746004L851161N017546O618937
5701H7048069Q727381J0984457J3068546J3780134J0518516K744665o229022j1946108
5693A28696638j4027180j2837331j0421279q138233n868874m054614k716262j425360
5685F9207505m90754K28296J042049J459592J916542K536569L055451K448033
5677H1403283K97418j343020r39829L64362J988417K935829K844567J473605j221530
5668H7803102l953012n440572n773163m927667l846748k699361k039127j702602
5660E7420850j470513j021366o91757o09816n29679m70374n04438m09057l74324
5651E1339526k54929j31915n2374J78882J97082N97132O18591O94995R33461J145330
$$ plain form
5709 63107342 64055962 65203601 66832462 68814421 71560425 75411586 80429132 87048069
5701 87048069 95775450 106759907 119828453 133608587 144127103 146871768 140642746 128696638
5693 128696638 114669458 101832127 91410848 83272615 77403741 73349127 70632865 69207505
5685 69207505 68716751 68945047 69987096 71446688 73363230 75899799 78955250 81403283
5677 81403283 81700701 80357681 79417852 79782214 81770631 84706460 87551027 89024632 87803102
5668 87803102 83850090 78409518 72636355 67708688 63861940 61162579 59123452 57420850
5660 57420850 55950337 54928971 54237214 53627398 53097719 52627345 52122907 51713850 51339526
5651 51339526 51084597 50952682 50900308 51079190 51276272 51873404 52491995 53186990 54120451 55265781
5641E5265781J331195J473077J590550J732740K272480K657800K762971L037329
5633G2123923L293246L567749L846265M514285N628434P099083Q986218J0047095
5625A19106298P490125L62584o816582r288741q179457n554650k667222o17596
5617I3834759J353570L362221N215907O761910N933673K168826j144592j176795
5609A16309479J352015M654943Q202617J0498586R623852M629442l052665q313308
5601A43904961r225933o630447k678242Q79999J899134j46244k912651l604974
5593A21485603k809011j638244n48467Q89604K767005N255157P814619J0036130
5585A43252396J0184724N842711j922737p709464q515907o472534l495910j709952
$$ plain form
5641 55265781 56596976 58070053 59660603 61393343 63665823 66323623 69086594 72123923
5633 72123923 75417169 78984918 82831183 87345468 92973902 100072985 109059203 119106298
5625 119106298 126596423 126959007 120142425 110853684 102674227 97119577 94452355 93834759
5617 93834759 95188329 98550550 103766457 110528367 116462040 118630866 117486274 116309479
5609 116309479 117661494 122316437 130519054 141017640 150641492 155270934 152218269 143904961
5601 143904961 134679028 128048581 125370339 126250338 128149472 128003228 125090577 121485603
5593 121485603 118676592 117038348 116489881 117379485 120146490 125401647 133216266 143252396
5585 143252396 153437120 159279831 157357094 149647630 141131723 134659189 131163279 129453327
5577A29453327j071615m83645K18700K61970o69377j511714o63487J165851L275887
5568A29975897M864296N270002L690694P85916j608422k090245j286526P44652
5560A40346264K900324L416995J158381j718172k320363j06611L261840O276714
5552A53215372P410577N372629J928622p21977m064708q533570j1557290j1797874
5544A31251781r868916p026857m618515k682618j359539n72384L01933J024754
5536A06449639K394112M161417O075282Q355320J0389739J0389474P363636L078356
5528A58656975m20097k964677o168853q717845q412066o108647l014953p23147
5520A22126690j065741m009610o831034p131707n665809l639466j693524n76631
$$ plain form
5577 129453327 128381712 127898067 128116767 128378737 127709360 126197646 125534159 126700010 129975897
5568 129975897 134840193 140110195 143800889 144586805 142978383 140888138 139601612 140346264
5560 140346264 143246588 146663583 147821964 146103792 143783429 143676818 146938658 153215372
5552 153215372 160625949 165998578 167927200 167205223 163140515 154606945 143049655 131251781
5544 131251781 121382865 114356008 109737493 107054875 105695336 105122952 105424885 106449639
5536 106449639 108843751 113005168 119080450 127435770 137825509 148214983 155578619 158656975
5528 158656975 158236878 155272201 149103348 140385503 131973437 125864790 122849837 122126690
5520 122126690 121060949 117051339 110220305 103088598 97422789 93783323 92089799 91513168
5512I1513168q55177k068919l083241k928250j542612P6425J612740J542599l51478
5503H3915255k816626l800491l778078l715225l595623l261585k677429j805944
5495E8464254j077256j096252j870693k773298k916502k545592j843176j293778
5487D3047707p20962p86155j552380k384419k775218k643327k235928j861104
5479B8088214j501459j231023j049052r25275q46452o14934o11599n59262n43209
5470B0205949n60787k41944k43519l77539k63136k64909j93772k98492j89169
5461A7572682r2065k66250j91233p5619k86208j26796j16019j31404j61717j58812
5451A5966559j09369j07401r797j19108l2508j18284j43747K3386P1629R4938
$$ plain form
5512 91513168 90657991 88589072 85505831 82577581 81034969 81111394 82724134 84266733 83915255
5503 83915255 81098629 77298138 73520060 69804835 66209212 62947627 60270198 58464254
5495 58464254 57386998 56290746 54420053 51646755 48730253 46184661 44341485 43047707
5487 43047707 42326745 41540590 39988210 37603791 34828573 32185246 29949318 28088214
5479 28088214 26586755 25355732 24306680 23381405 22534953 21920019 21308420 20749158 20205949
5470 20205949 19645162 19403218 19159699 18782160 18519024 18254115 18060343 17761851 17572682
5461 17572682 17480617 17214367 17023134 16947515 16661307 16534511 16418492 16287088 16125371 15966559
5451 15966559 15857190 15749789 15739992 15620884 15588376 15470092 15326345 15349731 15421360 15516298
5441A5516298K7037J47651J41284J36055L46115M10593N17480O40179P82915Q43356
5431A9508963P66066Q75561J098877J546227K225823K816095L609280M566705
5423C7013597N246799M920768K028072k296961n362407n985691n483922m453416
5415B5626839l309645k437937j862494j477226j147800q27136p60376o53384n17046
5406A2633795n07296l79815l75615m13543j84986k79826k10180k68624k43467
5397I770443j38510j92618k79146k62688j77676k04991m4980j68186k30499r3245
5387G977904n6782m1058q695k8111q0362j00227l9255j12200j42859N5201J28295
5376G551851J06983Q9868J05101K06768L2578P3243J28293J96720J91849L29858
$$ plain form
5441 15516298 15543335 15690986 15832270 15968325 16314440 16725033 17242513 17882692 18665607 19508963
5431 19508963 20275029 21150590 22249467 23795694 26021517 28837612 32446892 37013597
5423 37013597 42260396 47181164 49209236 46912275 41549868 35564177 30080255 25626839
5415 25626839 22317194 19879257 18016763 16539537 15391737 14564601 13804225 13150841 12633795
5406 12633795 12126499 11746684 11371069 10957526 10772540 10492714 10282534 10013910 9770443
5397 9770443 9631933 9439315 9160169 8897481 8719805 8514814 8469834 8301648 8071149 7977904
5387 7977904 7921122 7880064 7871369 7843258 7762896 7662669 7623414 7511214 7368355 7423556 7551851
5376 7551851 7658834 7748702 7853803 8060571 8093149 8166392 8294685 8491405 8683254 9013112
5366I013112M78054O92977P88299P20890K82090o2672m65957o72007p47068p30020
5356I297698m90905k47521k71075k66179j21412m4178j19031r990O5395J14009
5346G906811J1396J73881K18274J33287L40110L35739L82886N39878O64516P75305
5336A1482083R12779J343360J561348J722084K004114K119100J539340L46411
5328B3030619j281604k229180k487727k338944j841066j395664r78124o79121
5320I799189n93095l77315k39525j36879j52104j41608p1031k0271N7313N6357
5310H181031J95441M1815K56359M56451L58533N21169N76276Q58627J229643J695015
5300A4370360K139825K558606K400011J095361q25977k034327k613402k340491
$$ plain form
5366 9013112 9491166 10184143 10972442 11693332 11975422 11912750 11446793 10774786 10027718 9297698
5356 9297698 8806793 8559272 8288197 8022018 7900606 7856428 7737397 7727407 7792802 7906811
5346 7906811 7918207 8092088 8310362 8443649 8783759 9119498 9502384 10042262 10706778 11482083
5336 11482083 12394862 13738222 15299570 17021654 19025768 21144868 22684208 23030619
5328 23030619 21749015 19519835 17032108 14693164 12852098 11456434 10478310 9799189
5320 9799189 9206094 8828779 8589254 8452375 8300271 8158663 8087632 8067361 8124674 8181031
5310 8181031 8376472 8418287 8674646 9131097 9489630 10010799 10587075 11445702 12675345 14370360
5300 14370360 16510185 19068791 21468802 22564163 21738186 19703859 17090457 14749966
5292A4749966j871767j592268j152041p70007n88280n48136l63341k79145q8389
5283G496592j53240j41082j01104j17660o1168L1501p0658j2199M6071J10432
5273G027485J53080Q4740K24486M00693M61451O45268P07394P46670N15172L2788
5263A0999227m33314n80827p70463m58510l59384m16819k06634m6851j35069j02487
5253G488869j52011o3167j14687p7365k63071k02526j28011L5259k10964j69953
5243F142373j46359r4163n452n3239p0758K604M6294o3271q4927p0269R4086J7918
5231E714837P4359j6938N7393J54757J79972L67667L41628K07105K20933K66032
5221G567745J44074p2305j30583j35750k66253j69574j4189q9923K835O316j82872
$$ plain form
5292 14749966 12878199 11285931 10133890 9363883 8775603 8227467 7864126 7584981 7496592
5283 7496592 7343352 7202270 7101166 6983506 6922338 6953839 6883181 6870982 6917053 7027485
5273 7027485 7180565 7265305 7489791 7890484 8351935 8997203 9704597 10451267 10966439 10999227
5263 10999227 10565913 9985086 9214623 8756113 8396729 7979910 7773276 7726425 7591356 7488869
5253 7488869 7336858 7273691 7159004 7081639 6818568 6616042 6488031 6523290 6312326 6142373
5243 6142373 5996014 5901851 5896399 5843160 5772402 5775006 5821300 5758029 5673102 5602833 5696919 5714837
5231 5714837 5789196 5772258 5829651 5984408 6164380 6532047 6873675 7080780 7301713 7567745
5221 7567745 7711819 7639514 7508931 7373181 7106928 6937354 6923165 6833242 6836077 6842393 6659521
5210F659521l771j70351j46302j27263p1022m6848q1652o9375o406r0509k0271
5199E825751k6991J30033R3362L1843P6841J58172R3639K32423J57525R3890J92057
5188G058545J39572K48494K20967l5499j33204q7533j96688j03408l15778j52527
5178F642941K7651J57247n2336L3869k6955K3031l2507L9882n5568p4418L715
5167F686552q4909n3045M366n2420J04066l3993l8770Q9706J13P5081R4632K8964
5155F820343J83686J92399J61358J33488N4030J30428o2899K6128Q0161J39544
5145G858666K10481Q0332K06051J12878K23350J90735L83363L24597M63054M89817
5135A0543324K86852M01500O41169P99231J150483J549436K164347K963506L305808
$$ plain form
5210 6659521 6655750 6485399 6339097 6211834 6140812 6093964 6012312 5942937 5936531 5846022 5825751
5199 5825751 5798760 5928793 6022155 6053998 6130839 6289011 6382650 6615073 6772598 6866488 7058545
5188 7058545 7198117 7446611 7667578 7632079 7498875 7411342 7214654 7111246 6795468 6642941
5178 6642941 6670592 6827839 6775503 6809372 6782417 6805448 6772941 6812823 6757255 6682837 6686552
5167 6686552 6601643 6548598 6552964 6500544 6604610 6570617 6531847 6621553 6621666 6696747 6791379 6820343
5155 6820343 7004029 7196428 7357786 7491274 7545304 7675732 7612833 7638961 7719122 7858666
5145 7858666 8069147 8149479 8355530 8468408 8691758 8882493 9265856 9590453 10053507 10543324
5135 10543324 10830176 11231676 11872845 12672076 13822559 15371995 17536342 20499848 23805656
5126B3805656J600431j537079l092597k798992k217521j179496o69898m16423
5118A3494081r0779J54926j9152j17276k60602j43581o4903J92453K55596L56570
5108A3757333M87225M29224j0855p9625r8912q5109j27083j02310k6377M7010
5098A4190521j51557J08792J25509J39732K31727K90878K64463L14602M07529
5089A5922196K85503J39607K34991K59145O6950J45234L58532L51989L13193J69504
5079A8246844J08148K908Q8655J75419L38066K06673L46557N34870O17407Q48009
5069B1513556P83066P14627O86224R53945P52739Q83406R07054R78930R65477
5060B9139024J044146J041932J097913R54523O72050M54125O00601O46311R62159
$$ plain form
5126 23805656 25406087 23869008 20776411 17977419 15759898 14580402 13910504 13494081
5118 13494081 13403302 13558228 13539076 13421800 13161198 13017617 12952714 13145167 13400763 13757333
5108 13757333 14244558 14673782 14662927 14583302 14484390 14399281 14272198 14169888 14143511 14190521
5098 14190521 14038964 14147756 14273265 14412997 14644724 14935602 15200065 15514667 15922196
5089 15922196 16207699 16347306 16582297 16841442 16908392 17053626 17412158 17764147 18077340 18246844
5079 18246844 18354992 18357900 18446555 18621974 18960040 19166713 19513270 20048140 20665547 21513556
5069 21513556 22296622 23011249 23697473 24651418 25404157 26287563 27194617 28173547 29139024
5060 29139024 30183170 31225102 32323015 33277538 33949588 34403713 35004314 35650625 36612784
5051C6612784Q31822Q40041O76636P41176Q28964J102806J224480J374864J347907
5042D5581480J691280J568854J730516J493311J759952J931916K906325L271081
5034F1934715M177522M754348O260721P271289Q540590R882599J2746346J5359625
5026A30927755K0528904K7954983L9087581N1066536P0363047P3162692L1092682
5019D44184180m4892583q0764949p3947929n9275103l7728073k5828992j7337327
5012A04409224j3254663r642498p917243n778158m988392l549639l181240k306595
5004E3790796k200978j457107j575570r64141r65654r91554j746982k022965k410376
4995C9455469k484606k209413j952589j840983j585668j322492p91800o17040
$$ plain form
5051 36612784 37444606 38284647 38961283 39702459 40531423 41634229 42858709 44233573 45581480
5042 45581480 47272760 48841614 50572130 52065441 53825393 55757309 58663634 61934715
5034 61934715 66112237 70866585 77127306 84398595 92939185 102821784 115568130 130927755
5026 130927755 151456659 179411642 218499223 269565759 339928806 413091498 444184180
5019 444184180 399291597 318526648 244578719 185303616 147575543 121746551 104409224
5012 104409224 91154561 81512063 73594820 67816662 62828270 59278631 56097391 53790796
5004 53790796 51589818 50132711 48557141 47593000 46627346 45635792 43888810 41865845 39455469
4995 39455469 36970863 34761450 32808861 30967878 29382210 28059718 27267918 26650878
4987B6650878m91104n80010m59355o74503m81694o67577o23155p37480o24108
4978B1311892m61255k17650m16871j81258q5299K15094K93864M33532L34151k74614
4968B0951586q77552q93230q73806o93670o12490m48305k58767j94659j82950
4959A5916157j63159j58300j10871j78590k02256j01855j66822J2955N3409R284
4949A4909952J34750J94021K7711j3069J11185k0882j33959J61965J20770Q6724
4939A5579168Q7933J01059Q8958K27156J85691J96103K33085K70745L11977J80931
4929A7462806J54051J34153J44497L57087K85407J04447J24679K22918J97514
4920A9187559K69572L50173O19040O86690P70482R59782J109118P46982N88308
$$ plain form
4987 26650878 26159774 25579764 25120409 24445906 23964212 23296635 22673480 21936000 21311892
4978 21311892 20850637 20632987 20216116 20034858 19949559 20164653 20458517 20892049 21226200 20951586
4968 20951586 20074034 19180804 18306998 17613328 17000838 16552533 16293766 16099107 15916157
4959 15916157 15752998 15594698 15483827 15305237 15102981 15001126 14834304 14847259 14900668 14909952
4949 14909952 15044702 15238723 15266434 15253365 15364550 15343668 15209709 15371674 15492444 15579168
4939 15579168 15667101 15768160 15857118 16084274 16269965 16466068 16699153 16969898 17281875 17462806
4929 17462806 17616857 17751010 17895507 18252594 18538001 18642448 18767127 18990045 19187559
4920 19187559 19457131 19807304 20426344 21113034 21883516 22843298 23952416 24699398 25287706
4911B5287706N75865O47739P95143J276858J769607K542975L430127M759560O317880
4902D7403460Q129794O704059P80243n972132p950776p469858n459803l598855
4894C2566132k345711j525011r74633n53104k80777j38737J07479K01507L61706
4885B7418851N94590Q33639J042810J569984K105795K758656L404574K383485
4877D2112384o44772k912154l001440k366203j455971r58335n77977j96594n0921
4868B9948017Q1901J99243M33120M85064N63800O51580P08606Q78970Q23071Q90549
4858C5663921R81546J103013J251435J287448J408262J552454J884430J898373
4850D7030882K109037K124903K283428K518946K482920K757152K781428K558417
$$ plain form
4911 25287706 25863571 26511310 27306453 28583311 30352918 32895893 36326020 41085580 47403460
4902 47403460 55533254 62237313 63017556 57045424 49094648 41624790 36164987 32566132
4894 32566132 30220421 28695410 27720777 27167673 26886896 26748159 26855638 27057145 27418851
4885 27418851 28013441 28847080 29889890 31459874 33565669 36324325 39728899 42112384
4877 42112384 41467612 38555458 35554018 33187815 31731844 30773509 30195532 29998938 29948017
4868 29948017 30029918 30229161 30662281 31147345 31711145 32362725 33071331 33950301 34773372 35663921
4858 35663921 36645467 37748480 38999915 40287363 41695625 43248079 45132509 47030882
4850 47030882 49139919 51264822 53548250 56067196 58550116 61307268 64088696 66647113
4842F6647113K189639K027140J676501J348403J119063P35139O20924N11272L71832
4833G7247026L63836K42330L15321O49162Q18496J225662J598383K018499K633963
4824H7112678K882839L314043L685129L911388M092002M348324M458816M320285
4816A18125504L877775L222567K045923Q46398K445p18103j194570j415617k006192
4807A22786130k483324k953961l043140k812475k056338j335289n12478L38940
4799A07928065J235076J901847K478549K829872L206565L528096L598411M021097
4791A30727578M365314M418329M138987L335508K286071M21270r90975k024622
4783A46677460k709296k841935k791659k766177k830665k605444k185331j556488
$$ plain form
4842 66647113 68836752 70863892 72540393 73888796 75007859 75742998 76363922 76875194 77247026
4833 77247026 77610862 77853192 78168513 78817675 79636171 80861833 82460216 84478715 87112678
4824 87112678 89995517 93309560 96994689 100906077 104998079 109346403 113805219 118125504
4816 118125504 122003279 125225846 127271769 128118167 128120612 127402509 126207939 124792322 122786130
4807 122786130 120302806 117348845 114305705 111493230 109436892 108101603 107589125 107928065
4799 107928065 109163141 111064988 113543537 116373409 119579974 123108070 126706481 130727578
4791 130727578 135092892 139511221 143650208 146985716 149271787 149693057 148702082 146677460
4783 146677460 143968164 141126229 138334570 135568393 132737728 130132284 127946953 126390465
4775A26390465r51961m25242J85147N33130R80492J217908J686726K021681K097393
4766A33735739K131998J887658J688673J408558J240925R56363M69702l60495
4758A43159121j246576k213221k678037k773096k777114k425586k241492k186939
4750A24617060k324700k310986k006317j559435j301906j148789j353345j769722
4742A10841860k008267k039917j988671j987677j726529j981534k055550k147795
4734I4905920k380974k637025k826530l113719l416625l344274k967457k937378
4726G1281938k751725k649712k813691k969235k810485k938948k840088k579644
4718D8928410k577371k403395k429797k390222k248101j978062j957942j599850
$$ plain form
4775 126390465 125438504 125013262 125198409 125731539 126712031 127929939 129616665 131638346 133735739
4766 133735739 135867737 137755395 139444068 140852626 142093551 143049914 143519616 143159121
4758 143159121 141912545 139699324 137021287 134248191 131471077 129045491 126803999 124617060
4750 124617060 122292360 119981374 117975057 116415622 115113716 113964927 112611582 110841860
4742 110841860 108833593 106793676 104805005 102817328 101090799 99109265 97053715 94905920
4734 94905920 92524946 89887921 87061391 83947672 80531047 77186773 74219316 71281938
4726 71281938 68530213 65880501 63066810 60097575 57287090 54348142 51508054 48928410
4718 48928410 46351039 43947644 41517847 39127625 36879524 34901462 32943520 31343670
4710C1343670j283763j139518j031072o91535n83855k35115m4212Q1979k09982
4701B6206597o54332j332086j818100j765316j397612j016861q91634p42522o22619
4692A5965515n70677m46427m21894m24894l66986m47334k42896m10140l38711
4683A2295556k65658l92470k36426j83723l55903l65257k31853j89919k83021
4674I791326k87348k46307k41578j83729k73536j82661p9734j61475j65646j77675
4664G791637k04269j85818r8499k18234r7865k49331j65698m096j70666r6393
4654F300768p5548j64349j53564m6012L0431j81147p7806k38208p3737J359j73987
4643E148200q0621j06027j17416l729p4397m2986r5867l2738Q943j25819j41261
$$ plain form
4710 31343670 30059907 28920389 27889317 27197782 26613927 26378812 26334600 26416579 26206597
4701 26206597 25552265 24220179 22402079 20636763 19239151 18222290 17330656 16588134 15965515
4692 15965515 15394838 14948411 14526517 14101623 13734637 13287303 13044407 12634267 12295556
4683 12295556 12029898 11637428 11401002 11217279 10861376 10496119 10264266 10074347 9791326
4674 9791326 9503978 9257671 9016093 8832364 8558828 8376167 8296433 8134958 7969312 7791637
4664 7791637 7587368 7401550 7303051 7084817 6986952 6737621 6571923 6567827 6397161 6300768
4654 6300768 6225220 6060871 5907307 5861295 5891726 5710579 5632773 5394565 5320828 5322187 5148200
4643 5148200 5067579 4961552 4844136 4840407 4766010 4723024 4627157 4594419 4603362 4477543 4336282
4632D336282l2054l8628j04794p7552r9777K041M9641j03961k8441j2581m524
4621C885652j32547j31670J16670r5462J4245P9543l4257k2872r0336p3690r6654
4610C418622K3144l8387J1855J1589j40816L479Q3942j44096m9772K1905J7661
4599C219126m6554n966n7126r3916N421O8566M00n4802j19628P3106L9452p9556
4587B948523R773j3505j11959q9858o6800O8103m2850j12228K1385m8232K9240
4576B591592J1471l936l3230n8518R1495K7873l8289M7295k7981J15348Q9995
4565B813115m2124m7458L0934n3377N6911p779K6275j35474j2227K715k694Q6963
4553B715780j06473O6219N4614j65616k8778N1578J32248o8431j13206R735J21335
$$ plain form
4632 4336282 4304228 4265600 4160806 4083254 3983477 3985518 4035159 3931198 3902757 3890176 3885652
4621 3885652 3753105 3621435 3738105 3642643 3656888 3736431 3702174 3679302 3588966 3515276 3418622
4610 3418622 3441766 3403379 3415234 3426823 3286007 3289486 3373428 3229332 3179560 3201465 3219126
4599 3219126 3172572 3166606 3109480 3015564 3020985 3089551 3089951 3035149 2915521 2988627 3028079 2948523
4587 2948523 2958296 2944791 2832832 2742974 2676174 2744277 2701427 2589199 2610584 2562352 2591592
4576 2591592 2603063 2599127 2565897 2507379 2598874 2626747 2588458 2635753 2607772 2723120 2813115
4565 2813115 2770991 2723533 2754467 2701090 2758001 2750222 2776497 2641023 2628796 2631511 2628817 2715780
4553 2715780 2609307 2675526 2730140 2564524 2535746 2587324 2719572 2651141 2537935 2547670 2669005
4542B669005o6469o0269O1321J16059l9137J3239n7716O0861M6578P474O2476
4531B813422o0381O2849J6800q1057M1157Q4511P3272p5700J5496p4126L8280
4520B854523K9074K6370R533l5625N1534L8588p4110M2846L4129k8403O2496L3730
4508C044685n5604J3149p5831n546J6601O582J01123P612L5096m5670J37129O9638
4496C248964m2322J8383J1015q6652K6765N1609Q617n1588J5906J4439j2060O1620
4484C264696j510P2073K8168M7416l705m4812R8467K2348J9651m4543J28661P9643
4472C666553R2614N257k5170k0902R623J01009J3440j27432R0912M3803P6129
4461C925836J05588k836K027k9601k8196m2485J07921P844o1133M6691L8185J0995
$$ plain form
4542 2669005 2602536 2542267 2603588 2719647 2680510 2693749 2636033 2696894 2743472 2750946 2813422
4531 2813422 2753041 2815890 2832690 2751633 2792790 2877301 2950573 2874873 2890369 2816243 2854523
4520 2854523 2883597 2909967 2919500 2883875 2935409 2973997 2899887 2942733 2976862 2948459 3010955 3044685
4508 3044685 2989081 3002230 2926399 2920853 2937454 2944036 3045159 3052771 3087867 3042197 3179326 3248964
4496 3248964 3206642 3225025 3236040 3149388 3176153 3227762 3236379 3184791 3200697 3215136 3203076 3264696
4484 3264696 3263186 3335259 3363427 3410843 3407138 3362326 3460793 3483141 3502792 3458249 3586910 3666553
4472 3666553 3759167 3764424 3739254 3718352 3727975 3828984 3842424 3714992 3805904 3849707 3925836
4461 3925836 4031424 4028588 4030615 4001014 3972818 3930333 4038254 4046098 3984965 4031656 4069841 4080836
4449D080836P902l7052m6549o6710J19304P4811j29668O0913K8063Q2414L6451
4438D210715N4161L1712n3283J31433J19948n1524l4254K493k3976M0488N3130
4427D481043q350N1030J9306j8570J5324J672P433J19860N8795J19803o2059J06035
4415D891322R8717m9694J64394J7955O6611l3672j7435O5044P1540K00574J10464
4404E585820J22464K06005P2093o6218r1940j19280J6685r0498j5714J6811L4515
4393E670743q5085R057P0728M8808N1543J60995m4656o0226M7651J659m3713J31728
4381E959232R538l8532J912L4024q8280j57655J34583R7239j4117j09634k723
4370E825587J53153n6458P4516J76976J2873M4616J52607M9858j34604O9852J4682
$$ plain form
4449 4080836 4088738 4051686 4005137 3938427 4057731 4132542 4002874 4063787 4091850 4174264 4210715
4438 4210715 4264876 4296588 4243305 4374738 4494686 4443162 4408908 4411401 4387425 4427913 4481043
4427 4481043 4472693 4523723 4543029 4524459 4539783 4541455 4548888 4668748 4727543 4847346 4785287 4891322
4415 4891322 4990039 4940345 5104739 5122694 5189305 5155633 5138198 5203242 5274782 5475356 5585820
4404 5585820 5708284 5914289 5986382 5920164 5828224 5708944 5725629 5635131 5619417 5636228 5670743
4393 5670743 5585658 5594715 5665443 5714251 5765794 5926789 5882133 5821907 5869558 5871217 5827504 5959232
4381 5959232 5968770 5930238 5932150 5966174 5877894 5720239 5854822 5952061 5937944 5828310 5825587
4370 5825587 5978740 5922282 5996798 6173774 6186647 6231263 6383870 6433728 6299124 6368976 6383658
4359F383658P7005j18063P0746O7804M0989j02216p1242l830k7436l4194R745
4348F292966r2441k0136J43115N8536j08649j50761j3524N6172L634r479M8915
4337F208348l7155l6576P8387j00788L9232r402L501J8351j24634n9254k8446
4326E951564q1410r904N7532J5373j21046J14524p3984Q8802J02700L7891j2321
4315F069721j0124K2066P2555o4481J5057p33l3593j7856p8618K4182m5250m1398
4303E911528p8376o2641N4157J8836q835L666o3560L6007P0301O828K6491P9965
4291E994367N3737L738O4474Q9711M3860n5296k707K7017M4107R3690j52844J44604
4279F348458q88o6419J418O6576J3945P9348M7198Q1831Q0989q8752M7757j669
$$ plain form
4359 6383658 6460663 6342600 6413346 6481150 6522139 6419923 6348681 6344851 6317415 6283221 6292966
4348 6292966 6200525 6180389 6323504 6382040 6273391 6122630 6109106 6165278 6168912 6159433 6208348
4337 6208348 6171193 6134617 6213004 6112216 6151448 6142046 6145547 6163898 6039264 5980010 5951564
4326 5951564 5870154 5860250 5917782 5933155 5812109 5926633 5852649 5941451 6044151 6082042 6069721
4315 6069721 6059597 6081663 6154218 6089737 6104794 6104061 6070468 6052612 5973994 5998176 5952926 5911528
4303 5911528 5833152 5770511 5824668 5843504 5834669 5838335 5774775 5810782 5881083 5887911 5914402 5994367
4291 5994367 6048104 6051842 6116316 6206027 6249887 6194591 6191884 6218901 6263008 6356698 6203854 6348458
4279 6348458 6347570 6281151 6282569 6349145 6363090 6442438 6489636 6571467 6652456 6563704 6611461 6609792
4267F609792o184J41054O5305L4033K8769J17921P2509J58195J01771L4650P5373
4256G433188J59002K1015J12972M384R8658K13675R3480J33500O076L3792K8843
4245H338585O9750M3985L8347Q1778J50613J60501q366N3307J3998Q8956J42202
4234I173656K25406J00093J29727J82287J67534J24268J26324R125J75858J02576
4224A0516854J23419K14832O8596K49319P5417J00195R1812N8982J45025J29282
4214A1773733N9577J25440P8158J78091J77005O0403J26834J44184J39111J83517
4204A3046053R6358R4750J21351K37199N6671J90865K73872K51353L06781J99284
4194A4874537J05390K66263K93008J74400Q6906J97081K43110K26611L10318K47032
$$ plain form
4267 6609792 6603608 6744662 6809967 6844000 6872769 6990690 7063199 7221394 7323165 7357815 7433188
4256 7433188 7592190 7613205 7726177 7730561 7829219 8042894 8136374 8269874 8275950 8309742 8338585
4245 8338585 8408335 8452320 8490667 8572445 8723058 8883559 8875193 8928500 8942498 9031454 9173656
4234 9173656 9399062 9499155 9628882 9811169 9978703 10102971 10229295 10238420 10414278 10516854
4224 10516854 10640273 10855105 10923701 11173020 11248437 11348632 11440444 11499426 11644451 11773733
4214 11773733 11833310 11958750 12036908 12214999 12392004 12452407 12579241 12723425 12862536 13046053
4204 13046053 13142411 13237161 13358512 13595711 13652382 13843247 14117119 14368472 14675253 14874537
4194 14874537 14979927 15246190 15539198 15713598 15800504 15997585 16240695 16467306 16777624 17024656
4184A7024656J66904K93902K59265O9313K72297M40046L48842J68039K96802L10433
4174A9650499M53109O07353M81858L11724N06384M75523M87801M72759M87951
4165B3934961N31110O40800P44118O78269P57194P99750P85634P58701O53371
4156C0283908O19040P33079N63447M40065M95272M23628N07839N37090O19437
4147C5222805Q15032P86966R79451J139102J180625J296043J324191J321068J223228
4138D5288511R55175Q72123R22319R10024R60034J111782J203466J199464J002729
4129E4425627R55709J080733J071675J039771R88140R54396Q82880Q16822P35125
4120F2950878Q82160J061354J394264J897254K383863K628089K527506K468749
$$ plain form
4184 17024656 17191560 17485462 17744727 17814040 18086337 18526383 18875225 19043264 19340066 19650499
4174 19650499 20103608 20710961 21192819 21504543 22010927 22486450 22974251 23447010 23934961
4165 23934961 24466071 25106871 25850989 26529258 27286452 28086202 28871836 29630537 30283908
4156 30283908 30902948 31636027 32199474 32639539 33134811 33558439 34066278 34603368 35222805
4147 35222805 36037837 36824803 37804254 38943356 40123981 41420024 42744215 44065283 45288511
4138 45288511 46243686 47115809 48038128 48948152 49908186 51019968 52223434 53422898 54425627
4129 54425627 55381336 56462069 57533744 58573515 59561655 60516051 61398931 62215753 62950878
4120 62950878 63833038 64894392 66288656 68185910 70569773 73197862 75725368 78194117
4112G8194117J902121J161071M09319P7493J77983L49179M94544N98072N69530
4103H3933429O28783P46717P08536P96618R97038J051366J177032Q74189P72457
4094I1686165M95401K30863M92729R06088J502546K080752K692192L360701L501062
4085A06948499L446386K953611K191457J491333J184865J279477J376819J266750
4077A22139197R63551Q94367J035944J054000R93660P95304M73326M56871M69127
4068A29275347N26875P43922J166265J855747K411697K481396K420880J666566
4060A42548695P22293J54319l78544p67688r21214q88889m37116P0549N92445
4051A40694850Q19642M79350K07496R24j74360j91833o35086j200499j282164
$$ plain form
4112 78194117 80096238 81257309 81666628 81744121 81922104 82271283 82765827 83363899 83933429
4103 83933429 84562212 85308929 86017465 86814083 87811121 88862487 90039519 90913708 91686165
4094 91686165 92181566 92412429 92905158 93811246 95313792 97394544 100086736 103447437 106948499
4085 106948499 110394885 113348496 115539953 117031286 118216151 119495628 120872447 122139197
4077 122139197 123102748 123997115 125033059 126087059 127080719 127876023 128349349 128806220 129275347
4068 129275347 129802222 130546144 131712409 133568156 135979853 138461249 140882129 142548695
4060 142548695 143270988 143425307 143046763 142279075 141357861 140468972 140031856 140102405 140694850
4051 140694850 141514492 141993842 142201338 142202262 142027902 141836069 141200983 140000484 138718320
4042A38718320j061165j150200j290471j445086j505939j368071j147464j017339
4034A28732585j598667k833046l940189m284497m265429l816677l095788k329884
4026A02568408j464675j034092p63228o02451j001191j346409j359359j664421
4018I3332582j733720j889512j811620j725182j585266j585596j429860j146387
4010H0425439j099614p78412o45925p56652j090717j717537k316834k635172k557730
4001F6826846k352563k085837j748673j485149j030289q53762j174333j206505
3993E4889735j174118j192246j227927j299166j122203j140799j118633j009966
3985D5604677q56109q91527q24560q34020q31101q81620j001756r35654j200933
$$ plain form
4042 138718320 137657155 136506955 135216484 133771398 132265459 130897388 129749924 128732585
4034 128732585 127133918 124300872 120360683 116076186 111810757 107994080 104898292 102568408
4026 102568408 101103733 100069641 99306413 98703962 97702771 96356362 94997003 93332582
4018 93332582 91598862 89709350 87897730 86172548 84587282 83001686 81571826 80425439
4010 80425439 79325825 78547413 77901488 77144836 76054119 74336582 72019748 69384576 66826846
4001 66826846 64474283 62388446 60639773 59154624 58124335 57270573 56096240 54889735
3993 54889735 53715617 52523371 51295444 49996278 48874075 47733276 46614643 45604677
3985 45604677 44748568 43857041 43032481 42198461 41367360 40485740 39483984 38548330 37347397
3976C7347397j211830r41084q73841q01056n55615m28724k69540l50739m73442
3967C1441526n64255o15754n67491o78893p35046p31824p08258p92586p36759
3958B5310660p84556p82708r61954j018132r47340r44022p29201o79692p88040
3949A7675015p44972m85600n00836m86665m23319l05605l94230m13504k86798
3940A3633486l01377j72504k26580k38108k04892j56618m9425L021m0043j54813
3930A2092147k08599j31181j59401o5452j47627p1983l0329q8356j34002k44536
3920A0810681j06619j88837j24602j51726n800j30252l25518j46341o87j21970
3910I508329j15841k8467p4459o0071k8744o182j44025o3962k5880j24191o049
$$ plain form
3976 37347397 36135567 35194483 34320642 33519586 32963971 32535247 32265707 31914968 31441526
3967 31441526 30877271 30261517 29694026 29015133 28280087 27548263 26840005 26047419 25310660
3958 25310660 24526104 23743396 22781442 21763310 20815970 19871948 19142747 18463055 17675015
3949 17675015 16930043 16444443 15943607 15456942 15033623 14728018 14333788 13920284 13633486
3940 13633486 13332109 13159605 12933025 12694917 12490025 12333407 12283982 12287003 12246960 12092147
3930 12092147 11883548 11752367 11592966 11527514 11379887 11307904 11277575 11189219 11055217 10810681
3920 10810681 10704062 10515225 10390623 10238897 10233097 10102845 9777327 9630986 9630299 9508329
3910 9508329 9392488 9364021 9289562 9229491 9200747 9194565 9050540 8986578 8960698 8836507 8830458
3899H830458J10502j7274O8489o4220J15787J8500q6116N8625P3901q4831k773
3888I021048N8341o9378l3167k922J9266j41845q4869M9872j7287r3781j36489
3877H568789n1286n7440r9217l2846J23441j03964n9870l7633q9230q1175r9314
3866G980255M2968J01269P7779k7993J10486k1723k8308j80267o1293j28588j56829
3855G707756j51802J6771R5210M3385o6140K0851R130m8608j5686m9496R005j40958
3843G429418n2881j0460k2562j0661j003m4253Q7955q9619j74956j21009r9549
3832F890420J2213O8002K9065l7528J5017M1703k2788N3873k8633p9090P4092
3821G016346K25693K17991q6666J20193N3357r1636n9489j0002j9710O212J34644
$$ plain form
3899 8830458 8940960 8923686 8992175 8927955 9043742 9062242 8976126 9034751 9108652 9023821 9021048
3888 9021048 9079389 9010011 8976844 8973922 8993188 8851343 8766474 8816346 8799059 8705278 8568789
3877 8568789 8517503 8460063 8360846 8328000 8451441 8347477 8287607 8249974 8160744 8079569 7980255
3866 7980255 8023223 8124492 8202271 8174278 8284764 8263041 8234733 8054466 7993173 7864585 7707756
3855 7707756 7555954 7572725 7667935 7711320 7645180 7666031 7675161 7626553 7610867 7561371 7570376 7429418
3843 7429418 7376537 7366077 7343515 7332854 7331851 7287598 7375553 7285934 7110978 6989969 6890420
3832 6890420 6902633 6970635 6999700 6962172 6977189 7018892 6996104 7049977 7021344 6942254 7016346
3821 7016346 7242039 7460030 7373364 7493557 7546914 7455278 7395789 7385787 7366077 7372289 7506933
3810G506933p528k8759Q4476K5248L5341M2623N1557N9829k6274j13402m7895
3799G582149k2902o5420j43985j5563l3984J0853P1956p9469J04957Q7689k4960
3788G471321K16766J02937p1097l2749l7133P033q3698n944P3468J42625K0472
3777G804001r8707j26725Q2594m8999j49125J6221J29565m3590j6073M6946j7903
3766G578205n2633J7270j0185L5663l7388o3207m8846K4910J65214k4882o817
3755G577304O388P7926P0569J3262n5500M2371r6674n205L0629j18007M479l0543
3743G516999K8137q9624j8719q9229p2881L4778O3483J0630r9254o011p4107N866
3731G210068N0209o538j4363j85262n7319N9918j66340n402o0136l7202J29256
$$ plain form
3810 7506933 7499405 7470646 7555122 7580370 7615711 7658334 7709891 7769720 7743446 7630044 7582149
3799 7582149 7559247 7493827 7349842 7334279 7300295 7311148 7383104 7303635 7408592 7496281 7471321
3788 7471321 7688087 7791024 7719927 7687178 7650045 7657078 7573380 7567436 7640904 7783529 7804001
3777 7804001 7705294 7578569 7661163 7612164 7463039 7479260 7608825 7565235 7549162 7596108 7578205
3766 7578205 7525572 7542842 7532657 7568320 7530932 7467725 7418879 7443789 7609003 7584121 7577304
3755 7577304 7583692 7661618 7732187 7745449 7689949 7732320 7635646 7630441 7661070 7543063 7547542 7516999
3743 7516999 7545136 7455512 7436793 7347564 7274683 7309461 7372944 7383574 7284320 7278309 7204202 7210068
3731 7210068 7260277 7253739 7239376 7054114 6996795 7056713 6890373 6884971 6824835 6787633 6916889
3720F916889M2333N02N983Q2557J00509L9017L0264M6191K2696L4366r8240j34239
3708G088828J0434p9023J1338m984Q2332K4466j19383q0992j529n3489M896N8109
3696F941003j5527o7621j27149m2142J10922P0816j4449K0585k3082r758n5107
3685F788491K739L5339m9196L7213J25898j16221k2102l2140L9675O2218n4359
3674F817555M6824P7306m2468l2265P9259L912j6746O0147L4724l7573Q3966K49950
3662G324591N0456l7014J11448L320r665L3738Q7769J01346P2338R2881M3640
3651G874848O4885O6800j15536K8536n0728N1716l4202n568k0716k4127J06378
3640G942286O5410L7499m7424J51009Q4392J06605J68243M1481O9032J90519K22386
$$ plain form
3720 6916889 6959222 6959724 6965707 7048264 7148773 7187790 7218054 7264245 7286941 7321307 7223067 7088828
3708 7088828 7099262 7020239 7031577 7026593 7108925 7133391 7014008 6933016 6931487 6877998 6882894 6941003
3696 6941003 6925476 6857855 6730706 6688564 6799486 6870302 6855853 6876438 6853356 6843598 6788491
3685 6788491 6791230 6826569 6777373 6814586 6940484 6824263 6802161 6770021 6809696 6871914 6817555
3674 6817555 6864379 6941685 6899217 6866952 6946211 6950123 6933377 6993524 7028248 6990675 7074641 7324591
3662 7324591 7375047 7338033 7449481 7452801 7443136 7476874 7564643 7665989 7738327 7831208 7874848
3651 7874848 7939733 8006533 7890997 7919533 7868805 7920521 7886319 7880751 7860035 7835908 7942286
3640 7942286 8007696 8045195 7997771 8148780 8233172 8339777 8508020 8549501 8618533 8809052 9031438
3629I031438J96102Q1935j01531J323l3511o6712J3493K34694J95354M0234J1527
3618I604346m5275O1230k2508L3291J8874O4087R2914M6326J47992P2687P8973
3607A0152937J16414L8859Q7077Q9470J62375J52401J47283J40106J53941K17246
3597A1458109J24204J29463J23928J28438J90225K71437J77940J86190J46698
3588A2936632J60276K24646K09935J87549R2132K3320j7104J08034J14176K05140
3578A4244736J7690R4671J43017J75130J45788K41400K39538P2018J50723J63335
3568A5688046K17170K45670K90324K01837J96715K99792K69451L41623L48013
3559A8098641L21470L72807L65345K61383N02302L76548L41736L29041K14483
$$ plain form
3629 9031438 9227540 9309475 9207944 9209267 9175756 9109044 9122537 9357231 9552585 9592819 9604346
3618 9604346 9559071 9620301 9597793 9631084 9649958 9714045 9806959 9853285 10001277 10073964 10152937
3607 10152937 10269351 10308210 10395287 10484757 10647132 10799533 10946816 11086922 11240863 11458109
3597 11458109 11582313 11711776 11835704 11964142 12154367 12425804 12603744 12789934 12936632
3588 12936632 13096908 13321554 13531489 13719038 13811170 13834490 13817386 13925420 14039596 14244736
3578 14244736 14262426 14357097 14500114 14675244 14821032 15062432 15301970 15373988 15524711 15688046
3568 15688046 15905216 16150886 16441210 16643047 16839762 17139554 17409005 17750628 18098641
3559 18098641 18420111 18792918 19158263 19419646 19921948 20298496 20640232 20969273 21183756
3550B1183756L33350M42453M28179K79891K36620L78903M35057L09044M00934
3541B4428187M13241L80732M21717K71248L66987L29428M44991N56301M51243
3532B8064075M18341O89940N81407N41847O96569Q72165Q30195N87994O52478
3523C3935011Q17180R32208R59491J117190J108860J224581J155845J269358J473551
3514D3993275J593995J752665K136041K166750K332627K533890K737722K892034
3506F2138999K817079K668377K552973K361683J877827J057031R7769r69986j967782
3497G2633970k660851k864539l231436k906478k599997k324397k045049j656250
3489E2344973j149988r30584p24804r42553q47770o76034k75274J60993N78138
$$ plain form
3550 21183756 21517106 21959559 22387738 22667629 22904249 23283152 23718209 24027253 24428187
3541 24428187 24841428 25222160 25643877 25915125 26282112 26611540 27056531 27612832 28064075
3532 28064075 28482416 29172356 29753763 30295610 30992179 31864344 32694539 33282533 33935011
3523 33935011 34752191 35684399 36643890 37761080 38869940 40094521 41250366 42519724 43993275
3514 43993275 45587270 47339935 49475976 51642726 53975353 56509243 59246965 62138999
3506 62138999 64956078 67624455 70177428 72539111 74416938 75473969 75571738 74601752 72633970
3497 72633970 69973119 67108580 63877144 60970666 58370669 56046272 54001223 52344973
3489 52344973 51194985 50264401 49539597 48597044 47749274 47073240 46797966 46958959 47537097
3480D7537097J203432J806432J995869J212510j13483j874635k679672k789138
3472D6298412k506875k004590j885497j850199j512272j178889j116393r28223
3464C3315474p00647o70494n79531l99716l90003k94292j35156O3173J65033K86074
3454C0659915M25933N29012P40387R00307J456198K084528L081499M147760M896131
3445D8921670M441897J393772k341365m312464n122440n101355m328529l443230
3437C0107956k574750j984045j467392j165086r01449q29459n80001m53057l58196
3428A9794521l80639l42314r0147j01634j17762L4193J15094K70508J83965L08872
3418A9674657M46074Q49789J336783J682642K080285K021410J098437o76440j821919
$$ plain form
3480 47537097 48740529 50546961 52542830 53755340 53641857 51767222 49087550 46298412
3472 46298412 43791537 41786947 39901450 38051251 36538979 35360090 34243697 33315474
3464 33315474 32614827 31944333 31364802 30965086 30575083 30280791 30145635 30208808 30373841 30659915
3454 30659915 31085848 31614860 32355247 33255554 34711752 36796280 39877779 44025539 48921670
3445 48921670 53363567 54757339 52415974 48103510 42981070 37879715 33551186 30107956
3437 30107956 27533206 25549161 24081769 22916683 22015234 21185775 20605774 20152717 19794521
3428 19794521 19413882 19071568 18981421 18879787 18762025 18796218 18911312 19181820 19365785 19674657
3418 19674657 20120731 20970520 22307303 23989945 26070230 28091640 29190077 28513637 26691718
3409B6691718k415179k632512k239011j755583j259648j032089o72911n39234
3401A4145551m76074n03469l02991l50094l14041j98391k18017k48832p1321j78464
3391A1283857k09503k40571j74935j38017j46563p9156k24924o2203k04920j06463
3381I696602k00949j08654m4875n8290k2745p7209k23956j10311K0073j44216
3371H725470r0858p9024l5476r0009j04795r4251o8914j46572k4761L8955j3254
3360H016511p0611K516j42729j1800P2498j02636p8730j26735m2512p3997p9969
3349G361806n8551M119n6543m3482n2624j70478L6258P6708L3319j3786l5303
3338G081443K6503j11905m4427m5409j8503r6141o807n5275p6180O4800p5510
$$ plain form
3409 26691718 24276539 21644027 19405016 17649433 16389785 15357696 14684785 14145551
3401 14145551 13669477 13166008 12863017 12512923 12198882 12000491 11782474 11533642 11462321 11283857
3391 11283857 11074354 10833783 10658848 10520831 10374268 10295112 10070188 10007985 9803065 9696602
3381 9696602 9495653 9386999 9342124 9283834 9261089 9183880 8959924 8849613 8869686 8725470
3371 8725470 8634612 8555588 8520112 8430103 8325308 8231057 8162143 8015571 7990810 8029765 8016511
3360 8016511 7945900 7948416 7805687 7793887 7866385 7763749 7685019 7558284 7515772 7441775 7361806
3349 7361806 7303255 7307374 7250831 7207349 7154725 6984247 7020505 7097213 7130532 7116746 7081443
3338 7081443 7107946 6996041 6951614 6906205 6887702 6791561 6784754 6729479 6653299 6718099 6642589
3327F642589j54245l4510n7412r9749N8020P0013j49157j15996L9576M4879j2224
3316F231784j02391K1102p3007j39870J1747L7614l3971q91k6962m7000M116j38248
3304E744023N431l5558R4520L785n1042k974j16284K4452N171l8248j32227k7301
3292E473748J82690q0138p7947p6375l1495N0633j7660l7797J7672J42443Q9002
3281E634776l1341O27j1613n7257P5136J06521m5098N3361L0129J2454K0503R0979
3269E879177n3207Q3703l2926J25252J22827k8190J8762J09742J38242L367M1534
3258F408283l9455J90150R0512P6684J35254J58045N4917J90183K63869J73471
3248G701913L9234J23586Q4334J61172L50522L78647L36656K98344K26310K04195
$$ plain form
3327 6642589 6488344 6453834 6396422 6296673 6354693 6424706 6275549 6159553 6199129 6244008 6231784
3316 6231784 6129393 6150495 6077488 5937618 5949365 5986979 5953008 5952117 5925155 5878155 5882271 5744023
3304 5744023 5749454 5713896 5808416 5812201 5761159 5758185 5641901 5666353 5671524 5633276 5501049 5473748
3292 5473748 5656438 5576300 5498353 5421978 5390483 5441116 5423456 5385659 5403331 5545774 5634776
3281 5634776 5603435 5604062 5592449 5535192 5610328 5716849 5671751 5725112 5755241 5767695 5788198 5879177
3269 5879177 5825970 5909673 5876747 6001999 6124826 6096636 6115398 6225140 6363382 6366749 6408283
3258 6408283 6368828 6558978 6649490 6726174 6861428 7019473 7074390 7264573 7528442 7701913
3248 7701913 7741147 7864733 7949067 8110239 8460761 8839408 9176064 9474408 9700718 9904913
3238I904913j9136r5190j59178r3688p0481q1916J04473K43623L82115L57165
3228A0472700K68994K41350J33633k3538j32253j68982j35019m7566o580O412
3218A0609151J34154J33046J90509J97348J65834L53428L65371M61309N44863
3209A3155013N34760N52920M37029J97235m5539j67569j97028p2694o3157J29158
3199A4460128K99948N17734O35957N38198O07998N43929J70711n1278j4943j18591
3189A7589791L4139M7326J739L7611P8043J23418Q5086K17146J72504J96686J84852
3178A8768341K45498K40981L18611K86253K40136L48028L69283L52101M49913
3169B1619145M44759N53369N95026Q12088R19922R12879J102492J057011R22472
$$ plain form
3238 9904913 9885777 9790587 9631409 9537721 9467240 9385324 9489797 9733420 10115535 10472700
3228 10472700 10741694 10983044 11116677 11093139 10960886 10791904 10656885 10609319 10602739 10609151
3218 10609151 10743305 10876351 11066860 11264208 11430042 11783470 12148841 12610150 13155013
3209 13155013 13689773 14242693 14679722 14876957 14831418 14663849 14466821 14394127 14330970 14460128
3199 14460128 14760076 15277810 15913767 16451965 17059963 17603892 17774603 17723325 17708382 17589791
3189 17589791 17623930 17671256 17672995 17710606 17788649 17912067 17997153 18214299 18386803 18583489 18768341
3178 18768341 19013839 19254820 19573431 19859684 20099820 20447848 20817131 21169232 21619145
3169 21619145 22063904 22617273 23212299 24024387 24944309 25857188 26959680 28016691 28939163
3160B8939163O69722K82655k82246n05618r43922j210657j133393r97492r23090
3151B3895122o62848m42589k06216n2820N0653J66553J53108K96631M18867L18941
3141B3935402M83416O07066N63353L54290M11371L87133L72748L17307P8331j14591
3131B7395826l06813n37469o44546n98447o17205r87798j080962r64070p87090
3122B0871426p17142n74745m23068m01153k50786q3393q1363j12938k6997l704
3112A8196137K9514j04255j44374j14473j73181m11382m92632n58366m94212o56354
3102A5076422p41286p12628p19492o26303n58436o05587l90794m96062k91363
3093I934471k80359l31685m17064k37272k11911k33361j32240k60606k03601j01483
$$ plain form
3160 28939163 29608885 29891540 29609294 29103676 28159754 26949097 25815704 24818212 23895122
3151 23895122 23232274 22789685 22583469 22530649 22581302 22747855 22900963 23197594 23616461 23935402
3141 23935402 24418818 25025884 25589237 25943527 26354898 26742031 27114779 27432086 27510417 27395826
3131 27395826 27089013 26551544 25906998 25308551 24691346 23703548 22622586 21658516 20871426
3122 20871426 20154284 19579539 19156471 18755318 18504532 18421139 18339776 18226838 18199841 18196137
3112 18196137 18225651 18121396 17977022 17862549 17689368 17277986 16785354 16226988 15732776 15076422
3102 15076422 14335136 13622508 12903016 12276713 11718277 11112690 10721896 10225834 9934471
3093 9934471 9654112 9322427 8905363 8668091 8456180 8222819 8090579 7829973 7626372 7524889
3083G524889l7038k28529j67234k01652k11984j65415k25487j13250k34975j88616
3073E750709k28695j56593j57481n4274q2650j52945j80081j82345q4273p3880
3063D397492p6374j90207j02526p6583k6730p5475j43677m7733j14120n7045J089
3052C488111j06706L51m9515r1526q8265q7612k1717J7680j5912j19408j32842
3041B792639K457J3470p4900n3156k6334q7784j3091j11307r6811n4812o5829
3030B224542j48466j02246j1526j1828O2411j5840k0226n5092L7051r2257j9804
3019A846719J7259o5228j8462o3810k4520J9567M249o4228J4131j38441m5099
3008A482137k0484n6779J5990N3393O5312j28994j49903j45017m1435J51981N382
$$ plain form
3083 7524889 7487851 7259322 7092088 6890436 6678452 6513037 6287550 6174300 5939325 5750709
3073 5750709 5522014 5365421 5207940 5153666 5071016 4918071 4737990 4555645 4471372 4397492
3063 4397492 4321118 4130911 4028385 3951802 3925072 3849597 3705920 3658187 3544067 3487022 3488111
3052 3488111 3381405 3381756 3332241 3240715 3152450 3064838 3043121 3060801 3044889 2925481 2792639
3041 2792639 2795096 2808566 2733666 2680510 2654176 2566392 2553301 2441994 2345183 2290371 2224542
3030 2224542 2076076 1973830 1962304 1950476 2012887 1997047 1976821 1921729 1958780 1866523 1846719
3019 1846719 1863978 1798750 1780288 1716478 1691958 1711525 1715774 1651546 1665677 1527236 1482137
3008 1482137 1461653 1404874 1420864 1474257 1539569 1410575 1260672 1115655 1074220 1226201 1231583
2997A231583j5350P24N0158r3938j40472p7507K4796n7735p1416J08621j38j29273
2985H30053M1511m403o5560N010O3648K014q5842Q6M066k515p0207n9628K0857
2972F79090k0801j9390q8263l2537J32685J38680m2839j8115j11806m6502L2476
2961F02678J889N0578K1300l6563o2370m8056M8288n191n3204O5775Q92n2014
2949E34002k2268n9564P2880J4379m0696J6969n6280l0046M1905O7786n1042l2946
2937D55079l1388k2932K7230k6269j47402J35577J29199m3108r539j9833O322
2926D52936N0660o7866k8819K1912j6427m3849Q4494K7350K4274q7009q834K8939
2914D37761K7147M0056l3255j8711R479o236n5211k0762j8783J44673q9174o0528
$$ plain form
2997 1231583 1216233 1216957 1267115 1173177 1032705 955198 979994 922259 850843 959464 959326 830053
2985 830053 871564 867161 801601 806611 870259 872273 786431 786517 790583 788068 717861 658233 679090
2972 679090 658289 638899 550636 518099 650784 789464 746625 728510 616704 570202 602678
2961 602678 604567 655145 676445 639882 577512 529456 577744 572553 519349 585124 586016 534002
2949 534002 511734 452170 525050 539429 498733 515702 459422 429376 471281 539067 488025 455079
2937 455079 423691 400759 427989 401720 254318 389895 519094 475986 466447 446614 452936
2926 452936 503596 435730 406911 428823 412396 368547 453041 480391 504665 417656 408822 437761
2914 437761 464908 504964 471709 452998 462477 456241 401030 380268 361485 506158 416984 356456
2902C56456R1099q2413j41977P7197J15294j06746p555k9775j4157J161k6526
2891B32058K376J05081Q5740J3093n7405r8113j5737Q5306q8168P4850j1266K0322
2879C48137o411k3676M6985o2023P2773l4881j493K8333P792n9140n7200J06614
2867C65810m2895j06264O981j7944O3395m7644J6653M5102n1762J15195J9926
2856C66553q5008k2531L2910o6616p1557L0214Q2708M8743j19565R9994R3686
2845C89531o0769p4941j7697l5200n7731L1007K5713O3664r777p8414P3578R626
2833B58590J4543j37163N7411O9902q361L4945q1777r7237K6389m9921N2832K0174
2821A60327n3426q70j02014L0029m9219m8439M5732L0760K2933L9776l2500n4941
$$ plain form
2902 356456 447555 365142 223165 300362 415656 308910 301355 271580 257423 258584 232058
2891 232058 234434 339515 425255 438348 380943 282830 267093 352399 264231 339081 327815 348137
2879 348137 341726 318050 365035 303012 375785 340904 339411 367744 375536 316396 259196 365810
2867 365810 322915 216651 223632 205688 269083 221439 238092 283194 231432 346627 366553
2856 366553 281545 259014 291924 225308 153751 183965 266673 315416 195851 295845 389531
2845 389531 328762 253821 236124 200924 143193 174200 199913 263577 253800 175386 248964 258590
2833 258590 273133 135970 193381 263283 254922 289867 208090 110853 137242 87321 140153 160327
2821 160327 106901 106031 4017 34046 -15173 -63612 -17880 12880 35813 75589 43089 -11852
2809a1852Q0122k6042o7732N8608n3997m0060J85063K1136j45530j1045L0036
2798A8707R2365o9621n4210J2848Q6447P920K9863q8387o8116K5326P6046O664
2786G5852r3781O2113k4021l1873P7020M2518r9456R048R6033L0406j20252k5320
2774a713m9056j2262L5130o2976O8716R0165j39568o7844R4298j0773m1673P0883
2762b6673N8919N740o8699j9239J1777R8789P409q0824r3N5784m3244M0931l6517
2749D060n7279M825q667N8359M8187p5668n1129l605l4595R8725o5534j5981P844
2736i0458m2124N5087R072l4091J1166l4579l1005M5175J02827J5794r553Q5794
2724H3105o586o2874l1422p0971N7901L6795o913r0171k6607K6041Q3545K4889
$$ plain form
2809 -11852 68270 42228 -25504 33104 -20893 -60953 124110 145246 -284 -11329 18707
2798 18707 111072 41451 -12759 89 86536 94456 124319 35932 -32184 -6858 69188 75852
2786 75852 -17929 44184 20163 -11710 65310 107828 8372 17420 113453 143859 23607 -1713
2774 -1713 -50769 -63031 -27901 -90877 -22161 68004 -71564 -139408 -45110 -55883 -97556 -26673
2762 -26673 32246 37986 -30713 -49952 -38175 60614 68023 -12801 -12894 42890 -354 40577 4060
2749 4060 -53219 -48394 -57061 1298 49485 -26183 -77312 -80917 -115512 -16787 -82321 -98302 -90458
2736 -90458 -132582 -77495 -68423 -102514 -91348 -125927 -156932 -111757 -8930 6864 -2689 83105
2724 83105 76519 13645 -17777 -88748 -30847 5948 -965 -91136 -117743 -91702 -8157 16732
2712A6732j09488N124R7718p9763o4598n368O3226J9087M0059J7445r5119n4010
2700a48955j2970o401N3021p5097N0383J14017N323n4250N0942j4969j03030j7591
2688a59577J3839k8643N2293o7786K888R9366j05611O3943Q8365N9095j15696
2677i7524r933K0417Q437k9766j7305J03803l3903J3384L1351J2155J03669k8101
2665G6684j38681m3121j6450j4556J9068N2631k2669L4079n485m178k5925m5797
2653a34400M0697m3891k135N9206m645n8028r9583J5890J172L8962K6497p5967
2641b36225O8660R8866M0036J1818r444j59518Q9264m516M2889j0948O0931L9273
2629C1086Q1741m2281J4427L8093r6587j07335k3056J6952l786N196n5943l5120
$$ plain form
2712 16732 -92756 -87632 10086 -69677 -134275 -139643 -76417 -57330 -17271 174 -94945 -148955
2700 -148955 -161925 -168326 -115305 -190402 -140019 -26002 -20679 -74929 -23987 -38956 -141986 -159577
2688 -159577 -145738 -174381 -122088 -189874 -186986 -87620 -193231 -129288 -40923 18172 -97524
2677 -97524 -107457 -87040 -78603 -108369 -125674 -21871 -55774 -42390 -11039 1116 104785 76684
2665 76684 -61997 -105118 -121568 -136124 -117056 -64425 -87094 -53015 -58500 -62678 -88603 -134400
2653 -134400 -93703 -137594 -139729 -80523 -85168 -143196 -242779 -226889 -225717 -186755 -160258 -236225
2641 -236225 -167565 -68699 -28663 -16845 -26289 -185807 -96543 -101059 -58170 -69118 -8187 31086
2629 31086 112827 70546 84973 123066 26479 -80856 -103912 -86960 -90746 -85550 -141493 -176613
2617a76613J9829R4692m5507J7387N7818l2585Q218q4116M7969J8639N2923q7120
2605a08466o7649L8054k1635j4320O7480Q8007q3614r1400N7422P2282m6229O2406
2593d7662p156j28548k1710L5863L9616k142Q1365l8103N663J21399r6096m1494
2581i9005o1670Q5093q7308q343K4871Q0119J7958n2043k5233M1N5377P6938o1704
2568e4909n7965M0657O9670P1938p71k14871n085J0338l2914P7945P4531p4932
2556i6368p024K1293N4783j00242p8954J22218n6970N5410R9855q7112K1578M670
2544d6863P2054K0331n9773l0148L3903J0549n075N3061j3019k5631j6532j7008
2532b4151l0406n6177L4795J53761r7646J902L8327j7600K9589K8394l4542M913
$$ plain form
2617 -176613 -156784 -62092 -107599 -90212 -32394 -64979 -56761 -140877 -92908 -74269 -21346 -108466
2605 -108466 -176115 -138061 -159696 -174016 -106536 -18529 -102143 -193543 -136121 -63839 -110068 -47662
2593 -47662 -54818 -183366 -205076 -169213 -129597 -131739 -50374 -88477 -82814 38585 -57511 -99005
2581 -99005 -160675 -75582 -162890 -171233 -146362 -66243 -48285 -100328 -125561 -125520 -70143 6795 -54909
2568 -54909 -112874 -72217 -2547 69391 68620 -146251 -151336 -140998 -173912 -95967 -21436 -96368
2556 -96368 -103392 -82099 -27316 -127558 -206512 -84294 -141264 -85854 14001 -73111 -51533 -46863
2544 -46863 25191 45522 -14251 -44399 -10496 53 -5022 48039 35020 9389 -7143 -24151
2532 -24151 -54557 -110734 -75939 77822 -19824 -17922 20405 2805 32394 60788 26246 31159
2520C1159n1206j0220l7676n8289K1479P7175J9444k2368q0556L9986M8207K1699
2508a166J7220l0879J4921j29815J30015p614m5132K1849o1170R1993j1078M6658
2496C5802O3410k0079Q377l8566j00106J54269K1836p0154k8479k9251m0454O1133
2484A7738N7652N94L5125M8453O3826M8290m2243r7524M1480J57n3009M856P733
2471A33128P0008j7957m4396K3785q3429Q8592M3057k8067M3216j4582K1242K9657
2459B64254J41052r2519k6083O1856L4011k2160m5213R2249N0762l7140M3513
2448D64582k6403Q2949Q6372n8190n8213O3422L9021j15577R1756R388l2825P2866
2436F19148Q8701k5124K1313O5458J282l2877N607r7404k9456M4260J11966J06524
$$ plain form
2520 31159 -20047 -30267 -67943 -126232 -104753 -27578 -8134 -30502 -111058 -71072 -22865 -1166
2508 -1166 16054 -14825 96 -129719 296 -7318 -52450 -30601 -91771 222 -10856 35802
2496 35802 99212 79133 87510 48944 -51162 103107 124943 54789 26310 -2941 -43395 17738
2484 17738 75390 75984 111109 159562 223388 271678 229435 131911 173391 173548 120539 125395 133128
2471 133128 203136 185179 140783 164568 81139 169731 212788 184721 227937 213355 234597 264254
2459 264254 405306 312787 286704 348560 382571 360411 315198 407447 458209 421069 464582
2448 464582 438179 521128 607500 549310 491097 554519 593540 477963 569719 579107 546282 619148
2436 619148 707849 682725 704038 769496 770778 737901 743508 646104 616648 660908 772874 879398
2424H79398r8661O3683M9399J79404r1421n8374M3052L5905R0174o9421R677N9814
2412A092629J30259k5705J80338J30490M4927m4066P9553J11482K3531R6480J05761
2401A925679Q8633K5668l5714O3026M5907J3690Q7902J24795R7319J06698J13064
2390B656667L7510J32903K0934N7808P6120J32899Q2622J05602L06209K03381
2380C812655J97016K72473K69278L73414L94506K80656L10443K84423M44984O30868
2370G270716Q50963R54646J393230J862489K722845L759395M956928N326281M721315
2361C3818808J420329l396955n552849n964828n022271l423220k266833j668093
2353G944088j208060p08609n88512n36961k76057j27851j81581l37472k64064
$$ plain form
2424 879398 780737 844420 893819 1073223 981802 923428 966480 1002385 1092559 1023138 1032815 1092629
2412 1092629 1222888 1197183 1377521 1508011 1552938 1508872 1588425 1699907 1723438 1819918 1925679
2401 1925679 2014312 2039980 2004266 2067292 2113199 2126889 2214791 2339586 2436905 2543603 2656667
2390 2656667 2694177 2827080 2848014 2905822 2981942 3114841 3197463 3303065 3609274 3812655
2380 3812655 4009671 4282144 4551422 4924836 5319342 5599998 5910441 6194864 6639848 7270716
2370 7270716 8121679 9076325 10469555 12332044 15054889 18814284 23771212 29097493 33818808
2361 33818808 35239137 31842182 26289333 20324505 15302234 11879014 9612181 7944088
2353 7944088 6736028 6027419 5438907 4901946 4625889 4498038 4316457 3978985 3714921
2344C714921k64770k84219l50125l39771k25329j89288j78164r0720p2996j6835
2334A702704j29561j36284m6502j87442r0253m8801k2812r2819o5306j25692n4881
2323G02351Q6549k4025N3016j79576n8040m8669L6130P2810r3336k773k5729O352
2311E25060o2621J4636o37m3795P2889m405j55481l9138K261k5163r985K8151
2299C01772L2823n3491l3556l5152k5861o7022m370J04494K7860o5805k3364J14677
2287B73005m4968n1906N8029j36666J3533k6118L416n8271R3550l4866m2159k6660
2275A9919M2901j26129O2580N7292q4482R7934Q088o1880m0993K9949L8028r3897
2263e0690o825n4815N8378R4148R1833j5896q7205n646J19747M5607j05257M1543
$$ plain form
2344 3714921 3450151 3165932 2815807 2476036 2250707 2061419 1883255 1792535 1719539 1702704
2334 1702704 1573143 1436859 1390357 1202915 1112662 1063861 1041049 948230 882924 757232 702351
2323 702351 788900 764875 817891 638315 580275 531606 567736 640546 547210 544437 518708 525060
2311 525060 462439 477075 476438 432643 505532 501127 345646 306508 308769 283606 273621 301772
2299 301772 334595 281104 247548 212396 186535 119513 115143 219637 247497 181692 158328 273005
2287 273005 228037 176131 234160 97494 111027 84909 88325 30054 123604 88738 46579 19919
2275 19919 62820 -63309 -729 56563 -27919 70015 78103 16223 -24770 5179 43207 -50690
2263 -50690 -57515 -112330 -53952 40196 132029 116133 28928 23282 143029 188636 83379 124922
2251A24922j06724j067l0656P1557M2378J284p4566K9106k4655J8676m7367l9598
2239c6710n5810J3993P220M2776K0332N3210j67329J3822l7341P1199P3448K1013
2227A9823j16747l1187O3371M5408o1387r210M4503o7255j334J11535l0764m940
2215c8184P3901o179m9751o7201m4685q5125N4914M5975N2620K8341l0336l3864
2203i9574J16597r3279j3930p5656r1483O9474M7687q6829O5106P8641J1664o8569
2191a40151J2050l6426L6124j6516p375l3748K9765P0227j43071N195J15650l7726
2179a46002P9009Q655n6672M2648p6628M1909L7531l0242O0352r6431j2863m1643
2167a90377P6452J33j2734J5039N1339O791j1702J1594J8218n0035K0794Q3716
$$ plain form
2251 124922 18198 17131 -13525 58032 100410 101694 27128 56234 31579 50255 2888 -36710
2239 -36710 -92520 -78527 -71307 -28531 -8199 45011 -122318 -108496 -145837 -74638 -1190 19823
2227 19823 -96924 -128111 -64740 -19332 -80719 -89929 -45426 -112681 -114015 -2480 -33244 -38184
2215 -38184 35717 29538 -20213 -87414 -132099 -217224 -162310 -116335 -63715 -35374 -65710 -99574
2203 -99574 17023 -76256 -90186 -165842 -257325 -187851 -140164 -226993 -161887 -83246 -71582 -140151
2191 -140151 -128101 -164527 -128403 -144919 -152294 -186042 -156277 -86050 -229121 -223926 -108276 -146002
2179 -146002 -66993 -58338 -115010 -72362 -148990 -107081 -69550 -99792 -39440 -135871 -148734 -190377
2167 -190377 -113925 -113792 -126526 -111487 -60148 -53357 -65059 -53465 -35247 -85282 -64488 19228
2155A9228j26599p6140N6881J01846L64K0547r139k688K7132l7638q2721j2706
2143a21633q058J19772o449j18273N8768N6286l5955n522r0114M9408O6256k1662
2131e7176n5134M3684K9272o0740m2114O3917m4562N1084m6190L9645l212m1978
2119a23504k0357J0776J00385r8082J426P8979P1310q5318r579m1459o2381j4504
2107a92308J8681P3359J18642p3260j16362N4474M494L0245R5430K9253M4066
2096H6714J34011n6485J3031n3288L5588J331L5906p6679p9892m4607J1196L1930
2084C8756q2296L1609j2047j07302n5642j0342l813p134N5180l92j5531P4918
2072i4036J912k5457r8292m0037M7361Q5973n5544M9660J13052L7626n494n7511
$$ plain form
2155 19228 -107371 -183511 -126630 -24784 -24420 -3873 -13012 -15700 11432 -26206 -108927 -121633
2143 -121633 -129691 -9919 -16368 -134641 -75873 -19587 -55542 -61064 -151178 -101770 -35514 -57176
2131 -57176 -112310 -68626 -39354 -100094 -142208 -78291 -122853 -71769 -117959 -78314 -81526 -123504
2119 -123504 -143861 -133085 -32700 -130782 -129356 -50377 20933 -64385 -73964 -115423 -177804 -192308
2107 -192308 -173627 -100268 18374 -54886 -171248 -116774 -112280 -82035 13395 42648 86714
2096 86714 220725 164240 177271 123983 159571 160902 196808 120129 40237 -4370 6826 38756
2084 38756 -43540 -11931 -23978 -131280 -186922 -197264 -201077 -208211 -153031 -153423 -168954 -94036
2072 -94036 -92124 -117581 -215873 -255910 -208549 -122576 -178120 -128460 -15408 22218 16724 -40787
2060d0787J3338R310l6747l3410o5732J35558m2124l9780K6844k8581O3557m6109
$$ plain form
2060 -40787 -27449 -18139 -54886 -88296 -154028 -18470 -60594 -100374 -73530 -102111 -38554 -84663
$$ [...]
##END NTUPLES=NMR SPECTRUM
##END=
