##TITLE=1H_EC-3305(III-3)
 CDCl3
 8 sc, 
 20.12.2023
##JCAMPDX= 6.0         $$ Bruker NMR JCAMP-DX V2.0
##DATA TYPE= NMR SPECTRUM
##DATA CLASS= NTUPLES
##ORIGIN= UXNMR, Bruker Analytische Messtechnik GmbH
##OWNER= root
$$ XWIN-NMR		Version 3.5
$$ Wed Dec 20 14:01:38 2023 Russian Standard Time (UT+4h)  she@DPX200
##.OBSERVE FREQUENCY= 200.1313
##.OBSERVE NUCLEUS= ^1H
##.ACQUISITION MODE= SIMULTANEOUS
##.ACQUISITION SCHEME= undefined
##.AVERAGES= 8
##.DIGITISER RES= 18
##SPECTROMETER/DATA SYSTEM= spect
##.PULSE SEQUENCE= zg30
##.SOLVENT NAME= CDCl3
##.SHIFT REFERENCE= (INTERNAL, CDCl3, 0, 15.4681)
##AUDIT TRAIL= $$ (NUMBER, WHEN, WHO, WHERE, WHAT)
$$ ##TITLE= Audit trail, XWIN-NMR		Version 3.5
$$ ##JCAMPDX= 5.01
$$ ##ORIGIN= Bruker BioSpin GmbH
$$ ##OWNER= she
$$ F:/spectra/data/she/nmr/H-F/1/pdata/1/auditp.txt
$$ ##AUDIT TRAIL=  $$ (NUMBER, WHEN, WHO, WHERE, WHAT)
(   1,<2023-12-20 14:00:33.14 +0400>,<she>,<DPX200>,
      <created by zg, POWCHK disabled, PULCHK disabled
       configuration hash MD5:
       00 E9 B6 7A A2 85 ED C7 34 08 36 98 17 FE 4E 26
       data hash MD5: 16K
       0D 99 FF 35 6B CF 42 22 AC 08 38 6D 40 0E 6A 8B>)
(   2,<2023-12-20 14:00:35.37 +0400>,<she>,<DPX200>,
      <Start of raw data processing
       efp BC_mod = 2 LB = 0.24 FT_mod = 6 PKNL = 1 PHC0 = -24591.98 PHC1 = 9.652722 SI = 16K 
       data hash MD5: 16K
       19 78 BC EC 8F 5D 96 BF F0 76 9E 11 48 CA 05 9C>)
(   3,<2023-12-20 14:00:52.37 +0400>,<she>,<DPX200>,
      <pk PHC0 = -2.059055 PHC1 = 2.6 
       data hash MD5: 16K
       98 BC 9E C2 45 37 E0 45 2F 2D 8D 2D 06 65 E5 22>)
(   4,<2023-12-20 14:00:54.92 +0400>,<she>,<DPX200>,
      <abs ABSG = 5 
       data hash MD5: 16K
       0F 03 85 F3 97 8C 13 30 61 AF 8D 9D B1 81 76 3B>)
$$ ##END=
$$ 
$$ hash MD5
$$ EB 0A E3 1F F5 6E 6D 06 29 4D AB 64 69 19 D7 B1
##$RELAX= 
##$RELAX= 
##$RELAX= 
##$RELAX= 
##$RELAX= 
##$RELAX= 
$$ Bruker specific parameters
$$ --------------------------
##$DU= <F:/spectra>
##$EXPNO= 1
##$NAME= <H-F>
##$PROCNO= 1
##$TYPE= <nmr>
##$USER= <she>
##$AMP= (0..31)
100 100 100 100 100 100 100 100 100 100 100 100 100 100 100 100 100 100 
100 100 100 100 100 100 100 100 100 100 100 100 100 100 
##$AQSEQ= 0
##$AQ_mod= 1
##$AUNM= <au_zg>
##$AUTOPOS= <>
##$BF1= 200.13
##$BF2= 200.13
##$BF3= 200.13
##$BF4= 200.13
##$BF5= 200.13
##$BF6= 200.13
##$BF7= 200.13
##$BF8= 200.13
##$BYTORDA= 1
##$CFDGTYP= 0
##$CFRGTYP= 5
##$CHEMSTR= <none>
##$CNST= (0..31)
1 1 145 1 1 1 1 1 1 1 1 1 1 1 1 1 1 1 1 1 1 1 1 1 1 1 1 1 1 1 1 1 
##$CPDPRG= <>
##$CPDPRG1= <>
##$CPDPRG2= <>
##$CPDPRG3= <>
##$CPDPRG4= <mlev>
##$CPDPRG5= <mlev>
##$CPDPRG6= <mlev>
##$CPDPRG7= <mlev>
##$CPDPRG8= <mlev>
##$CPDPRGB= <>
##$CPDPRGT= <>
##$D= (0..31)
0 1.2 0 0 0 0 0 0 0 0.06 0 0.03 0 0 0 0 0.0002 0 0 0 0 0 0 0 0 0 0 0 0 
0 0 0 
##$DATE= 1703066432
##$DBL= (0..7)
120 120 120 120 120 120 120 120 
##$DBP= (0..7)
150 150 150 150 150 150 150 150 
##$DBP07= 0
##$DBPNAM0= <>
##$DBPNAM1= <>
##$DBPNAM2= <>
##$DBPNAM3= <>
##$DBPNAM4= <>
$$ [...]
##$SUBNAM3= <"">
##$SUBNAM4= <"">
##$SUBNAM5= <"">
##$SUBNAM6= <"">
##$SUBNAM7= <"">
##$SUBNAM8= <"">
##$SUBNAM9= <"">
##$SW= 18.0517328524113
##$SWIBOX= (0..15)
0 0 2 0 0 0 0 0 0 0 0 0 0 0 0 0 
##$SW_h= 3612.71676300578
##$TD= 16384
##$TD0= 1
##$TE= 0
##$TE2= 300
##$TE3= 300
##$TEG= 300
##$TL= (0..7)
0 120 120 120 120 120 120 120 
##$TP= (0..7)
150 150 150 150 150 150 150 150 
##$TP07= 0
##$TPNAME0= <>
##$TPNAME1= <>
##$TPNAME2= <>
##$TPNAME3= <>
##$TPNAME4= <>
##$TPNAME5= <>
##$TPNAME6= <>
##$TPNAME7= <>
##$TPOAL= (0..7)
0.5 0.5 0.5 0.5 0.5 0.5 0.5 0.5 
##$TPOFFS= (0..7)
0 0 0 0 0 0 0 0 
##$TUNHIN= 0
##$TUNHOUT= 0
##$TUNXOUT= 0
##$USERA1= <user>
##$USERA2= <user>
##$USERA3= <user>
##$USERA4= <user>
##$USERA5= <user>
##$V9= 5
##$VALIST= <valist>
##$VCLIST= <CCCCCCCCCCCCCCC>
##$VD= 0
##$VDLIST= <DDDDDDDDDDDDDDD>
##$VPLIST= <PPPPPPPPPPPPPPP>
##$VTLIST= <TTTTTTTTTTTTTTT>
##$WBST= 1024
##$WBSW= 4
##$XGAIN= (0..3)
0 0 0 0 
##$XL= 0
##$YL= 0
##$YMAX_a= 269982
##$YMIN_a= -440993
##$ZGOPTNS= <>
##$ZL1= 120
##$ZL2= 120
##$ZL3= 120
##$ZL4= 120
##$ABSF1= 15.34473
##$ABSF2= -2.707117
##$ABSG= 5
##$ABSL= 3
##$ALPHA= 0
##$AQORDER= 0
##$ASSFAC= 0
##$ASSFACI= 0
##$ASSFACX= 0
##$ASSWID= 0
##$AUNMP= <proc_1d>
##$AZFE= 0.1
##$AZFW= 0.1
##$BCFW= 0
##$BC_mod= 2
##$BYTORDP= 0
##$COROFFS= 0
##$CY= -3
##$DATMOD= 1
##$DC= 0
##$DFILT= <>
##$DTYPP= 0
##$F1P= 0
##$F2P= 0
##$FCOR= 1
##$FTSIZE= 16384
##$FT_mod= 6
##$GAMMA= 0
##$GB= 0
##$INTBC= 1
##$INTSCL= 3.70164e-10
##$ISEN= 128
##$LB= 0.24
##$LEV0= 0
##$LPBIN= 0
##$MAXI= 10000
##$MC2= 0
##$MEAN= 0
##$ME_mod= 0
##$MI= 1.114404
##$NCOEF= 0
##$NC_proc= -6
##$NLEV= 6
##$NOISF1= 3.799351
##$NOISF2= 2.8
##$NSP= 0
##$NTH_PI= 0
##$NZP= 0
##$OFFSET= 15.46813
##$PC= 1
##$PHC0= -24594.04
##$PHC1= 12.25272
##$PH_mod= 1
##$PKNL= yes
##$PPARMOD= 0
##$PSCAL= 0
##$PSIGN= 0
##$REVERSE= no
##$SF= 200.130010720085
##$SI= 16384
##$SIGF1= 3
##$SIGF2= 2
##$SINO= 5.538805
##$SIOLD= 16384
##$SREGLST= <1H.CDCl3>
##$SSB= 0
##$STSI= 16384
##$STSR= 0
##$SW_p= 3612.71676300578
##$SYMM= 0
##$S_DEV= 0
##$TDeff= 16384
##$TDoff= 0
##$TI= <>
##$TILT= no
##$TM1= 0
##$TM2= 0
##$TOPLEV= 0
##$USERP1= <user>
##$USERP2= <user>
##$USERP3= <user>
##$USERP4= <user>
##$USERP5= <user>
##$WDW= 1
##$XDIM= 16384
##$YMAX_p= 299855280
##$YMIN_p= -469503
$$ End of Bruker specific parameters
$$ ---------------------------------
##NTUPLES= NMR SPECTRUM
##VAR_NAME=  FREQUENCY,     SPECTRUM/REAL,   SPECTRUM/IMAG
##SYMBOL=    X,             R,               I
##VAR_TYPE=  INDEPENDENT,   DEPENDENT,       DEPENDENT
##VAR_FORM=  AFFN,          ASDF,            ASDF
##VAR_DIM=   16384,         16384,           16384
##UNITS=     HZ,            ARBITRARY UNITS, ARBITRARY UNITS
##FACTOR=    0.220516191357247, 1,           1
##FIRST=     3095.63704507306, 0,            0
##LAST=      -517.079717932723, 0,           0
##MIN=       -517.079717932723, -469503,     0
##MAX=       3095.63704507306, 299855280,    0
$$ Real data points
##PAGE= N=1
##DATA TABLE= (X++(R..R)), XYDATA
$$ [...]
8093E96066m1211j6562r8723p263J57503j13459j6637J432j2128j3091J05402
$$ 596066 554855 538293 439570 432307 589810 476351 459714 461146 449018 435927 541329
8082E41329N7031o1504M56j3195n0828M4101p1371L7016J10552P1625J3291l9917
$$ 541329 598360 536856 537312 524117 473289 517390 446019 483035 593587 665212 678503 638586
8070F38586l7794M8909n7554n2533M0288O4680P052L6458k7410K8527J09159p2466
$$ 638586 600792 649701 592147 539614 579902 644582 651634 688092 660682 689209 798368 725902
8058G25902k2328N1341r167J15367J6644K7418m255l0084J55234L8744M0887J36868
$$ 725902 703574 754915 745748 861115 877759 905177 900922 870838 1026072 1064816 1105703 1242571
8046A242571j1468J40619J48718J21612J26615Q4774K15116L39039L31697M93736
$$ 1242571 1231103 1371722 1520440 1642052 1768667 1853441 2068557 2407596 2739293 3233029
8036C233029O78887Q79368J038475J140314J004417P04178j62107q03665j101240
$$ 3233029 3911916 4791284 5829759 6970073 7974490 8678668 8516561 7712896 6611656
8027F611656j227906r87410r46164n69531m11939m10071l03878j19866j31774
$$ 6611656 5383750 4396340 3450176 2880645 2468706 2058635 1754757 1634891 1503117
8018A503117j41595j83617M986l266j20908o1698r5256r2165j59220J06609j20022
$$ 1503117 1361522 1177905 1182891 1179625 1058717 997019 901763 809598 650378 756987 636965
8007F36965n0464J43335m0216n539M0124r7279j11771j5393k8722M9206j08988
$$ 636965 586501 729836 689620 684081 724205 626926 515155 499762 471040 520246 411258
7996D11258j01041J35667n9688N2687J3275o5901l7392k0593R3424N215M0409
$$ 411258 310217 445884 386196 438883 452158 386257 348865 328272 421696 426911 467320
7985D67320r4833p4732q4761J01271j36529K9343P1748n5783K4710Q1708m6073
$$ 467320 372487 297755 212994 314265 177736 207079 278827 223044 247754 329462 283389
7974B83389j0595j20491M3890J1828l3445O4151p9448K0114p3631K6059J7715
$$ 283389 272794 152303 196193 208021 174576 238727 159279 179393 105762 131821 149536
7963A49536K3234l1909o1278o2214K3588J45316R08q0952J518k9436J1198n4931
$$ 149536 172770 140861 79583 17369 40957 186273 187181 106229 107747 78311 89509 34578
7951C4578K1522R6086l9608r828o5764N647K2239l061O6481N6973j6003K1403
$$ 34578 56100 152186 112578 102750 36986 42633 64872 61811 128292 185265 169262 190665
7939A90665j54308k8202o7039P1902J5750J1445j9014L7809O3570j06862K5766
$$ 190665 36357 8155 -58884 13018 28768 40213 21199 59008 122578 15716 41482
7928D1482N4945K1496L1729q6847L9760k6295L7333J9355j9537N0620m5969Q8761
$$ 41482 96427 117923 149652 62805 102565 76270 113603 132958 113421 164041 118072 206833
7916B06833p396l6396L3894Q0529r6629N3966p8603j069j5816p4479J21931J18088
$$ 206833 199437 163041 196935 277464 180835 234801 156198 155129 139313 64834 186765 304853
7904C04853J5272m9071l6673J62776P3756o4686o0839j751K7228P3428J4141o2299
$$ 304853 320125 271054 234381 397157 470913 406227 345388 343637 370865 444293 458434 396135
7892C96135r447m392o3112o423j3119J07704l0494m8308j42219J6070l4468j8300
$$ 396135 386688 382296 319184 312761 299642 407346 376852 328544 186325 202395 167927 149627
7880A49627j5176O966M539L6711j78m6463K7896l4247L114m8407K11563m0785
$$ 149627 134451 141417 145956 182667 182489 136026 163922 129675 132789 84382 295945 255160
7868B55160k9819Q2756l9720M6991N4020q7701M0741M7837L0100J5370J3365p3057
$$ 255160 225341 308097 268377 315368 369388 281687 322428 370265 400365 415735 429100 356043
7856C56043O3361J3030n8964N3903l1073O2953K0060o7755o239k1473K8191M8240
$$ 356043 419404 432434 373470 427373 396300 459253 479313 411558 405319 383846 412037 460277
7844D60277j3642k7046l3302O6188j5365j23950N3429q1555n7404k575J2660p7289
$$ 460277 446635 419589 386287 452475 437110 313160 366589 285034 227630 225055 237715 160426
7832A60426j25184K68032j396n6025j3666m5797K3470J21494J1508j48286L9499
$$ 160426 35242 303274 301878 245853 232187 186390 209860 331354 342862 194576 234075
7821B34075J02513L0708j53099k8537O9477J7302j61509n6903R9329p486q1146
$$ 234075 336588 367296 214197 185660 255137 272439 110930 54027 153356 145870 64724
7810F4724K3054P4131j0260r3627r6695J52885M9652m9676l9183o6885K04742
$$ 64724 87778 161909 151649 58022 -38673 114212 163864 114188 75005 8120 212862
7799B12862J93323r9671n0939o0711o156N6170Q2991m9820j3241J4228q6342P4030
$$ 212862 406185 306514 255575 194864 188708 244878 327869 278049 264808 279036 192694 266724
7787B66724o0158M8851m7761k8950Q8583p1563k1967n9092N213Q9322M6536R43
$$ 266724 206566 255417 207656 178706 267289 195726 173759 114667 119880 209202 255738 256681
7775B56681P0671q9960k4093k7639j0731Q6741n7376j15276j8766Q6563o0639
$$ 256681 327352 237392 213299 185660 174929 261670 204294 89018 70252 156815 96176
7764I6176J3519L0361O773n6498O1153R2883r4923O699r1936o7787J27136Q2668
$$ 96176 109695 140056 146829 90331 151484 244367 149444 156143 64207 -3580 123556 206224
7752B06224o8803n5001j6450L6711n5998N7946O7240k8925k8557m5006J07547
$$ 206224 137421 82420 65970 102681 46683 104629 171869 142944 114387 69381 176928
7741A76928L1043p0988o2726M8424m4080J8145O9055q0703J8887N6590j21394
$$ 176928 207971 136983 74257 122681 78601 96746 165801 85098 103985 160575 39181
7730C9181J11707Q0876m3936l055q5926k6117N1990p221m8305P0140Q7266o5391
$$ 39181 150888 231764 187828 184773 98847 72730 124720 117499 69194 139334 226600 161209
7718A61209k4459M0796q5945n0682K8547R7990q0135J2863M4371o4560Q6578p9139
$$ 161209 136750 177546 91601 40919 69466 167456 87321 100184 144555 79995 166573 87434
7706H7434J5405N479n60R320Q0163K8119j18327n3598J99671N5465k7295q8010
$$ 87434 102839 108318 107758 117078 197241 225360 107033 53435 253106 308571 281276 193266
7694A93266j15923N2372k8712L733J2837l4688k3640l4575J09899J2121k8395
$$ 193266 77343 129715 101003 104736 117573 82885 59245 24670 134569 146690 118295
7683A18295p2039j8513M7261K3642J0693l0429K2468N071j5049m6234J17672K845
$$ 118295 46256 27743 75004 98646 109339 78910 101378 106449 91400 45166 162838 165683
7671A65683j0036p0034m4118J2810m5303L7869N9522p793N6571l5483m0488M8705
$$ 165683 155647 85613 41495 54305 9002 46871 106393 98600 155171 119688 79200 127905
7659A27905m4207K1269l2487n2566J05826J04757j45270j3745o1051l3173J57735
$$ 127905 83698 104967 72480 19914 125740 230497 85227 71482 10431 -22742 134993
7648A34993k8881Q17l4137l0310n4581O739J2351M5606o6250j4927j6249L5582
$$ 134993 106112 106929 72792 42482 -12099 -5360 6991 52597 -13653 -28580 -44829 -9247
7636i247m1286j4221J18033m5441n9217P5896k7687J0906o3302N4317l9789J1830
$$ -9247 -50533 -64754 53279 7838 -51379 24517 -3170 7736 -55566 -1249 -41038 -29208
7624b9208l1239j13137Q9070J0841p7756R4757M8437k3182J3142m4241j9607L6540
$$ -29208 -60447 -173584 -84514 -73673 -151429 -56672 -8235 -31417 -18275 -62516 -82123 -45583
7612d5583M430j8143J14992o8812P9024K5190j00825n365o3909m8977L1297P5836
$$ -45583 -41153 -59296 55696 -13116 65908 91098 -9727 -15092 -79001 -127978 -96681 -20845
7600b0845o041Q9353j718m6665J1507l5966P2514k0497j5582p492Q855J2213L1738
$$ -20845 -26886 62467 60749 14084 25591 -10375 62139 41642 26060 18568 27423 39636 71374
7587G1374K1851M8770j32153r8222P0644j9323L020N8116p9924M7061J29750l1632
$$ 71374 93225 141995 9842 -88380 -17736 -37059 -34039 24077 -55847 -8786 120964 89332
7575H9332k1930j0647L9274l1241J9640k3298q6472p6546P6407J02225p8939P6354
$$ 89332 67402 56755 96029 64788 84428 61130 -25342 -101888 -25481 76744 -2195 74159
7563G4159q777L1942m1740J8998J8799Q348K7752L5707q2267m2471L7704r0121
$$ 74159 65382 97324 55584 74582 93381 101729 129481 165188 82921 40450 78154 -11967
7551a1967j59202M7412K42005N7957R980j75365j00418j1977K7881M6267j6861
$$ -11967 -171169 -123757 118248 176205 186185 10820 -89598 -101575 -73694 -27427 -44288
7540d4288N0400l1932j6201J8661J43442n9195P08n166j6882O0861J6405j3102
$$ -44288 6112 -25820 -42021 -23360 120082 60887 61595 56429 39547 100408 116813 103711
7528A03711n5002l2264L4827k8417l7470J2472K6371L3836N0045m0993L7557M1243
$$ 103711 48709 16445 51272 22855 -14615 -2143 24228 58064 108109 67116 104673 145916
7516A45916o5685m6426k655P3788j02060n5679K5383J38061o0774P8535j350M6142
$$ 145916 80231 33805 31150 104938 2878 -52801 -27418 110643 49869 128404 127054 173196
7504A73196k3142j26238l0349j8128J73465Q1864l3765n2180j04086K4558R124
$$ 173196 150054 23816 -6533 -24661 148804 230668 196903 144723 40637 65195 74319
7493G4319P1772O3622l8302J4477m2072j2415J3168L0513J634j56141K468k6433
$$ 74319 146091 209713 171411 185888 143816 131401 144569 175082 176716 20575 23043 -3390
7481c390m1522L7256M1784J32499O6187o3299L949J6530j5913K8265O5333J0890
$$ -3390 -44912 -7656 34128 166627 232814 169515 173464 189994 174081 202346 267679 278569
7469B78569k3462n76K7012j7914J8125N6403k06015M3509l1490M1669O7079l2043
$$ 278569 255107 254531 281543 263629 281754 338157 132142 175651 144161 185830 252909 220866
7457B20866m560K353K4386m188N3588L4096p9602J457J29758j0229m334J88J4870
$$ 220866 216306 218659 243045 238857 292445 326541 246939 248396 378154 367925 363591 363779 378649
7444C78649r1181q4871J3804K2080K768J4971M9520k1174l1990o5511N5380L7905
$$ 378649 287468 202597 216401 238481 241249 256220 305740 284566 252576 187065 242445 280350
7432B80350r3273J7427O2342o4522r295K4712j5273L3629l7509L144L0687O7585
$$ 280350 187077 204504 266846 202324 193029 217741 202468 236097 198588 201732 232419 300004
7420C00004n009k007l1215M6888p9457k3635m701j09898q672O8336J4158m085
$$ 300004 294995 292988 261773 308661 229204 205569 200868 90970 82298 150634 164792 160707
7408A60707L21k862m9710l2535J5628N2878Q0257j5050j8156k7427p81j4835o5208
$$ 160707 161028 158166 108456 75921 91549 144427 224684 209634 191478 164051 163270 148435 83227
7395H3227M1408j2258m4733R0628j04092k2234r7601Q4028M3786k2829l062q978
$$ 83227 124635 112377 67644 158272 54180 31946 -65655 18373 62159 39330 36268 27290
7383B7290p9018Q0939P1274L1635k525j9694o8304l3559K2757O383O0248r9006
$$ 27290 -51728 29211 100485 132120 129595 109901 41597 8038 30795 37178 97426 -1580
7371a580k6142R8001N4767j42744N7943q456l8750J0728P2704m4965o8853O3694
$$ -1580 -27722 70279 125046 -17698 40245 31789 -6961 3767 76471 31506 -37347 26347
7359B6347L1963P510L9696n7015k7714j6355K0384n6811L4946j4147K2297N9710
$$ 26347 58310 65820 105516 48501 20787 4432 24816 -31995 2951 -11196 11101 70811
7347G0811o2890o6181J0044N4046q3861Q1735J6252j1024m6106l6449J6580K0923
$$ 70811 7921 -58260 -48216 5830 -78031 3704 19956 8932 -37174 -73623 -57043 -36120
7335c6120o1878p5395l1980J92376j4083K7809N001k9514O6533q0615j06447L8035
$$ -36120 -97998 -173393 -205373 -12997 -27080 729 5730 -23784 42749 -37866 -144313 -106278
7323a06278J27336o2165k4425p2948L4123L7322J7844q3019m4762R0653N1199
$$ -106278 21058 -41107 -65532 -138480 -104357 -67035 -49191 -132210 -176972 -86319 -35120
7312c5120P1525p8317p7835k6588O6219R3133k7344R9062j3326j18690J7500p716
$$ -35120 36405 -41912 -119747 -146335 -80116 13017 -14327 84735 71409 -47281 -29781 -37497
7300c7497p8281J07932N9248P3997n6562j25365n12Q6004j07528m3308L4571J3404
$$ -37497 -115778 -7846 51402 125399 68837 -56528 -57040 28964 -78564 -121872 -87301 -73897
7288g3897R9702J6022n0701M5426n0423O2887R3411j47112l1385J4798J81825
$$ -73897 25805 41827 -8874 36552 -13871 49016 142427 -4685 -36070 -21272 160553
7277A60553p0952K1872R7600j02167j56145R9129O0165o8114j03822R4318N2058
$$ 160553 89601 111473 209073 106906 -49239 49890 110055 41941 -61881 32437 84495
7266H4495l5349o5054j3256J02193l7472Q419Q983m7964K125m91K4242n053r9487
$$ 84495 49146 -15908 -29164 73029 35557 43976 52959 4995 7120 6629 30871 25818 -73669
7253g3669K0206L8977J0990j3620K5087m5262Q8117n8453p8400N6172L4364j37566
$$ -73669 -53463 -14486 -3496 -17116 7971 -37291 50826 -7627 -86027 -29855 4509 -133057
7241a33057j0038N1799O5119O6758K5531K0650p2796r3746q0613L0185k5918J27115
$$ -133057 -143095 -91296 -26177 40581 66112 86762 13966 -79780 -160393 -130208 -156126 -29011
7229b9011o583p2945r9819J27918Q3429L0738r5405p722R0627j26557j4785P8996
$$ -29011 -35594 -108539 -208358 -80440 2989 33727 -61678 -69400 21227 -105330 -120115 -41119
7217d1119Q9136k5992j15709m34M5003j0105J36210q0934l711O9422m829r0566
$$ -41119 48017 22025 -93684 -94118 -49115 -59220 76990 -3944 -7655 61767 56938 -33628
7205c3628n4022P0429j2670r337K7649N0559M5481m2909q5845O399J04326K5838
$$ -33628 -87650 -17221 -29891 -39228 -11579 38980 84461 41552 -44293 -37894 66432 92270
7193I2270q909q9400K0189L326o1291J0148M8342k832Q4384L4814m252m7886n089
$$ 92270 83361 -6039 14150 17476 -43815 -33667 14675 11843 96227 131041 126789 78903 73814
7180G3814m1700o0767N3764J6696Q638N150j6255q2999O2612O2940R0918Q4366
$$ 73814 32114 -28653 25111 41807 50445 55595 39340 -43659 18953 81893 172811 257177
7168B57177n9213j55729p7718L4794J11339j197J2163K5628n629k1427n3783M0081
$$ 257177 197964 42235 -35483 -689 110650 109453 121616 147244 141615 120188 66405 106486
7156A06486L2929l6169r0490k3316J17578o7503K518O5314Q8171M3757N9036o773
$$ 106486 139415 103246 12756 -10560 107018 39515 42033 107347 195518 239275 298311 291538
7144B91538P8183K22478K52909J35526j44047j89404j23399p6177j31866q4562
$$ 291538 369721 592199 845108 980634 836587 647183 523784 447607 315741 231179
7134B31179J2931o6187o6917L060p8379L9022Q8178L118o5800l3800Q611L4596
$$ 231179 244110 177923 111006 114066 35687 74709 162887 166005 100205 66405 75016 109612
7122A09612Q9410k8490p1969j06103o9050K2662P0696n4897N5758M2205J09145
$$ 109612 199022 170532 98563 -7540 -76590 -53928 16768 -38129 17629 59834 168979
7111A68979K9486k49602J6597L7322K6272m0190L1208l4815Q5548M0644m5117
$$ 168979 198465 -51137 -34540 2782 29054 -11136 20072 -14743 70805 111449 66332
7100F6332m0712o5075R355R5385k7313m1159o6863R5802m4207K5858J2363J11798
$$ 66332 25620 -39455 -30100 65285 37972 -3187 -70050 25752 -18455 7403 19766 131564
7088A31564k9814r0789L6936L46M3048Q12j0724q7833l3606J8861M8999J959P552
$$ 131564 101750 10961 47897 48243 91291 92103 81379 -6454 -40060 -21199 27800 29759 37311
7075C7311n9087m877N990J7436j4258M7574r4048r047l8901Q1093r62r213M0425
$$ 37311 -21776 -26653 -20663 -3227 -17485 30089 -63959 -73006 -111907 -30814 -31776 -40989 -564
7062e64K3531k7527L0003p4288o6460O9485O7454j3356L7705p1951j35220O3910
$$ -564 22967 -4560 25443 -48845 -115305 -45820 21634 8278 45983 -25968 -161188 -97278
7050i7278R1178j1634J29488o0883o7942P8371K1609j29944l2085N8201L485L9955
$$ -97278 -6100 -17734 111754 50871 -17071 61300 82909 -47035 -79120 -20919 -17434 22521
7038B2521j9704l5716K3974O8368k6877L6888L7223j0522q5722J21565r866q9743
$$ 22521 2817 -32899 -8925 59443 32566 69454 106677 96155 10433 131998 122132 32389
7026C2389K7109P2429O8844o0408l0230J2106l4432R793Q067N7368l6726N3395
$$ 32389 59498 131927 200771 140363 110133 122239 87807 97600 105667 163035 126309 179704
7014A79704j02695j8803O8547j9502m8826k6627M0143j07479m970L9684j7746
$$ 179704 77009 58206 126753 107251 58425 31798 71941 -35538 -40508 -824 -18570
7003a8570K6785J3439M9121k7550L3867M9987l1213n3498j505l5466p244J4016
$$ -18570 8215 21654 70775 43225 77092 127079 95866 42368 40863 5397 -1847 12169
6991A2169M6895P8029o0874J03N5310j41265m02P8031L7421k0217J1005o205l7149
$$ 12169 59064 137093 76219 76322 131632 -9633 -10035 67996 105417 85200 96205 90000 52851
6978E2851m7351Q0270r0631n0742J05277L6563R543r2308p7296j009J74372N2305
$$ 52851 5500 85770 -4861 -55603 49674 86237 95780 3472 -73824 -74833 99539 151844
6966A51844p4389n2934j9740p59j2995j2051L5485O0499K5543k1883n9819p0475
$$ 151844 77455 24521 4781 4022 -8973 -21024 14461 74960 100503 78620 18801 -51674
6954e1674K0258k0499J09470p2358N1134J10349k0966o9255o9378J03988J06085
$$ -51674 -31416 -51915 57555 -14803 36331 146680 125714 56459 -12919 91069 197154
6943A97154m7642J6100j0885l2298n2336k9976R3000K7303j61188N8422M4867
$$ 197154 149512 165612 154727 122429 70093 40117 133117 160420 -768 57654 102521
6932A02521P0986j08917L642j196P9175n8565m0955O3241l8924l5347q7896k2753
$$ 102521 173507 64590 68232 67036 146211 87646 46691 109932 71008 35661 -52235 -74988
6920g4988R0323J37976j32607L2003K037j128L3744R452o7976K4830N6578j3319
$$ -74988 15335 153311 20704 52707 54744 53616 87360 96812 28836 53666 110244 96925
6908I6925m4665N4505K0068K000m2172J2592j8760n5616L0371j7319L3962k769
$$ 96925 52260 106765 126833 128833 86661 99253 80493 24877 55248 37929 71891 69122
6896F9122m6406p3489J22145R1030N041M5052j10415m5878N525M7308M8353K4883
$$ 69122 22716 -50773 71372 162402 167443 212495 102080 56202 61727 109035 157388 182271
6884A82271J6201n381o9674m9333J25324N2524n2002l2181m4668l4612r2759J36113
$$ 182271 198472 193091 123417 74084 199408 251932 199930 167749 123081 88469 -4290 131823
6872A31823o3405k6434J2689J7756P5484J1626l9909j21101k3279R0018r8747
$$ 131823 68418 41984 54673 72429 147913 159539 119630 -1471 -24750 65268 -33479
6861c3479J5060J0973j27996J66640N6175l7875j2463L0458k9255M605L2945M2642
$$ -33479 -18419 -7446 -135442 31198 87373 49498 37035 67493 38238 42843 75788 118430
6849A18430q674L8384K5765j13434M1572J4175K0394m8542K400l8780j0579L8419
$$ 118430 109756 148140 173905 60471 102043 116218 136612 88070 90470 51690 41111 79530
6837G9530O9151J29251o1712o0925n7130j12307P8138N0851r8168q697O4154L0897
$$ 79530 148681 277932 216220 155295 98165 -14142 63996 114847 16679 7982 72136 103033
6825A03033j2335M658j3315k7688N6933K8205j1618P1041l608j02204k2219M8496
$$ 103033 90698 95356 82041 54353 111286 139491 127873 198914 195306 93102 70883 119379
6813A19379m223J0843k2310j9723N1654K715p6715j4319K5455Q4129O7359O0810
$$ 119379 115156 125999 103689 83966 135620 138335 61620 47301 72756 156885 224244 285054
6801B85054j52155j30893L1709J701L0467Q1453j08689P4786P6358p2874j4546
$$ 285054 132899 2006 33715 35416 65883 147336 38647 113433 189791 116917 102371
6790A02371o8360O7452N4081n2643l7082p0540n5789J71054N7928r9583o6319
$$ 102371 34011 101463 155544 102901 65819 -4721 -60510 110544 168472 68889 2570
6779B570M6380K0130L8576m0847M7752L9590K2676m6776P7429O549o6019N1512
$$ 2570 48950 69080 107656 66809 114561 154151 176827 130051 207480 214029 148010 199522
6767A99522n0981L590J1302m502q0975m0545K1547N3102j4811n7061j5265R7456
$$ 199522 148541 152131 163433 158931 77956 37411 58958 112060 97249 40188 24923 122379
6755A22379M7069k6093M6684J3704k3845P0497L1944m5682j28646O4437k9684
$$ 122379 169448 143355 190039 203743 179898 250395 282339 236657 108011 172448 142764
6744A42764N7527K1198n782J6318K7165o0587p5641N21j0609K9868J12110r9729
$$ 142764 200291 221489 215707 232025 259190 198603 122962 123483 112874 142742 254852 155123
6732A55123J9700K5831p9049L4180L547M5828j2850n2382q344J03566k9475o539
$$ 155123 174823 200654 121605 155785 159332 205160 192310 139928 131584 235150 205675 199136
6720A99136L9787L6512Q2227k4818Q6873l0360r2678q2826O2556N9641n9721J1696
$$ 199136 238923 275435 357662 332844 419717 389357 296679 213853 276409 336050 276329 288025
6708B88025J7704j1110n947o1651O2452O9168l6843q621j04216p63L1488J4779
$$ 288025 305729 294619 288672 227021 289473 358641 321798 313177 208961 208198 239686 254465
6696B54465J9210O7038k5828o1880l1066N8948L5074L2859k3708k1605o694k9017
$$ 254465 273675 340713 314885 253005 221939 280887 315961 348820 325112 303507 296813 267796
6684B67796L3610J2319K2903J19006l1591k7033m8764q7382P0799l1291L4144
$$ 267796 301406 313725 336628 455634 424043 397010 348246 260864 331663 300372 334516
6673C34516R3076K2827L4962o8745j7135l8255M791k4842P0558o0451P5422m140
$$ 334516 427592 450419 485381 416636 399501 361246 366037 341195 411753 351302 426724 422584
6661D22584N5673J0628j59190q585N8474O6977l460L2407j4998k5838r933J6895
$$ 422584 478257 488885 329695 321110 379584 446561 443101 475508 460510 434672 424739 441634
6649D41634J157p4309J10707o0858Q7402K2526q1462P1398J06140l7665n2632
$$ 441634 442791 368482 479189 418331 505733 528259 446797 518195 624335 586670 534038
6638E34038o1883O9952L7467n0598Q8841N8350L4189n1459j8207J8967n9678J25742
$$ 534038 472155 542107 579574 528976 617817 676167 710356 658897 640690 659657 599979 725721
6626G25721P1111q5560O5347O4869M1911n3543L3925O4173k3253m6215L8924J09172
$$ 725721 796832 711272 776619 841488 883399 829856 863781 927954 904701 858486 897410 1006582
6614A006582K2083L3542J04538l0517k9255O1057R3960K4642j9761j65212K7739
$$ 1006582 1028665 1062207 1166745 1136228 1106973 1168030 1261990 1286632 1266871 1101659 1129398
6603A129398J2793l1505J8070o8628m7504o850N375O9312k0130n5497J4297Q8899
$$ 1129398 1142191 1110686 1128756 1060128 1012624 1005774 1011149 1080461 1060331 1004834 1019131 1108030
6591A108030o69J03816l6448N155P1887J08472P3575n8760m9334K8195Q7748o1722
$$ 1108030 1107361 1211177 1174729 1179884 1251771 1360243 1433818 1375058 1325724 1353919 1441667 1379945
6579A379945p8067q8941o9477l5634p8277J9035r1564L3034j2152n5904J6007
$$ 1379945 1301878 1212937 1143460 1107826 1029549 1048584 957020 990054 977902 921998 938005
6568I38005J6023k331l9796O4320r0165m1489K35586l226k2122n0205Q0406N0791
$$ 938005 954028 951697 911901 976221 886056 844567 1080153 1076927 1054805 1004600 1085006 1135797
6556A135797L9464N7084j10003o2386j5753J04253r078j36492n8543j44n6015
$$ 1135797 1175261 1232345 1122342 1059956 1044203 1148456 1139378 1002886 944343 944199 888184
6545H88184k6997P4299j11785Q2161L1999j03088L1255j6144J02095n9845m5380
$$ 888184 861187 935486 823701 905862 937861 834773 866028 849884 951979 892134 846754
6534H46754J09795Q1978j18318j9641Q87L2281Q4764p9819m9082J20912j7111
$$ 846754 956549 1038527 920209 900568 901455 933736 1018500 938681 889599 1010511 993400
6523I93400m5884l8307J1542q9088N8278k9854J0308J8816L0282P539L4629j4867
$$ 993400 947516 909209 920751 831663 889941 860087 870395 889211 919493 927032 961661 946794
6511I46794O0745J36282p1635L4855n2573R6219k4007P01q6785k0187M2673j3595
$$ 946794 1007539 1143821 1072186 1107041 1054468 1150687 1126680 1127381 1040596 1020409 1063082 1049487
6499A049487k4251m0486n3433j6961L4828k8072k295j1933K8106j7527O902O9390
$$ 1049487 1025236 984750 931317 914356 949184 921112 918817 906884 934990 917463 924365 993755
6487I93755j1113n2838L3231O487M0031K8961K7249j10221r4654k2390l7968J7401
$$ 993755 982642 929804 963035 969522 1009553 1038514 1065763 955542 860888 838498 800530 817931
6475H17931j7843N4518o4626j9890n2104N0041J00184n0794K7822N9595J2064
$$ 817931 800088 854606 789980 770090 717986 768027 868211 817417 845239 904834 916898
6464I16898J0570M8070M51p0198q3207J10698M3929J1830n0791N8802J04300q8242
$$ 916898 927468 975538 975989 905791 822584 933282 977211 989041 938250 997052 1101352 1013110
6452A013110r9403L9106r062p6910K6045O7257m7937J01993N8051M4374N26R8041
$$ 1013110 913707 952813 943751 866841 892886 960143 912206 1014199 1072250 1116624 1117150 1215191
6440A215191m2357M4112N2445l1737N736L2094m0690k2936J0609j6009j3417k4753
$$ 1215191 1172834 1216946 1269391 1237654 1243390 1275484 1234794 1211858 1222467 1206458 1193041 1168288
6428A168288O8540m1832j8391j7346P0688j5368J0832P1668m8306K1752J4463
$$ 1168288 1236828 1194996 1176605 1159259 1229947 1214579 1225411 1297079 1248773 1270525 1284988
6417A284988J2805l0536J7167j2357M946R3506P848o9250J9531J26840m0629M146
$$ 1284988 1297793 1267257 1284424 1272067 1277013 1370519 1378367 1309117 1328648 1455488 1414859 1419005
6405A419005O4954N8908j19567l6685J33257o181K6834o9534N079Q1167J6744
$$ 1419005 1483959 1542867 1423300 1386615 1519872 1513691 1540525 1470991 1476070 1557237 1573981
6394A573981l4719n4576J3763j34318K3728L5658J09211L8761r7323J5861L6204
$$ 1573981 1539262 1484686 1498449 1364131 1387859 1423517 1532728 1571489 1474166 1490027 1526231
6383A526231N025j0351K509L6136Q8773R5339r3561J36504M5320K8564P0213J6163
$$ 1526231 1531256 1520905 1523414 1559550 1648323 1743662 1650101 1786605 1831925 1860489 1930702 1946865
6371A946865M0897j3631L4846r637n3925J6995N787J005J6630k1845j3030k6034
$$ 1946865 1987762 1974131 2008977 1999340 1945415 1962410 1968197 1969202 1985832 1963987 1950957 1924923
6359A924923R5664K11170M6194J06680o732j038m0123N2999J75882O7992Q2210
$$ 1924923 2020587 2231757 2277951 2384631 2377899 2376861 2336738 2389737 2565619 2633611 2715821
6348B715821J14616M4469O9474Q3000J72926J25356J18052J01308L10212K92464
$$ 2715821 2830437 2874906 2944380 3027380 3200306 3325662 3443714 3545022 3855234 4147698
6338D147698K89920M42365L76115L16625q4802k38590k59867l07957L7387m8983
$$ 4147698 4437618 4879983 5256098 5572723 5487921 5249331 4989464 4681507 4718894 4669911
6328D669911m3456J45551J93920K28677L47593M44700J86517Q8553r9443J19402
$$ 4669911 4626455 4772006 4965926 5194603 5542196 5986896 6173413 6261966 6162523 6281925
6318F281925J67022K12581L25920J85843n8127l02207k87172j76083l9141J28538
$$ 6281925 6448947 6661528 6987448 7173291 7115164 6812957 6525785 6349702 6310561 6439099
6308F439099J4508J36531j2087o9799j45327j98964L8141J4284Q9601K45353K92300
$$ 6439099 6453607 6590138 6578051 6508252 6362925 6163961 6202102 6216386 6305987 6551340 6843640
6297F843640L78054M86588K89484L2973k49418l26372m07107l19110k22284k21359
$$ 6843640 7221694 7708282 7997766 8030739 7781321 7454949 7047842 6728732 6506448 6285089
6287F285089r601j15569l6395l6852P0245p2995k5017R1389P2574L1668J18017
$$ 6285089 6275488 6159919 6123524 6086672 6156917 6083922 6058905 6150294 6222868 6254536 6372553
6276F372553R8157L9796J07905L9672K1146J9615O1093N4087J63500J49666L8642
$$ 6372553 6470710 6510506 6618411 6658083 6679229 6698844 6759937 6814024 6977524 7127190 7165832
6265G165832J34409O9412R5813R0385O5585R9873J98477J00574K18151K13072
$$ 7165832 7300241 7369653 7465466 7555851 7621436 7721309 7919786 8020360 8238511 8451583
6255H451583Q1983K14534K28759J76378K30117J44538J42582K88669R6065K73737
$$ 8451583 8533566 8748100 8976859 9153237 9383354 9527892 9670474 9959143 10055208 10328945
6245A0328945J72099J96339K16238J77660L10670K71745J79096K23413L47464
$$ 10328945 10501044 10697383 10913621 11091281 11401951 11673696 11852792 12076205 12423669
6236A2423669L20287M02549L47510L47407L76196L65418M97805O04110M42907
$$ 12423669 12743956 13146505 13494015 13841422 14217618 14583036 15080841 15684951 16127858
6227A6127858N47434N47159N66297O06479O10664P43475R56620J044820J189118
$$ 16127858 16675292 17222451 17788748 18395227 19005891 19749366 20705986 21750806 22939924
6218B2939924J309067J535787J876489K226601K886233L421315M206923N318430
$$ 22939924 24248991 25784778 27661267 29887868 32774101 36195416 40402339 45720769
6210D5720769O371903O198261L017991j609167m227973m611379l473878k241025
$$ 45720769 52092672 58290933 61308924 59699757 55471784 50860405 47386527 45145502
6202D5145502j142843j2787J072826K278201L169450M115459M166194K188058
$$ 45145502 44002659 43989872 45062698 47340899 50510349 54625808 58792002 60980060
6194F0980060Q3806j99680Q80188K550049M141264M290810J960521j705138m216616
$$ 60980060 61063866 60864186 61744374 64294423 68435687 72726497 74687018 72981880 68765264
6185F8765264m549004l453927j809475j16111J607370J959472k35933k795162
$$ 68765264 64216260 60762333 58952858 58836747 60444117 62403589 62167656 59372494
6177E9372494l474134k779456j522388k14929R68716K350981L748841N204062
$$ 59372494 55898360 53118904 51596516 51381587 52350303 54701284 58450125 63654187
6169F3654187O168368N345081J127693m072858o092909n753890m457505k819737
$$ 63654187 69822555 75167636 76295329 72222471 66129562 60375672 55918167 53098430
6161E3098430j560830l25210O87164J514016K074574K069463J191398l89679j996883
$$ 53098430 51537600 51212390 51899554 53413570 55488144 57557607 58749005 58359326 56362443
6152E6362443k941780l313122l067835k692064k023134j641968j293238q35463
$$ 56362443 53420663 50107541 47039706 44347642 42324508 40682540 39389302 38553839
6144C8553839n76168m2813K31970N14140J004622J252853J478954J951214K495520
$$ 38553839 37977671 37934858 38166828 38680968 39685590 40938443 42417397 44368611 46864131
6135D6864131L249092M063470M966602O437296P365313P633542O523215L554188
$$ 46864131 50113223 54176693 59143295 65580591 72945904 80579446 87102661 90656849
6127I0656849j352700n849870q200840q359122p416997n761439m337223l506279
$$ 90656849 89304149 83454279 75253439 66894317 59477320 53715881 49378658 45872379
6119D5872379k849682k301676k085856j739534j210213q72141m68210k55922O1725
$$ 45872379 43022697 40721021 38635165 36895631 35685418 34813277 34345067 34089145 34150870
6110C4150870N42022J098892J475741K103117K743575L289983L504071L240143
$$ 34150870 34692892 35791784 37267525 39370642 42114217 45404200 48908271 52148414
6102E2148414J835981n41713k845570m422817m793851m400964l812788l227347
$$ 52148414 53984395 53442682 50597112 46174295 41380444 36979480 33166692 29939345
6094B9939345k534387k200584j851818j630316j666994j468169j180527q98588
$$ 29939345 27404958 25204374 23352556 21722240 20055246 18587077 17406550 16507962
6086A6507962r68515p71115n88128n20250n29580n32395n41189m30322n17493
$$ 16507962 15539447 14768332 14180204 13659954 13130374 12597979 12056790 11626468 11108975
6077A1108975l83027m34752l24117n20003m07798k57819k95640k82223l47271
$$ 11108975 10725948 10291196 9967079 9447076 9039278 8781459 8485819 8203596 7856325
6068G856325k35232j88240j87374j08761j23926j22274k65300l3864q8615O0566
$$ 7856325 7621093 7432853 7245479 7136718 7012792 6890518 6625218 6591354 6502739 6563305
6058F563305l7364j5451M8806n4942J7874j60230k37130k63314k27108l26522
$$ 6563305 6525941 6510490 6559296 6504354 6522228 6361998 6124868 5861554 5634446 5307924
6048E307924j96607j58760j33107j64740k14146Q065j35630j03427P2202k5389
$$ 5307924 5111317 4952557 4819450 4654710 4440564 4448629 4312999 4209572 4281774 4256385
6038D256385Q9398r3972j04258P736o4459J9817n6199m0560P6146L0768N0933
$$ 4256385 4345783 4251811 4147553 4155289 4090830 4110647 4054448 4013888 4090034 4120802 4171735
6027D171735l238r8409n5529r5917k23129j12059l8512j9225n2441r9712L1167
$$ 4171735 4168497 4070088 4014559 3918642 3695513 3583454 3544942 3525717 3473276 3373564 3404731
6016C404731j02211J05j20295r8588L5468n3880j08109m2126j06100J00778J0157
$$ 3404731 3302520 3302625 3182330 3083742 3119210 3065330 2957221 2915095 2808995 2909773 2919930
6005B919930j03593j58407l5302j04880r892J14724j0621J16994o9239K9315r6869
$$ 2919930 2816337 2657930 2622628 2517748 2507856 2622580 2611959 2728953 2659714 2689029 2592160
5994B592160P8098J2462L9524K7363q1686j03172k1424k20j2002P0184k2354j04717
$$ 2592160 2670258 2682720 2722244 2749607 2667921 2564749 2543325 2543105 2531103 2601287 2578933 2474216
5982B474216O9753j33316r6210k8652M5214J0058r474l9773N5604k1031M8861
$$ 2474216 2543969 2410653 2314443 2285791 2331005 2341063 2331589 2291816 2347420 2326389 2375250
5971B375250j22656l079n0834J02828P6083l2965j7987k9555n2144L853J1809
$$ 2375250 2252594 2249515 2198681 2301509 2377592 2344627 2326640 2297085 2244941 2248794 2260603
5960B260603j07789l4821N4752j329M6983J7664o2166P2543J9613K6793J8364
$$ 2260603 2152814 2117993 2172745 2171416 2218399 2236063 2173897 2246440 2266053 2292846 2311210
5949B311210p5605K8180M9398L3303j2128m9278l1672K5601Q4416r0498m0036
$$ 2311210 2235605 2263785 2313183 2346486 2334358 2285080 2253408 2279009 2363425 2272927 2232891
5938B232891N6318L9926J9724L7897Q13n2502l7618l9488r922J17867Q357J25400
$$ 2232891 2289209 2329135 2348859 2386756 2387569 2335067 2297449 2257961 2248039 2365906 2374263 2499663
5926B499663O5117o8648o5183n2911J6907O800m657l3399j8175J0103O6628o8711
$$ 2499663 2564780 2496132 2430949 2378038 2394945 2401745 2397088 2363689 2345514 2355617 2422245 2353534
5914B353534n1846J84437J8954m9174j9358j3488J04134M5488L1756J59870o9963
$$ 2353534 2301688 2486125 2505079 2455905 2436547 2423059 2527193 2572681 2604437 2764307 2694344
5903B694344j16893J7539j6666n4914K9703R1880l1949j9872Q8349k0859m4147
$$ 2694344 2577451 2594990 2578324 2523410 2553113 2644993 2613044 2593172 2681521 2660662 2616515
5892B616515j7728P5302J3869J63449j6381M9790O2221P8673k1251R0726J09931
$$ 2616515 2598787 2674089 2687958 2851407 2835026 2884816 2947037 3025710 3004459 3095185 3205116
5881C205116r0952l1086j19762M3828J49895m0445N6518R7671J89039m0328l3530
$$ 3205116 3114164 3083078 2963316 3007144 3157039 3116594 3173112 3270783 3459822 3419494 3385964
5870C385964M2564J13920J47762N2609L6643R107k2001R2472M6185n093K533P3490
$$ 3385964 3428528 3542448 3690210 3742819 3779462 3788569 3766568 3859040 3905225 3900132 3902665 3976155
5858C976155j6361J1518j542P6441J58549q413J34962M5201J29468N6578l4693
$$ 3976155 3959794 3971312 3969770 4046211 4204760 4196347 4331309 4376510 4505978 4562556 4527863
5847D527863R4544O717J5524Q0180M4950J36316n5968J6817J17089J61073J38093
$$ 4527863 4622407 4629124 4644648 4724828 4769778 4906094 4850126 4866943 4984032 5145105 5283198
5836E283198L3839n6084N7822J9527l4752Q7760M1578J15821J2005J46037P9465
$$ 5283198 5317037 5260953 5318775 5338302 5303550 5391310 5432888 5548709 5560714 5706751 5786216
5825E786216P6159O8204K8624K2752n57K50007K0877j7229J36348J37868J03671
$$ 5786216 5862375 5930579 5959203 5981955 5981398 6231405 6252282 6235053 6371401 6509269 6612940
5814F612940O9125O0174K38381Q4943P5870R1596J05103J39119J08328n6961P1570
$$ 6612940 6682065 6742239 6980620 7065563 7141433 7233029 7338132 7477251 7585579 7528618 7600188
5803G600188J22387J87907K14010O2917J73380J63533P3390K93359K37901K56995
$$ 7600188 7722575 7910482 8124492 8187409 8360789 8524322 8597712 8891071 9128972 9385967
5793I385967K41900K92146L39933L81637M75500L81711M25471N90698M58367L22403
$$ 9385967 9627867 9920013 10259946 10641583 11117083 11498794 11924265 12514963 12973330 13295733
5783A3295733R5862j72354k9000J14032J83204K75101M15460N25789O36125N54426
$$ 13295733 13391595 13219241 13190241 13304273 13487477 13762578 14178038 14703827 15339952 15894378
5773A5894378O77029P82166L59670J32987J59888K84518K26012L53215N74600
$$ 15894378 16571407 17353573 17713243 17846230 18006118 18290636 18516648 18869863 19444463
5764A9444463N52275K34578N5270J01400J0085K1854K46723M03855L81414L43853
$$ 19444463 19996738 20231316 20286586 20387986 20398071 20419925 20666648 21070503 21451917 21795770
5754B1795770K11859L15948L01701K03881N04991O79961P74453R10966P98661
$$ 21795770 22007629 22323577 22625278 22829159 23334150 24014111 24788564 25699530 26498191
5745B6498191R91991J209815J109411Q94057Q35640K12046j88117j33104J20610
$$ 26498191 27490182 28699997 29809408 30703465 31539105 31751151 31563034 31429930 31550540
5736C1550540K60563L50324N69623Q48472J072453J348273J879508K024614K377476
$$ 31550540 31811103 32161427 32731050 33579522 34651975 36000248 37879756 39904370 42281846
5727D2281846K932274L537875M293775M980215M886418L603512J079959j478389
$$ 42281846 45214120 48751995 53045770 58025985 62912403 66515915 67595874 66117485
5719F6117485l194236l956330l905086l103522k224146j800464j325392r65362
$$ 66117485 62923249 58966919 55061833 51958311 49734165 47933701 46608309 45642947
5711D5642947l39175j75864q1352L35127Q32468J049728J548334K166803K585548
$$ 45642947 45303772 45127908 45046556 45381683 46214151 47263879 48812213 50979016 53564564
5702E3564564L425176M290782N508126P008078Q504466R453203P720195K454308
$$ 53564564 56989740 61280522 66788648 73796726 82301192 91754395 99474590 101928898
5694A01928898l351550p412791q896901q410432p153622n625246m147405l055961
$$ 101928898 98577348 91164557 82267656 73857224 66703602 61078356 56930951 53874990
5686E3874990k169456j277382o33805J75383R20594J692612K432232L034307K409319
$$ 53874990 51705534 50428152 49794347 49969730 50890324 52582936 55015168 58049475 60458794
5677F0458794J83948j809454j916403j155972J2543J171613K012518K011764J270880
$$ 60458794 60642742 58833288 56916885 55760913 55773456 56945069 58957587 60969351 62240231
5668F2240231m18238k404382l675121l969797l603777l099367k344425j643840
$$ 62240231 61821993 59417611 55742490 51772693 48168916 45069549 42725124 41081284
5660D1081284j136494p97650p73877o21690m01107l19970m26305o03100n55152
$$ 41081284 39944790 39147140 38373263 37751573 37350466 37030496 36604191 36001091 35445939
5651C5445939n51559m30232l08446k47784r4857O0798k1707J87781L04320N75326
$$ 35445939 34894380 34464148 34155702 33907918 33813061 33873859 33852152 34039933 34344253 34919579
5641C4919579O18192P66190R52593J177630J355078J451691J702954K089763K334999
$$ 34919579 35537771 36303961 37256554 38434184 39789262 41240953 42943907 45033670 47368669
5632D7368669K644788L327233M251377N143258O305140P304414N423210P5495
$$ 47368669 50013457 53340690 57592067 62735325 69040465 76344879 81768089 81843584
5624H1843584m487684n661627n035654l682859k099181o55844O60285J829611
$$ 81843584 77355900 71694273 66658619 62975760 60876579 60220735 60881020 62710631
5616F2710631L268279M277569L793934J463225o72991p80293J20471J376575L230437
$$ 62710631 65978910 70256479 74050413 75513638 74840647 74060354 74180825 75557400 78787837
5607G8787837M647265M644239K612717r44143l379161l815510k713525q01593
$$ 78787837 83435102 88079341 90692058 89747915 86368754 82553244 79839719 79038126
5599G9038126P15989P58267r63504k763830k826842j717712l93715Q33517J640671
$$ 79038126 79754115 80512382 79548878 76785048 73958206 72240494 71846779 72680296 74320967
5590G4320967J872699K571567L611671N148147N871770L912707m48165l947908
$$ 74320967 76193666 78765233 82376904 87525051 93396821 97309528 96861363 92913455
5582I2913455n141285m915117l729218k229487r63887k36L02452L02835N60776
$$ 92913455 87772170 82857053 79127835 76898348 75934461 75934225 76236677 76539512 77100288
5573G7100288Q35729N52476p29235j244155r17176p0716R58778J775543J947914
$$ 77100288 77936017 78488493 77759258 76515103 75597927 75527211 76485989 78261532 80209446
5564H0209446J417464J070476J434705K313730L733711N119491N371144L564900
$$ 80209446 81626910 82697386 84132091 86445821 90179532 95299023 100670167 104235067
5556A04235067M10705j658175j530223J89750K329610M046847M134159K496688
$$ 104235067 104645772 102987597 101457374 101647124 103976734 108023581 112157740 114654428
5548A14654428N17319j354765l985812o577554p579126p144072o060363m454876
$$ 114654428 115171747 113816982 109831170 103253616 95674490 88530418 82470055 78015179
5540G8015179l052867j851924o80162J42108J058235J601566J960084K709757
$$ 78015179 74962312 73110388 72430226 72572334 73630569 75232135 77192219 79901976
5532G9901976L805237M978787O193751O432038M959122K494497K21162j680228
$$ 79901976 83707213 88686000 94879751 101311789 106270911 108765408 108986570 107306342
5524A07306342l955367n501098n332375m158467k185241p20990o84929k550937
$$ 107306342 103350975 97849877 92517502 88359035 86173794 85452804 84767875 82216938
5516H2216938m437197m796303m010703k619840j404706p85436o95445j426816
$$ 82216938 77779741 72983438 68972735 66352895 64948189 64162753 63467308 62040492
5508F2040492j931588j877287j236254l14831L79949N12795m37530j797270k162112
$$ 62040492 60108904 58231617 56995363 56680532 57060481 57573276 57135746 55338476 53176364
5499E3176364k044311k218568k404877k331938j847495j447420q11305p11398
$$ 53176364 51132053 48913485 46508608 44176670 42329175 40881755 40070450 39359052
5491C9359052j144461j729603j830446j729429j368601r15567o71835o23087j026000
$$ 39359052 38214591 36484988 34654542 32925113 31556512 30640945 29969110 29346023 28320023
5482B8320023j721109j929274j830722j660858j430391j107077r92578r41720
$$ 28320023 26598914 24669640 22838918 21178060 19747669 18640592 17648014 16706294
5474A6706294p49098p43221p03761o41350m67205m86977l88613l70464l66317
$$ 16706294 15957196 15213975 14510214 13868864 13401659 12914682 12526069 12155605 11789288
5465A1789288j89767l50108k17106k93536k21784m05989k37621k40363l75697
$$ 11789288 11599521 11249413 11032307 10738771 10516987 10110998 9873377 9633014 9257317
5456I257317m19106k13730j26099j95815p6246j78936j92755k49690j81936j02108
$$ 9257317 8838211 8624481 8498382 8302567 8226321 8047385 7854630 7604940 7423004 7320896
5446G320896r1272r6078n2065l0970j61980m7442j1858j73280J9585j83553q5667
$$ 7320896 7229624 7133546 7081481 7050511 6888531 6841089 6829231 6655951 6675536 6491983 6406316
5435F406316j9233J16272M4593K439J6744J41056J35383j49413n7429q5224K0048
$$ 6406316 6387083 6503355 6547948 6550387 6567131 6708187 6843570 6694157 6636728 6551504 6571552
5424F571552J9418J05571K78812K93673L69519L98737J84567l77829m89188m80182
$$ 6571552 6590970 6696541 6975353 7269026 7638545 8037282 8221849 7844020 7354832 6874650
5414F874650m94015m20083l52718k62210j77427j15233j46397j17434l4109j53564
$$ 6874650 6380635 5960552 5607834 5345624 5168197 5052964 4906567 4789133 4755024 4601460
5404D601460j21445j42197O903l2425k7829R787q7208q3426j21419j04998j53348
$$ 4601460 4480015 4337818 4344721 4312296 4284467 4294254 4207046 4123620 4002201 3897203 3743855
5393C743855k8664n1081l2988J0864k5033n8542l5493q7725l6131M5483n1981
$$ 3743855 3715191 3664110 3631122 3641986 3616953 3558411 3522918 3435193 3399062 3444545 3392564
5382C392564K1498j16360N78N8648K314M5756m7407J14295L6589J8831m4348n2033
$$ 3392564 3414062 3297702 3298280 3356928 3359242 3404998 3357591 3471886 3508475 3527306 3482958 3430925
5370C430925O1302p7836n5931O9468P5835K5836N2941N9590O6420J49213j2456
$$ 3430925 3492227 3414391 3358460 3427928 3503763 3529599 3582540 3642130 3708550 3857763 3845307
5359C845307L3991k4759r6999j24427m3769r5540l9818j94979j1191L429m5958
$$ 3845307 3879298 3854539 3757540 3633113 3589344 3493804 3453986 3259007 3247816 3251245 3205287
5348C205287O4943J24662k1462K5169N6318q3051J53188J89244J6860K77988K87930
$$ 3205287 3270230 3394892 3373430 3398599 3454917 3371866 3525054 3714298 3731158 4009146 4297076
5337D297076J84937J29905J2356K9025k1246Q4792Q0431K66340L28042L84422
$$ 4297076 4482013 4611918 4624274 4653299 4632053 4716845 4797276 5063616 5391658 5776080
5327E776080o7730l40439l88761l70131l35242l03019k97719k50726j71593k4172
$$ 5776080 5708350 5367911 4979150 4609019 4273777 3970758 3673039 3422313 3250720 3226548
5317C226548j21403j21165j00147J2939m8522K0031R0720L4823l4703k7135l5938
$$ 3226548 3105145 2983980 2883833 2896772 2848250 2868281 2959001 2993824 2959121 2931986 2896048
5306B896048J08322L9029J21198J01288J17028K55952K02125L25230L26706M99414
$$ 2896048 3004370 3043399 3164597 3265885 3382913 3638865 3840990 4166220 4492926 4992340
5296D992340L82051L6411j07575l37223m98991l46711l17393k12916j95228j01948
$$ 4992340 5374391 5410802 5303227 4966004 4467013 4120302 3802909 3589993 3394765 3292817
5286C292817j09259j9778o3379m8902Q775j40263Q551r821N5702j79213m3951
$$ 3292817 3183558 3163780 3100401 3051499 3060274 2920011 2928562 2918741 2974443 2795230 2751279
5275B751279J1170k4184P5766J2043P395n4611r1756P7455K29467K06183M8574
$$ 2751279 2762449 2738265 2814031 2826074 2833469 2778858 2687102 2764557 2994024 3200207 3248781
5264C248781J85967K49553p8962m7485l2791j53341j90377j95620j16785k0286
$$ 3248781 3434748 3684301 3605339 3557854 3525063 3371722 3181345 2985725 2868940 2848654
5254B848654q936O379p0729M614N3568n1024n0788O5515m4420j12303L3444Q402
$$ 2848654 2839718 2846097 2775368 2779982 2833550 2782526 2731738 2797253 2752833 2640530 2673974 2682376
5242B682376j13635q17k558l4349J3343K8628j52510j624l0816q759M3592R6300
$$ 2682376 2568741 2567924 2565366 2531017 2544360 2572988 2420478 2418854 2388038 2379279 2422871 2519171
5230B519171p1818m7492l0681J2470N0195L8489K8754J86090J18980K1270k0600
$$ 2519171 2447353 2399861 2369180 2381650 2431845 2470334 2499088 2685178 2804158 2825428 2804828
5219B804828K7747P3213J00882n1986J9355P7538N136j26063n3367J44432J12345
$$ 2804828 2832575 2905788 3006670 2954684 2974039 3051577 3056713 2930650 2877283 3021715 3134060
5208C134060q7059j85832P7664j06363k06537J6703r7957n565K0964m943J11910
$$ 3134060 3047001 2861169 2938833 2832470 2625933 2642636 2544679 2539114 2560078 2555135 2667045
5197B667045M6207r60J8607J20251L6045J23591J4367K3142M7305M1643L0898
$$ 2667045 2713252 2712292 2730899 2851150 2887195 3010786 3025153 3048295 3095600 3137243 3168141
5186C168141j1426l209K9305l4917R9676q377J4072j7298J22054m428j06224M324
$$ 3168141 3156715 3153506 3182811 3147894 3247570 3239193 3253265 3235967 3358021 3353593 3247369 3251693
5174C251693M3761Q4555p812N2751J01322L9026N0824Q9802L5444N2511P8280
$$ 3251693 3295454 3380009 3372197 3424948 3526270 3565296 3616120 3705922 3741366 3793877 3872157
5163C872157m6518L8128P2342J64576J35985Q7379K1061o5775R2300Q1759J1928
$$ 3872157 3825639 3863767 3936109 4100685 4236670 4324049 4345110 4279335 4371635 4453394 4465322
5152D465322J46313Q1827L5584J22989J15728J38050N8231J09016Q6301K35394
$$ 4465322 4611635 4693462 4729046 4852035 4967763 5105813 5164044 5273060 5359361 5594755
5142E594755J56318R5849K61806K83023L14259L66170N85570O06779P55734R72765
$$ 5594755 5751073 5846922 6108728 6391751 6706010 7072180 7657750 8264529 9020263 9993028
5132I993028J187783J590376K059809K687462K765942O92806j793338k262535
$$ 9993028 11180811 12771187 14830996 17518458 20284400 20977206 19183868 16921333
5124A6921333j947237j229270j065170p73239l68677j92888J37941j51665l83440
$$ 16921333 14974096 13744826 12679656 11906417 11537740 11344852 11482793 11331128 10947688
5115A0947688k25996j64208J0523k8192K6894Q0359o7559j98385k63452l4440
$$ 10947688 10721692 10557484 10568007 10539815 10566709 10647068 10579509 10381124 10117672 10083232
5105A0083232p82j41194j62643m3292m3529q469j11779j21647p5339K09655K29860
$$ 10083232 10082450 9941256 9778613 9735321 9691792 9683323 9571544 9449897 9374558 9584213 9814073
5094I814073J85404J18637J94653J49023K32854K34597K81626K41354J73899K87344
$$ 9814073 9999477 10118114 10312767 10461790 10694644 10929241 11210867 11452221 11626120 11913464
5084A1913464L41708L78246J71623J52177O194l1326o3224K62570J96344K06305
$$ 11913464 12255172 12633418 12805041 12957218 12963412 12932086 12868862 13131432 13327776 13534081
5074A3534081L86862K91574M08199L34101L46021L46532M20128M20237M63339
$$ 13534081 13920943 14212517 14620716 14954817 15300838 15647370 16067498 16487735 16951074
5065A6951074M46809L99146M23190N76308N85817O80036P46970P22070P45304
$$ 16951074 17397883 17797029 18220219 18796527 19382344 20062380 20809350 21531420 22276724
5056B2276724P16775P14559R01006Q61054Q27243Q09705Q07787Q76040R62743
$$ 22276724 22993499 23708058 24609064 25470118 26297361 27107066 27914853 28790893 29753636
5047B9753636R90343J138242J180465J450805J540911J348049Q97509R87122J512054
$$ 29753636 30743979 31882221 33062686 34513491 36054402 37402451 38299960 39287082 40799136
5038D0799136J774675K277711K943404L709248M442714N497856O784344Q538591
$$ 40799136 42573811 44851522 47794926 51504174 55946888 61444744 68229088 76767679
5030G6767679J0484840J3470537J8089468K4801293L2128706M2712067N2183968
$$ 76767679 87252519 100723056 118812524 143613817 175742523 218454590 270638558
5023B70638558K9216722k2717915m7075963m5479674l7526005k7401348k0443734
$$ 270638558 299855280 277137365 230061402 184581728 147055723 119654375 99210641
5016I9210641j4397190j0872414q097937o417303m979203m042358l260463k897225
$$ 99210641 84813451 73941037 65843100 59425797 54446594 50404236 47143773 44246548
5008D4246548k367426k081696j803927j533144j063116q66579q97466j108094
$$ 44246548 41879122 39797426 37993499 36460355 35397239 34530660 33633194 32525100
5000C2525100j468821j483326j442149j442789j386328j167348j020599r96793
$$ 32525100 31056279 29572953 28130804 26688015 25301687 24134339 23113740 22116947
4992B2116947r20589p10542o87905o67036o22737n91979n28765o83218o18357
$$ 22116947 21196358 20485816 19797911 19130875 18508138 17916159 17387394 16704176 16085819
4983A6085819n20765n93647n13173m49448n62074n41309l63616k53579j60603
$$ 16085819 15565054 14971407 14458234 14008786 13446712 12905403 12541787 12288208 12127605
4974A2127605k29508j41047j16852l21724k60565m10175l92866k24749k76053
$$ 12127605 11898097 11757050 11640198 11318474 11057909 10647734 10254868 10030119 9754066
4965I754066l43772j56171l27155k99172q4941m172o3723q7069q8392j12277m8877
$$ 9754066 9410294 9254123 8926968 8627796 8542855 8538683 8474960 8387891 8299499 8187222 8138345
4954H138345n7396J12430J242p3113p3706m7228k4175K7152p659l0008L7306K1047
$$ 8138345 8080949 8193379 8194621 8121508 8047802 8000574 7976399 8003551 7995892 7965884 8003190 8024237
4942H024237j075j66817r0192q737O741J51721J34341L7291J01865L4957J33823
$$ 8024237 8023162 7856345 7766153 7757416 7764157 7915878 8050219 8087510 8189375 8224332 8358155
4931H358155K48826J31307P6249J35682n5482m4327K2031Q482N310J08426Q6426
$$ 8358155 8606981 8738288 8814537 8950219 8894737 8850410 8872441 8880923 8886233 8994659 9081085
4920I081085J11324K6942R5208K612J07976O9461J08663R3029J25834Q5225P9165
$$ 9081085 9192409 9219351 9314559 9317171 9425147 9494608 9603271 9696300 9822134 9907359 9986524
4909I986524K47163J68717M34270N54071N74473P74889R01395J244057J278643
$$ 9986524 10233687 10402404 10836674 11390745 11965218 12740107 13641502 14885559 16164202
4900A6164202J34745q24854j001076j009377q95790n95850l45674j78176k15445
$$ 16164202 16298947 15474093 14473017 13463640 12567850 11972000 11626326 11448150 11232705
4891A1232705n1074J50569J71612Q8322J51610L01818M25028O96396O83006R56152
$$ 11232705 11181631 11332200 11503812 11592134 11743744 12045562 12470590 13166986 13849992 14806144
4881A4806144J265210J168997J37065p54565q71250p54242l90059k94832p6262
$$ 14806144 16071354 17240351 17377416 16622851 15751601 14997359 14607300 14312468 14236206
4872A4236206K1560J86619J75104K31612L09477L84342K57947L03340K35497K65808
$$ 14236206 14257766 14444385 14619489 14851101 15160578 15544920 15802867 16106207 16341704 16607512
4862A6607512K55003J43149K72777K91284K75651M35437M87615N92845N30996
$$ 16607512 16862515 17005664 17278441 17569725 17845376 18280813 18768428 19361273 19892269
4853A9892269N75460N95889N78284P45533Q45700Q89988J158374J140644J270574
$$ 19892269 20467729 21063618 21641902 22387435 23233135 24123123 25281497 26422141 27692715
4844B7692715J433624J478115J614784J734540J792227J704795J774038J573708
$$ 27692715 29126339 30604454 32219238 33953778 35746005 37450800 39224838 40798546
4836D0798546J353068J037109Q57395P10722N29400L89958L43632O2176r7967
$$ 40798546 42151614 43188723 44046118 44756840 45286240 45676198 46019830 46082006 45984039
4827D5984039J13317Q4226J80425L52454N96903P19809J051658J484098J745031
$$ 45984039 46097356 46181582 46362007 46714461 47311364 48031173 49082831 50566929 52311960
4818E2311960K075425K269009K430217K731597K641307K708985K541943K428617
$$ 52311960 54387385 56656394 59086611 61818208 64459515 67168500 69710443 72139060
4810G2139060K096099J261605O00790k35737q11715j208636j400227j648886j778247
$$ 72139060 74235159 75496764 76097554 75861817 75050102 73841466 72441239 70792353 69014106
4801F9014106k089565k274817k298176j953776j393601j031100o26177j00346
$$ 69014106 66924541 64649724 62351548 60397772 59004171 57973071 57346894 57246548
4793E7246548L87184O60864R89816J360571J702324J988278K229307K381315K512806
$$ 57246548 57633732 58294596 59284412 60644983 62347307 64335585 66564892 68946207 71459013
4784G1459013K430564K334955J847515J450236O60627k71251j044193j799842
$$ 71459013 73889577 76224532 78072047 79522283 80182910 79911659 78867466 77067624
4776G7067624k138306k434182k409432k337488k038824j856242j629015j263446
$$ 77067624 74929318 72495136 70085704 67748216 65709392 63853150 62224135 60960689
4768F0960689q52317o61656j83499J57448N17197Q60437J195848J652589J929550
$$ 60960689 60108372 59446716 59263217 59420665 59937862 60798299 61994147 63646736 65576286
4759F5576286K004910J937160J747515J586040J311615J061736J093521O50772
$$ 65576286 67581196 69518356 71265871 72851911 74163526 75225262 76318783 76969555
4751G6969555r0341r10708j690083k213628k301539k390509k327645k134386j961304
$$ 76969555 76879214 75968506 74278423 72064795 69763256 67372747 65045102 62910716 60949412
4742F0949412j916923j766652j527410j173231j044273q97583n19199l39016k97021
$$ 60949412 59032489 57265837 55738427 54565196 53520923 52623340 52104141 51765125 51468104
4733E1468104k50397j51902k36006l37006n79502o10523o47941r80153j161033
$$ 51468104 51217707 51065805 50829799 50492793 49913291 49302768 48654827 47674674 46513641
4724D6513641j451843j902761k048265k059862k106791k046270j854821j767520
$$ 46513641 45061798 43159037 41110772 39050910 36944119 34897849 33043028 31275508
4716C1275508j772485j672959j547514j329225j362212j329966q65001r33002
$$ 31275508 29503023 27830064 26282550 24953325 23591113 22261147 21396146 20463144
4708B0463144q17657n43869o38161q82709r25540r45344q68824r05312q31514
$$ 20463144 19645487 19101618 18463457 17580748 16655208 15709864 14841040 13935728 13104214
4699A3104214o13962n43491n39559m49772l58855m18561l34384k84209j90907
$$ 13104214 12490252 11946761 11407202 10957430 10598575 10180014 9845630 9561421 9370514
4690I370514k26358l56295k86438j82311k08656j40492k12410k51998j95988k26994
$$ 9370514 9144156 8787861 8501423 8319112 8110456 7969964 7757554 7505556 7309568 7082574
4680G082574k18554k57907j7120j66781j28259j94830k52320k44679r6705j43985
$$ 7082574 6864020 6606113 6588993 6422212 6293953 6099123 5846803 5602124 5505419 5361434
4670E361434j92208l9896q2681j1596r5209j52760p3191n762j31020j39533j64877
$$ 5361434 5169226 5129330 5046649 5035053 4939844 4787084 4713893 4708131 4577111 4437578 4272701
4659D272701J8359m8343j28981P6874J2192k01129n1442p0068j52309l9546n2791
$$ 4272701 4291060 4242717 4113736 4190610 4202802 4001673 3950231 3880163 3727854 3688308 3635517
4648C635517K1724j5976k7229K1546K062J7188j5920O8591p1441J38229J5002
$$ 3635517 3657241 3641265 3614036 3635582 3637644 3654832 3638912 3707503 3636062 3774291 3789293
4637C789293m487Q2895L2579p1546m375q9148j35546l1822j04166j40893j17410
$$ 3789293 3784806 3867701 3900280 3828734 3824359 3735211 3599665 3567843 3463677 3322784 3205374
4626C205374j2614K6538K1953m9979o9175Q895k3282m4156j41493J7968R3869
$$ 3205374 3192760 3219298 3241251 3191272 3122097 3130992 3107710 3063554 2922061 2940029 3033898
4615C033898J50995L3869P7629J17108n914P9733N8954M6469j68740r8515M0699
$$ 3033898 3184893 3218762 3296391 3413499 3407585 3487318 3546272 3592741 3424001 3325486 3366185
4604C366185j10040l8864j62560m0285n6069j26655J9305o7736j3134m4323M5262
$$ 3366185 3256145 3217281 3054721 3014436 2958367 2831712 2851017 2783281 2770147 2725824 2771086
4593B771086Q335l1168l4306j1810M5175K6254o714o2751l0038O5139J8641R9514
$$ 2771086 2779421 2748253 2713947 2702137 2747312 2773566 2766852 2704101 2674063 2739202 2757843 2857357
4581B857357K01165J65972J01954J29743M6462J41281J6960o9087j10755k2503
$$ 2857357 3058522 3224494 3326448 3456191 3502653 3643934 3660894 3591807 3481052 3458549
4571C458549j38181k18174j97320p3832j27865j01463M0914J5361k3931K6896
$$ 3458549 3320368 3102194 2904874 2831042 2703177 2601714 2642628 2657989 2634058 2660954
4561B660954Q2600r3605j9928O3557O2028J14971O41J49615J38578P6436O4511
$$ 2660954 2743554 2649949 2630021 2693578 2755606 2870577 2871218 3020833 3159411 3235847 3300358
4550C300358N1245J96243j39693q8994p3933j46386l633j05276k39659j74280
$$ 3300358 3351603 3547846 3408153 3319159 3245226 3098840 3095207 2989931 2750272 2575992
4540B575992q1749j05821j31315o2276M9694P8857r7730l4181r4019l1420N5606
$$ 2575992 2494243 2388422 2257107 2194831 2244525 2323382 2225652 2191471 2097452 2066032 2121638
4529B121638L8548o8410L6572k6016M8690n6523j05658J64524Q1637O9125M4280
$$ 2121638 2160186 2091776 2128348 2102332 2151022 2094499 1988841 2153365 2235002 2304127 2348407
4518B348407J02990N264P1569n4432j3023j80552m9197J4561k7178j3294j07258
$$ 2348407 2451397 2456661 2528230 2473798 2460775 2280223 2231026 2245587 2218409 2205115 2097857
4507B097857q0564m5882O5420J04519j7552m0573j17374J02228j3563m1376Q5038
$$ 2097857 2017293 1971411 2036831 2141350 2123798 2083225 1965851 2068079 2054516 2013140 2098178
4496B098178L8720J39547J39990J82944L4629Q8182l1688p5823p2774p2105k9417
$$ 2098178 2136898 2276445 2416435 2599379 2634008 2722190 2690502 2614679 2541905 2469800 2440383
4485B440383j20910j19563m8128o256o9911o5055K0902o2790N4494j899p2778
$$ 2440383 2319473 2199910 2151782 2145526 2075615 2010560 2031462 1968672 2023166 2021267 1948489
4474A948489J891N835q2698O3188Q9087m7344L2703R1128J6373J5554j9945j07867
$$ 1948489 1950380 1956215 1873517 1936705 2025792 1978448 2011151 2102279 2118652 2134206 2114261 2006394
4462B006394J0131Q6216L0623O2668K8074j12M0085K4241q3693J4501k1887M5662
$$ 2006394 2016525 2102741 2133364 2196032 2224106 2223994 2264079 2288320 2204627 2219128 2197241 2242903
4450B242903P6573P603N0631k3507J54467l8842J08234L6672l0227M9257O8959
$$ 2242903 2319476 2327079 2377710 2354203 2508670 2469828 2578062 2614734 2584507 2633764 2702723
4439B702723K7095O0769L5870k7270O4567O2285L2836R0900p9539n7888J59014
$$ 2702723 2729818 2790587 2826457 2799187 2863754 2926039 2958875 3049775 2970236 2912348 3071362
4428C071362J48753N4343P1769J88110P4834P7721j9591R2912l0547j3230k3932
$$ 3071362 3220115 3274458 3346227 3534337 3609171 3686892 3667301 3760213 3729666 3716436 3692504
4417C692504P2376l8751Q8588J04413l947J93443k2120p5569r3270J4077J3840
$$ 3692504 3764880 3726129 3814717 3919130 3915183 4108626 4086506 4010937 3917667 3931744 3945584
4406C945584p7564P5729r064n2420M7861Q5041J20744O4532J07215J90749P6955
$$ 3945584 3868020 3943749 3934685 3882265 3930126 4015167 4135911 4200443 4307658 4498407 4575362
4395D575362J87828J30114l3654m6970p6614o570k0269m7616l764j3004M0097
$$ 4575362 4763190 4893304 4859650 4812680 4736066 4729496 4709227 4661611 4657847 4644843 4684940
4384D684940j3652J3969m0171j16778m9907l3894m3969p7076l6118l8216m4230
$$ 4684940 4671288 4685257 4645086 4528308 4478401 4444507 4400538 4323462 4287344 4249128 4204898
4373D204898J6358j8663O8449Q4586l5898j49846O972k4152P1290J23615q864
$$ 4204898 4221256 4202593 4271042 4355628 4319730 4169884 4176856 4152704 4223994 4347609 4338745
4362D338745N1894L8314K4766N5126N4543L9243J37982M8630J7132l2833R341
$$ 4338745 4390639 4428953 4453719 4508845 4563388 4602631 4740613 4789243 4806375 4773542 4782883
4351D782883p3220j04550n5413p2902p7922k9019q7463N095n9267j41697n8734
$$ 4782883 4709663 4605113 4549700 4476798 4398876 4369857 4282394 4287489 4228222 4086525 4027791
4340D027791m9306l5060L8491j01872o1525K1650m0790m741m9509M5856K2043
$$ 4027791 3978485 3943425 3981916 3880044 3818519 3840169 3799379 3794638 3745129 3790985 3813028
4329C813028n2890P856L7007j33564m4916p1191p2441L5912r6817j1532n5426
$$ 3813028 3760138 3767994 3805001 3671437 3626521 3555330 3482889 3518801 3421984 3410452 3355026
4318C355026m1732p4940m5189M3185K3550q1378m1713K8514L1184m9018n4483
$$ 3355026 3313294 3238354 3193165 3236350 3259900 3178522 3136809 3165323 3196507 3147489 3093006
4307C093006j46905j5300N7601j49116j5388q1986n4998J8025j69975L5454R2634
$$ 3093006 2946101 2930801 2988402 2839286 2823898 2741912 2686914 2704939 2534964 2570418 2663052
4296B663052p0269n5003J5128j4452K7877K3473K3928m902m7925K8847R9544j01769
$$ 2663052 2592783 2537780 2552908 2538456 2566333 2589806 2613734 2608832 2560907 2589754 2689298 2587529
4284B587529N0572P0659N5085Q4972j15166j6770K0331J8749r2465O2952J5415
$$ 2587529 2638101 2708760 2763845 2848817 2733651 2716881 2737212 2755961 2663496 2726448 2741863
4273B741863k2662p4616j960R1984p6657P9534L1546n479K7848j02629o1681N5966
$$ 2741863 2719201 2644585 2642625 2734609 2657952 2737486 2769032 2763553 2791401 2688772 2627091 2683057
4261B683057J12559p8442K3890J30099J8832J18716l8757n8667l5829j1464R6691
$$ 2683057 2795616 2717174 2741064 2871163 2889995 3008711 2969954 2911287 2875458 2863994 2960685
4250B960685K5166K4937P2555J33419m8358N5397O6589m8524j0946L7051J10038
$$ 2960685 2985851 3010788 3083343 3216762 3168404 3223801 3290390 3241866 3230920 3267971 3378009
4239C378009R3679q8810j8694J6531l1047J4862J60296L6991N8453J34151J8178
$$ 3378009 3471688 3382878 3364184 3380715 3349668 3364530 3524826 3561817 3620270 3754421 3772599
4228C772599L3592r09K8072J65022M2820J6724J1863K827J37547L0157O3814J43186
$$ 3772599 3806191 3805282 3833354 3998376 4041196 4057920 4069783 4072610 4210157 4240314 4304128 4447314
4216D447314j29963p6670R8456J7092Q0944K4262L1293j0340r220J0947J7774
$$ 4447314 4317351 4240681 4339137 4356229 4437173 4461435 4492728 4482388 4473168 4484115 4501889
4205D501889O7122K19001J14052n3850L9864R2433J29026J05574O7053N5628O7201
$$ 4501889 4569011 4788012 4902064 4848214 4888078 4980511 5109537 5215111 5282164 5337792 5404993
4194E404993L6558J26481N4717J56577R8686p872P5881J22003M8678K1155Q5172
$$ 5404993 5441551 5568032 5622749 5779326 5878012 5870140 5946021 6068024 6116702 6137857 6223029
4183F223029J01397J46616J99348J26256k749L6208J28958J74465J45559P7121
$$ 6223029 6324426 6471042 6670390 6796646 6793897 6830105 6959063 7133528 7279087 7356208
4173G356208J50630J24586J14622J71667J04095J77501K67118L10368J60265J44902
$$ 7356208 7506838 7631424 7746046 7917713 8021808 8199309 8466427 8776795 8937060 9081962
4163I081962J94631J70908J61100K09921K71597L36625L45783L65244K71171M37028
$$ 9081962 9276593 9447501 9608601 9818522 10090119 10426744 10772527 11137771 11408942 11845970
4153A1845970M42822M52616O14863M81063O10361M78674M45787M21246K27714
$$ 11845970 12288792 12741408 13356271 13837334 14447695 14926369 15372156 15793402 16021116
4144A6021116L81171L14579L15099J94593L61109L37784M11845N54703P01283
$$ 16021116 16402287 16716866 17031965 17226558 17587667 17925451 18337296 18891999 19593282
4135A9593282P35552P90806Q94278P11446O89538O87267M58476M19939M77887
$$ 19593282 20328834 21119640 22013918 22725364 23414902 24102169 24560645 24980584 25458471
4126B5458471N79316O53365N14922O73783P66060M82556M79550O32518O00118
$$ 25458471 26037787 26691152 27206074 27879857 28645917 29128473 29608023 30240541 30840659
4117C0840659N66704O30279N02064N00884L76934M10119O86792O80088R30360
$$ 30840659 31407363 32037642 32539706 33040590 33417524 33827643 34514435 35194523 36124883
4108C6124883J246261J479908J584709J446041J298273Q64211L33539K33025O7041
$$ 36124883 37371144 38851052 40435761 41881802 43180075 44044286 44377825 44610850 44677891
4099D4677891J19618K02914K60488K30983L45718M47871M16853L19955M90255
$$ 44677891 44797509 45000423 45260911 45491894 45837612 46285483 46702336 47022291 47512546
4090D7512546N85000N18140L63409K85795K46616J89695K45955K82812M44374
$$ 47512546 48097546 48615686 48979095 49264890 49511506 49701201 49947156 50229968 50674342
4081E0674342Q42494J301716J546972J730008J899430J733703J391949J028181
$$ 50674342 51516836 52818552 54365524 56095532 57994962 59728665 61120614 62148795
4073F2148795R07900Q88797R36089Q24306P96019O19343N10800M72180N02620
$$ 62148795 63056695 63945492 64881581 65705887 66501906 67121249 67632049 68104229 68606849
4064F8606849M72356K34375K84407K55312L58483L39935J47239K87222M34407
$$ 68606849 69079205 69313580 69597987 69853299 70211782 70551717 70698956 70986178 71420585
4055G1420585N85313P31204R33587P98509M20904J09372l59529o29737p64900
$$ 71420585 72005898 72737102 73670689 74469198 74890102 74999474 74639945 74010208 73245308
4046G3245308o82657n07751j53436K64767L97626L44300M30326K22885J02617
$$ 73245308 72562651 72054900 71901464 72166231 72563857 72908157 73338483 73561368 73663985
4037G3663985j12795k49935m36796l24708j59953l28756m81018o13997q76798
$$ 73663985 73551190 73301255 72864459 72539751 72379798 72051042 71570024 70956027 70079229
4028G0079229j014263q14345q15674p75388j038029j333327j657856k206211k391731
$$ 70079229 69064966 68250621 67434947 66659559 65621530 64288203 62630347 60424136 58032405
4019E8032405j931739j528949j022749n03477k59980j56668k51766l09032m10948
$$ 58032405 56100666 54571717 53548968 53045491 52785511 52628843 52377077 52068045 51657097
4010E1657097n24387n81217n94660o41736o58663q74259r85795r34027p56350
$$ 51657097 51132710 50551493 49956833 49315097 48656434 47782175 46796380 45862353 45106003
4001D5106003m45126k83227n007l5052k96407p59816j259844j482664j522618
$$ 45106003 44660877 44377650 44372643 44337591 44041184 43281368 42021524 40538860 39016242
3992C9016242j366047j233920j162966r90596o87387n84584o26096p53891o72704
$$ 39016242 37650195 36416275 35253309 34262713 33575326 32990742 32364646 31610755 30938051
3983C0938051p53185q79820o58601o63963o22737p02669n54752n25890n68028
$$ 30938051 30184866 29305046 28646445 27982482 27359745 26657076 26102324 25576434 25008406
3974B5008406m14302m76702m65733m26425m89298o20822p16895o93513p75579
$$ 25008406 24594104 24117402 23651669 23225244 22735946 22115124 21398229 20704716 19929137
3965A9929137o71820m30239n95659l83612l29805j98599m02281m54118l94847
$$ 19929137 19257317 18827078 18231419 17847807 17518002 17319403 16917122 16463004 16068157
3956A6068157k48224k20173k10144k35378l33327k41001k00482l05373m21660
$$ 16068157 15819933 15599760 15389616 15154238 14820911 14579910 14379428 14074055 13652395
3947A3652395m41791l62027k78201l95667l22631k09004k33288k64650q9437M3421
$$ 13652395 13210604 12848577 12570376 12174709 11852078 11643074 11409786 11145136 11055699 11099120
3937A1099120P210j20262K1713J29425j6877R1178J64775R5950J04614m4200K40369
$$ 11099120 11106330 10986068 11007781 11137206 11120329 11211507 11376282 11472232 11576846 11532646 11773015
3926A1773015K03725L84547M45439M79424N58112P12498P35046M88412M16877
$$ 11773015 11976740 12361287 12806726 13286150 13844262 14556760 15291806 15780218 16197095
3917A6197095L1457j83154l79859o07734p65428q34737r21859p78849p27522n78028
$$ 16197095 16228552 16045398 15665539 15057805 14292377 13457640 12535781 11756932 11029410 10451382
3907A0451382l60770l38910l77011l64308k48143k30831k05795l14071o8954k6115
$$ 10451382 10090612 9751702 9374691 9010383 8762240 8531409 8325614 8011543 7942589 7916474
3897G916474j49336j59526n4210k24186k01925k24910r9008k49214q4236l8553
$$ 7916474 7767138 7607612 7553402 7329216 7127291 6902381 6803373 6554159 6469923 6431370
3887F431370k07641k1234j06548P9413J37259J8571J3415l9576k69327k47489
$$ 6431370 6223729 6202495 6095947 6175360 6312619 6331190 6344605 6305029 6035702 5788213
3877E788213j95809m9579k33910k23442n7616p2040m696o1668r3646J8879m5828
$$ 5788213 5592404 5542825 5308915 5085473 5027857 4955817 4951121 4889453 4795807 4814686 4768858
3866D768858m3508l7320o5567q3133j38650j13035n2213j67639p3217k2072j35676
$$ 4768858 4725350 4688030 4622463 4539330 4400680 4287645 4235432 4067793 3994576 3972504 3836828
3855C836828m5751L3875k8267j10365L7731P9929j13863k65j11849m1544J2276
$$ 3836828 3791077 3824952 3796685 3686320 3724051 3803980 3690117 3689852 3578003 3536459 3548735
3844C548735M3070J33891N5053J61579k1792J6632m7991J2769J9508r4922P4116
$$ 3548735 3591805 3725696 3780749 3942328 3920536 3937168 3889177 3901946 3921454 3826532 3900648
3833C900648o8357n1477R4850k4429Q0562L8404k0040J17677J10145N0057r2224
$$ 3900648 3832291 3780814 3875664 3851235 3931797 3970201 3950161 4067838 4177983 4228040 4135816
3822D135816j89244j0491l8273l1347Q87j08043L4263K5728N455j84622K4927
$$ 4135816 3946572 3936081 3897808 3866461 3867348 3759305 3793568 3819296 3824751 3640129 3665056
3811C665056J23149n5214K0856r878j16545J0000m6575j01427k8060n9499M6341
$$ 3665056 3788205 3732991 3753847 3743969 3627424 3637424 3590849 3489422 3461362 3401863 3448204
3800C448204q0558l0025r3437k0168k3876p0733q5436m5431j8190M2596J63933
$$ 3448204 3367646 3337621 3244184 3224016 3200140 3129407 3043971 2998540 2980350 3022946 3186879
3789C186879M3870J9253J2152R3010K6261k775J06424R5252Q0943O3514k6671
$$ 3186879 3230749 3250002 3262154 3355164 3381425 3378650 3485074 3580326 3661269 3724783 3698112
3778C698112R5901k2382m7581n932J7415r9439j55459K5857q813l2619N969o3613
$$ 3698112 3794013 3771631 3724050 3718118 3735533 3636094 3480635 3506492 3497679 3465060 3471029 3407416
3766C407416k4540L8268M1481M7322K7544m1619j16375k3934M7165p7818l4960
$$ 3407416 3382876 3421144 3462625 3509947 3537491 3495872 3379497 3355563 3402728 3324910 3289950
3755C289950j41780K1099O3388O6747O0549o6905l0067P2732J50924q2087q9736
$$ 3289950 3148170 3169269 3232657 3299404 3359953 3293048 3262981 3335713 3486637 3404550 3314814
3744C314814j08022J6293l3797p6412n0208L8459r3620m7636P2992n251Q608j6170
$$ 3314814 3206792 3223085 3189288 3112876 3062668 3101127 3007507 2959871 3032863 3027612 3036220 3020050
3732C020050l549M1413Q5971J54433J31924k495J0455k8684k3820l9596l4067
$$ 3020050 3016501 3057914 3143885 3298318 3430242 3427747 3438202 3409518 3385698 3346102 3312035
3721C312035o0471k49109k81268o6347m3752n5394N0874q0650L1095M6606k6473
$$ 3312035 3251564 3002455 2721187 2654840 2611088 2555694 2606568 2525918 2557013 2603619 2577146
3710B577146P6372L1531j3194p2007L7591K2679k7564J0162J4260R4811k9509
$$ 2577146 2653518 2685049 2671855 2599848 2637439 2660118 2632554 2642716 2656976 2751787 2722278
3699B722278l6516j07520L7450l426m6516K9367o1443J3651q636Q067p7843p3167
$$ 2722278 2685762 2578242 2615692 2612266 2565750 2595117 2533674 2547325 2538689 2546756 2468913 2395746
3687B395746n1910M252J2558m494O4820k9847j00388l1O4894m5580R5805m9728
$$ 2395746 2343836 2348088 2360646 2356152 2420972 2391125 2290737 2290706 2355600 2310020 2405825 2356097
3675B356097k0026J09532J52556J37653j01336j27772m2888k4720k6283o8514
$$ 2356097 2336071 2445603 2598159 2735812 2634476 2506704 2463816 2439096 2412813 2344299
3665B344299r9171p5924o4308n1264o8441n5487L5449R5068J2088M285P322L6437
$$ 2344299 2245128 2169204 2104896 2053632 1985191 1929704 1965153 2060221 2072309 2076594 2083916 2120353
3653B120353J0507Q5275J03440l7374j8445L6526J15027n9396p6801j06517o2119
$$ 2120353 2130860 2216135 2319575 2282201 2263756 2300282 2415309 2355913 2279112 2172595 2110476
3642B110476J60189J95560r7501l6749m7902R889Q0081j17099M4952r2638j0053
$$ 2110476 2270665 2466225 2368724 2331975 2284073 2293962 2374043 2256944 2301896 2209258 2199205
3631B199205o3366J1492o8942Q0005M935p9613l4567m1461Q1821J8507j823L2198
$$ 2199205 2135839 2147331 2078389 2158394 2163329 2083716 2049149 2007688 2089509 2108016 2106193 2138391
3619B138391J380K6081R6570j4929N0268m3004j17676L2567L5167K1206o5393
$$ 2138391 2139771 2165852 2262422 2247493 2297761 2254757 2137081 2169648 2204815 2226021 2160628
3608B160628k8112N2831r1017k4938N4996L2418L2550M0525j9064j15662M0297
$$ 2160628 2132516 2185347 2094330 2069392 2124388 2156806 2189356 2229881 2210817 2095155 2135452
3597B135452J06105O3311J02475L1655Q548m2587j565j7875L7305L2871j08169
$$ 2135452 2241557 2304868 2407343 2438998 2447546 2404959 2403394 2385519 2422824 2455695 2347526
3586B347526k3453Q0428l378J8131O1793N319L5524P3129Q1251l1613l482p9007
$$ 2347526 2324073 2404501 2401123 2419254 2481047 2486366 2521890 2595019 2676270 2644657 2641175 2562168
3574B562168N8804Q4167m3653J15939N7302J54311j7037L0180J21447Q8261P0740
$$ 2562168 2620972 2705139 2661486 2777425 2834727 2989038 2972001 3002181 3123628 3211889 3282629
3563C282629J32529K84361L6155j7502P3194l4155R667N4939J2043j85414n6776
$$ 3282629 3415158 3699519 3735674 3718172 3791366 3757211 3766878 3821817 3833860 3648446 3591670
3552C591670R7060n7121J37128L184n2346K4276J06615Q2713J17319J48089O1000
$$ 3591670 3688730 3631609 3768737 3771921 3719575 3743851 3850466 3933179 4050498 4198587 4259587
3541D259587R0128J39542J63877K23835K06216O4418M2185Q6814p5865j0097p548
$$ 4259587 4349715 4489257 4653134 4876969 5083185 5147603 5189788 5276602 5200737 5190640 5183092
3530E183092L5756n5442n8036n1414N808K648J76709J79571O1461m9311O1099
$$ 5183092 5218848 5163406 5105370 5053956 5059764 5062412 5239121 5418692 5480153 5430842 5491941
3519E491941J46964O9926J66480R9406J58114J17743J02423J48611K60231K34560
$$ 5491941 5638905 5708831 5875311 5974717 6132831 6250574 6352997 6501608 6761839 6996399
3509F996399K15352J04876J50271L25701J44019K44431L38193L26168K35560K36870
$$ 6996399 7211751 7316627 7466898 7792599 7936618 8181049 8519242 8845410 9080970 9317840
3499I317840L32954L03711M10981N04763M75804J58466L45873L57984M88449L65053
$$ 9317840 9650794 9954505 10365486 10870249 11346053 11504519 11850392 12208376 12696825 13061878
3489A3061878L55937L75567M72233M02452J50786J63411j05005k47751l71817
$$ 13061878 13417815 13793382 14265615 14668067 14818853 14982264 14877259 14629508 14257691
3480A4257691l82182k84090m63914m80147l03261p8028J0695J65325K22122j48570
$$ 14257691 13875509 13591419 13127505 12647358 12344097 12266069 12276764 12442089 12664211 12515641
3470A2515641m77088m24551p17224o27696n88820m49853l65710k76471m84838
$$ 12515641 12038553 11614002 10896778 10269082 9680262 9230409 8864699 8588228 8103390
3461H103390m00403j77854j07847j69017k23842j7211p0647k799o0966l4658k0570
$$ 8103390 7702987 7525133 7417286 7248269 7024427 7007216 6936569 6933770 6872804 6838146 6817576
3450F817576J1231Q5216J52521K59048K32157J70197K82731N04780O97821P63345
$$ 6817576 6828807 6914023 7066544 7325592 7557749 7727946 8010677 8515457 9213278 9976623
3440I976623R65489M83642k17179o94727r53942q36074p91457p04852n34473n56275
$$ 9976623 10942112 11425754 11208575 10513848 9559906 8723832 7932375 7227523 6693050 6136775
3430F136775l95677l36290k48715j60912j81656j77818l7402j57165K292Q604
$$ 6136775 5741098 5404808 5156093 4995181 4813525 4635707 4598305 4441140 4443432 4452036
3420D452036k9814K7579J41405R3260p4241K3961j8563K5138Q0048M2603J22078
$$ 4452036 4422222 4449801 4591206 4684466 4610225 4634186 4615623 4640761 4720809 4763412 4885490
3409D885490L25892M08079K18903o1613k74540l12234m20505m04170l84233l75714
$$ 4885490 5211382 5619461 5838364 5776751 5502211 5189977 4769472 4365302 3981069 3605355
3399C605355j76090k32407j77096j16335j35943m3160o1467n9612j43191o1699
$$ 3605355 3429265 3196858 3019762 2903427 2767484 2724324 2662857 2603245 2460054 2398355
3389B398355r2789n3535k3331Q806R464N1026o8273j38019n8512J7451q0408r211
$$ 2398355 2305566 2252031 2228700 2237506 2246970 2297996 2229723 2091704 2033192 2050643 1970235 1961024
3377A961024M4409k7838k0641p8018l1522n0531R1736O119p42o4345n0625J2843
$$ 1961024 2005433 1977595 1956954 1878936 1847414 1796883 1888619 1894738 1893996 1829651 1779026 1791869
3365A791869q5439p9877K5556j2001l6956o8765k314P2004j05665n1915N093N2636
$$ 1791869 1706430 1626553 1652109 1640108 1603152 1534387 1532073 1604077 1498412 1446497 1451590 1504226
3353A504226j5013j8044O4812m8720p7379M0094m236p1800K9658k6012q7252K2618
$$ 1504226 1489213 1471169 1535981 1487261 1409882 1449976 1445740 1373940 1403598 1377586 1290334 1312952
3341A312952K8797M5877m5254n2573j0095O44K7325M0330q5594L943R0477J1403
$$ 1312952 1341749 1387626 1342372 1289799 1279704 1280348 1307673 1348003 1262409 1266352 1356829 1368232
3329A368232o3701j06341m9878L4073k5845M9986J6436j08573J825N252J18821
$$ 1368232 1304531 1198190 1148312 1182385 1156540 1206526 1222962 1114389 1116214 1121466 1240287
3318A240287P8161k9443j81997k1648K4495M5320J48516n5231r5231m678r9220
$$ 1240287 1318448 1289005 1107008 1085360 1109855 1155175 1303691 1248460 1153229 1148551 1049331
3307A049331q433N4584J6719m5855K2715j4974n367k3020l1961J220K6523j04594
$$ 1049331 1040898 1095482 1112201 1066346 1089061 1074087 1068720 1045700 1013739 1014959 1041482 936888
3295I36888L4303N046M2299N0580p6825m9320R6799M4595L665M6682r8379o3914
$$ 936888 971191 976237 1018536 1069116 992291 942971 1039770 1084365 1088030 1134712 1036333 972419
3283I72419n5603M0957p0251n6657J53524k2381k3728O9259j3172j54604L6758
$$ 972419 916816 957773 887522 830865 984389 962008 938280 1007539 994367 839763 876521
3272H76521M3466M5457M825m0311k2476m2533n41P909O7180L8146j0822P4339
$$ 876521 919987 965444 970269 929958 907482 864949 864408 872317 939497 977643 966821 1041160
3260A041160o4528K7469L9146m5404J17j48459O2435L6232N99L5378Q6293j31505
$$ 1041160 976632 1004101 1043247 997843 997960 849501 911936 948168 948767 984145 1070438 938933
3248I38933L861J06001M4956k0260o257M0308Q293j3175K1379O0107P1410M8033
$$ 938933 942794 1048795 1093751 1073491 1067234 1107542 1115835 1102660 1124039 1184146 1255556 1303589
3236A303589m3829r5818J0925J51069n9128n994P9088K5600Q1803l8839K4451
$$ 1303589 1259760 1163942 1174867 1325936 1266808 1260814 1339902 1365502 1447305 1408466 1432917
3225A432917N635n2238L364M8717J33977r3558R6230K7154r0551N6157J10076
$$ 1432917 1438552 1386314 1389678 1438395 1572372 1478814 1575044 1602198 1511647 1567804 1677880
3214A677880L5524o6488N2814P5279l7345j95528J6018M2320K3868J53659M1704
$$ 1677880 1713404 1646916 1699730 1775009 1737664 1542136 1558154 1600474 1624342 1778001 1819705
3203A819705j44544M0695M2527L4161Q4045J86097J90775N9942r30k8742J8956
$$ 1819705 1675161 1715856 1758383 1792544 1876589 2062686 2253461 2313403 2312473 2283731 2302687
3192B302687N7597M9265Q9490N7208R7727L3340R5905r978n3696j8743k6729M3203
$$ 2302687 2360284 2409549 2499039 2556247 2653974 2687314 2783219 2773241 2719545 2700802 2674073 2717276
3180B717276r3160n0626J40491J33779l1588J9667P3422K3332J42294J6010k291
$$ 2717276 2624116 2573490 2713981 2847760 2816172 2835839 2909261 2932593 3074887 3090897 3088606
3169C088606k0715N7847R8640K5492N5382J9291L0361J584O968P4227L0035J9042
$$ 3088606 3067891 3125738 3224378 3249870 3305252 3324543 3354904 3356488 3363456 3437683 3467718 3486760
3157C486760O3059j2679R8122J85338Q3919P6176J18226J37165K32876K72260
$$ 3486760 3549819 3537140 3635262 3820600 3904519 3980695 4098921 4236086 4468962 4741222
3147D741222J60222J24561P9697q361p3021j59819j96494k48456k05436r5369
$$ 4741222 4901444 5026005 5105702 5097341 5024320 4864501 4668007 4419551 4214115 4118746
3137D118746r2362k15186j10345j55809K4389J65261O3247k03423p2269J80163
$$ 4118746 4026384 3811198 3700853 3545044 3569433 3734694 3797941 3594518 3522249 3702412
3127C702412R8024k7801M5005K15480J6606J05208Q8504M7846M7964L6431K8524
$$ 3702412 3800436 3772635 3817640 4033120 4049726 4154934 4243438 4291284 4339248 4375679 4404203
3116D404203J7226L4917j32342j71952k37853j42389q3709q4482o3217j69344
$$ 4404203 4421429 4456346 4324004 4152052 3914199 3771810 3688101 3603619 3540402 3371058
3106C371058j99457l5073j47610j38650r566r7819o7340J46549O6023l4928k5007
$$ 3371058 3171601 3136528 2988918 2850268 2840702 2742883 2675543 2822092 2888115 2853187 2828180
3095B828180k4754n0607O2078p7177l0500o9503q9232l6452k16392j45753r270
$$ 2828180 2803426 2752819 2814897 2737720 2707220 2637717 2548485 2512033 2295641 2149888 2140618
3084B140618k3785j59973m6291o0741j18746q7835j01325j554K428p0225j01427
$$ 2140618 2116833 1956860 1910569 1849828 1731082 1643247 1541922 1540368 1542796 1472571 1371144
3073A371144k0376m8060l3026K0405J716j63516n8984Q5624l2564p8871j1582
$$ 1371144 1350768 1302708 1269682 1290087 1291803 1128287 1069303 1154927 1122363 1043492 1031910
3062A031910p2232o4826P0504q4725N8913l6343l4584n4993j6131j725j409q245
$$ 1031910 959678 894852 965356 880631 939544 903201 868617 813624 797493 795768 794359 786114
3050G86114j59101m5523J9612O5340j18743l4187O4773l8417J9826k9282K9910
$$ 786114 627013 581490 601102 666442 547699 513512 578285 539868 559694 530412 560322
3039E60322J8138k4870n1989r5090l41Q7938m0206L5730N4768p3001j25052p7248
$$ 560322 578460 553590 501601 406511 406170 494108 453902 489632 544400 471399 346347 269099
3027B69099P9811L0890J2478n811N2769j2949p2202o940k9056R0216m5247K724
$$ 269099 348910 379800 392278 386467 439236 426287 354085 347145 318089 408305 363058 365782
3015C65782J1810r1965R566L0302K8722o2962l0629J9490j7557l2030m8496L7070
$$ 365782 377592 285627 295193 325495 354217 291255 260626 280116 262559 230529 182033 219103
3003B19103n166K4212q721J7146M029l1202L668R7476l1471j23162J114R6616
$$ 219103 213937 238149 229428 246574 250603 219401 223069 320545 289074 165912 167026 263642
2991B63642m2193k2424J1982J5535Q1460p0472o821o0852o1840j1492J11014m890
$$ 263642 221449 199025 211007 226542 308002 237530 230709 169857 108017 96525 207539 202649
2979B02649K9042l3034j5956P15O4421J02513o7556j53983n2249L4333L2859J02851
$$ 202649 231691 198657 182701 183416 247837 350350 282794 128811 76562 110895 143754 246605
2967B46605l7468r9737N3919J1481K1063m5276k6335N9069q4336l417N0029R97
$$ 246605 209137 109400 163319 174800 195863 150587 124252 183321 98985 95568 145597 146594
2955A46594m2282K6183m189j611k8225m5490n8189L9609M1453J4249o1969n0581
$$ 146594 104312 130495 126306 124695 96470 50980 -7209 32400 73853 88102 26133 -24448
2943b4448J8364L6034O8165j929o9593J5162Q4475K7089j02686N2365M5199J1828
$$ -24448 -6084 29950 98115 96186 26593 41755 126230 153319 50633 102998 148197 160025
2931A60025M299n8774L92l1242M1695J0506n1995L2184j04967R9946J4127q8409
$$ 160025 164324 105550 105942 74700 116395 126901 74906 107090 2123 102069 116196 27787
2919B7787k867o1473M78N4883M5444J9416j3220l429K7329k5117j8927J2861k8394
$$ 27787 24920 -36553 -36075 18808 64252 83668 70448 67019 94348 69231 50304 63165 34771
2906C4771o1445L9250R796M8143r521O537o7832M2658l8003J5018p0395j090N0802
$$ 34771 -26674 12576 22372 70515 60994 67531 -301 42357 4354 19372 -51023 -52113 -1311
2893a311m6966K8348N5216j5064M1978l4146j08166j435J0271M3968M3016J7657
$$ -1311 -48277 -19929 35287 20223 62201 28055 -80111 -81546 -71275 -27307 15709 33366
2881C3366k9738N2841k3141N5389l477L219m0314j08843M0207J5845l2790q414
$$ 33366 3628 56469 33328 88717 85240 88459 48145 -60698 -20491 -4646 -37436 -45850
2869d5850M2858R023K2787K6284m3936M6052l5181j9480J17088k17305k058N9461
$$ -45850 -2992 6031 28818 55102 11166 57218 22037 2557 119645 -97660 -99718 -40257
2857d0257j9115J0474K8993m7p8481N6292N8213q614O5888J1661p044l8953J9458
$$ -40257 -59372 -48898 -19905 -19952 -98433 -42141 16072 7458 73346 85007 77963 39010 58468
2844E8468J1471o0008O8554q8240l7236L1255N0082k6163m0116M9642n5003k9301
$$ 58468 69939 9931 78485 -9755 -46991 -15736 34346 8183 -31933 17709 -37294 -66595
2832f6595N9516K4950q529o6380P6090m694k2057K4870n0311O1792Q2364K9916
$$ -66595 -7079 17871 9342 -57038 19052 14358 -7699 17171 -33140 28652 111016 140932
2820A40932m3365l9960j2063M248o9363P2726r1345j2521J30133j30976l8666
$$ 140932 97567 57607 45544 49792 -19571 53155 -38190 -50711 79422 -51554 -90220
2809i0220P549j988J1608P5556l4222j630J77338m7625j09358M2871O6477n6675
$$ -90220 -82671 -84659 -73051 2505 -31717 -33347 143991 96366 -12992 29879 96356 39681
2797C9681j22290M8403R138m7697M5600n719j8718J10837L6670q1686k6130J2816
$$ 39681 -82609 -34206 -25068 -72765 -27165 -32884 -51602 59235 95905 14219 -11911 905
2785I05N1451J5610J0488j18760j03615P0491J04172j5925k3153Q825j57715P1783
$$ 905 52356 67966 78454 -40306 -143921 -73430 30742 14817 -8336 489 -157226 -85443
2773h5443j1751J8418K0263Q7491j5395K9955M8276r7944K0396K4209o9316L7015
$$ -85443 -97194 -78776 -58513 28978 13583 43538 91814 -6130 14266 38475 -30841 6174
2761F174n374o0689J31304o1740j10774K9378K6866N8796K6875l9388j28123L1681
$$ 6174 800 -59889 71415 9675 -101099 -71721 -44855 13941 40816 1428 -126695 -95014
2749i5014J04987l9205l4343o968N3493o1877j3574Q3494m1965m2884L0662M5599
$$ -95014 9973 -29232 -63575 -70543 -17050 -78927 -92501 -9007 -50972 -93856 -63194 -17595
2737a7595j28961K5277J40597n2254j43722Q832J82219P2408L1832q8758l8246
$$ -17595 -146556 -121279 19318 -32936 -176658 -167826 14393 86801 118633 29875 -8371
2726h371M4636O6116j3360r8874n0586M0545R1980o5606m4637l1995N6701Q4536
$$ -8371 36265 102381 89021 -9853 -60439 -19894 72086 6480 -38157 -70152 -13451 71085
2714G1085j1458l2926L2464J1857o0057N6780r4652l3501R078o6821O4187P3025
$$ 71085 59627 26701 59165 71022 10965 67745 -26907 -60408 -51330 -118151 -53964 19061
2702A9061P4497K7414k37059o6497J50077O0376n828J7638l0859O0951q6343O2935
$$ 19061 93558 120972 -116087 -182584 -32507 27869 22041 39679 8820 69771 -16572 46363
2690D6363R178j76282N9338N8016K0761R0k0044M8536M6699J7530M0315l0801
$$ 46363 55541 -120741 -61403 -3387 17374 17464 -2580 45956 92655 110185 150500 119699
2678A19699p4257l2902p0349P733M7774j10318l830J37008o5018L3370o030k9311
$$ 119699 45442 12540 -57809 -50076 -2302 -112620 -116450 20558 -44460 -11090 -17120 -46431
2666d6431K891J7229k88q031N7115r3929j734j88o2781O2253N0202k628L3792
$$ -46431 -43540 -26311 -26599 -34630 22485 -71444 -73178 -73366 -136147 -73894 -23692 -26320 7472
2653G472O2630j0791k2903N7866n0585p1662Q354M6215j3621j4525M1642N423
$$ 7472 70102 59311 36408 94274 43689 -27973 -19619 26596 12975 -1550 40092 45515
2641D5515K4994j4111k7749J8473q2874l2993M0105J05008N7516n8311q0425P9026
$$ 45515 70509 56398 28649 47122 -35752 -68745 -28640 76368 133884 75573 -4852 74174
2629G4174Q7376o9099o3466j2577J07569n4351o9632J05920O0944P6228o2306
$$ 74174 161550 92451 28985 16408 123977 69626 -6 105914 166858 243086 180780
2618A80780N049J08621J9348P1234O8613K8329j6328r4313k5038p0386l7457L091
$$ 180780 185829 294450 313798 385032 453645 481974 465646 371333 346295 275909 238452 241543
2606B41543l2230j17890Q4661P238r5500Q122j4919l2297Q5825P238J1717Q0446
$$ 241543 209313 91423 176084 183322 87822 95944 81025 48728 134553 141791 153508 233954
2594B33954p3591p5556J1531J846k2102K0748L0474r2824M1872J8737o7230L4561
$$ 233954 160363 84807 96338 98184 76082 96830 127304 34480 76352 95089 27859 62420
2582F2420l2831l0053J04786L2009l5966j7220j4106K7582q3002n2686J8345K4827
$$ 62420 29589 -464 104322 136331 100365 83145 69039 96621 13619 -39067 -20722 4105
2570D105l0584M8169J7254r2917k1565J324J1880Q1348O2968l0921N841L4165
$$ 4105 -26479 21690 38944 -53973 -75538 -74214 -62334 19014 81982 51061 56902 91067
2558I1067q1585L5837j55451l8092J57399L9635k5338L6980n5788N8652N198J6595
$$ 91067 9482 45319 -110132 -148224 9175 48810 23472 60452 4664 63316 68514 85109
2546H5109l463M7437l0638j3252k350K9511O379k1586p2251j9503k3274P969J14645
$$ 85109 81646 129083 98445 85193 82843 112354 118733 97147 24896 5393 -17881 -9912 104733
2533A04733k0337O2816j41272J53163k0653n4465L7925K4317M7270m8224r8770
$$ 104733 84396 147212 5940 159103 138450 83985 121910 146227 193497 145273 46503
2522D6503L2517j9052L9193o747o3266J3750N3116K1984m3022P4768L8769M1476
$$ 46503 79020 59968 99161 92414 29148 42898 96014 117998 74976 149744 188513 229989
2510B29989j33100p727K9198O174O3453l6856O3642L0993J7678n8872p7892K3242
$$ 229989 96889 89162 118360 124534 187987 151131 214773 245766 263444 204572 126680 149922
2498A49922K21l2710k6034J31151o591N3094o340n3505J2990M5452R9579k0292
$$ 149922 150143 117433 91399 222550 215959 269053 262713 209208 222198 267650 367229 346937
2486C46937j01114K1328P5511N5075n0669q9964j7833N4411m5242K2895l754n1469
$$ 346937 245823 267151 342662 397737 347068 257104 239271 293682 248440 271335 267581 216112
2474B16112J23109n503k4050M8271k1249k2411Q5264j67576J1798N2336k303O9847
$$ 216112 339221 333718 309668 357939 336690 314279 399543 231967 243765 296101 293798 363645
2462C63645J01595r8936J167L9154N5727O6687R326q3851R5824J03586p32L915
$$ 363645 465240 366304 367471 406625 462352 529039 538365 454514 550338 653924 653192 657107
2450F57107m1776m3280P7956L6113r2621m79l0427l7633J11319J57582N056N4528
$$ 657107 615331 572051 650007 686120 593499 593020 562593 524960 636279 793861 798917 853445
2438H53445p8108L8134J6544o1431M1625O3719R0811J42232l3344m3050K3627
$$ 853445 775337 813471 830015 768584 810209 873928 964739 1106971 1073627 1030577 1054204
2427A054204R2782O8812n5098m5286N3289L4909K7742n2412R3168J0463N0395
$$ 1054204 1146986 1215798 1160700 1115414 1168703 1203612 1231354 1178942 1272110 1282573 1332968
2416A332968Q0944o7592M2882j6028O6342J59263N4194O4875Q4552O0842N2943
$$ 1332968 1413912 1346320 1389202 1373174 1439516 1598779 1652973 1717848 1802400 1863242 1916185
2405A916185R8427P550o401n5310m5931J52247J03814o381J04052K7207N1358
$$ 1916185 2014612 2022162 2015761 1960451 1914520 2066767 2170581 2164200 2268252 2295459 2346817
2394B346817J9747O0072J62413J18504J04357J35182M2209L0792K49147R2648
$$ 2346817 2366564 2426636 2589049 2707553 2811910 2947092 2989301 3020093 3269240 3361888
2384C361888J11815J09655J77067J39686O9073J88270J00147K69934K74684L56883
$$ 3361888 3473703 3583358 3760425 3900111 3969184 4157454 4257601 4527535 4802219 5159102
2374E159102K09430Q8211K40282J28051K57122K43875K95062K43629K84218M89420
$$ 5159102 5368532 5456743 5697025 5825076 6082198 6326073 6621135 6864764 7148982 7638402
2364G638402M01279M69906O31300R14011Q41532L62138N06161P71836J145342
$$ 7638402 8039681 8509587 9140887 10054898 10896430 11258568 11764729 12536565 13681907
2355A3681907J196266J607197K242860K901361L653979N062430O707249Q762144
$$ 13681907 14878173 16485370 18728230 21629591 25283570 30346000 37053249 45815393
2347D5815393J2135450J5702024O878678q893662j3675707j2496760r819515p133509
$$ 45815393 57950843 73652867 80531545 71637883 57962176 45465416 35645901 28512392
2339B8512392n003589l620531k682195k116541j645788j250577q02413n51145
$$ 28512392 23508803 19888272 17206077 15089536 13443748 12193171 11390758 10839613
2331A0839613l15783n17454o89985o96255q80742o33736n18015m55071n14516
$$ 10839613 10523830 10006376 9316391 8620136 7739394 7105658 6587643 6132572 5618056
2322E618056k55675k57574k07308k46552k73937k96080j86337k35504j39467j37774
$$ 5618056 5362381 5104807 4897499 4650947 4377010 4080930 3894593 3659089 3519622 3381848
2312C381848j07601j57459j77123q2170j07030j54440o7405j60998j05072q1796
$$ 3381848 3274247 3116788 2939665 2857495 2750465 2596025 2528620 2367622 2262550 2180754
2302B180754j78752j42086j11609p3689k7127M9987j00344r299o3408o1707m7376
$$ 2180754 2002002 1859916 1748307 1674618 1647491 1697478 1597134 1587835 1524427 1462720 1415344
2291A415344j07541k4158J35785j5001q8616j23319o6623r7501n1973r879j01252
$$ 1415344 1307803 1283645 1419430 1404429 1315813 1192494 1125871 1028370 976397 966518 865266
2280H65266m774O1380l4464l8335k9494j1891l6546O6609p431l337j6697q4583
$$ 865266 860492 921872 887408 849073 819579 807688 771142 837751 830320 826983 810286 725703
2268G25703j50030j7595l9865j55503P3212Q9186q891m0590j9397O643K8145L4138
$$ 725703 575673 558078 518213 362710 435922 525108 516217 475627 456230 462873 491018 525156
2256E25156L1125j50368P7290r5379r2p739K1695N6988Q615j35016J7483N1597
$$ 525156 556281 405913 483203 387824 387732 379993 401688 458676 467291 332275 349758 401355
2244D01355k3488P339m2011J11379j47432j09639P5223R96k3449M0883o708m2114
$$ 401355 377867 385206 343195 454574 307142 197503 272726 273722 250273 291156 284448 242334
2232B42334q7814n3291K38626m4861n0213J0845q4188K8547K3159J4420k2190
$$ 242334 154520 101229 339855 294994 244781 255626 171438 199985 223144 237564 215374
2221B15374J1276Q758N7274l0428K5344j24281M7974N1148K6605j5282K2278j4319
$$ 215374 226650 235408 292682 262254 287598 163317 211291 262439 289044 273762 296040 281721
2209B81721j6470j19923Q6490Q2140p0173r6661o8164P5042k645j991o4984P4668
$$ 281721 265251 145328 231818 313958 243785 147124 78960 154002 151357 149366 84382 159050
2197A59050O4450j24272n1856K7978j6417J1028J1421o1682R3631Q3336j0784
$$ 159050 223500 99228 47372 75350 58933 69961 81382 19700 113331 196667 185883
2186A85883j66833J1490J27409p420k3491O106j9473M7409N3242k3558m8513L2112
$$ 185883 19050 30540 157949 150529 127038 133144 113671 161080 214322 190764 142251 174363
2174A74363q9114l7863N1860J7966J06005p4559j24340K1610J19708l3823m8977
$$ 174363 85249 47386 99246 117212 223217 148658 24318 45928 165636 131813 82836
2163H2836j18765J36291n7784O5511j6979j3370k8167M1854L0664K5827N676j18925
$$ 82836 -35929 100362 42578 108089 91110 77740 49573 91427 122091 147918 153594 34669
2151C4669O458J0462K9666l3618n8458J9760O8423l4617l3319P7227K6257p5867
$$ 34669 41127 51589 81255 47637 -10821 8939 77362 42745 9426 86653 112910 37043
2139C7043j47226J4749N0567O8615J6965n6530k817M7727R5264N4575k5783J8753
$$ 37043 -110183 -95434 -44867 23748 40713 -15817 -18634 29093 124357 178932 153149 171902
2127A71902K9036O799q9221J5142N4250j63385N0103o3060j0248J07481Q1598
$$ 171902 200938 207737 118516 133658 187908 24523 74626 11566 1318 108799 190397
2116A90397l7994j02018j03939k5795K2842Q1853m6320Q9554K1900n3878o9476
$$ 190397 152403 50385 -53554 -79349 -56507 25346 -20974 68580 90480 36602 -32874
2105c2874O4674J3873n8647P7703l6766N3713n0095N974N1049o2875J7037m8152
$$ -32874 31800 45673 -12974 64729 27963 81676 31581 37555 88604 25729 42766 -5386
2093e386L4174N5373J1124L6625m8626K5832Q601R6806J2902o2016M1686p3123
$$ -5386 28788 84161 95285 131910 83284 109116 117717 214523 227425 165409 207095 133972
2081A33972o0863M8814K0304K9115J10186j1999k3042J30973r0249j22876J4221
$$ 133972 73109 121923 142227 171342 281528 269529 246487 377460 287211 164335 178556
2070A78556k863j43407p392N4555r33J599j83155j0646l3488J1899M460R227P851
$$ 178556 175693 32286 24894 79449 78516 80115 -103040 -113686 -147174 -135275 -130815 -121588 -113737
2057a13737N2430k3806J6770J21479j7484j66633N2585Q4432l9446L0047k6832
$$ -113737 -61307 -85113 -68343 53136 35652 -130981 -78396 6036 -33410 -3363 -30195
2046c0195l590j2302j8789O0334O9969J5927k2539M5272j759j34479n1632m3276
$$ -30195 -33785 -46087 -64876 -4542 65427 81354 58815 104087 102328 -32151 -83783 -127059
2034a27059M2755R5721M1357j3264j8214Q4386k4619p2160k9820l7983K7680N671
$$ -127059 -84304 11417 52774 39510 21296 105682 81063 8903 -20917 -58900 -31220 -25549
2022b5549M1269n7731J27743q0305j26104N4355K01683n5155m1231Q7462j8385
$$ -25549 15720 -42011 85732 5427 -120677 -66322 135361 80206 38975 126437 108052
2011A08052j4002p2797n6785K5911J651j3903Q1453M7287p1088j7118O557J1397
$$ 108052 94050 21253 -35532 -9621 -7970 -21873 59580 106867 35779 18661 25218 36615
1999C6615k7709J7211P385j4149n2883l2721N8487k7969n9239O3471n6172J7051
$$ 36615 8906 26117 33502 19353 -33530 -66251 -7764 -35733 -94972 -31501 -87673 -70622
1987g0622K7106P998m010m9139M6710j6242n054m940O9961l7095n0843P9596J0167
$$ -70622 -43516 -35518 -39528 -88667 -41957 -58199 -63253 -68193 1768 -35327 -86170 -6574 3593
1974C593l1956K1923N0328m0729p6793M5918M74J9271o8867M5511J27446j2798
$$ 3593 -28363 -6440 43888 3159 -73634 -27716 -27242 -7971 -76838 -31327 96119 83321
1962H3321o5971P7673p8505r1666Q1784l1660K7551n564q970k8886O2127o155
$$ 83321 17350 95023 16518 -75148 6636 -25024 2527 -3037 -12007 -40893 21234 15079
1950A5079q0348M4999l3762J16615l4574k758r6172J9275m6838L1336P3970o3950
$$ 15079 -65269 -20270 -54032 62583 28009 25251 -70921 -51646 -98484 -67148 6822 -57128
1938e7128L3740N9818L2295n9168k276N9072K5184p0790q4546Q2662j09355L1448
$$ -57128 -23388 36430 68725 9557 7281 66353 91537 20747 -63799 18863 -90492 -59044
$$ [...]
##END NTUPLES=NMR SPECTRUM
##END=
