##TITLE=1H_EC-3305(III-2)
 CDCl3
 8 sc, 
 20.12.2023
##JCAMPDX= 6.0         $$ Bruker NMR JCAMP-DX V2.0
##DATA TYPE= NMR SPECTRUM
##DATA CLASS= NTUPLES
##ORIGIN= UXNMR, Bruker Analytische Messtechnik GmbH
##OWNER= root
$$ XWIN-NMR		Version 3.5
$$ Wed Dec 20 14:07:43 2023 Russian Standard Time (UT+4h)  she@DPX200
##.OBSERVE FREQUENCY= 200.1313
##.OBSERVE NUCLEUS= ^1H
##.ACQUISITION MODE= SIMULTANEOUS
##.ACQUISITION SCHEME= undefined
##.AVERAGES= 8
##.DIGITISER RES= 18
##SPECTROMETER/DATA SYSTEM= spect
##.PULSE SEQUENCE= zg30
##.SOLVENT NAME= CDCl3
##.SHIFT REFERENCE= (INTERNAL, CDCl3, 0, 15.4417)
##AUDIT TRAIL= $$ (NUMBER, WHEN, WHO, WHERE, WHAT)
$$ ##TITLE= Audit trail, XWIN-NMR		Version 3.5
$$ ##JCAMPDX= 5.01
$$ ##ORIGIN= Bruker BioSpin GmbH
$$ ##OWNER= she
$$ F:/spectra/data/she/nmr/H-F/1/pdata/1/auditp.txt
$$ ##AUDIT TRAIL=  $$ (NUMBER, WHEN, WHO, WHERE, WHAT)
(   1,<2023-12-20 14:06:32.67 +0400>,<she>,<DPX200>,
      <created by zg, POWCHK disabled, PULCHK disabled
       configuration hash MD5:
       00 E9 B6 7A A2 85 ED C7 34 08 36 98 17 FE 4E 26
       data hash MD5: 16K
       13 6E 62 F0 43 D5 B9 15 2B 9C A7 4F 6E E7 BD 2A>)
(   2,<2023-12-20 14:06:37.93 +0400>,<she>,<DPX200>,
      <Start of raw data processing
       efp BC_mod = 2 LB = 0.24 FT_mod = 6 PKNL = 1 PHC0 = -24594.04 PHC1 = 12.25272 SI = 16K 
       data hash MD5: 16K
       AC D9 47 5D EF 2F 7C 2A 86 74 3E C9 9D 34 15 BA>)
(   3,<2023-12-20 14:06:54.00 +0400>,<she>,<DPX200>,
      <pk PHC0 = 0.03828299 PHC1 = 4.470348e-08 
       data hash MD5: 16K
       46 E7 9C C6 27 DB 14 E5 A5 51 3F 8C DA 50 DE B0>)
(   4,<2023-12-20 14:06:57.28 +0400>,<she>,<DPX200>,
      <abs ABSG = 5 
       data hash MD5: 16K
       16 0D 89 ED 7B 42 BC 8C 6F DA E6 D2 84 40 C4 C3>)
$$ ##END=
$$ 
$$ hash MD5
$$ 6C 9C 9D A3 7F 3E BD 5A 76 8D B4 58 D2 80 96 7A
##$RELAX= 
##$RELAX= 
##$RELAX= 
##$RELAX= 
##$RELAX= 
##$RELAX= 
$$ Bruker specific parameters
$$ --------------------------
##$DU= <F:/spectra>
##$EXPNO= 1
##$NAME= <H-F>
##$PROCNO= 1
##$TYPE= <nmr>
##$USER= <she>
##$AMP= (0..31)
100 100 100 100 100 100 100 100 100 100 100 100 100 100 100 100 100 100 
100 100 100 100 100 100 100 100 100 100 100 100 100 100 
##$AQSEQ= 0
##$AQ_mod= 1
##$AUNM= <au_zg>
##$AUTOPOS= <>
##$BF1= 200.13
##$BF2= 200.13
##$BF3= 200.13
##$BF4= 200.13
##$BF5= 200.13
##$BF6= 200.13
##$BF7= 200.13
##$BF8= 200.13
##$BYTORDA= 1
##$CFDGTYP= 0
##$CFRGTYP= 5
##$CHEMSTR= <none>
##$CNST= (0..31)
1 1 145 1 1 1 1 1 1 1 1 1 1 1 1 1 1 1 1 1 1 1 1 1 1 1 1 1 1 1 1 1 
##$CPDPRG= <>
##$CPDPRG1= <>
##$CPDPRG2= <>
##$CPDPRG3= <>
##$CPDPRG4= <mlev>
##$CPDPRG5= <mlev>
##$CPDPRG6= <mlev>
##$CPDPRG7= <mlev>
##$CPDPRG8= <mlev>
##$CPDPRGB= <>
##$CPDPRGT= <>
##$D= (0..31)
0 1.2 0 0 0 0 0 0 0 0.06 0 0.03 0 0 0 0 0.0002 0 0 0 0 0 0 0 0 0 0 0 0 
0 0 0 
##$DATE= 1703066792
##$DBL= (0..7)
120 120 120 120 120 120 120 120 
##$DBP= (0..7)
150 150 150 150 150 150 150 150 
##$DBP07= 0
##$DBPNAM0= <>
##$DBPNAM1= <>
##$DBPNAM2= <>
##$DBPNAM3= <>
$$ [...]
##$SUBNAM3= <"">
##$SUBNAM4= <"">
##$SUBNAM5= <"">
##$SUBNAM6= <"">
##$SUBNAM7= <"">
##$SUBNAM8= <"">
##$SUBNAM9= <"">
##$SW= 18.0517328524113
##$SWIBOX= (0..15)
0 0 2 0 0 0 0 0 0 0 0 0 0 0 0 0 
##$SW_h= 3612.71676300578
##$TD= 16384
##$TD0= 1
##$TE= 0
##$TE2= 300
##$TE3= 300
##$TEG= 300
##$TL= (0..7)
0 120 120 120 120 120 120 120 
##$TP= (0..7)
150 150 150 150 150 150 150 150 
##$TP07= 0
##$TPNAME0= <>
##$TPNAME1= <>
##$TPNAME2= <>
##$TPNAME3= <>
##$TPNAME4= <>
##$TPNAME5= <>
##$TPNAME6= <>
##$TPNAME7= <>
##$TPOAL= (0..7)
0.5 0.5 0.5 0.5 0.5 0.5 0.5 0.5 
##$TPOFFS= (0..7)
0 0 0 0 0 0 0 0 
##$TUNHIN= 0
##$TUNHOUT= 0
##$TUNXOUT= 0
##$USERA1= <user>
##$USERA2= <user>
##$USERA3= <user>
##$USERA4= <user>
##$USERA5= <user>
##$V9= 5
##$VALIST= <valist>
##$VCLIST= <CCCCCCCCCCCCCCC>
##$VD= 0
##$VDLIST= <DDDDDDDDDDDDDDD>
##$VPLIST= <PPPPPPPPPPPPPPP>
##$VTLIST= <TTTTTTTTTTTTTTT>
##$WBST= 1024
##$WBSW= 4
##$XGAIN= (0..3)
0 0 0 0 
##$XL= 0
##$YL= 0
##$YMAX_a= 792359
##$YMIN_a= -1096258
##$ZGOPTNS= <>
##$ZL1= 120
##$ZL2= 120
##$ZL3= 120
##$ZL4= 120
##$ABSF1= 15.46814
##$ABSF2= -2.58371
##$ABSG= 5
##$ABSL= 3
##$ALPHA= 0
##$AQORDER= 0
##$ASSFAC= 0
##$ASSFACI= 0
##$ASSFACX= 0
##$ASSWID= 0
##$AUNMP= <proc_1d>
##$AZFE= 0.1
##$AZFW= 0.1
##$BCFW= 0
##$BC_mod= 2
##$BYTORDP= 0
##$COROFFS= 0
##$CY= -3
##$DATMOD= 1
##$DC= 0
##$DFILT= <>
##$DTYPP= 0
##$F1P= 0
##$F2P= 0
##$FCOR= 1
##$FTSIZE= 16384
##$FT_mod= 6
##$GAMMA= 0
##$GB= 0
##$INTBC= 1
##$INTSCL= 3.70164e-10
##$ISEN= 128
##$LB= 0.24
##$LEV0= 0
##$LPBIN= 0
##$MAXI= 10000
##$MC2= 0
##$MEAN= 0
##$ME_mod= 0
##$MI= 1.114404
##$NCOEF= 0
##$NC_proc= -6
##$NLEV= 6
##$NOISF1= 3.799351
##$NOISF2= 2.8
##$NSP= 0
##$NTH_PI= 0
##$NZP= 0
##$OFFSET= 15.44169
##$PC= 1
##$PHC0= -24594
##$PHC1= 12.25272
##$PH_mod= 1
##$PKNL= yes
##$PPARMOD= 0
##$PSCAL= 0
##$PSIGN= 0
##$REVERSE= no
##$SF= 200.130016013248
##$SI= 16384
##$SIGF1= 3
##$SIGF2= 2
##$SINO= 5.538805
##$SIOLD= 16384
##$SREGLST= <1H.CDCl3>
##$SSB= 0
##$STSI= 16384
##$STSR= 0
##$SW_p= 3612.71676300578
##$SYMM= 0
##$S_DEV= 0
##$TDeff= 16384
##$TDoff= 0
##$TI= <>
##$TILT= no
##$TM1= 0
##$TM2= 0
##$TOPLEV= 0
##$USERP1= <user>
##$USERP2= <user>
##$USERP3= <user>
##$USERP4= <user>
##$USERP5= <user>
##$WDW= 1
##$XDIM= 16384
##$YMAX_p= 489724514
##$YMIN_p= -868101
$$ End of Bruker specific parameters
$$ ---------------------------------
##NTUPLES= NMR SPECTRUM
##VAR_NAME=  FREQUENCY,     SPECTRUM/REAL,   SPECTRUM/IMAG
##SYMBOL=    X,             R,               I
##VAR_TYPE=  INDEPENDENT,   DEPENDENT,       DEPENDENT
##VAR_FORM=  AFFN,          ASDF,            ASDF
##VAR_DIM=   16384,         16384,           16384
##UNITS=     HZ,            ARBITRARY UNITS, ARBITRARY UNITS
##FACTOR=    0.220516191357247, 1,           1
##FIRST=     3090.34575601872, 0,            0
##LAST=      -522.371006987061, 0,           0
##MIN=       -522.371006987061, -868101,     0
##MAX=       3090.34575601872, 489724514,    0
$$ Real data points
##PAGE= N=1
##DATA TABLE= (X++(R..R)), XYDATA
$$ [...]
7964A56844J2907l1250l7803J4885J7680M3772l2225o9359q2194m8512J05831
$$ 156844 169751 138501 100698 115583 133263 177035 144810 75451 -6743 -55255 50576
7953E0576O617k5020m8729L9862M8415J2569n3759l1766o588M7251p8562O5464
$$ 50576 57193 32173 -16556 23306 71721 84290 30531 -1235 -7823 39428 -39134 26330
7941B6330M3137m2989J1380m4336k1877K6427R1060P214q4133R8498l569n2170
$$ 26330 69467 26478 37858 -6478 -28355 -1928 89132 96346 12213 110711 107142 54972
7929E4972J02451k0119N5773O8196M1375o6892J01418J22313p5383k1634P6456
$$ 54972 157423 137304 193077 261273 302648 235756 337174 459487 384104 362470 438926
7918D38926J7119M6108j6867p1678L8067M5017k2948o713K8592M5693j3860J04795
$$ 438926 456045 502153 485286 413608 451675 496692 473744 467031 495623 541316 527456 632251
7906F32251j56623l4233Q5148r5286q9058m1997k9900R0255j01003n8832j2749
$$ 632251 475628 441395 526543 431257 342199 300202 270302 360557 259554 200722 187973
7895A87973k5443J09230k9362m0402l7834N0485n9630m2921K8380O5100P2534
$$ 187973 162530 271760 242398 201996 164162 214647 155017 112096 140476 205576 278110
7884B78110P5256n2848P2454K52j466n1950l198J7832J54884J22666j3846l9347
$$ 278110 353366 300518 372972 373224 371758 319808 316610 334442 489326 611992 598146 558799
7872E58799K0322K1393M109j6977J8263K1652o4967L9884n1621L5065J7772j32643
$$ 558799 579121 600514 604623 587646 605909 627561 562594 602478 550857 585922 603694 471051
7860D71051K799J0585M991N07K9482R91q7649L0260K7858o3536o5385L4668m9063
$$ 471051 473850 484435 489426 489933 519415 520406 432757 463017 490875 427339 361954 396622 347559
7847C47559o6356m4683j443q2990M4286M5763r6140r400o5566K2762J35621K5465
$$ 347559 281203 236520 235077 152087 196373 242136 145996 136596 71030 93792 229413 254878
7835B54878j0507J14009J2110L7194r0297j2466K7217k0782L2099j1554n4380
$$ 254878 244371 358380 370490 407684 317387 304921 332138 311356 343455 331901 277521
7824B77521j05965P685J35566N7541j42121N127L2544j05825J702J6989k4264
$$ 277521 171556 179241 314807 372348 230227 235354 267898 162073 163775 180764 156500
7813A56500m5557k0053O48O7949J83891Q3092j3516m041k4589O042l4501N0692
$$ 156500 110943 90890 91538 159487 343378 426470 412954 408913 384324 390366 355865 406557
7801D06557L4752k6912p8124j3056k1423j29512J00680J19586J8635l5568m8213
$$ 406557 441309 414397 336273 323217 301794 172282 272962 392548 411183 375615 327402
7790C27402J6091K3409j06179O5960q635r7248J9366K1278O550j15845j12301
$$ 327402 343493 366902 260723 326683 318048 220800 240166 261444 267994 152149 39848
7779C9848J05925k3868N8531l1918l7288K5717L680O7375Q3414q3459q4189K0965
$$ 39848 145773 121905 180436 148518 111230 136947 140627 208002 291416 207957 123768 144733
7767A44733j08626J8312R1313J04573P0734r6475L1905O1002j50916L2738J19183
$$ 144733 36107 54419 145732 250305 321039 224564 256469 317471 166555 199293 318476
7756C18476q959l354q4986m1747M9492P0540l5891j02003l7859K1667L8724N7556
$$ 318476 309517 306163 221177 179430 228922 299462 263571 161568 123709 145376 184100 241656
7744B41656j4486j10381m992J9079j07885P5848J05008j54268n300j5576j8650
$$ 241656 227170 116789 111797 130876 22991 98839 203847 49579 44279 28703 10053
7733A0053O669m8776J9617r700L4574j07135r2991K4758N9317Q6158Q2503M2594
$$ 10053 16722 -32054 -12437 -22137 12437 -94698 -187689 -162931 -103614 -17456 65047 107641
7721A07641k6968Q391o5734l570o051o5500K313N2429J00520o6607r3709l3276
$$ 107641 80673 89064 23330 19760 13709 -51791 -49478 2951 103471 36864 -56845 -90121
7709i0121O5846L2312m2408r283o0738K9491r694O4891q7857K7897l9516k9959
$$ -90121 -24275 8037 -34371 -43654 -104392 -74901 -84595 -19704 -107561 -79664 -119180 -149139
7697a49139P756l341j1910m1779L3794m8839M2098O4269k9173O3191n304n1234
$$ -149139 -141383 -144724 -156634 -198413 -164619 -213458 -171360 -107091 -136264 -73073 -78377 -129611
7685a29611p2094M1081l2861L5843j549m119K5952J675j03866o5616M7846K2075
$$ -129611 -201705 -160624 -193485 -157642 -159191 -163310 -137358 -135683 -239549 -305165 -257319 -235244
7673b35244O7926K2748j4903j5267j1294n9384P4987K1002J1248k4592k1592j21463
$$ -235244 -167318 -144570 -159473 -174740 -186034 -245418 -170431 -149429 -138181 -162773 -184365 -305828
7661c05828L0645M240j986K3174j10657n1654l6505L8893k673j7131N4838l0689
$$ -305828 -275183 -270943 -272929 -249755 -360412 -412066 -448571 -409678 -412351 -429482 -374644 -405333
7649d05333M9720k7597m7530l1865q5582O755k0551J23953q4175n314P4584l6159
$$ -405333 -355613 -383210 -430740 -462605 -548187 -541432 -561983 -438030 -522205 -527519 -452935 -489094
7637d89094R4577l726n6616n0155M3101k27N2491l0290m3187l1189J7281k4808
$$ -489094 -394517 -398243 -454859 -505014 -461913 -462140 -409649 -439939 -483126 -514315 -497034 -521842
7625e21842P2380R049l8621P8403r1978j05940K1946J26166J8190M0440R6415
$$ -521842 -449462 -440413 -479034 -400631 -492609 -598549 -576603 -450437 -432247 -391807 -295392
7614b95392j01797m8342k0613p6916P1471M7176j2886m7520n540M0806n0840M7682
$$ -295392 -397189 -445531 -466144 -543060 -471589 -424413 -437299 -484819 -490359 -449553 -500393 -452711
7602d52711L2288m0595M4328M9670M9402j91211J0244P3445p0442M7358j1904
$$ -452711 -420423 -461018 -416690 -367020 -317618 -508829 -498585 -425140 -495582 -448224 -460128
7591d60128K1175m9310M3924j1907l6640J61824K7002n5713N8966J3258K2187
$$ -460128 -438953 -488263 -444339 -456246 -492886 -331062 -304060 -359773 -300807 -287549 -265362
7580b65362q8606m4815K264N1401m3210m9611p6818K7435m4130Q7534O7725k3199
$$ -265362 -353968 -398783 -396519 -345118 -388328 -437939 -514757 -487322 -531452 -443918 -376193 -399392
7568c99392J74275l2821N0723k04739n6802O0395L5108k2988r175M5026M5393
$$ -399392 -225117 -257938 -207215 -411954 -468756 -408361 -373253 -396241 -405416 -360390 -314997
7557c14997J3877k3477n1201P3845P9555l9814P3283Q465K3879J11983j4631p340
$$ -314997 -301120 -324597 -375798 -301953 -222398 -262212 -188929 -180464 -156585 -44602 -59233 -66573
7545f6573n2237n2994L8548k6017l5453J04252P7447k3594l1245J098m9288L8457
$$ -66573 -118810 -171804 -133256 -159273 -194726 -90474 -13027 -36621 -67866 -66768 -116056 -77599
7533g7599n8381q4408j1021L5409J0305l7855L727L3149p2427m7417O9214K5200
$$ -77599 -135980 -220388 -231409 -196000 -185695 -223550 -219823 -186674 -259101 -306518 -237304 -212104
7521b12104M5986M6799J5931m9204J3561K9945m414m9404M0177n6997M6530K4220
$$ -212104 -166118 -119319 -103388 -152592 -139031 -109086 -113500 -162904 -122727 -179724 -133194 -108974
7509a08974N867j7267K0464k8913j0831P471m3960k4102k6438p525J06922k5019
$$ -108974 -103107 -120374 -99910 -128823 -139654 -132183 -176143 -200245 -226683 -234208 -127286 -152305
7497a52305m1149N2949l0683m3941m5011o608k6334J45217J15297j77591O3936
$$ -152305 -193454 -140505 -171188 -215129 -260140 -266748 -293082 -147865 -32568 -210159 -146223
7486a46223q500n8073L2078n7944K8829O2n513K9899J8705m9509R3547k3064q5206
$$ -146223 -154723 -212796 -180718 -238662 -209833 -209771 -215284 -185385 -166680 -216189 -122642 -145706 -230912
7473b30912P4547K5371R0579L8975P995r9729j6462N9305Q3148L7115l8038j5204
$$ -230912 -156365 -130994 -40415 -1440 6555 -93174 -109636 -50331 32817 69932 31894 16690
7461A6690j7015l0660m9084N9631J493k1201O8748k8217j86080N660m461N9374
$$ 16690 -325 -30985 -80069 -20438 -18945 -40146 28602 385 -185695 -180035 -184496 -125122
7449a25122J5245K640k25335L5508j0859Q0942N6401p7776O3372J0894M5516N227
$$ -125122 -109877 -107237 -332572 -297064 -307923 -226981 -170580 -248356 -184984 -174090 -128574 -123347
7437a23347l0808k1019O7702P0335J533j56099q3433k91O2697J43813j1712j76657
$$ -123347 -154155 -175174 -107472 -37137 -35604 -191703 -275136 -275427 -212730 -68917 -80629 -257286
7425b57286q0892K1181M8958m5684O0843P0009L4801O8336j26832j10359l8059
$$ -257286 -338178 -316997 -268039 -313723 -252880 -182871 -148070 -79734 -206566 -316925 -354984
7414c54984o4830K5891j5581P0569K6864j57365J18828m7944j4801m7494O84L847
$$ -354984 -419814 -393923 -409504 -338935 -312071 -469436 -350608 -398552 -413353 -460847 -460163 -456316
7402d56316n8976j6828N705J3543l0077R5797M957o9314j05517K2155O2192l4546
$$ -456316 -515292 -532120 -526415 -512872 -542949 -447152 -442195 -511509 -617026 -594871 -532679 -567225
7390e67225m2924m5742K4435J83042J5191n9732q24N5451j9374n5132j14654n9400
$$ -567225 -610149 -655891 -631456 -448414 -433223 -492955 -493779 -438328 -457702 -512834 -627488 -686888
7378f86888k7634Q8126j1564n429P6245k7012L2044J11741j29420j1728L7573
$$ -686888 -714522 -626396 -637960 -643389 -567144 -594156 -562112 -450371 -579791 -591519 -553946
7367e53946m0390K0509o4861m3009n3965J04660J10388j1345J5017j07063R937
$$ -553946 -594336 -573827 -638688 -681697 -735662 -631002 -520614 -531959 -516942 -624005 -614068
7356f14068k0506P654q5200m0695L3267L6289o3115l3956J36376k2992J7166l3209
$$ -614068 -634574 -626920 -712120 -752815 -719548 -683259 -746374 -780330 -643954 -666946 -649780 -682989
7344f82989q285P2599O1555j30508l8259J17826L8495o3159k2207j992R715j7520
$$ -682989 -691274 -618675 -557120 -687628 -725887 -608061 -569566 -632725 -654932 -656924 -647209 -664729
7332f64729Q2853n8143j55506R2768N2705k567p1472k5767L7215M9924p3353j1845
$$ -664729 -581876 -640019 -795525 -702757 -650052 -652619 -724091 -749858 -712643 -662719 -736072 -747917
7320g47917J16617L7381m3693Q035o1765k1996K9961q4938j3014L0332K1209k9142
$$ -747917 -631300 -593919 -637612 -629577 -691342 -713338 -683377 -768315 -781329 -750997 -729788 -758930
7308g58930N3060N5047j7241L3033o3237O5529o3743p5333M2476j06509P8741
$$ -758930 -705870 -650823 -668064 -635031 -698268 -632739 -696482 -771815 -729339 -835848 -757107
7297g57107J0396K1833M0412k5056O6737L0501m0127l2091j438n2338o71p97R0868
$$ -757107 -746711 -724878 -684466 -709522 -642785 -612284 -652411 -684502 -685940 -738278 -738949 -739746 -648878
7284f48878m3420j5714P9269q9419M3850j02541J15035O3382m8374k8628K2752
$$ -648878 -692298 -708012 -628743 -718162 -674312 -776853 -661818 -598436 -646810 -675438 -652686
7273f52686l1987j2635p6554O582L5355N3947l6152j5412J13756o0084n3189N3613
$$ -652686 -684673 -697308 -773862 -767280 -731925 -677978 -714130 -729542 -615786 -675870 -729059 -675446
7261f75446L4536J13810q9550k3166N3685k5983K0450j6237l8575m3326R5100
$$ -675446 -640910 -527100 -616650 -639816 -586131 -612114 -591664 -607901 -646476 -689802 -594702
7250e94702k1003q1078j16239Q5726j5513J3589Q9293J9947O3141q2296k2138
$$ -594702 -615705 -696783 -813022 -727296 -742809 -729220 -639927 -619980 -556839 -639135 -661273
7239f61273K9697k0404M7291o768j15981l9686k7778P7271J5996n0915O1083M6298
$$ -661273 -631576 -651980 -604689 -611457 -727438 -767124 -794902 -717631 -701635 -752550 -691467 -645169
7227f45169n6283l7024p7450O0563M2696J350j30942Q156N3003n77P9987R5769
$$ -645169 -701452 -738476 -815926 -755363 -712667 -711317 -842259 -834103 -781100 -781677 -701690 -605921
7215f05921L3560j37887Q5076o776L9150j16131l4015J01200J01805q2552r0420
$$ -605921 -572361 -710248 -625172 -631948 -592798 -708929 -742944 -641744 -539939 -622491 -712911
7204g12911m8787J38448k2974p6499L8929K5972k4730P778m0428o2534O0392K6282
$$ -712911 -761698 -623250 -646224 -722723 -683794 -657822 -682552 -674774 -715202 -777736 -717344 -691062
7192f91062j317k5106l4906N052m536K2950N6940L3415N0266K1803k5203j5044
$$ -691062 -692379 -717485 -752391 -747339 -751875 -728925 -671985 -638570 -588304 -566501 -591704 -606748
7180f06748q1629J734q915k6746J22742j0716r3373l2827K0245Q9954j9895L0391
$$ -606748 -688377 -686643 -695558 -722304 -599562 -610278 -703651 -736478 -716233 -626279 -646174 -615783
7168f15783P8990k2959j06580m670N4655n8647L5227L2283M4689p0355l4449J31051
$$ -615783 -536793 -559752 -666332 -671002 -616347 -674994 -639767 -607484 -562795 -633150 -667599 -536548
7156e36548j00150p9404N2969Q4043N3819r1063j4666o2490O8424K11607l9004
$$ -536548 -636698 -716102 -663133 -579090 -525271 -616334 -631000 -693490 -625066 -413459 -452463
7145d52463m8132J2366N2592J33825J11659R6262J35569K40144J26228M4823k02533
$$ -452463 -500595 -488229 -435637 -301812 -190153 -93891 41678 281822 408050 452873 250340
7134B50340k20918j45997k00332m4672K0520J636q4394r7102o9597N0340n0121
$$ 250340 29422 -116575 -316907 -361579 -341059 -339423 -423817 -520919 -590516 -540176 -590297
7123e90297l8508J8068N5964O7406n1426q5092l6904j1779J7303m1415j0902J32742
$$ -590297 -628805 -610737 -554773 -487367 -538793 -623885 -660789 -672568 -655265 -696680 -707582 -574840
7111e74840j04334P5758j15414l8182k1162Q6436R6937j7236r2184k2250J9031
$$ -574840 -679174 -603416 -718830 -757012 -778174 -691738 -594801 -612037 -704221 -726471 -707440
7100g07440J34900p1271m4869j5k154K940m7562L1661M2605k4793l6080L2253
$$ -707440 -572540 -643811 -688680 -688695 -690849 -687909 -735471 -703810 -661205 -685998 -722078 -689825
7088f89825n417q1385n6066J33332L2102o4527q118O5852j73902Q7188J37330
$$ -689825 -695242 -776627 -832693 -699361 -667259 -731786 -739904 -674052 -847954 -760766 -623436
7077f23436j11646N8583J5948j26047M4155m1469O2098O5416P8969k2395q1275
$$ -623436 -735082 -676499 -660551 -786598 -742443 -783912 -721814 -656398 -577429 -599824 -681099
7066f81099O1331m7780j0538n1447Q2840N8077j44257Q539J2899J1233P2254o6637
$$ -681099 -619768 -667548 -678086 -729533 -646693 -588616 -732873 -724334 -711435 -700202 -627948 -694585
7054f94585P2025N5292o2461m1334p1548k6306N7511P4789O4323r1128m7899J11129
$$ -694585 -622560 -567268 -629729 -671063 -742611 -768917 -711406 -636617 -572294 -663422 -711321 -600192
7042f00192j00078m4584N6689j1388n8270K2656O8260O4892n4120q693j03191
$$ -600192 -700270 -744854 -688165 -699553 -757823 -735167 -666907 -602015 -656135 -664828 -768019
7031g68019O180q710J6310m3310P672M5303m3787N1154P0166P6440n4357p1056
$$ -768019 -761839 -770549 -754239 -797549 -789877 -744574 -788361 -737207 -667041 -590601 -644958 -716014
7019g16014P4373k4601n9126K0690O0644m9400J1042L2699Q5702n6779m4552N772
$$ -716014 -641641 -666242 -725368 -704678 -644034 -693434 -682392 -649693 -563991 -620770 -665322 -659550
7007f59550L7503r9767j2268m7455o5854N5975K8931M1303L5902O59J3877o734
$$ -659550 -622047 -721814 -734082 -781537 -847391 -791416 -762485 -721182 -685280 -684621 -670744 -677478
6995f77478n9292M370L6594L568r7702J597l5160K9508P2889K982J0704L245k1312
$$ -677478 -736770 -732400 -695806 -692238 -789940 -788343 -823503 -793995 -721106 -718124 -707420 -704175 -725487
6982g25487q98J1546k7190o6696J52413n9060J7133Q715P7953L565n1947k3369
$$ -725487 -726385 -714839 -742029 -808725 -656312 -715372 -698239 -689524 -611571 -608006 -659953 -683322
6970f83322j7123m670Q1402j05144J1510l7094n8660J09121P0433l5802n9535
$$ -683322 -700445 -705115 -623713 -728857 -717347 -754441 -813101 -703980 -633547 -669349 -728884
6959g28884K9914K1685j09490J7007J3858J17720k3758o2399Q9600j5149l7736
$$ -728884 -698970 -677285 -786775 -769768 -755910 -638190 -661948 -724347 -634747 -649896 -687632
6948f87632n056K7032J9625j08688K1642P8290j04130K3473j341J6011K2873l1640
$$ -687632 -692688 -665656 -646031 -754719 -733077 -654787 -758917 -735444 -736785 -720774 -697901 -729541
6936g29541L7140O8224k9775R0611q1187J1157q8073K2510j4758j6685m1047o6688
$$ -729541 -692401 -624177 -653952 -563341 -644528 -633371 -721444 -698934 -713692 -730377 -771424 -838112
6924h38112N994J17251N6976j5475j3556o0340O6727J7935j25764k1617Q6139
$$ -838112 -832118 -714867 -657891 -673366 -686922 -747262 -680535 -662600 -788364 -809981 -723842
6913g23842k3999K0001l3319J473m5686O9168R398m3416J6930P8824J1720l5959
$$ -723842 -747841 -727840 -761159 -759686 -805372 -736204 -726806 -770222 -753292 -674468 -662748 -698707
6901f98707J46548k00705O1224J24673m4080n8872j5480J7162j3967o0527j1482
$$ -698707 -552159 -752864 -691640 -566967 -611047 -669919 -685399 -668237 -682204 -742731 -754213
6890g54213K2603M8531q0994n1381J74586L7120k2948j20111K5026k513l3911
$$ -754213 -731610 -683079 -764073 -815454 -640868 -603748 -626696 -746807 -721781 -724294 -758205
6879g58205m6708J73388K17349j70531k0282M0384j40846N5831N2976M5334q851
$$ -758205 -804913 -631525 -414176 -584707 -604989 -564605 -705451 -649620 -596644 -551310 -560161
6868e60161o2649n9702M2303j7967n5851L0979j0581N2632p828j14322R2373j841
$$ -560161 -622810 -682512 -640209 -658176 -714027 -683048 -693629 -640997 -648825 -763147 -670774 -672615
6856f72615R751P2697l9510p7329k6766j8157J6236K7716L9542L2873N0255j18359
$$ -672615 -662864 -590167 -629677 -707006 -733772 -751929 -735693 -707977 -668435 -635562 -585307 -703666
6844g03666j64435J37170L1932l1264J37494j301j67330J17145J00554n7755o7222
$$ -703666 -868101 -730931 -698999 -730263 -592769 -594070 -761400 -644255 -543701 -601456 -668678
6833f68678j4321Q7659N6105q4161o9779P3110k8413o802l319n056L1534J4588
$$ -668678 -682999 -595340 -539235 -623396 -693175 -620065 -648478 -655280 -658599 -663655 -632121 -617533
6821f17533Q9520n7502n3378O6619p798M6218R506j53674M5478O7028q2352j16562
$$ -617533 -528013 -585515 -638893 -572274 -580072 -533854 -524348 -678022 -632544 -565516 -647868 -764430
6809g64430K5314R6739J1365n3219R550j5211j7106o395Q7840M8044o1946J8996
$$ -764430 -739116 -642377 -631012 -684231 -674681 -689892 -706998 -713393 -625553 -577509 -639455 -620459
6797f20459L3691n9342n5905l9097Q4823M7840P2114j51915M5335J04075j1906
$$ -620459 -586768 -646110 -702015 -741112 -656289 -608449 -536335 -688250 -642915 -538840 -550746
6786e50746o1179o2916L3608N3662O6846n2485l031l2613N6423n259o822o2656
$$ -550746 -611925 -674841 -641233 -587571 -520725 -573210 -576241 -608854 -552431 -557690 -564512 -627168
6774f27168q244O7944j01143l8132k3029k4172Q2460k9938q7071O7039J09996
$$ -627168 -635412 -567468 -668611 -706743 -729772 -753944 -671484 -701422 -788493 -721454 -611458
6763f11458K6075j7089M6226Q262l9695L3387p0363O1871j0107M2653j49899l5655
$$ -611458 -585383 -602472 -556246 -547984 -587679 -554292 -624655 -562784 -572891 -530238 -680137 -715792
6751g15792P3450N8635Q4841J3983q1481j43067J44578Q8519j05525m389J5075
$$ -715792 -642342 -583707 -498866 -484883 -566364 -709431 -564853 -476334 -581859 -586248 -571173
6740e71173P8323o6325r2099M4931J46029N755q5258R1583R0193N079j17176J42
$$ -571173 -492850 -559175 -651274 -606343 -460314 -454559 -539817 -448234 -358041 -352962 -470138 -469996
6728d69996m3050l224m1065P2475J3034k3570m0149J4470j280l9489K9817K6318
$$ -469996 -513046 -516270 -557335 -484860 -471826 -495396 -535545 -521075 -522355 -561844 -532027 -505709
6716e05709M0784m2169j2592K1313J41053p2119j08221K2321O7436N0180j4020
$$ -505709 -464925 -507094 -519686 -498373 -357320 -429439 -537660 -515339 -447903 -397723 -411743
6705d11743M4576N9650k3928j559j12303q5668N1938n4350L1994J14617K4806
$$ -411743 -367167 -307517 -331445 -333004 -445307 -530975 -479037 -533387 -501393 -386776 -361970
6694c61970l5531J4310P9226N2202n3323k3172M3497m8137L3088O3298k2261O5618
$$ -361970 -397501 -383191 -303965 -251763 -305086 -328258 -284761 -332898 -299810 -236512 -258773 -193155
6682a93155J3660L0831L1197m8767L0050L2632O4242N8836j09943j1427O8375
$$ -193155 -179495 -148664 -117467 -166234 -136184 -103552 -39310 19526 -90417 -101844 -33469
6671c3469n3550k8751O5848O1259Q3059L4282M1157j13680r3864P9948O1737N7583
$$ -33469 -87019 -115770 -49922 11337 94396 128678 169835 56155 -37709 42239 103976 161559
6659A61559Q5345K0532j8820p961J17374N2286k561L7786m3440K1344J21785n3905
$$ 161559 246904 267436 248616 240655 358029 410315 407754 445540 402100 423444 545229 491324
6647D91324p7167K7571r0257k4707l9843M9256J7355K1091k6206O3902J4106m7550
$$ 491324 414157 441728 351471 326764 286921 336177 353532 374623 348417 412319 426425 378875
6635C78875O9763j02498o8670P3651o7287n5379O6738J68729P1185L0880O0595
$$ 378875 448638 346140 277470 351121 283834 228455 295193 463922 535107 565987 626582
6624F26582n8021n9401j6867k18447K186q0314j01014j2602P2670L6480o7760
$$ 626582 568561 509160 492293 273846 276032 195718 94704 82102 154772 191252 123492
6613A23492p7008k8486M4597n3153j8168j29417o137K8189K0452M1484P8546j12343
$$ 123492 46484 17998 62595 9442 -8726 -138143 -144280 -116091 -95639 -54155 24391 -87952
6601h7952l4973K5462j9930K1075k721n090P729J6701J8489J401M1018n1466K3318
$$ -87952 -122925 -97463 -117393 -96318 -99039 -104129 -96400 -79699 -61210 -59809 -18791 -70257 -46939
6588d6939p3667M5887P438M4277j7895j18012j5227R6756M5314j74903N1965J74057
$$ -46939 -120606 -74719 -67281 -23004 -40899 -158911 -174138 -77382 -32068 -206971 -155006 19051
6576A9051L9991l6093L7864M6384N704m8825m4172j01232N4117n1768p107P4468
$$ 19051 59042 22949 60813 107197 112901 64076 19904 -81328 -27211 -78979 -86086 -11618
6564a1618j49937J44297J8618k7251L529r6351J05962K1539O736J1834N5870P4070
$$ -11618 -161555 -17258 1360 -25891 -22362 -118713 -12751 8788 15524 27358 83228 157298
6552A57298l6930l3306J17427J23598N7197O6998j8193j8920j27927K2343j2646
$$ 157298 120368 87062 204489 328087 385284 452282 434089 415169 287242 309585 296939
6541B96939p4994K3062L0252m5274M9181R2769O4044Q5890L248j8993K3770L0120
$$ 296939 221945 245007 275259 229985 279166 371935 435979 521869 525117 506124 529894 560014
6529E60014L2103J6435J01160J9525M6972O667q6666M0664r6314K7780J7340r0836
$$ 560014 592117 608552 709712 729237 776209 782876 696210 736874 640560 668340 685680 594844
6517E94844p4910l8627n3067j7378l0739j9672K7274R530L6806J75214m1999M6842
$$ 594844 519934 481307 428240 410862 380123 360451 387725 397255 434061 609275 567276 614118
6505F14118m0105k0339l5259m0702K9648p9104m1959l4873J8311o1878l5363M5346
$$ 614118 574013 553674 518415 477713 507361 428257 386298 351425 369736 307858 272495 317841
6493C17841p6094r9610j0051r106J0773N590J9001k1179K8312o1937j14519M5661
$$ 317841 241747 142137 132086 122980 133753 139343 158344 137165 165477 103540 -10979 34682
6481C4682o9274O6861L9364L5228l113n7177M1196J5155n1823M3557J48614n2230
$$ 34682 -34592 32269 71633 106861 103748 46571 87767 102922 51099 94656 243270 191040
6469A91040R9799j0742O4294J22335j46011P539n9952L6342K6433Q693O3194n2299
$$ 191040 290839 280097 344391 466726 320715 328254 268302 304644 331077 339770 402964 350665
6457C50665k85n385q615o9704Q4384K5785N625l0933N2132L6166m870j4129Q4112
$$ 350665 350380 344995 336380 266676 351060 376845 382470 351537 403669 439835 434965 420836 504948
6444E04948J1845r860J40451J17351J57253j121k5567q678m3310M234N3389q6227
$$ 504948 516793 506933 647384 764735 921988 920867 895300 886622 843312 847546 900935 814708
6432H14708J0976j2661k9475j29403m6957p3911M1350l23J8986J35608o2297j07557
$$ 814708 825684 813023 783548 654145 607188 533277 574627 574304 593290 728898 666601 559044
6420E59044M8073O7588l2485R3991L2836L1643J47245K4529l4934J6980m8670
$$ 559044 607117 674705 642220 736211 769047 800690 947935 972464 937530 954510 905840
6409I05840l3889P9575q896l6554k4533P8731L51j31930O4505J3513J5870k3532
$$ 905840 871951 951526 942630 906076 881543 960274 960625 828695 893200 906713 922583 899051
6397H99051L9173K3553j14562N3121J21663N2456O5386J00406L6452j11403L4024
$$ 899051 938224 961777 847215 900336 1021999 1074455 1139841 1240247 1276699 1165296 1199320
6386A199320m1586k3618J5564k5720k250K6710j3174M6682J3632J01641J4927
$$ 1199320 1157734 1134116 1149680 1123960 1121710 1148420 1135246 1181928 1195560 1297201 1312128
6375A312128r5842l8397J68446L3356p7895P3141J44847P0251N4264Q3829O206
$$ 1312128 1216286 1177889 1346335 1379691 1301796 1374937 1519784 1590035 1644299 1728128 1734334
6364A734334N7732R1200p7287K6810O6956n3848o8644R0122j5766L0136k853N394
$$ 1734334 1792066 1883266 1805979 1832789 1899745 1845897 1777253 1867375 1851609 1881745 1878892 1884286
6352A884286M3700p061P2335J7748O9976J01049R6618J23090J26876P1947M049
$$ 1884286 1927986 1920925 1993260 2011008 2080984 2182033 2278651 2401741 2528617 2600564 2604613
6341B604613J00747J54991O9296R3837J41754K52260Q6784M5526J44n014p3101
$$ 2604613 2705360 2860351 2929647 3023484 3165238 3417498 3504282 3549808 3549952 3544938 3471837
6330C471837j31262j62658o1545M2185K05924J75145P9681N9390J15173J05333
$$ 3471837 3340575 3177917 3116372 3158557 3364481 3539626 3619307 3678697 3793870 3899203
6320C899203J63577R9731J39988J45585M6916Q8727J75456J26257M5929q3962
$$ 3899203 4062780 4162511 4302499 4448084 4495000 4583727 4759183 4885440 4931369 4847407
6310D847407q6068o9295L6290J51606Q1996l5048R6282M5403M274Q3924J58368
$$ 4847407 4761339 4692044 4728334 4879940 4961936 4926888 5023170 5068573 5072847 5156771 5315139
6299E315139J28770Q2526J22458J09502K34049K08230J08010O1728n4748J397
$$ 5315139 5443909 5526435 5648893 5758395 5992444 6200674 6308684 6370412 6315664 6317061
6289F317061L4004J7299N6268J91200J75401N5224J6867K60863J79571J50010
$$ 6317061 6351065 6368364 6424632 6615832 6791233 6846457 6863324 7124187 7303758 7453768
6279G453768L34867J79481R8247Q9939L04405K31456K96511J31920J62695K47026
$$ 7453768 7788635 7968116 8066363 8156302 8460707 8692163 8988674 9120594 9283289 9530315
6269I530315L62919L10685J44532Q7572J70158J18554K09826K77157K39932L37039
$$ 9530315 9893234 10203919 10348451 10436023 10606181 10724735 10934561 11211718 11451650 11788689
6259A1788689L05896K60654L42042M06628L31512M67036M94240L29960M64624
$$ 11788689 12094585 12355239 12697281 13103909 13435421 13902457 14396697 14726657 15191281
6250A5191281M67526M09327L71685L61747M05473N00035K88317K83338N17550
$$ 15191281 15658807 16068134 16439819 16801566 17207039 17707074 17995391 18278729 18796279
6241A8796279N01724N25557N52623M76476N78958O46136O57616Q17187P46797
$$ 18796279 19298003 19823560 20376183 20852659 21431617 22077753 22735369 23552556 24299353
6232B4299353P91217P95378R21748Q40606Q55310R77784R59975Q88329Q70481
$$ 24299353 25090570 25885948 26807696 27648302 28503612 29481396 30441371 31329700 32200181
6223C2200181J184035J441687J497519J755509J915502K243066K671814L187698
$$ 32200181 33384216 34825903 36323422 38078931 39994433 42237499 44909313 48097011
6215D8097011L877851M827193N876663P324807Q735896R871148R129553N165514
$$ 48097011 51974862 56802055 62678718 70003525 78739421 88610569 97740122 102905636
6207A02905636j187403o202393p564766o369973m205039j983620q1071K049194
$$ 102905636 101718233 95515840 87951074 81581101 77376062 75392442 75311371 77360565
6199G7360565L919145N550521O859918O483133M277466J113229j3533J284181
$$ 77360565 81279710 86830231 93690149 100173282 104450748 105563977 105550444 106834625
6191A06834625L497550N285488N435647K519717k219727o150863p194343n670818
$$ 106834625 110332175 115617663 121053310 123573027 121353300 115202437 108008094 102337276
6183A02337276l099122Q3904K358004K492153J51455l437675n314983m357296
$$ 102337276 99238154 99322058 101680062 104172215 104323670 100885995 95571012 91213716
6175I1213716k421691j85501K040844M021491O111141Q112285R163407P353787
$$ 91213716 88792025 88606524 90647368 94668859 100780000 108892285 118055692 125409479
6167A25409479J961459n319118r503476r434557p610031n044276k477025m40198
$$ 125409479 127370938 122051820 112548344 103113787 95503756 90459480 87982455 87542257
6159H7542257J208749K391163L059985K877162J540504n74943k900073m455206
$$ 87542257 88751006 91142169 94202154 97079316 98619820 98044877 95144804 90689598
6151I0689598n314856n287389m696892l755550k876665k175701j341900o87101
$$ 90689598 85374742 80087353 75390461 71634911 68758246 66582545 65240645 64553544
6143F4553544L06986P91315J509758K158731K854597L696585M322670N335310
$$ 64553544 64860530 65651845 67161603 69320334 72174931 75871516 80194186 85529496
6135H5529496O288897P332747Q709598J0069548J0764564J0238912P592332K300817
$$ 85529496 91818393 99151140 107860738 117930286 128694850 138933762 146526094 148826911
6127A48826911m462021j0244999j3020271j2856954j1112647r215213p389562
$$ 148826911 144364890 134119891 121099620 108242666 97130019 87914806 80525244
6120H0525244n943830m846597l940203k933807k090360j300819p64441l2113N85619
$$ 80525244 74581414 69734817 65794614 62860807 60770447 59469628 58705187 58673074 59258693
6111E9258693J086086J584505K188586K935645L692109M572620N009490M679630
$$ 59258693 60344779 61929284 64117870 67053515 70745624 75318244 80327734 85007364
6103H5007364L300111N98985k650327n441863o950486p104632o600680n461101
$$ 85007364 88307475 88906460 86256133 80814270 73863784 66759152 60158472 54697371
6095E4697371m545954l957535l406523k694826k314873j859460j301759j007905
$$ 54697371 50151417 46193882 42787359 40092533 37777660 35918200 34616441 33608536
6087C3608536q25333k94562k10174j32631k47337m69476r11312j124902j364461
$$ 33608536 32783203 32488641 32278467 32145836 31898499 31429023 30517711 29392809 28028348
6078B8028348j496152j192110j084277r34665p81430o94989p45464m12752k59914
$$ 28028348 26532196 25340086 24255809 23321144 22539714 21844725 21099261 20686509 20426595
6069B0426595j34431K0496P6060J89941L16369M78780O19214R82225J151133J479956
$$ 20426595 20292164 20312660 20388720 20578661 20895030 21373810 21993024 22975249 24126382 25606338
6059B5606338J830665J915097J887482J218909K71868r14306k006993k566117
$$ 25606338 27437003 29352100 31239582 32458491 32730359 31816053 29809060 27242943
6051B7242943k718554k190637j912527j501899j087565q86684o34504n50761n40645
$$ 27242943 24524389 22333752 20421225 18919326 17831761 16945077 16310573 15759812 15219167
6042A5219167k69677j63354n1072M2505R3559J37807K47539N16973M64615P35624
$$ 15219167 14949490 14786136 14735064 14777569 14871128 15008935 15256474 15773447 16238062 16973686
6032A6973686P90544Q00052O10764J23637l66709r12632j209615j331310j348132
$$ 16973686 17764230 18564282 19175046 19298683 18931974 18019342 16809727 15478417 14130285
6023A4130285j283059j075605p97983p12789n47522m75050m47001l81729l39280
$$ 14130285 12847226 11771621 10973638 10260849 9713327 9238277 8791276 8409547 8070267
6014H070267l18422j90178k31209l22670j73932j66799j85610j66187k60950j38846
$$ 8070267 7751845 7561667 7330458 7007788 6833856 6667057 6481447 6315260 6054310 5915464
6004E915464j20065k65363n9260j93779k31482j02763K0929J45945j61413j21454
$$ 5915464 5795399 5530036 5470776 5276997 5045515 4942752 4963681 5109626 4948213 4826759
5994D826759j58718j09962j11723k09425L3827q3780q0682j1537r9580k4248K9006
$$ 4826759 4668041 4558079 4446356 4236931 4270758 4186978 4106296 4094759 3995179 3970931 3999937
5983C999937m4412j75194j49810o8872j25512n4551o0834Q3371j30145N8079Q4304
$$ 3999937 3955525 3780331 3630521 3561649 3436137 3381586 3320752 3404123 3273978 3332057 3416361
5972C416361q0984m3785k05079o5628O2848j3382n7455O729m3110m1632j8766
$$ 3416361 3335377 3291592 3086513 3020885 3083733 3070351 3012896 3019625 2976515 2934883 2916117
5961B916117J9502J1762j05855m537K4563n2642k1892K490Q3797M3391M3430j2357
$$ 2916117 2935619 2947381 2841526 2836989 2861552 2808910 2787018 2789508 2873305 2916696 2960126 2947769
5949B947769P0460J05932L8894N7101J0163l6006J3317Q0898K1164j46258J4937
$$ 2947769 3018229 3124161 3163055 3220156 3230319 3194313 3207630 3288528 3309692 3163434 3178371
5938C178371r1545q1990L8097K6188k8152m9593K0092P4459j50317n182M7671
$$ 3178371 3086826 3004836 3042933 3069121 3040969 2991376 3011468 3085927 2935610 2930428 2978099
5927B978099q046J35372Q5732l6693r85l75K3493K7093l2762p2886J250M1658
$$ 2978099 2970053 3105425 3191157 3154464 3153479 3153104 3176597 3203690 3170928 3098042 3099292 3140950
5915C140950k2879J3117N9081J3846R294R0142J00723P5173Q8374M0842q153N738
$$ 3140950 3118071 3131188 3190269 3204115 3213409 3303551 3404274 3479447 3567821 3608663 3600510 3606248
5903C606248K4919l9569j38651m2416O3122L4928m6598l1858K4597J57551K1663
$$ 3606248 3631167 3591598 3452947 3410531 3473653 3508581 3461983 3430125 3454722 3612273 3633936
5892C633936N1912J3093p052O8262P28N2181J50616L0593N0275m8196l1795O5163
$$ 3633936 3685848 3698941 3691889 3760151 3760879 3813060 3963676 3994269 4044544 3996348 3964553 4029716
5880D029716L9471J03348L4542J18040K3450j10780N417J80723Q7656P2532M8513
$$ 4029716 4069187 4172535 4207077 4325117 4348567 4237787 4243204 4423927 4511583 4584115 4632628
5869D632628M6019J87623J76659K4620n6843Q5137P2044M0630R9782K5747R652
$$ 4632628 4678647 4866270 5042929 5067549 5010706 5095843 5167887 5208517 5308299 5334046 5343698
5858E343698R7760J46868J32813J34690O9283J7201J66051P969l0219J26832J9153
$$ 5343698 5441458 5588326 5721139 5855829 5925112 5942313 6108364 6116333 6086114 6212946 6232099
5847F232099N1398J90814K9912Q8110P5573J24366J73261O6406J46672J83401
$$ 6232099 6283497 6474311 6504223 6592333 6667906 6792272 6965533 7031939 7178611 7362012
5837G362012J55508Q4372K5846q548J28323O2307q6754J76695J08806J29641K20443
$$ 7362012 7517520 7601892 7627738 7619190 7747513 7809820 7723066 7899761 8008567 8138208 8358651
5826H358651M9656O5701P3684J30256J01476M2783J32113J53187K85810L28562
$$ 8358651 8408307 8474008 8547692 8677948 8779424 8822207 8954320 9107507 9393317 9721879
5816I721879J00051K13794K22462K49173J26791J05244J13263M0130J14170K23589
$$ 9721879 9821930 10035724 10258186 10507359 10634150 10739394 10852657 10892787 11006957 11230546
5806A1230546K64915J61351K01220J61793K21724L10751M19274K93185L69320
$$ 11230546 11495461 11656812 11858032 12019825 12241549 12552300 12971574 13264759 13634079
5797A3634079M37340M03110N83148N40306M91759N49927N25973O97241P52085
$$ 13634079 14071419 14474529 15057677 15597983 16089742 16639669 17165642 17862883 18614968
5788A8614968Q46226R62597O33108K45783R1540J25235K12764N7180R9236P9138
$$ 18614968 19461194 20423791 21056899 21302682 21394222 21519457 21732221 21789401 21888637 21967775
5778B1967775L75379L61474M48704N11387N11674O40337P67448P53539O75088
$$ 21967775 22343154 22704628 23153332 23664719 24176393 24816730 25584178 26337717 27012805
5769B7012805P63678Q24546O99925N54649O14442P82940R81213J015177J171740
$$ 27012805 27776483 28601029 29300954 29855603 30470045 31252985 32234198 33249375 34421115
5760C4421115J116183J392183J611724J709558J363802K71496n25217l60952j50703
$$ 34421115 35537298 36929481 38541205 40250763 41614565 41886061 41360844 40999892 40849189
5751D0849189M6044J49320O8134J24402L40380M75849M32455M53886M72875P08355
$$ 40849189 40895233 41044553 41112687 41237089 41577469 42053318 42485773 42939659 43412534 44120889
5741D4120889R38952R76985J252755J452113J801109K001926K459221K951046
$$ 44120889 45059841 46036826 47289581 48741694 50542803 52544729 55003950 57954996
5733E7954996L587447M545285N525170O546894P356207P948832P817961N995201
$$ 57954996 61542443 66087728 71612898 78159792 85515999 93464831 101282792 107277993
5725A07277993K387933j908654n349896p121058p237855o095186m761654l616298
$$ 107277993 109665926 107757272 102407376 95286318 88048463 81953277 77191623 73575325
5717G3575325k460784j508763p28843j06704L72427Q14820J249517J772104K442480
$$ 73575325 71114541 69605778 68876935 68770231 69142658 69957478 71206995 72979099 75421579
5708G5421579L288213M405744N639333P298516R332096J1442107J3165993J3701032
$$ 75421579 78709792 83115536 88754869 96053385 105385481 116827588 129993581 143694613
5700A43694613J0978302M225590m252680j0908030j3928093j4129439j2242104
$$ 143694613 154672915 158898505 154645825 143737795 129809702 115680263 103438159
5693A03438159r908646p557554n642214m074610k783756j965673j345639j187761
$$ 103438159 93529513 85971959 80329745 76255135 73471379 71505706 70160067 68972306
5685F8972306r47282p19303m09209J67886Q65167J402438J879671K427783L033201
$$ 68972306 68025024 67305721 66896512 67064398 67929565 69332003 71211674 73639457 76672658
5676G6672658L715202M105310L540719J922706m35903l114231n281261o101287
$$ 76672658 80387860 84493170 88033889 89956595 89520692 86406461 81125200 75023913
5668G5023913n629410m871342l713729k873589k096380j556050j159830q05975
$$ 75023913 69394503 64523161 60809432 57935843 55839463 54283413 53123583 52317608
5660E2317608o96191n34598o04117n99000n71356l01127j46286o6848J46513K84732
$$ 52317608 51621417 51086819 50482702 49883702 49312346 49011219 48864933 48798085 48944598 49229330
5650D9229330N28923P15794O95626Q05967Q71823J034198Q87462J195978J450148
$$ 49229330 49758253 50474047 51169673 51975640 52847463 53881661 54769123 55965101 57415249
5641E7415249J654148J913179K238882K443974K949314L272628L346134L497491
$$ 57415249 59069397 60982576 63221458 65665432 68614746 71887374 75233508 78730999
5633G8730999L501735L676757L818304M469331N942538P742940R624620J0601142
$$ 78730999 82232734 85909491 89727795 94197126 100139664 107882604 117507224 128108366
5625A28108366Q887341L733206l599363q156572q498182o428681l945072j102968
$$ 128108366 136995707 140728913 137129550 128972978 120474796 114046115 110101043 108998075
5617A08998075J369562L472518N380009O925228O999007N011619K041097Q21052
$$ 108998075 110367637 113840155 119220164 126145392 133144399 138156018 140197115 141018167
5609A41018167K283904M549952O379222P159417O462144L558701j394001n729208
$$ 141018167 143302071 147852023 154231245 161390662 167852806 171411507 170017506 164288298
5601A64288298p527615o033869k690170N24019K164741J126416k039334m595092
$$ 164288298 156760683 150726814 148036644 148560663 150725404 151851820 149812486 145217394
5593A45217394m491834k942405p19164J844867M222083O375849Q255728R401856
$$ 145217394 140725560 137783155 137063991 138908858 143130941 149506790 157762518 167164374
5585A67164374Q892179O244961J542150l952039o702616o463231n054066l250768
$$ 167164374 176056553 182301514 183843664 179891625 173189009 166725778 161671712 158420944
5577A58420944j449995l39174m58375p76728l61134N88829J668747J632602O19073
$$ 158420944 156970949 156631775 156173400 155396672 155035538 155624367 157293114 158925716 159544789
5568A59544789j121091k634900k832166j738907K75619K669435M433844M580937
$$ 159544789 158423698 155788798 152956632 151217725 151493344 154162779 158596623 163177560
5560A63177560K737471K45284o14943Q89341L743467O270939P186922N466151
$$ 163177560 165915031 166160315 165545372 166434713 170178180 176449119 183636041 189102192
5552A89102192K043772j813150n745462r374241j1589875j1566267r903295p703251
$$ 189102192 191145964 189332814 183587352 174213111 162623236 151056969 141153674 133450423
5544A33450423n518936l729783k313443r29354M14348K012499L913330N929942
$$ 133450423 127931487 124201704 121888261 120958907 121373255 123385754 127299084 133229026
5536A33229026Q048281R966223J0734675R626849O503983K359519j702671n367606
$$ 133229026 141277307 151243530 161978205 171605054 178109037 180468556 178765885 173398279
5528A73398279q276928r338983p915791n181983k660838j803297l237684n998632
$$ 173398279 165121351 155782368 147866577 142684594 140023756 138220459 134982775 128984143
5520A28984143p865764p383900n554848l553024j873460j549062k140503l066940
$$ 128984143 121118379 113734479 108179631 104626607 102753147 101204085 99063582 95996642
5512I5996642l198788k381822j193466K39467R13177j62212j875009l234387l706487
$$ 95996642 92797854 90416032 89222566 89462033 90375210 90212998 88337989 85103602 81397115
5503H1397115l407696l230069l162149k977487k315138j741805j514357j854760
$$ 81397115 77989419 74759350 71597201 68619714 66304576 64562771 63048414 61193654
5495F1193654k507570k964989k856146k370920j846932j271557j141893j567874
$$ 61193654 58686084 55721095 52864949 50494029 48647097 47375540 46233647 44665773
5487D4665773k187282k688678k795920k639477k212992j954551j666206j271551
$$ 44665773 42478491 39789813 36993893 34354416 32141424 30186873 28520667 27249116
5479B7249116j045270q71670q22374p75983n27048m45799n36175m84077l05223
$$ 27249116 26203846 25332176 24509802 23733819 23206771 22760972 22224797 21740720 21435497
5470B1435497l06825l49912k98403k72736k37310l27494j57096j11974j21135
$$ 21435497 21128672 20778760 20480357 20207621 19970311 19642817 19485721 19373747 19252612
5461A9252612o2748k35052k16969j80950j79978j17876r7333r6925j28050j73313
$$ 19252612 19189864 18954812 18737843 18556893 18376915 18259039 18161706 18064781 17936731 17763418
5451A7763418k01920p4084L7316n0243J51641n2099L9722R7758J37024Q3078J90193
$$ 17763418 17561498 17487414 17524730 17474487 17626128 17574029 17613751 17711509 17848533 17931611 18121804
5440A8121804K29670L45222N87158O58871Q53253J098260J322754J482780J723912
$$ 18121804 18351474 18696696 19283854 19942725 20795978 21894238 23216992 24699772 26423684
5431B6423684K178761K771916L390278M346579N432107O223524N957575L808584
$$ 26423684 28602445 31374361 34764639 39111218 44543325 50766849 56724424 60533008
5423F0533008m62840m875248p019756p052592o212142m898099l670255k770088
$$ 60533008 60070168 55194920 48175164 41122572 34910430 30012331 26342076 23571988
5415B3571988k154928j665112j482286j077330j033668r37860q73543p36894n36535
$$ 23571988 21417060 19751948 18269662 17192332 16158664 15220804 14347261 13610367 13073832
5406A3073832o03803n56754m05388l77228m75497l01401j97126k40777k17666
$$ 13073832 12470029 11913275 11507887 11130659 10655162 10353761 10156635 9915858 9698192
5397I698192l25941k69171j68208k19591k16907k95167o8624j81110j02243j09590
$$ 9698192 9372251 9103080 8934872 8715281 8498374 8203207 8134583 7953473 7851230 7741640
5387G741640j85280j38122j84781j16315j050m1389J7618n821p7891Q137m3057
$$ 7741640 7556360 7418238 7233457 7117142 7116092 7074703 7092321 7086500 7008609 7016746 6973689
5376F973689L5498l459k9964l394N7676m4839l9752J28152K12818M09018K81979
$$ 6973689 7009187 7005728 6975764 6972370 7030046 6985207 6945455 7073607 7286425 7695443 7977422
5365G977422J06513O8594j13403k37587l57573m12382m12990r8372j80323o7503
$$ 7977422 8083935 8152529 8039126 7801539 7443966 7031584 6618594 6520222 6339899 6272396
5355F272396j36461p9307l6352o865J2450j61348M6305J04181n4302O28P1661
$$ 6272396 6135935 6056628 6020276 6013411 6025861 5864513 5910818 6014999 5960697 5961325 6032986
5344F032986K11741J49719J67717K50151L03736M55706M86819O76094Q24615J098621
$$ 6032986 6244727 6394446 6562163 6812314 7116050 7571756 8058575 8734669 9559284 10657905
5334A0657905J332533J164542N04989l18607r69085j199826j293625j172527q85516
$$ 10657905 11990438 13154980 13659969 13341362 12372277 11172451 9878826 8706299 7820783
5325G820783o61805m61593m02139k91562j29789r4169j30051k29556l6132R6690
$$ 7820783 7158978 6697385 6295246 6003684 5873895 5779726 5649675 5420119 5383987 5480677
5315E480677l4548o1202l0611O2108M7316J64066J07716K87131L67334K80311
$$ 5480677 5446129 5384927 5354316 5416424 5463740 5627806 5735522 6022653 6389987 6670298
5305F670298L97819N87184Q10858J038840J098351P61567K19422m96718q55766
$$ 6670298 7068117 7655301 8466159 9504999 10603350 11364917 11584339 11087621 10231855
5296A0231855j107664j048084q35534p00479m75003k97464k00780l37354j32998
$$ 10231855 9124191 8076107 7240573 6540094 6065091 5767627 5566847 5229493 5096495
5287E096495j26832o0256r228J1946m1059o8444J19380J9377j4340k4469M4040
$$ 5096495 4969663 4909407 4900179 4912125 4871066 4802622 4922002 4941379 4927039 4902570 4946610
5276D946610K1163O0594R5885J5618J46033K66228K59877L95460K12249J28129
$$ 4946610 4967773 5028367 5124252 5139870 5285903 5552131 5812008 6207468 6419717 6547846
5266F547846K763j07655l02663l61739k34645j36854n4833m7651k456j33155j30260
$$ 6547846 6550609 6442954 6140291 5778552 5543907 5407053 5352220 5304569 5302113 5168958 5038698
5255E038698m6318j57937k12811j37052k06298j06929q4170l9482n0317l5256
$$ 5038698 4992380 4834443 4621632 4484580 4278282 4171353 4087183 4047701 3997384 3962128
5245C962128m3984o478K1217j1651Q7238j04827j08722o3719J40736Q5047n5681
$$ 3962128 3918144 3911666 3932883 3921232 4008470 3903643 3794921 3731202 3871938 3956985 3901304
5234C901304J34938R444o3622J0999J62717J02154l7828J78826J63369J46452
$$ 3901304 4036242 4045686 3982064 3993063 4155780 4257934 4220106 4398932 4562301 4708753
5224D708753R9307L2112M3466j14134q0477r8389k42204J4708o8925r9718j49326
$$ 4708753 4808060 4840172 4883638 4769504 4689027 4590638 4348434 4363142 4294217 4194499 4045173
5213D045173n1659j05664q8293m8928l3639j4240j14761l1272N1334J23843Q2120
$$ 4045173 3993514 3887850 3799557 3750629 3716990 3702750 3587989 3556717 3608051 3731894 3814014
5202C814014m6595J60652J42971K28996L0517l0445P168R9391J544l0003m599
$$ 3814014 3767419 3928071 4071042 4300038 4330555 4300110 4307278 4406669 4408213 4378210 4373611
5191D373611J08357J42577J97197P8958r6206j35024j67318k40893j60264M8447
$$ 4373611 4481968 4624545 4821742 4900700 4804494 4669470 4502152 4261259 4100995 4149442
5181D149442k7061K5401J8811J25735N0692P8031O2480K8773K1715J775j4444
$$ 4149442 4122381 4147782 4166593 4292328 4343020 4421051 4483531 4512304 4534019 4535794 4521350
5170D521350n9324K1p649o2604N4012P4518k871l4205J07008R8651l7800K619
$$ 4521350 4462026 4462047 4454398 4391794 4445806 4520324 4517453 4483248 4590256 4688907 4651107 4653726
5158D653726J48694Q7276J34779O5779O4351K3466J24222M1483P3964J37247j9381
$$ 4653726 4802420 4889696 5024475 5090254 5154605 5178071 5302293 5343776 5417740 5554987 5535606
5147E535606r4636R4064Q7257Q9668M5305N1096J46105M0016P5195P3529R7659
$$ 5535606 5440970 5535034 5622291 5711959 5757264 5808360 5954465 5994481 6069676 6143205 6240864
5136F240864J35985J65197P0222K00265L65561L11077K99819M79388N49816L84290
$$ 6240864 6376849 6542046 6612268 6812533 7178094 7489171 7788990 8268378 8818194 9202484
5126I202484K69940q9961k04684j06881l0339J12215K95751L53398M40985L51884
$$ 9202484 9472424 9382463 9177779 9070898 9040559 9152774 9448525 9801923 10242908 10594792
5116A0594792L12407J43142j12846j46695K1591M9625J26344Q4219J89719J60427
$$ 10594792 10907199 11050341 10937495 10790800 10812391 10862016 10988360 11072579 11262298 11422725
5106A1422725K13324L25796K56589J00843L4194L6042J98413J18994Q9766n018
$$ 11422725 11636049 11961845 12218434 12319277 12353471 12389513 12587926 12706920 12796686 12791668
5096A2791668J31187K78982K85188K13245M13376M24339L39576K51355M13487
$$ 12791668 12922855 13201837 13487025 13700270 14113646 14537985 14877561 15128916 15542403
5087A5542403K27159L53116K98073L99411K34157K24429K09075L83509M61995
$$ 15542403 15769562 16122678 16420751 16820162 17054319 17278748 17487823 17871332 18333327
5078A8333327N00293O08628N81613M79601O12202M54550M64870N20998O56543
$$ 18333327 18833620 19442248 20023861 20503462 21115664 21570214 22035084 22556082 23212625
5069B3212625P71213P75966Q38574Q77788Q93063J148268J108590J253801J214528
$$ 23212625 23983838 24759804 25598378 26476166 27369229 28517497 29626087 30879888 32094416
5060C2094416J098187J168184J194783J272900J261907J223655R84444P23281
$$ 32094416 33192603 34360787 35555570 36828470 38090377 39314032 40298476 41021757
5052D1021757P48769P18677O38621P01818R84124J181399J408842J797743J855814
$$ 41021757 41770526 42489203 43127824 43829642 44813766 45995165 47404007 49201750 51057564
5043E1057564K086372J914057K116166J824079J867552J673680J979042K108256
$$ 51057564 53143936 55057993 57174159 58998238 60865790 62539470 64518512 66626768
5035F6626768K668209L532697N051742N985957P134833Q347862J0235493J2383352
$$ 66626768 69294977 72827674 77879416 83865373 91000206 99348068 109583561 121966913
5027A21966913J5826681J9529887K5777137L4417346M6836787N8660447P2477728
$$ 121966913 137793594 157323481 183100618 217517964 264354751 323015198 395492926
5020C95492926O4723449K9508139m0488761q4835724p7709024o3513648m5267989
$$ 395492926 460216375 489724514 449235753 364400029 286691005 223177357 177909368
5013A77909368l1169287k1048681j5597721j1307970q898822o549305n638688
$$ 177909368 146740081 125691400 110093679 98785709 89886887 83337582 77698894
5006G7698894m620165m204693l504937l449653k957188k713650j684787j736804
$$ 77698894 73078729 68874036 65369099 61919446 58962258 56248608 54563821 52827017
4998E2827017j750740k170330k421110k259440j969782j929407j633474j753612
$$ 52827017 51076277 48905947 46484837 44225397 42255615 40326208 38692734 36939122
4990C6939122j589932j692407j504242j410911j095082j153439q42910q83076
$$ 36939122 35349190 33656783 32152541 30741630 29646548 28493109 27650199 26767123
4982B6767123o38796p52827p79213q19650o64810p91942p40677n63094l11876
$$ 26767123 26128327 25375500 24596287 23776637 23111827 22319885 21579208 21016114 20704238
4973B0704238m79180m16448l37629l16637k48567l30172m15171m88268k40851
$$ 20704238 20225058 19808610 19470981 19154344 18905777 18575605 18160434 17672166 17431315
4964A7431315k89912l61503j95454j73222j40782j40541j19339k08088l26306
$$ 17431315 17141403 16779900 16584446 16411224 16270442 16129901 16010562 15802474 15476168
4955A5476168k61755j40218j93889j85596k0995M535j16735N330j8355J31185
$$ 15476168 15214413 15074195 14880306 14694710 14673715 14678250 14561515 14566845 14548490 14679675
4945A4679675K46099J77698p082J18517P7456R4475K39561J41086L30807N6042
$$ 14679675 14925774 15103472 15096390 15214907 15292363 15386838 15626399 15767485 16098292 16154334
4935A6154334J74091J38962J83204K12440K54490L90781L22731K79015L09395
$$ 16154334 16328425 16467387 16650591 16863031 17117521 17508302 17831033 18110048 18419443
4926A8419443K76050L13248J96150J10736J15386K71954K03232K44127K62575
$$ 18419443 18695493 19008741 19204891 19315627 19431013 19702967 19906199 20150326 20412901
4917B0412901N03229M84916M84524M99340L01208J02707J22329K02865L69092
$$ 20412901 20916130 21401046 21885570 22384910 22686118 22788825 22911154 23114019 23483111
4908B3483111M29536R30635J274097J582261K096693K827686L272409K692935
$$ 23483111 23912647 24843282 26117379 27699640 29796333 32624019 35896428 38589363
4900C8589363Q19592j891527l231073k984364k272900j495198r36459n35897j76460
$$ 38589363 39408955 37517428 34286355 31301991 29029091 27533893 26597434 26061537 25885077
4891B5885077K1517K42328L21786M18177O42835P85282Q05597R62171J211200
$$ 25885077 25906594 26148922 26470708 26888885 27531720 28317002 29122599 30084770 31295970
4882C1295970J361168J616371K270420K757041L684199L685204K540291r3402
$$ 31295970 32657138 34273509 36543929 39300970 42985169 46670373 49210664 49117262
4874D9117262k924641k950159k271223j596064q28739j60807K03434N36246P25280
$$ 49117262 46192621 43242462 40971239 39375175 38546436 38385629 38589063 39125309 39850589
4865C9850589J025930R52004J185098J241599J296232J363265J490257J644177
$$ 39850589 40876519 41828523 43013621 44255220 45551452 46914717 48404974 50049151
4857E0049151J796733K010676K235070K431563K541358K717331K833802K961280
$$ 50049151 51845884 53856560 56091630 58523193 61064551 63781882 66615684 69576964
4849F9576964K890002K780123K728708K319932J924344J676637J325141R50271
$$ 69576964 72466966 75247089 77975797 80295729 82220073 83896710 85221851 86172122
4841H6172122Q76256O50488N89216M37090L46395K88599L79191P57498J017957
$$ 86172122 87048378 87698866 88288082 88725172 89071567 89360166 89739357 90496855 91514812
4832I1514812J341087J829049K342436K798938L264451L660125M179051M431820
$$ 91514812 92855899 94684948 97027384 99826322 103090773 106750898 110929949 115361769
4824A15361769M419085M566553M651344M457635L864472L325528K093545J139984
$$ 115361769 119780854 124347407 128998751 133456386 137320858 140646386 142739931 143879915
4816A43879915P0490q28146j341876j674744j932236k378925k612456k402598
$$ 143879915 143950405 143122259 141780383 140105639 138173403 135794478 133182022 130779424
4808A30779424k033906j532954r56963l53143M17126J310574J878067K406638
$$ 130779424 128745518 127212564 126255601 125902458 126319584 127630158 129508225 131914863
4800A31914863L040094L559204L998761M211816M422862M466360M471195M089561
$$ 131914863 134954957 138514161 142512922 146724738 151147600 155613960 160085155 164174716
4792A64174716L152917J850813N39907p48335j657484k217813k302380k336541
$$ 164174716 167327633 169178446 169718353 168970018 167312534 165094721 162792341 160455800
4784A60455800k252137j963441j476763j171617q65197o81138k66676n4890L31425
$$ 160455800 158203663 156240222 154763459 153591842 152726645 152045507 151778831 151723941 152055366
4775A52055366O82519J081589J396713J688584J822007J751380J652087J329978
$$ 152055366 152737885 153819474 155216187 156904771 158726778 160478158 162130245 163460223
4767A63460223J071624Q42747M08940k52026j133085k034612k871691k937905
$$ 163460223 164531847 165374594 165783534 165531508 164398423 162363811 159492120 156554215
4759A56554215k901738k767767k539641k266321k082464k071543k230163k006629
$$ 156554215 153652477 150884710 148345069 146078748 143996284 141924741 139694578 137687949
4751A37687949j912852j766235j657078j821694k150369k423909k527200k566624
$$ 137687949 135775097 134008862 132351784 130530090 128379721 125955812 123428612 120861988
4743A20861988k524531k436149k498780k564310k954750l164699l466743l788689
$$ 120861988 118337457 115901308 113402528 110838218 107883468 104718769 101252026 97463337
4735I7463337l939755l936246l716556l527347l456857l274059l114660l124147
$$ 97463337 93523582 89587336 85870780 82343433 78886576 75612517 72497857 69373710
4727F9373710l114185l165050k961237k930268k828418k703306k714254k608364
$$ 69373710 66259525 63094475 60133238 57202970 54374552 51671246 48956992 46348628
4719D6348628k484966k408453k326037k012167j831628j664890j352867j266419
$$ 46348628 43863662 41455209 39129172 37117005 35285377 33620487 32267620 31001201
4711C1001201j267402j164774r05126q31210o55038n31298n48800k15016j03932
$$ 31001201 29733799 28569025 27663899 26832689 26177651 25646353 25097553 24882537 24778605
4702B4778605k48766n60015q17128p45835j024258j144303r71059p44644p58858
$$ 24778605 24529839 23969824 23152696 22406861 21382603 20238300 19267241 18522597 17763739
4693A7763739n19687m93731n99444m81352m30258l68638l72005k73079l19473
$$ 17763739 17244052 16750321 16150877 15669525 15239267 14870629 14498624 14225545 13906072
4684A3906072l47093k22514l91949k90877l19242k28667l39656k91178k16011
$$ 13906072 13558979 13336465 12944516 12653639 12334397 12105730 11766074 11474896 11258885
4675A1258885k62097k28782k41395k95190k53826j68749j27721k47947k41608
$$ 11258885 10996788 10768006 10526611 10231421 9977595 9808846 9681125 9433178 9191570
4666I191570j19440j99319j34280k17886j22922j39369j42655K3116k12682j29131
$$ 9191570 9072130 8872811 8738531 8520645 8397723 8258354 8115699 8138815 7926133 7797002
4656G797002j32482n6374o5194r8840j99746j46211K8370j2757l9161j56384n9700
$$ 7797002 7664520 7608146 7542952 7444112 7244366 7098155 7126525 7113768 7074607 6918223 6858523
4645F858523j45881p6385o6591q2253p0645j12430n9633Q9647n2225p8816O7567
$$ 6858523 6712642 6636257 6569666 6487413 6416768 6304338 6244705 6334352 6282127 6203311 6270878
4634F270878r5634j5408k4411O6553k4500K2031m9100J9990N108N6364J07855
$$ 6270878 6175244 6159836 6135425 6201978 6177478 6199509 6150409 6170399 6175507 6231871 6339726
4623F339726O5502J22971j2249O2303K51972K1341o7865j7794o4990p9798j01006
$$ 6339726 6405228 6528199 6515950 6578253 6830225 6851566 6783701 6765907 6700917 6621119 6520113
4612F520113j81743j63091k4524j61007n3425n658j02677j12828L5103J04667
$$ 6520113 6338370 6175279 6150755 5989748 5936323 5930665 5827988 5715160 5750263 5854930
4602E854930o7050K890J04506Q70J1083L4382J37399J87275J82292Q2606J04628
$$ 5854930 5787880 5790770 5895276 5896146 5907229 5941611 6079010 6266285 6448577 6531183 6635811
4591F635811N1250K3755l0087q7816j36604k52052j72106j93686p9465m6026q6546
$$ 6635811 6687061 6710816 6680729 6592913 6456309 6204257 6032151 5838465 5759000 5712974 5626428
4580E626428p7657m5853p2591p4600q6033r417Q1043l0734R6197j05239M0216
$$ 5626428 5548771 5502918 5430327 5355727 5269694 5260277 5341320 5310586 5406783 5301544 5341760
4569E341760J679O1768J80652K1529J19378R9241J99222J58071K20298R0577J57387
$$ 5341760 5343439 5405207 5585859 5607388 5726766 5826007 6025229 6183300 6403598 6494175 6651562
4558F651562K46059q8787j50212j59322j60617j57304j79621j38053k05381k01451
$$ 6651562 6897621 6808834 6658622 6499300 6338683 6181379 6001758 5863705 5658324 5456873
4548E456873j80522j43968j5571R6032j6599j5089J12177P340J20123Q4897J68415
$$ 5456873 5276351 5132383 5116812 5212844 5196245 5181156 5293333 5300673 5420796 5505693 5674108
4537E674108J66099J35723J42313J76850P5660q8788o0572l024q3496j65850k19238
$$ 5674108 5840207 5975930 6118243 6295093 6370753 6281965 6221393 6218369 6134873 5969023 5749785
4526E749785k19918j45861j78435j00898k28903k44608q3407j53832l1598L1179
$$ 5749785 5529867 5384006 5205571 5104673 4875770 4631162 4547755 4393923 4362325 4393504
4516D393504K0461o3765K3923m1885l6879n2669j2391J10625J9414O5478K4374
$$ 4393504 4413965 4350200 4374123 4332238 4295359 4242690 4230299 4340924 4360338 4425816 4450190
4505D450190O2641J92032R5041L8873J58569N4045J71144Q347n0476m4633j55735
$$ 4450190 4512831 4704863 4799904 4838777 4997346 5051391 5222535 5230882 5180406 5135773 4980038
4494D980038K9389j03336j02992r6394j09906l832l3900K4402J02869j6377o5963
$$ 4980038 5009427 4906091 4803099 4706705 4596799 4592967 4559067 4583469 4686338 4669961 4603998
4483D603998j6282J56880L6071J27418Q4272N5982P5532J34919J54141Q3387J5588
$$ 4603998 4587716 4744596 4780667 4908085 4992357 5048339 5123871 5258790 5412931 5496318 5511906
4472E511906O3682P2846r9141p2864j45923k25101j89484o3961k6504k9722n1900
$$ 5511906 5575588 5648434 5549293 5476429 5330506 5105405 4915921 4851960 4825456 4795734 4743834
4461D743834p9523K3226P3297K3359l9696l4124j1381m1986Q7522O787Q370N0080
$$ 4743834 4664311 4687537 4760834 4784193 4744497 4710373 4698992 4657006 4744528 4751315 4759685 4809765
4449D809765N9518o5436k473N3141P3806p683K2996q4667q8721P9788P6145J3395
$$ 4809765 4869283 4803847 4801374 4854515 4928321 4920638 4943634 4858967 4770246 4850034 4926179 4939574
4437D939574J29774J18473P1904m8356J4096J09242K7258J52953M7140R7630J39135
$$ 4939574 5069348 5187821 5259725 5211369 5225465 5334707 5361965 5514918 5562058 5659688 5798823
4426E798823J01145J53597J34448O8349k4024J07547J65145K32215J41495J92533
$$ 5798823 5899968 6053565 6188013 6256362 6232338 6339885 6505030 6737245 6878740 7071273
4416G071273K98335J76032J54441R1820J77279J86686K46176L06162L84081M21182
$$ 7071273 7369608 7545640 7700081 7791901 7969180 8155866 8402042 8708204 9092285 9513467
4406I513467K74583j66510l83481l76979m08725k80986k01199j52119k17993j7278
$$ 9513467 9788050 9621540 9238059 8861080 8452355 8171369 7970170 7818051 7600058 7582780
4396G582780K9628R0895k6275N2292j3556J0484K695l2665o3324r8146O641j50797
$$ 7582780 7612408 7703303 7677028 7729320 7715764 7726248 7728943 7696278 7632954 7534808 7541449 7390652
4384G390652k8231r0318M6209J26497R392O696J42427m2128j4403J07837R6434
$$ 7390652 7362421 7272103 7318312 7444809 7454201 7460897 7603324 7561196 7546793 7654630 7751064
4373G751064n0560J10474R8642M7473r7784m0427j0728k9393R2500m1731K31851
$$ 7751064 7700504 7810978 7909620 7957093 7859309 7818882 7808154 7778761 7871261 7829530 8061381
4362H061381j9797o113m6257p4869j73415l1940j5938q4580n0735o6721R2880
$$ 8061381 8041584 8035471 7989214 7914345 7740930 7708990 7693052 7608472 7557737 7491016 7583896
4351G583896R9814o2496K0050J3476k3995j8363L6941N7073P1443p5368q8591
$$ 7583896 7683710 7621214 7641264 7654740 7630745 7612382 7649323 7706396 7777839 7702471 7613880
4340G613880M4217n9506r6102q074J0410m1771p362r5860k37875j22025r850l9575
$$ 7613880 7658097 7598591 7502489 7494415 7504825 7463054 7455692 7359832 7121957 6999932 6990082 6950507
4328F950507N4165j30675q5270j16108K1969o0297o9830N7371L7248q6150l7165
$$ 6950507 7004672 6873997 6788727 6672619 6694588 6634291 6564461 6621832 6659080 6572930 6535765
4317F535765k0487o9437q8802n3928n1300J35662Q655k47967r3428K606J6983
$$ 6535765 6515278 6445841 6357039 6303111 6251811 6387473 6396128 6148161 6054733 6057339 6074322
4306F074322K7733p7275j03057L5489K4315L505k3735m2206k828M6320N5556J45437
$$ 6074322 6102055 6024780 5921723 5957212 5981527 5985032 5961297 5919091 5916263 5962583 6018139 6163576
4294F163576q5953M067P3660q62L5847k6982J04562N3686K8972k7597J53825P3136
$$ 6163576 6077623 6081690 6155350 6154488 6190335 6163353 6267915 6321601 6350573 6322976 6476801 6549937
4282F549937M908J9116o3588q7682l1791J74414J50385j8513K0152L276R7200
$$ 6549937 6554845 6573961 6510373 6422691 6390900 6565314 6715699 6697186 6717338 6720614 6817814
4271F817814J03238M8242m7245J30394J76688O0269K3897J27709N3491P9269M512
$$ 6817814 6921052 6969294 6922049 7052443 7229131 7289400 7313297 7441006 7494497 7573766 7578278
4260G578278k278K14802J54086M324Q5396J10575m9147L1812J05791J93519N2119
$$ 7578278 7576000 7790802 7944888 7949212 8034608 8145183 8096036 8127848 8233639 8427158 8479277
4249H479277j7476J33304J0584Q5332J55917J7356J28538L6411J53089M5989O3321
$$ 8479277 8461801 8595105 8605689 8691021 8846938 8864294 8992832 9029243 9182332 9228321 9291642
4238I291642Q4667J54507M3433P8923O8711J06331K71863J09273N5968J89474
$$ 9291642 9376309 9530816 9574249 9653172 9721883 9828214 10100077 10209350 10265318 10454792
4228A0454792J92342J23595J88025J85093K7365J51761J16373N1366J27555J33128
$$ 10454792 10647134 10770729 10958754 11143847 11171212 11322973 11439346 11490712 11618267 11751395
4218A1751395J80065L2794J25059Q0339J38310R8548J36193K16011N7418J54967
$$ 11751395 11931460 11964254 12089313 12169652 12307962 12406510 12542703 12758714 12816132 12971099
4208A2971099J41066J45050J55374K38059K54562J59658J37752J47037K22246
$$ 12971099 13112165 13257215 13412589 13650648 13905210 14064868 14202620 14349657 14571903
4199A4571903L06062K29624J88131J57657K56261L78426K48168J45166Q0152L47934
$$ 14571903 14877965 15107589 15295720 15453377 15709638 16088064 16336232 16481398 16561550 16909484
4189A6909484L22411K63383K20692K55369K75668K15951M15360K97760L74394
$$ 16909484 17231895 17495278 17715970 17971339 18247007 18462958 18878318 19176078 19550472
4180A9550472L21562M03182M53990N40931M89606M12469M97636N75473M97450
$$ 19550472 19872034 20275216 20729206 21270137 21759743 22172212 22669848 23245321 23742771
4171B3742771N48303P08390P56918P76256P61216Q51643R53207R16759R64056
$$ 23742771 24291074 24999464 25756382 26532638 27293854 28145497 29098704 30015463 30979519
4162C0979519R22189R01695P59793O46565O20047N76118P14653O25545O45322
$$ 30979519 31901708 32803403 33563196 34209761 34829808 35405926 36120579 36746124 37391446
4153C7391446P05891P49091R42381J074638J062462J356989J506851J549580J385620
$$ 37391446 38097337 38846428 39788809 40863447 41925909 43282898 44789749 46339329 47724949
4144D7724949J290323J270957J153029J093352R97790J124399J047715J273074
$$ 47724949 49015272 50286229 51439258 52532610 53530400 54654799 55702514 56975588
4136E6975588J388939J287425J245735J271995J317872J172582J192451J068284
$$ 56975588 58364527 59651952 60897687 62169682 63487554 64660136 65852587 66920871
4128F6920871J212114J031856R96636J163158J317561J616612K046740K423027
$$ 66920871 68132985 69164841 70161477 71324635 72642196 74258808 76305548 78728575
4120G8728575K591645K776200K609895K242216J538802R26843O61490M50332N02385
$$ 78728575 81320220 84096420 86706315 88948531 90487333 91414176 92075666 92525998 93028383
4111I3028383O83029P47506Q00752P06569Q00518R43878Q96618J114991J109769
$$ 93028383 93711412 94458918 95259670 95966239 96766757 97710635 98607253 99722244 100832013
4102A00832013J232234J102856R55887R28858R08246R97279J166380J654444K034394
$$ 100832013 102064247 103167103 104122990 105051848 105960094 106957373 108123753 109778197 111812591
4093A11812591K658784L154089L433785L512063L351384K958665K447342K020393
$$ 111812591 114471375 117625464 121059249 124571312 127922696 130881361 133328703 135349096
4085A35349096J862617J733311J624060J464917J392535J215251J091826J040489
$$ 135349096 137211713 138945024 140569084 142034001 143426536 144641787 145733613 146774102
4077A46774102J013430Q74963P30823P00826P88429Q47202J233867J700629K274736
$$ 146774102 147787532 148662495 149393318 150094144 150882573 151729775 152963642 154664271 156939007
4068A56939007K850187L348529L364238K413942J054795j60558n79275j070675
$$ 156939007 159789194 163137723 166501961 168915903 169970698 169810140 169230865 168160190
4060A68160190j091321n96747m7495M70306J018500J224679J158063O28132K88502
$$ 168160190 167068869 166472122 166424627 166894933 167913433 169138112 170296175 170924307 171212809
4051A71212809n7613m70667q25353r80319q95771j318788j486209j583755j755550
$$ 171212809 171155196 170684529 169859176 168878857 167983086 166664298 165178089 163594334 161838784
4042A61838784j631173j285672q43064q86518j026549j339765j896998k792726
$$ 161838784 160207611 158921939 158078875 157192357 156165808 154826043 152929045 150136319
4034A50136319m130249m823475m424583l682595k679569j962613j494563j381797
$$ 150136319 146006070 141182595 136758012 133075417 130395848 128433235 126938672 125556875
4026A25556875j329839j475805j666942j652331j679060j736580j718710j841997
$$ 125556875 124227036 122751231 121084289 119431958 117752898 116016318 114297608 112455611
4018A12455611j839445j694143j474992j157207q41505n51298k65851n73988j105502
$$ 112455611 110616166 108922023 107447031 106289824 105448319 104897021 104631170 104057182 102951680
4009A02951680j648665k077868k143716k226970k138959k362658k299321k030291
$$ 102951680 101303015 99225147 97081431 94854461 92715502 90352844 88053523 86023232
4001H6023232k134361k350230k390240k362988k378529k176773j994560j991875
$$ 86023232 83888871 81538641 79148401 76785413 74406884 72230111 70235551 68243676
3993F8243676j836591j595479j633552j361735j159151j136078j010952j136720
$$ 68243676 66407085 64811606 63178054 61816319 60657168 59521090 58510138 57373418
3985E7373418j124624j291853j364249j495349j429299j501151j412433j212346
$$ 57373418 56248794 54956941 53592692 52097343 50668044 49166893 47754460 46542114
3977D6542114r96111q95023o67044p02668p14479o91017p38073o72488p12698
$$ 46542114 45546003 44650980 43983936 43281268 42566789 41875772 41137699 40465211 39752513
3968C9752513p45053o86679p65976p25460q14003p02927p79918q04724o95806
$$ 39752513 39007460 38320781 37554805 36829345 36015342 35312415 34532497 33727773 33031967
3959C3031967m55617l94863n21196m99772k80205k65521l70690k40666j73894
$$ 33031967 32576350 32181487 31660291 31160519 30880314 30614793 30244103 30003437 29829543
3950B9829543l03581k23404j64763j71138j92096j28844k31249j20527n7517q2264
$$ 29829543 29525962 29302558 29137795 28966657 28774561 28645717 28414468 28293941 28236424 28154160
3940B8154160r9163l8330Q0305r8362K9671k209m738J01866j1448j90772j30527
$$ 28154160 28054997 28016667 28096972 27998610 28028281 28026072 28021334 28123200 28111752 27920980 27790453
3929B7790453k0433q3315j92665m0700j67318l585q2823K4679R805j07737o3356
$$ 27790453 27770020 27686705 27494040 27453340 27286022 27282437 27199614 27224293 27234098 27126361 27063005
3918B7063005p8308j74253j38020k43898k95012k33316j30778k44866k94156j01136
$$ 27063005 26984697 26810444 26672424 26428526 26133514 25900198 25769420 25524554 25230398 25129262
3908B5129262k58645k10290j93020k04649j21323k37792k40040q9934j35992j38910
$$ 25129262 24870617 24660327 24467307 24262658 24141335 23903543 23663503 23573569 23437577 23298667
3898B3298667k81986l36941p6406k57584k53949k07090j70240k61159k03526j48806
$$ 23298667 23016681 22679740 22603334 22345750 22091801 21884711 21714471 21453312 21249786 21100980
3888B1100980j88392n0643k722K3962k3000j87513j28810r1964j22447r4936l7185
$$ 21100980 20912588 20861945 20859223 20883185 20860185 20672672 20543862 20451898 20329451 20234515 20197330
3877B0197330k43505k70063j65092k52596P042j38105j29994J36483J04119O0471
$$ 20197330 19953825 19683762 19518670 19266074 19273116 19135011 19005017 19141500 19245619 19306090
3867A9306090Q6675M2725N3781O7625M0291k40421k82449l03964k13766j98862
$$ 19306090 19392765 19435490 19489271 19556896 19597187 19356766 19074317 18770353 18556587 18357725
3857A8357725k95879j86218r9693k8346q5435k6406k7396j28918j45375p5691
$$ 18357725 18061846 17875628 17775935 17747589 17662154 17635748 17608352 17479434 17334059 17258368
3847A7258368j78339j27639k48301j48031j70865r9070q134j96104r978R631j74934
$$ 17258368 17080029 16952390 16704089 16556058 16385193 16286123 16277989 16081885 16071907 16081538 15906604
3836A5906604l0331j05261O3266m2731J20195J37868m3391J07886p606R7040m1425
$$ 15906604 15876273 15771012 15834278 15791547 15911742 16049610 16006219 16114105 16106499 16203539 16162114
3825A6162114J31407J88166J13137N2048J57836K8940q121l7636O6060j1583k3628
$$ 16162114 16293521 16481687 16594824 16646872 16804708 16833648 16825527 16787891 16853951 16842368 16818740
3814A6818740J35824J77157R5722K15364K50219R6665Q2360J18713n4122k5238
$$ 16818740 16954564 17131721 17227443 17442807 17693026 17789691 17872051 17990764 17936642 17911404
3804A7911404o0236j09913j05881p3410Q990l7597L5493j6959N6053p08p1994
$$ 17911404 17851168 17741255 17635374 17561964 17570954 17533357 17568850 17551891 17607944 17607236 17535242
3793A7535242M4311r9242m3541J7941q1473n1269o7027N6205K6613k5448L2780
$$ 17535242 17579553 17480311 17436770 17454711 17373238 17321969 17254942 17311147 17337760 17312312 17345092
3782A7345092K9011J45917J57956L8878J33898k8789J45775K32271J03669k3236
$$ 17345092 17374103 17520020 17677976 17716854 17850752 17821963 17967738 18200009 18303678 18280442
3772A8280442R739j307o1745p7659j32346n730L88J69696J98421J11557R8652
$$ 18280442 18290181 18288874 18227129 18149470 18017124 18011394 18011782 18181478 18379899 18491456 18590108
3761A8590108J09339J72258K5901K1132K01594N1221J8981K6151L2521K4811p6623
$$ 18590108 18699447 18871705 18897606 18918738 19120332 19171553 19190534 19216685 19249206 19274017 19197394
3750A9197394M3649J21084J46516O3090N9481m2951K03297P0998l2606q4038p0606
$$ 19197394 19241043 19362127 19508643 19571733 19631214 19588263 19791560 19862558 19829952 19745914 19675308
3739A9675308j83536j69097j38274p2739q8946q3773l1263l299J40489r5867O163
$$ 19675308 19491772 19322675 19184401 19111662 19022716 18938943 18907680 18904381 19044870 18949003 18955166
3728A8955166r616J96161K53839J90111J35471K14621J23491j53296q3720o5918
$$ 18955166 18945550 19141711 19395550 19585661 19721132 19935753 20059244 19905948 19822228 19756310
3718A9756310j61870r8107k16878k5072j16522p8544p5464q7373l0586q8964j32476
$$ 19756310 19594440 19496333 19279455 19254383 19137861 19059317 18983853 18896480 18865894 18776930 18644454
3707A8644454L2238J05334J29087O5446J18630Q6565P1561J40977J6492J16012
$$ 18644454 18676692 18782026 18911113 18976559 19095189 19181754 19253315 19394292 19410784 19526796
3697A9526796q7998P7191P8510L0983R196K2650J39333R4436M3046J68592l9112
$$ 19526796 19438798 19515989 19594499 19625482 19634678 19657328 19796661 19891097 19934143 20102735 20063623
3686B0063623j818P9376J9049Q5917J10137l6822l4618P8098J07287J77251K47041
$$ 20063623 20061805 20141181 20160230 20246147 20356284 20319462 20284844 20362942 20470229 20647480 20894521
3675B0894521M6770O9750K39126K09813J73387K14385L49835K88275J52304K24444
$$ 20894521 20941291 21011041 21250167 21459980 21633367 21847752 22197587 22485862 22638166 22862610
3665B2862610J79974Q3688J43371P7930J56755J19186K21428J49499R3669Q4946
$$ 22862610 23042584 23126272 23269643 23347573 23504328 23623514 23844942 23994441 24088110 24173056
3655B4173056J48391J31322J09095K43378J76106K17591K44478J89504K91118
$$ 24173056 24321447 24452769 24561864 24805242 24981348 25198939 25443417 25632921 25924039
3646B5924039L17340K23459P7845K46867K33133J66283L11877L23752K18874K68508
$$ 25924039 26241379 26464838 26542683 26789550 27022683 27188966 27500843 27824595 28043469 28311977
3636B8311977J94315J90742L18688L20322L26809L26605J95589K91892L51827
$$ 28311977 28506292 28697034 29015722 29336044 29662853 29989458 30185047 30476939 30828766
3627C0828766K20667L03350L05812L52854K22884L30865M50069L87079L68192
$$ 30828766 31049433 31352783 31658595 32011449 32234333 32565198 33015267 33402346 33770538
3618C3770538L07032L99711N16331M46582L46806M29145M40045M82725N98164
$$ 33770538 34077570 34477281 34993612 35440194 35787000 36216145 36656190 37138915 37737079
3609C7737079N63455N89382M96918L91432N15079M97115N37637N62150P20547
$$ 37737079 38300534 38889916 39386834 39778266 40293345 40790460 41328097 41890247 42610794
3600D2610794O75504N77663O17488O36064P27925O91646O58746P42227P72906
$$ 42610794 43286298 43863961 44481449 45117513 45845438 46537084 47195830 47938057 48710963
3591D8710963Q02125P34893P11072Q73838P59980P62956P91640Q03573Q49476
$$ 48710963 49513088 50247981 50959053 51832891 52592871 53355827 54147467 54951040 55800516
3582E5800516P50180O79413P98881P77855Q72729R19982R31658J036254R95355
$$ 55800516 56550696 57230109 58028990 58806845 59679574 60599556 61531214 62567468 63562823
3573F3562823J132516J244398J007518J194747J252987J257799J382652J568929
$$ 63562823 64695339 65939737 66947255 68142002 69394989 70652788 72035440 73604369
3565G3604369J609174J666478J745884J594214J676849J854994J818266J945661
$$ 73604369 75213543 76880021 78625905 80220119 81896968 83751962 85570228 87515889
3557H7515889J900370J804410J884349J737804J659129J744158J837814J797645
$$ 87515889 89416259 91220669 93105018 94842822 96501951 98246109 100083923 101881568
3549A01881568J816570J875101K037954K024913K017200K035678K039568K119964
$$ 101881568 103698138 105573239 107611193 109636106 111653306 113688984 115728552 117848516
3541A17848516K268582K515458K569036K779115K815417L095323L380665L593940
$$ 117848516 120117098 122632556 125201592 127980707 130796124 133891447 137272112 140866052
3533A40866052L760571L906074M009473M285571M388942M654598N192435N735546
$$ 140866052 144626623 148532697 152542170 156827741 161216683 165871281 171063716 176799262
3525A76799262O290995P074049P805636Q643077R531962J0434638J1519407J2391094
$$ 176799262 183090257 190164306 197969942 206613019 216144981 226579619 238099026 250490120
3517B50490120J3288468J4334079J4977499J5329289J5142356J4206318J2400287
$$ 250490120 263778588 278112667 293090166 308419455 323561811 337768129 350168416
3510C50168416R016341M601886r01203o685614j1906842j5579041j7348661j7432807
$$ 350168416 359184757 363786643 362885440 356199826 344292984 328713943 311365282 293932475
3502B93932475j6415565j4672603j2955080j1276171r923237q566369p640448
$$ 293932475 277516910 262844307 249889227 238613056 228689819 220123450 212483002
3495B12483002o835840o189150n425694n214065m766182m446003m107608l846244
$$ 212483002 205647162 199458012 194032318 188818253 184052071 179606068 175498460 171652216
3487A71652216l416412l030738k650942k231202k002252j706120j670224k193367
$$ 171652216 168235804 165205066 162554124 160322922 158320670 156614550 154944326 152750959
3479A52750959k944786l429979l759432l770303l619704l430772l466771l351145
$$ 152750959 149806173 146376194 142616762 138846459 135226755 131795983 128329212 124978067
3471A24978067l390858l239524l082161k900104k834890k763055k584009k499403
$$ 124978067 121587209 118347685 115265524 112365420 109530530 106767475 104183466 101684063
3463A01684063k473696k219988k013611j965734j750212j458746j352863j183276
$$ 101684063 99210367 96990379 94976768 93011034 91260822 89802076 88449213 87265937
3455H7265937j028808p78328n02967N1321M49940P27890P69921J84999j193395
$$ 87265937 86237129 85458801 84955834 85007155 85457095 86184985 86954906 87139905 85946510
3446H5946510k494432l106786l105805k819800k591324k134690j820280j446971
$$ 85946510 83452078 80345292 77239487 74419687 71828363 69693673 67873393 66426422
3438F6426422j271227j236437j100063j097597r23780p44877p80282q49783q06338
$$ 66426422 65155195 63918758 62818695 61721098 60797318 60052441 59272159 58422376 57616038
3429E7616038q25308o78910n39703n38779m26810k87058k80602k37232j91710
$$ 57616038 56790730 56111820 55572117 55033338 54606528 54319470 54038868 53801636 53609926
3420E3609926K11711K52611L83660N57025K06022k62421q07571j197793j365817
$$ 53609926 53821637 54074248 54457908 55014933 55220955 54958534 54150963 52953170 51587353
3411E1587353j301895j227022j078494r86160q81955q12298o75865o68943n99830
$$ 51587353 50285458 49058436 47979942 46993782 46111827 45299529 44623664 43954721 43354891
3402D3354891n11214n58163n54903m07388l25902n08212l97688m29919l83949
$$ 43354891 42843677 42285514 41730611 41323223 40997321 40489109 40091421 39661502 39277553
3393C9277553l17774l79295l08978k77737l97257l22830k56847l65896j90566
$$ 39277553 38959779 38580484 38271506 37993769 37596512 37273682 37016835 36650939 36460373
3384C6460373k25491k86777l79756j85843k2613k50554l00351k32997r7085r3326
$$ 36460373 36234882 35948105 35568349 35382506 35359893 35109339 34808988 34575991 34478906 34385580
3374C4385580k27215k13727j80640k36493j47673j29443j31038j73781j55210
$$ 34385580 34158365 33944638 33763998 33527505 33379832 33250389 33119351 32945570 32790360
3365C2790360k13553j41697n3089j32665k13851n4659j25482j42010q8410j02024
$$ 32790360 32576807 32435110 32382021 32249356 32035505 31980846 31855364 31713354 31624944 31522920
3355C1522920j53476j03400k2695j64204Q645o8763j29605j38837p1372q9168
$$ 31522920 31369444 31266044 31243349 31079145 31087790 31019027 30889422 30750585 30679213 30590045
3345C0590045j72896j96709j38894q8525l12939k58476j33489j73429j86379k36447
$$ 30590045 30417149 30220440 30081546 29993021 29680082 29421606 29288117 29114688 28928309 28691862
3335B8691862j77539k01393j41256l29332k33921k16958k97121k37343j42074
$$ 28691862 28514323 28312930 28171674 27842342 27608421 27391463 27094342 26856999 26714925
3326B6714925k04642j14961j11428j45029m8548r8592j18826o00j67721j72356
$$ 26714925 26510283 26395322 26283894 26138865 26090317 25991725 25872899 25872299 25704578 25532222
3316B5532222j13157j72641o3303j45384k36562j93665k37131k25768k20758k34305
$$ 25532222 25419065 25246424 25183121 25037737 24801175 24607510 24370379 24144611 23923853 23689548
3306B3689548j79042k22007j61800j39895r8968j89296k21220j97661j57223k50852
$$ 23689548 23510506 23288499 23126699 22986804 22887836 22698540 22477320 22279659 22122436 21871584
3296B1871584n3241k6651m6796n9314p0521n4793l9880r6824j96971Q4663N6106
$$ 21871584 21818343 21791692 21744896 21685582 21615061 21560268 21520388 21423564 21226593 21311256 21367362
3285B1367362n4837k2225O2696J06819K477L4342k1606L2468K20795J5495r0378
$$ 21367362 21312525 21290300 21352996 21459815 21462292 21496634 21475028 21507496 21728291 21743786 21653408
3274B1653408R9750L982R5270J28756J10977J45522J50411O2532k2277J38386
$$ 21653408 21753158 21757140 21852410 21981166 22092143 22237665 22388076 22450608 22428331 22566717
3264B2566717J49434J15756R7640J56910K88663K57994J85594K48738K13303K75036
$$ 22566717 22716151 22831907 22929547 23086457 23375120 23633114 23818708 24067446 24280749 24555785
3254B4555785K27578J76523K95584L51741M13494K73670L67238M65737L85277
$$ 24555785 24783363 24959886 25255470 25607211 26020705 26294375 26661613 27127350 27512627
3245B7512627L90863K54368L08216L76708K87545L18120K47115L04278L77200
$$ 27512627 27903490 28157858 28466074 28842782 29130327 29448447 29695562 29999840 30377040
3236C0377040K92708M53550N30248K96587L06037K61029K48968L33445L16798
$$ 30377040 30669748 31123298 31653546 31950133 32256170 32517199 32766167 33099612 33416410
3227C3416410K69480K98284L21550N38787M99815N65483P13876O75866P37012
$$ 33416410 33685890 33984174 34305724 34844511 35344326 35909809 36623685 37299551 38036563
3218C8036563Q03054J012267R63606J051811J128443R67852J029930Q37621Q80977
$$ 38036563 38839617 39851884 40815490 41867301 42995744 43963596 44993526 45831147 46712124
3209D6712124R55080J057611J209841J391875J452335J546976J667583J682115
$$ 46712124 47667204 48724815 49934656 51326531 52778866 54325842 55993425 57675540
3201E7675540J896710J674362J667586J487568J349037J196955R93419Q49878
$$ 57675540 59572250 61246612 62914198 64401766 65750803 66947758 67941177 68791055
3193F8791055O35038O11287N92765N72815O18534P47610R00022J022561J159206
$$ 68791055 69426093 70037380 70630145 71202960 71821494 72569104 73469126 74491687 75650893
3184G5650893J111992J223858J679870J860230K051626K167625K498420K992533
$$ 75650893 76762885 77986743 79666613 81526843 83578469 85746094 88244514 91237047
3176I1237047K964637L154496L595936L985648M187662M226019M276561M092978
$$ 91237047 94201684 97356180 100952116 104937764 109125426 113351445 117628006 121720984
3168A21720984L258214K256979N99036j096186k794156l836926m265608m156306
$$ 121720984 124979198 127236177 127835213 126739027 123944871 120107945 115842337 111686031
3160A11686031l528822k467870j775438q53037j01784L20423Q28419J271618J623648
$$ 111686031 108157209 105689339 103913901 103060864 102959080 103279503 104107922 105379540 107003188
3151A07003188J896764K132428K217495K495765K429715K468728K415907K251497
$$ 107003188 108899952 111032380 113249875 115745640 118175355 120644083 123059990 125311487
3143A25311487J935882J472091P24363k22933j224964k093194k610689l022645
$$ 125311487 127247369 128719460 129443823 129220890 127995926 125902732 123292043 120269398
3135A20269398l267176l806814m373679m247726l941621l446111k805674k196180
$$ 120269398 117002222 113195408 108821729 104574003 100632382 97186271 94380597 92184417
3127I2184417j686565j045958p43449l83657m2424J72450N5925r0819k86998n85366
$$ 92184417 90497852 89451894 88708445 88324788 88282364 88454814 88510739 88419920 88132922 87547556
3117H7547556j067532j276773j612759j759967k271311k773986l159300l610509
$$ 87547556 86480024 85203251 83590492 81830525 79559214 76785228 73625928 70015419
3109G0015419l557279l404374l175312k977197k637018k485921k198364j865668
$$ 70015419 66458140 63053766 59878454 56901257 54264239 51778318 49579954 47714286
3101D7714286j808210j686085j429563j314208j178977r10167r57557r77418q07763
$$ 47714286 45906076 44219991 42790428 41476220 40297243 39387076 38429519 37452101 36644338
3092C6644338o68932o35270p53585r30024q44987q49800r24813r37599j067719
$$ 36644338 35975406 35340136 34586551 33656527 32811540 31961740 31036927 30099328 29031609
3083B9031609q28507r52481q86593p11137o90119o09536o48584o81247o71488
$$ 29031609 28203102 27250621 26364028 25652891 24962772 24353236 23704652 23023405 22351917
3074B2351917n11188m78012m75763n56507m89112m77478m59984n44996m71405
$$ 22351917 21840729 21362717 20886954 20330447 19841335 19363857 18903873 18358877 17887472
3065A7887472l12855l95945j37022l01984k13266k11243k50970k46385k28553
$$ 17887472 17574617 17178672 17041650 16739666 16526400 16315157 16064187 15817802 15589249
3056A5589249j15390j87419j86611k56251j00546k33774l58951k69722j36267
$$ 15589249 15473859 15286440 15099829 14843578 14743032 14509258 14150307 13880585 13744318
3047A3744318j98690l48557l52408k85085l38542l06177k32664k87998k45903
$$ 13744318 13545628 13197071 12844663 12559578 12221036 11914859 11682195 11394197 11148294
3038A1148294k63448k01731j28226j56814k31081k09343o5576j36283j07522j14090
$$ 11148294 10884846 10683115 10554889 10398075 10166994 9957651 9892075 9755792 9648270 9534180
3028I534180r8186j45896m0663q515j11694j55845j86571j21713k07325j65804
$$ 9534180 9435994 9290098 9249435 9240920 9129226 8973381 8786810 8665097 8457772 8291968
3018H291968q0637j74051j58942k56516k48257r4398q5042j38071k8847j07036
$$ 8291968 8211331 8037280 7878338 7621822 7373565 7279167 7194125 7056054 7027207 6920171
3008F920171k30414p6918q3163j99793j07231l9458j14775p1292j29311j12556
$$ 6920171 6689757 6612839 6529676 6329883 6222652 6183194 6068419 5997127 5867816 5755260
2998E755260N487q4337j02253m1058k35684m0685J6050j10041j05221k5520r4965
$$ 5755260 5760747 5676410 5574157 5533099 5297415 5256730 5272780 5162739 5057518 5031998 4937033
2987D937033p6077k9089k7260j32600j24746j0531M2558q2431j546m5141p0198
$$ 4937033 4860956 4831867 4804607 4672007 4547261 4536730 4579288 4496857 4495311 4450170 4379972
2976D379972k15348r2636R6829P3372j44523n6694n3520J109j20337m3011l4109
$$ 4379972 4164624 4071988 4168817 4242189 4097666 4040972 3987452 3988561 3868224 3825213 3791104
2965C791104M7932M3415o8554m542q9356o2482m5879J02408q9777n5178M4683
$$ 3791104 3839036 3882451 3813897 3809355 3719999 3657517 3611638 3714046 3624269 3569091 3613774
2954C613774p9698p2092j1196j2774n8715m949N9233l9649o702n8397j5565k970
$$ 3613774 3534076 3461984 3450788 3438014 3379299 3374350 3433583 3393934 3387232 3328835 3313270 3310300
2942C310300L7752o5599p5089q3690p499R251r8372j52216J05571O7599L9002
$$ 3310300 3348052 3282453 3207364 3123674 3116175 3125426 3027054 2874838 2980409 3048008 3087010
2931C087010j01422o0340j7677K5070j18146O2090M5244o6682M7905J2471J5589
$$ 3087010 2985588 2925248 2907571 2932641 2814495 2876585 2921829 2855147 2903052 2915523 2931112
2920B931112l1153m2292k7971o9565L7617R1782j0979l4137k2181m751m6629K1918
$$ 2931112 2899959 2857667 2829696 2760131 2797748 2889530 2878551 2844414 2822233 2817482 2770853 2792771
2908B792771j14925M927k9359j1854q5317q8044J27645k5756p0995J3124Q5313
$$ 2792771 2677846 2682773 2653414 2641560 2556243 2468199 2595844 2570088 2499093 2512217 2597530
2897B597530O9430o9992M5089k7936o9359r1065j9982l0720J649J1782J774N6243
$$ 2597530 2666960 2596968 2642057 2614121 2544762 2453697 2433715 2402995 2404644 2416426 2418200 2474443
2885B474443j4977O773N5276K467p7310p5539J3291L9277N5718j57098j04002
$$ 2474443 2459466 2466239 2521515 2523982 2446672 2371133 2384424 2423701 2479419 2322321 2218319
2874B218319J15524j14965p9805O1403M2659o2678K7762j1651k427N5197J279
$$ 2218319 2333843 2218878 2139073 2200476 2243135 2180457 2208219 2196568 2194141 2249338 2250617
2863B250617J2487k3649O1165J76634L794j34585o7208L37N1657j6429r4011j6786
$$ 2250617 2263104 2239455 2300620 2477254 2481048 2346463 2279255 2279592 2331249 2314820 2220809 2204023
2851B204023n6856J2316J1039l5541m3134n6498j06904j30093Q4400J86814j17303
$$ 2204023 2147167 2159483 2170522 2134981 2091847 2035349 1928445 1798352 1882752 2069566 1952263
2840A952263q2813P6453J24449j94276j78741K0656K8430l352n3909J00938L1101
$$ 1952263 1869450 1945903 2070352 1876076 1697335 1717991 1746421 1743069 1689160 1790098 1821199
2829A821199l0638o6687j15435Q531N1214K8497j62876m1450q9908J1991n6381
$$ 1821199 1790561 1723874 1608439 1616970 1668184 1696681 1533805 1492355 1402447 1414438 1358057
2818A358057j30164M1984o2820Q859l5524j1381q734R9816J5911j11576m5216
$$ 1358057 1227893 1269877 1207057 1215916 1180392 1169011 1160277 1260093 1276004 1164428 1119212
2807A119212k494j17439N7399R1528Q16J6900M6553n3189j09884M6295l6032j5494
$$ 1119212 1116718 999279 1056678 1148206 1149022 1165922 1212475 1159286 1049402 1095697 1059665 1044171
2795A044171M2317o4517J15673m8690k9497J9587l7580l5957j3470o1481l3977
$$ 1044171 1086488 1021971 1137644 1088954 1059457 1079044 1041464 1005507 992037 930556 896579
2784H96579l3846K6134J7292j7514J7074J5718R5027r1502P834J9284k2337L1053
$$ 896579 862733 888867 906159 888645 905719 921437 1016464 924962 932796 952080 929743 960796
2772I60796m987m3179j8749j165n5634k7901J8764k2418O718P6150P792o5086
$$ 960796 955809 912630 893881 892716 837082 809181 827945 805527 812245 888395 896187 831101
2760H31101p5274P7822j8161r5922L936M3461j02762K5047p9024O9646P4504j6928
$$ 831101 755827 833649 815488 719566 723502 766963 664201 689248 610224 679870 754374 737446
2748G37446O7402q3149n8244M2751r6556R676J21935p3841p2966J6566J14604
$$ 737446 804848 721699 663455 706206 609650 619326 741261 667420 594454 611020 725624
2737G25624o9804r4463P2827J12840J935r4678o6141k4507p282j10522k7169J15679
$$ 725624 655820 561357 634184 747024 748959 654281 588140 563633 556351 445829 418660 534339
2725E34339J36139o7688j02820L8783q000L1488k8183n7881O2509r2105n5451
$$ 534339 670478 602790 499970 538753 530753 562241 534058 476177 538686 446581 391130
2714C91130p036K0457Q3733j9738L2441j02561l3176J5781r0639P1941K8952j44667
$$ 391130 384094 404551 488284 468546 500987 398426 365250 381031 290392 362333 391285 246618
2702B46618n7188J68011N3643j29347N93P5868K6636M6984n1681N309K6104j00104
$$ 246618 189430 357441 411084 281737 282330 358198 384834 431818 380137 385446 411550 311446
2690C11446j14604K1864m6217n1218J36641o7724j3749N3270Q0427l9843l8305
$$ 311446 196842 218706 172489 121271 257912 190188 176439 229709 310136 270293 231988
2679B31988n2189J16050l1830j2694r8551r198J23079O9308n3799r7041k0989
$$ 231988 179799 295849 264019 251325 152774 143576 266655 335963 282164 185123 164134
2668A64134N2807o053R795K3611r9467o1235K5465K5749N5434P0203l9794n6129
$$ 164134 216941 210888 220683 244294 144827 83592 109057 134806 190240 260443 220649 164520
2656A64520j7990M4934r8556O5745j1211q5627J04259p1183j6783M0311J1792
$$ 164520 146530 191464 92908 158653 147442 61815 166074 94891 78108 118419 130211
2645A30211K1285o875R965R937P599P5307n6900J4081N4238M262l4753N0906N0015
$$ 130211 151496 144621 154586 164523 172122 247429 190529 204610 258848 263110 228357 279263 329278
2632C29278k8134O800j21880j47773j9109J10132m9100J6200k8338n6821L3170
$$ 329278 301144 307944 186064 38291 19182 129314 80214 96414 68076 11255 44425
2621D4425q5805K0796Q8004k2318n2770k2439Q5638r6829o5128k9136l3481J19562
$$ 44425 -41380 -20584 67420 45102 -7668 -30107 55531 -41298 -106426 -135562 -169043 -49481
2609d9481l023O2663o3961j17494Q2506O2601K5984r3014J2472Q7592K3503P7058
$$ -49481 -52504 10159 -53802 -171296 -88790 -26189 -205 -93219 -80747 6845 30348 107406
2597A07406J4938q8847l2690o2803K6867J618L8319p4129o581K5864j01049N9908
$$ 107406 122344 33497 807 -61996 -35129 -33511 4808 -69321 -75902 -50038 -151087 -91179
2585i1179J01093o7980j0858K529L4631J27297p1984J495j5454j27224L512M0350
$$ -91179 9914 -58066 -68924 -66395 -31764 95533 23549 25044 9590 -117634 -114122 -73772
2573g3772L3552N2922k9615m1913n0443k0117O3256M1102j113N3903k5767m5420
$$ -73772 -40220 12702 -16913 -58826 -109269 -129386 -66130 -25028 -26141 27762 1995 -43425
2561d3425j17995J2941R4924J2288q6587j8065Q7303J6042J19615K2315p1318
$$ -43425 -161420 -148479 -53555 -41267 -127854 -145919 -58616 -42574 77041 99356 28038
2550B8038k1667K4575n828j08752N2249k4788r7395n3046Q067J04683o8080K7140
$$ 28038 6371 30946 25118 -83634 -31385 -56173 -153568 -206614 -198547 -93864 -161944 -134804
2538a34804N2969Q4656J12347k1011k6918m6184j7865N6540j6632j437r5861J10400
$$ -134804 -81835 2821 115168 94157 67239 21055 3190 59730 43098 41661 -54200 56200
2526E6200m4747L6123N0528o2853L633P5443j0901l3802l8335K7017n5757K1473
$$ 56200 11453 47576 98104 35251 38884 114327 103426 69624 31289 58306 2549 24022
2514B4022q6008k5088K03951n1398k2561J47869N738j78016Q0423J50322o8151
$$ 24022 -61986 -87074 116877 65479 42918 190787 196525 18509 98932 249254 181103
2503A81103j26135P1506K5297o2329J4409p7141J22447J6986m8746O6153j791
$$ 181103 54968 126474 151771 89442 103851 26710 149157 166143 117397 183550 181759
2492A81759K8194o0297m5596O2399k1556O3810k1011o1341R1229P8265N718j02033
$$ 181759 209953 149656 104060 166459 144903 208713 187702 126361 217590 295855 301573 199540
2480A99540l6234J19690J52230p7925J1433n6849M4600p764M2865R1762j1945
$$ 199540 163306 282996 435226 357301 368734 311885 356485 348721 391586 483348 471403
2469D71403P013P0970o2097L5302j2538J3088P3438O2580N3023m2238o571J3826
$$ 471403 478416 549386 487289 522591 510053 523141 596579 659159 712182 669944 663373 677199
2457F77199N1537J3663J50436m2471j56491L711K6163Q492O4506J22625p576L7078
$$ 677199 728736 742399 892835 850364 693873 697584 723747 732239 796745 919370 911794 948872
2445I48872o0666Q9990O4544K48K7537R9364M4865l5181q575J7871m4348J32429
$$ 948872 888206 978196 1042740 1042988 1070525 1169889 1214754 1179573 1170998 1188869 1144521 1276950
2433A276950Q2811m8737M334J09651J7517N2377Q5641J6448M9017L4938K06154
$$ 1276950 1359761 1311024 1315358 1425009 1442526 1494903 1580544 1596992 1646009 1680947 1887101
2422A887101J8479j9140M0159Q2925J18024N6018Q4604J39843J90052J20063J30541
$$ 1887101 1905580 1886440 1926599 2009524 2127548 2183566 2268170 2408013 2598065 2718128 2848669
2411B848669J25349J80983J31800K34252J59856K17913J36284K3688l1477K26320
$$ 2848669 2974018 3155001 3286801 3521053 3680909 3898822 4035106 4058794 4027317 4253637
2401D253637J94390P1839l1040K05524J18148N8398K64105L57180K67744L58318
$$ 4253637 4448027 4519866 4488826 4694350 4812498 4870896 5135001 5492181 5759925 6118243
2391F118243L13476J65532M06890L81842M14023N34076N39866N33484N46154M74837
$$ 6118243 6431719 6597251 7004141 7385983 7800006 8334082 8873948 9407432 9953586 10428423
2381A0428423O03500Q87142J004111J327854J566879K084158L047476M020129
$$ 10428423 11031923 11919065 12923176 14251030 15817909 17902067 20949543 24969672
2373B4969672N361668P161451R356546J0201533R845927N42945r559494j1268399
$$ 24969672 30331340 37492791 46849337 57050870 66896797 67439742 57880248 46611849
2365D6611849r847375q329246o070359m008141k877311k161456j617010j189699
$$ 46611849 36764474 28435228 22364869 18356728 15479417 13317961 11700951 10511252
2357A0511252q32564n29477l42773l00429m44408p45072q32443p41576o06340
$$ 10511252 9678688 9149211 8806438 8506009 8061601 7316529 6484086 5742510 5136170
2348E136170n22642k85527l71787k01855q0094j33524j45412j38517o4568j37161
$$ 5136170 4613528 4328001 3956214 3754359 3674265 3540741 3395329 3256812 3192244 3055083
2338C055083l03849k29478j43114j41210j36212j27979j25195j39227M0858M6926
$$ 3055083 2751234 2521756 2378642 2237432 2101220 1973241 1848046 1708819 1749677 1796603
2328A796603j41605k42799J2629m9467q7612M1541O3042p4886J3983j28795l6242
$$ 1796603 1654998 1412199 1424828 1375361 1287749 1329290 1392332 1317446 1331429 1202634 1166392
2317A166392r1836j02522m1748l223k053m3456k315K0834j27359l2471q53Q0836
$$ 1166392 1074556 972034 930286 927063 925010 881554 879239 900073 772714 740243 739390 820226
2305H20226j18194m6205o4596n2816n2522j6863j32252m8988J03012L9008L4740
$$ 820226 702032 655827 591231 538415 485893 469030 336778 287790 390802 429810 464550
2294D64550j9539o1436L8649M9187p6621r6184n1672N6680Q3596l6630m6165J3094
$$ 464550 445011 383575 422224 471411 394790 298606 246934 303614 387210 350580 304415 317509
2282C17509r533M1508q9555m5605N5251L9354j6752j34010O7591q83j02469O135
$$ 317509 307976 349484 259929 214324 269575 308929 292177 158167 225758 224875 122406 128541
2270A28541J03363l4780j34255n2636J55388N5263o4163k0972n0599j3369k0209
$$ 128541 231904 197124 62869 10233 165621 220884 156721 135749 85150 71781 51572
2259E1572L1651M2502L1309o420k4067J026L5026l263r6135j33444J22845m803
$$ 51572 83223 125725 157034 150614 126547 127573 162599 159336 63201 -70243 52602 47799
$$ [...]
##END NTUPLES=NMR SPECTRUM
##END=
