##TITLE=1H_EC-3304(II-1)-9
 CDCl3
 8 sc, 
 20.11.2023
##JCAMPDX= 6.0         $$ Bruker NMR JCAMP-DX V2.0
##DATA TYPE= NMR SPECTRUM
##DATA CLASS= NTUPLES
##ORIGIN= UXNMR, Bruker Analytische Messtechnik GmbH
##OWNER= root
$$ XWIN-NMR		Version 3.5
$$ Mon Nov 20 15:51:07 2023 Russian Standard Time (UT+4h)  she@DPX200
##.OBSERVE FREQUENCY= 200.1313
##.OBSERVE NUCLEUS= ^1H
##.ACQUISITION MODE= SIMULTANEOUS
##.ACQUISITION SCHEME= undefined
##.AVERAGES= 8
##.DIGITISER RES= 18
##SPECTROMETER/DATA SYSTEM= spect
##.PULSE SEQUENCE= zg30
##.SOLVENT NAME= CDCl3
##.SHIFT REFERENCE= (INTERNAL, CDCl3, 0, 15.5122)
##AUDIT TRAIL= $$ (NUMBER, WHEN, WHO, WHERE, WHAT)
$$ ##TITLE= Audit trail, XWIN-NMR		Version 3.5
$$ ##JCAMPDX= 5.01
$$ ##ORIGIN= Bruker BioSpin GmbH
$$ ##OWNER= she
$$ F:/spectra/data/she/nmr/H-F/1/pdata/1/auditp.txt
$$ ##AUDIT TRAIL=  $$ (NUMBER, WHEN, WHO, WHERE, WHAT)
(   1,<2023-11-20 15:49:36.64 +0400>,<she>,<DPX200>,
      <created by zg, POWCHK disabled, PULCHK disabled
       configuration hash MD5:
       00 E9 B6 7A A2 85 ED C7 34 08 36 98 17 FE 4E 26
       data hash MD5: 16K
       91 47 EF 8C 3B 8B 1F 3E 43 D9 88 DA 59 FC C6 5D>)
(   2,<2023-11-20 15:49:39.00 +0400>,<she>,<DPX200>,
      <Start of raw data processing
       efp BC_mod = 2 LB = 0.24 FT_mod = 6 PKNL = 1 PHC0 = -23867.95 PHC1 = 7.652689 SI = 16K 
       data hash MD5: 16K
       12 88 F4 04 8B 66 8A 40 95 10 45 21 21 4B 8F 20>)
(   3,<2023-11-20 15:50:03.98 +0400>,<she>,<DPX200>,
      <pk PHC0 = -7.084395 PHC1 = 11.4 
       data hash MD5: 16K
       3A B9 3D 5E 54 13 39 DA C4 9C E2 D3 BF D5 64 5D>)
(   4,<2023-11-20 15:50:07.20 +0400>,<she>,<DPX200>,
      <abs ABSG = 5 
       data hash MD5: 16K
       03 60 F4 0E A7 DC 79 B1 0B 3A 33 B9 88 A7 65 85>)
$$ ##END=
$$ 
$$ hash MD5
$$ D2 B9 0D 3D B2 55 AF A5 55 7F CB 10 DF F7 46 46
##$RELAX= 
##$RELAX= 
##$RELAX= 
##$RELAX= 
##$RELAX= 
##$RELAX= 
$$ Bruker specific parameters
$$ --------------------------
##$DU= <F:/spectra>
##$EXPNO= 1
##$NAME= <H-F>
##$PROCNO= 1
##$TYPE= <nmr>
##$USER= <she>
##$AMP= (0..31)
100 100 100 100 100 100 100 100 100 100 100 100 100 100 100 100 100 100 
100 100 100 100 100 100 100 100 100 100 100 100 100 100 
##$AQSEQ= 0
##$AQ_mod= 1
##$AUNM= <au_zg>
##$AUTOPOS= <>
##$BF1= 200.13
##$BF2= 200.13
##$BF3= 200.13
##$BF4= 200.13
##$BF5= 200.13
##$BF6= 200.13
##$BF7= 200.13
##$BF8= 200.13
##$BYTORDA= 1
##$CFDGTYP= 0
##$CFRGTYP= 5
##$CHEMSTR= <none>
##$CNST= (0..31)
1 1 145 1 1 1 1 1 1 1 1 1 1 1 1 1 1 1 1 1 1 1 1 1 1 1 1 1 1 1 1 1 
##$CPDPRG= <>
##$CPDPRG1= <>
##$CPDPRG2= <>
##$CPDPRG3= <>
##$CPDPRG4= <mlev>
##$CPDPRG5= <mlev>
##$CPDPRG6= <mlev>
##$CPDPRG7= <mlev>
##$CPDPRG8= <mlev>
##$CPDPRGB= <>
##$CPDPRGT= <>
##$D= (0..31)
0 1.2 0 0 0 0 0 0 0 0.06 0 0.03 0 0 0 0 0.0002 0 0 0 0 0 0 0 0 0 0 0 0 
0 0 0 
##$DATE= 1700480976
##$DBL= (0..7)
120 120 120 120 120 120 120 120 
##$DBP= (0..7)
150 150 150 150 150 150 150 150 
##$DBP07= 0
##$DBPNAM0= <>
##$DBPNAM1= <>
##$DBPNAM2= <>
##$DBPNAM3= <>
##$DBPNAM4= <>
$$ [...]
##$SUBNAM3= <"">
##$SUBNAM4= <"">
##$SUBNAM5= <"">
##$SUBNAM6= <"">
##$SUBNAM7= <"">
##$SUBNAM8= <"">
##$SUBNAM9= <"">
##$SW= 18.0517328524113
##$SWIBOX= (0..15)
0 0 2 0 0 0 0 0 0 0 0 0 0 0 0 0 
##$SW_h= 3612.71676300578
##$TD= 16384
##$TD0= 1
##$TE= 0
##$TE2= 300
##$TE3= 300
##$TEG= 300
##$TL= (0..7)
0 120 120 120 120 120 120 120 
##$TP= (0..7)
150 150 150 150 150 150 150 150 
##$TP07= 0
##$TPNAME0= <>
##$TPNAME1= <>
##$TPNAME2= <>
##$TPNAME3= <>
##$TPNAME4= <>
##$TPNAME5= <>
##$TPNAME6= <>
##$TPNAME7= <>
##$TPOAL= (0..7)
0.5 0.5 0.5 0.5 0.5 0.5 0.5 0.5 
##$TPOFFS= (0..7)
0 0 0 0 0 0 0 0 
##$TUNHIN= 0
##$TUNHOUT= 0
##$TUNXOUT= 0
##$USERA1= <user>
##$USERA2= <user>
##$USERA3= <user>
##$USERA4= <user>
##$USERA5= <user>
##$V9= 5
##$VALIST= <valist>
##$VCLIST= <CCCCCCCCCCCCCCC>
##$VD= 0
##$VDLIST= <DDDDDDDDDDDDDDD>
##$VPLIST= <PPPPPPPPPPPPPPP>
##$VTLIST= <TTTTTTTTTTTTTTT>
##$WBST= 1024
##$WBSW= 4
##$XGAIN= (0..3)
0 0 0 0 
##$XL= 0
##$YL= 0
##$YMAX_a= 390360
##$YMIN_a= -462741
##$ZGOPTNS= <>
##$ZL1= 120
##$ZL2= 120
##$ZL3= 120
##$ZL4= 120
##$ABSF1= 15.47695
##$ABSF2= -2.5749
##$ABSG= 5
##$ABSL= 3
##$ALPHA= 0
##$AQORDER= 0
##$ASSFAC= 0
##$ASSFACI= 0
##$ASSFACX= 0
##$ASSWID= 0
##$AUNMP= <proc_1d>
##$AZFE= 0.1
##$AZFW= 0.1
##$BCFW= 0
##$BC_mod= 2
##$BYTORDP= 0
##$COROFFS= 0
##$CY= -3
##$DATMOD= 1
##$DC= 0
##$DFILT= <>
##$DTYPP= 0
##$F1P= 0
##$F2P= 0
##$FCOR= 1
##$FTSIZE= 16384
##$FT_mod= 6
##$GAMMA= 0
##$GB= 0
##$INTBC= 1
##$INTSCL= 3.70164e-10
##$ISEN= 128
##$LB= 0.24
##$LEV0= 0
##$LPBIN= 0
##$MAXI= 10000
##$MC2= 0
##$MEAN= 0
##$ME_mod= 0
##$MI= 1.114404
##$NCOEF= 0
##$NC_proc= -4
##$NLEV= 6
##$NOISF1= 3.799351
##$NOISF2= 2.8
##$NSP= 0
##$NTH_PI= 0
##$NZP= 0
##$OFFSET= 15.51221
##$PC= 1
##$PHC0= -23875.03
##$PHC1= 19.05269
##$PH_mod= 1
##$PKNL= yes
##$PPARMOD= 0
##$PSCAL= 0
##$PSIGN= 0
##$REVERSE= no
##$SF= 200.130001900958
##$SI= 16384
##$SIGF1= 3
##$SIGF2= 2
##$SINO= 5.538805
##$SIOLD= 16384
##$SREGLST= <1H.CDCl3>
##$SSB= 0
##$STSI= 16384
##$STSR= 0
##$SW_p= 3612.71676300578
##$SYMM= 0
##$S_DEV= 0
##$TDeff= 16384
##$TDoff= 0
##$TI= <>
##$TILT= no
##$TM1= 0
##$TM2= 0
##$TOPLEV= 0
##$USERP1= <user>
##$USERP2= <user>
##$USERP3= <user>
##$USERP4= <user>
##$USERP5= <user>
##$WDW= 1
##$XDIM= 16384
##$YMAX_p= 277392642
##$YMIN_p= -102644
$$ End of Bruker specific parameters
$$ ---------------------------------
##NTUPLES= NMR SPECTRUM
##VAR_NAME=  FREQUENCY,     SPECTRUM/REAL,   SPECTRUM/IMAG
##SYMBOL=    X,             R,               I
##VAR_TYPE=  INDEPENDENT,   DEPENDENT,       DEPENDENT
##VAR_FORM=  AFFN,          ASDF,            ASDF
##VAR_DIM=   16384,         16384,           16384
##UNITS=     HZ,            ARBITRARY UNITS, ARBITRARY UNITS
##FACTOR=    0.220516191357247, 1,           1
##FIRST=     3104.45859522864, 0,            0
##LAST=      -508.258167777135, 0,           0
##MIN=       -508.258167777135, -102644,     0
##MAX=       3104.45859522864, 277392642,    0
$$ Real data points
##PAGE= N=1
##DATA TABLE= (X++(R..R)), XYDATA
$$ [...]
8539C24763k2884m2683q499j1711k3412L672P484R213l77k5402J5737N6045N287
$$ 324763 301879 259196 250697 238986 215574 219246 226730 235943 235566 210164 225901 281946 287233
8526B87233K9747M718K0923L3197k09L4649M2888J3057J2148L816M605o691K90
$$ 287233 316980 321698 342621 375818 375609 410258 453146 466203 478351 482167 486772 480081 480371
8513D80371k6501R714J6036O498j6653j030K4583Q468O25m1303n3417k4672m1102
$$ 480371 453870 463584 479620 486118 469465 468435 493018 501486 502111 460808 407391 382719 341617
8500C41617k3281M479q005j8284j8017j5303k4857k4824k3987O529J3817o570
$$ 341617 318336 322815 314810 296526 278509 263206 238349 213525 189538 196067 209884 203314
8488B03314Q38j820J4849r323J1773J1896M135K9351K7138N646j3071L013K5171
$$ 203314 204152 202332 217181 207858 219631 231527 235662 265013 292151 297797 284726 287739 312910
8475C12910j4257j7977j6325K3346k7532k9449K3758p374J6880q50m3179J4433
$$ 312910 298653 280676 264351 287697 260165 230716 254474 247100 263980 263130 219951 234384
8463B34384n476k1991J7545j0477q818m3328P641l0451l1862M977O377J3295J4069
$$ 234384 228908 206917 224462 213985 205167 161839 169480 139029 107167 112144 118521 131816 145885
8450A45885L717L4088p819l5799k7332j9964j3326J3521J2312J1357J1807k8320
$$ 145885 149602 183690 175871 140072 112740 92776 79450 92971 105283 116640 128447 100127
8438A00127k6310J022J0366J5560j8627j5675J330q57n750k2784P438P652R80
$$ 100127 73817 74839 85205 100765 82138 66463 67793 66936 61186 38402 45840 53492 54472
8425E4472k1076l014L2438l57Q935J423j8310j8750J7656j8853j731n285p639
$$ 54472 33396 30382 62820 62463 71398 72821 54511 35761 53417 34564 32833 27548 19909
8412A9909p694J1381k2671j435N286j9896L3387Q335l0412P700K582k712J8187
$$ 19909 12215 23596 925 -510 4776 -15120 18267 26602 -3810 3890 6472 3760 21947
8399B1947l686R292k2423K1443L4533j0940l9102J9433m199k4145J7071Q500l288
$$ 21947 18261 27553 5130 26573 61106 50166 11064 30497 26298 2153 19224 27724 24436
8386B4436k0743k5450O268O091J1993J9924L317J8747q218k4255Q737L1625k8231
$$ 24436 3693 -21757 -15489 -9398 2595 22519 25836 44583 36365 12110 20847 52472 24241
8373B4241l4572J0641r145L0521j7974l900P924j2834O692K892O344R997j1676
$$ 24241 -10331 310 -8835 21686 3712 -188 7736 -5098 1594 4486 10830 20827 9151
8360I151j5484k012J1662K756M827J2383j8046M282J685J196K1187l0842J0645
$$ 9151 -6333 -8345 3317 6073 10900 23283 5237 9519 11204 12400 33587 2745 13390
8347A3390K2101J313l1233k1262K2061k888R518j4287j372L4678p785J5620k3158
$$ 13390 35491 36804 5571 -15691 6370 3482 13000 -1287 -2659 32019 24234 39854 16696
8334A6696l1811J3521R001r353J63j5882j1060Q550K4236J2522J3186k5843k4752
$$ 16696 -15115 -1594 7407 -1946 -1783 -17665 -28725 -20175 4061 16583 29769 3926 -20826
8321b0826J3023J6126K4261j5588k5098O249j9168q268J9946q191j5456K3362
$$ -20826 -7803 8323 32584 16996 -8102 -1853 -21021 -29289 -9343 -17534 -32990 -9628
8309i628J5097j579j7646n233K2226L451J6504j0163m7711M0028n294k5892M041
$$ -9628 5469 3890 -13756 -18989 3237 6688 23192 13029 -34682 5346 52 -25840 -21799
8296b1799n451K0156R42J8185m245N61j1409j0300j5403K1465k1554K4775j0086
$$ -21799 -27250 -7094 -6152 12033 7788 8349 -3060 -13360 -28763 -7298 -28852 -4077 -14163
8283a4163J6527J3693P230l3985n704L556j2979N348o862j46K3860N63P738J2195
$$ -14163 2364 16057 23287 -10698 -16402 -12846 -25825 -20477 -27339 -27485 -3625 -3062 4676 16871
8269A6871o248k1678J1299Q674j3914L5488j1477J0387k4660Q282l982N56k91
$$ 16871 10623 -11055 244 8918 -4996 30492 19015 29402 4742 13024 9042 9598 9307
8256I307k5479j0081J2954J8327K4789j0357k909O650J119Q702K950j2072R512
$$ 9307 -16172 -26253 -13299 5028 29817 19460 16551 23201 24320 33022 35972 23900 33412
8243C3412j4201m0041J8503j2564M218K4671K0668j546l196J1157o252k350l772
$$ 33412 19211 -20830 -2327 -14891 -10673 13998 34666 33120 29924 41081 34829 32479 28707
8230B8707k2707M909J4019o98J9622j7752k1959p194J620j2662N858j6229O392
$$ 28707 6000 10909 24928 24230 43852 26100 4141 -3053 -1433 -14095 -8237 -24466 -18074
8217a8074K8071k4822L314J2803J1851K1604l2945L396R045R102k1963j6613J4765
$$ -18074 9997 -14825 -11511 1292 13143 34747 1802 5198 14243 23345 1382 -15231 -466
8204d66j46K6766j5697K5041j7855r45J9918Q426m1605L763J7135M7884j4699
$$ -466 -612 26154 10457 35498 17643 16698 36616 45042 3437 7200 24335 72219 57520
8191E7520n1353k0230m908K619K368L3209k6823l993M463P670J1464K22j9442
$$ 57520 6167 -14063 -18971 -16352 -13984 19225 -7598 -11591 -7128 542 12006 12228 -7214
8178g214m180k8803K5020J6201l775m058K0590J1587k1509R519n867J8050k2170
$$ -7214 -11394 -40197 -15177 1024 -2751 -6809 13781 25368 3859 13378 7511 25561 3391
8165C391J7966J8907j4935q14J0826j6269l2849N628M313K4579j3347m933k237
$$ 3391 21357 40264 25329 24515 35341 19072 -13777 -8149 -3836 20743 7396 2463 226
8152B26q042L392P479j1004r373L0755n398O132P77K3187q976k7103M0663j8452
$$ 226 -7816 -4424 3055 -7949 -17322 13433 8035 14167 14944 38131 29155 2052 42715 24263
8138B4263l40M917l4035J6679J1023k2567Q405J90j256M534L0869j4484l0171
$$ 24263 23923 28840 -5195 11484 22507 -60 8345 8535 7279 11813 42682 28198 -1973
8125a973l0916Q209J8489J644j249J0509O027K2510j6507j3760r031l0873K4762
$$ -1973 -32889 -24680 -6191 -4547 -5796 4713 10740 33250 16743 2983 -6048 -36921 -12159
8112a2159J0633K7801P218l0886Q171K2429J4457k6991m016j6975l419k881o491
$$ -12159 -1526 26275 33493 2607 10778 33207 47664 20673 16657 -318 -3737 -6618 -13109
8099a3109m077J0584J4900J7886j0121k1192J0941Q68r065J3274k002j3658L1274
$$ -13109 -17186 -6602 8298 26184 16063 -5129 5812 6680 -2385 10889 8887 -4771 26503
8086B6503j6604J169K4114J6143j8336j1662j2041J1308j8405R99K4393q081k1404
$$ 26503 9899 11068 35182 51325 32989 21327 9286 20594 2189 3188 27581 19500 -1904
8073a904L955J0417J3131j1988j5588O239K1136k6644q29J6942M458r854k277
$$ -1904 2051 12468 25599 13611 -1977 4262 25398 -1246 -2075 14867 19325 9471 7194
8060G194k5413j750M461K897K8463K0395k9836m308o237m052K0524j0411R08J1775
$$ 7194 -18219 -19969 -15508 -12611 15852 36247 6411 2103 -4134 -8186 12338 1927 2835 14610
8046A4610P112p256k0216j5760J759l13N136r198m649j0933K8823J7971R443j1983
$$ 14610 21722 14466 -5750 -21510 -19751 -20064 -14928 -24126 -28775 -39708 -10885 7086 16529 4546
8032D546R203k8018k3736J2149K872J0590j1637J805L8482P52j0794k883j0186
$$ 4546 13749 -14269 -38005 -25856 -22984 -12394 -24031 -22226 16256 17008 6214 3331 -6855
8019f855j3513k11J7923M503J9666R276q445k1934j2667q199J13j4507M073J4304
$$ -6855 -20368 -20579 -2656 1847 21513 30789 22344 410 -12257 -20456 -20343 -34850 -30777 -16473
8005a6473P961N978k3829P498K0274j5627J7027R113j9086n557k4874L2075K492
$$ -16473 -8512 -2534 -26363 -18865 1409 -14218 2809 11922 -7164 -12721 -37595 -5520 -3028
7992c028R604j6912p39K0258L382j5830n27j1127J4140k994j5611K0698n14r334
$$ -3028 6576 -10336 -11075 9183 12565 -3265 -3792 -14919 -779 -3773 -19384 1314 800 -8534
7978h534j3149j106r544K7455k1507k0683j2855J8117J0612n046J4860o019q418
$$ -8534 -21683 -22789 -32333 -4878 -26385 -47068 -59923 -41806 -31194 -36240 -21380 -27399 -35817
7965c5817L9824J9153j8707o672k6011K6552J9195k0498j272j0180J2526o288
$$ -35817 4007 23160 4453 -2219 -28230 -1678 17517 -2981 -4253 -14433 -1907 -8195
7953h195J6986j3926n966j9418J879J3339J6257p151Q900k0606m430m030j8144
$$ -8195 8791 -5135 -11101 -30519 -28640 -15301 956 -6195 2705 -17901 -22331 -26361 -44505
7940d4505L3063l726K538Q603j2066l0818M057J2987K4604j2715J4120k83P197
$$ -44505 -11442 -15168 -12630 -4027 -16093 -46911 -42854 -29867 -5263 -17978 -3858 -4141 3056
7927C056j1867J0714j2283q559P417j8565O474J8332M612k142O978L339J8421
$$ 3056 -8811 1903 -10380 -18939 -11522 -30087 -23613 -5281 -669 -2811 4167 7506 25927
7914B5927k5771k2688K0946j1807L1941k0109l459J6996j2042p253m055M6970
$$ 25927 156 -22532 -1586 -13393 18548 -1561 -5020 11976 -66 -7319 -11374 35596
7902C5596r26r939l0208m879q219J3951J485j4726n676j2678J4714l72q188K4123
$$ 35596 34670 24731 -5477 -10356 -18575 -4624 -3139 -17865 -23541 -36219 -21505 -21877 -30065 -5942
7888e942K3537K339l1633J5291j1472J75L0620j7929k142q81M543j7757j4281
$$ -5942 17595 19934 -11699 3592 -7880 -7705 22915 4986 2844 1963 6506 -11251 -25532
7875b5532K2848K3020J0579l6292k2286J6971j1692R434K8012n449k1320p606
$$ -25532 -2684 20336 30915 -5377 -27663 -10692 -22384 -12950 15062 9613 -11707 -19313
7863a9313K5583m038l302r83k8678M564R52K3760k6449o247k705L447J261J1769
$$ -19313 6270 2232 -1070 -2053 -30731 -26167 -25215 -1455 -27904 -34151 -36856 -33409 -32148 -20379
7849b0379Q606K5924J2455l7634j0969K0325L299N713j0417q523J4945j8016J1735
$$ -20379 -11773 14151 26606 -11028 -21997 -1672 1627 7340 -3077 -11600 3345 -14671 -2936
7836b936l647J4985J4457O399o038l0267L442j4491M510m531K4475r361l046J777
$$ -2936 -6583 8402 22859 29258 23220 -7047 -3605 -18096 -13586 -18117 6358 -3003 -6049 -4272
7822d272k043o501j9628L490L6191K617k0006J5138K220l732J616L223j6110P445
$$ -4272 -6315 -12816 -32444 -28954 7237 9854 -10152 4986 7206 3474 5090 8313 -7797 -352
7808c52l0987k7072l857K7842J2325n3077k7466J50478K3776k8261q363k0976
$$ -352 -31339 -58411 -62268 -34426 -22101 -75178 -102644 47834 71610 43349 34986 14010
7796A4010J3439l1726j5045Q505R025j172K1956O991j5443m088p795K0469J2843
$$ 14010 27449 -4277 -19322 -10817 -1792 -2964 18992 25983 10540 6452 -1343 19126 31969
7783C1969m0589R55K4878r131p14q474r264R910J8488j6169k656J01q436J9287
$$ 31969 -8620 -7665 17213 8082 7368 -1106 -10370 -460 18028 1859 -797 -696 -9132 10155
7769A0155j2458O91j2086J7940N937J1659N195k3419l1375K1407J1998n670j0348
$$ 10155 -2303 -1612 -13698 4242 10179 21838 27033 3614 -27761 -6354 5644 -26 -10374
7756a0374N539K5531j8604K7976Q26k9926p605J0001j2383R66n891J6982n39r890
$$ -10374 -4835 20696 2092 30068 30894 968 -6637 3364 -9019 -8053 -13944 3038 2499 -7391
7742g391J4694l380J1258l924J721R796j8863k892O952J3672m4129o840J7166
$$ -7391 7303 3923 15181 11257 12978 22774 3911 1019 7971 21643 -22486 -29326 -12160
7729a2160K6606o025J68j4057j442o96P918o769J3579N773j5145J461q785m901
$$ -12160 14446 8421 8589 -5468 -6910 -7606 312 -6457 7122 12895 -2250 -789 -9574 -14475
7715a4475J9213K1791j6672k1368j2595J8708J7511P778j7346J5837l844k196
$$ -14475 4738 26529 9857 -11511 -24106 -5398 12113 19891 2545 18382 14538 12342
7703A2342J9885j2683k2802K4457j9505J2827L987j649j3985j452O860j1458N457
$$ 12342 32227 19544 -3258 21199 1694 14521 18508 16859 2874 1422 8282 -3176 2281
7690B281J5084j4022J1688j531Q565j4432m0090o299L6155j40J0043R043p575
$$ 2281 17365 3343 15031 13500 22065 7633 -32457 -38756 -2601 -2741 7302 16345 8770
7677H770J7459j2453j0799j917o532j2763J9122K2390N493o845k9033K768j3950
$$ 8770 26229 13776 2977 1060 -5472 -18235 887 23277 28770 21925 -7108 -4340 -18290
7664a8290l766K6205P26K5412J2777j4361j8857k2216J572Q503j4358J850J3460
$$ -18290 -22056 4149 4875 30287 43064 28703 9846 -12370 -10798 -2295 -16653 -14803 -1343
7651a343P343J5434j8990k0542J1823P12O365j5825p799L8018J202J0415Q343
$$ -1343 6000 21434 2444 -18098 -6275 -5563 802 -15023 -22822 15196 16398 26813 35156
7638C5156k6061P499J6851j394o287l432k9505j667J8202P716j8414J7658J2585
$$ 35156 9095 16594 33445 32051 25764 22332 -7173 -8840 9362 17078 -1336 16322 28907
7625B8907k2781L788j9189J9589R456j3188J2310n695j0803j5511R465J1219m865
$$ 28907 6126 9914 -9275 10314 19770 6582 18892 13197 2394 -13117 -3652 7567 2702
7612B702J5075j195j003J6188k8096k3371L860J3629K674L0473R828l4277j2594
$$ 2702 17777 16582 15579 31767 3671 -19700 -15840 -2211 463 30936 40764 6487 -6107
7599f107J0652k366L615m916K509o61J8521J6029k8099j1982M71J0646j0776L6
$$ -6107 4545 2179 5794 878 3387 2726 21247 37276 9177 -2805 -2334 8312 -2464 -2428
7585b428Q504j4904j0867q103O818M4848p613O174q812N750M48j7236o366m713
$$ -2428 6076 -8828 -19695 -27798 -20980 23868 16255 22429 13617 19367 19815 2579 -3787 -8500
7571h500L0031J253q826R680q383j8010J6576j2561n309P549J548j2100P687k1065
$$ -8500 21531 22784 13958 23638 15255 -2755 13821 1260 -4049 3500 5048 -7052 635 -20430
7557b0430m698K2687N799P957j8594L3005L491k683q560k3394j3380q013J1584
$$ -20430 -25128 -2441 3358 11315 -7279 25726 29217 26534 17974 -5420 -18800 -26813 -15229
7544a5229O239J1857J2611k4819l1969K2702J9789P754r183k8526j643K5463J431
$$ -15229 -8990 2867 15478 -9341 -41310 -18608 1181 8935 -248 -28774 -30417 -4954 -3523
7531c523L618p928K159R819K4674k1900k370m3016K3222J9971L3505l6102n093
$$ -3523 95 -7833 -5674 4145 28819 6919 4549 -38467 -15245 4726 38231 2129 -2964
7518b964K7703l3599k685K3199q998l1947Q635K9121Q488j1165j127o384j510
$$ -2964 24739 -8860 -11545 11654 2656 -29291 -20656 8465 16953 5788 4661 -1723 -3233
7505c233n849j2424J8890N22k5835M3852j1426K926m690O501k107j252N213k6026
$$ -3233 -9082 -21506 -2616 -2094 -27929 15923 4497 7423 2733 9234 7127 5875 11088 -14938
7491a4938J7953J4406j1018J4093l2604j0238Q254j3750J4307K070k604J158m193
$$ -14938 3015 17421 6403 20496 -12108 -22346 -14092 -27842 -13535 -11465 -14069 -12911 -17104
7478a7104K7370J8008j6472j0812j6777j6724Q342J0611L4330M807J604k3665
$$ -17104 10266 28274 11802 990 -15787 -32511 -24169 -13558 20772 25579 27183 3518
7466C518j091K563J4249l8404j5175J5198L8940P528j6053O258L953j0381J4126
$$ 3518 2427 4990 19239 -19165 -34340 -19142 19798 27326 11273 17531 21484 11103 25229
7453B5229m267j097M690j1870m601J0536n278o868j6644n370K0447j4462J9669
$$ 25229 20962 19865 24555 12685 8084 18620 13342 6474 -10170 -15540 4907 -9555 10114
7440A0114K675j8011L1091k5291J4780n464k5353o759J4239Q960k4936r58J7412
$$ 10114 12789 -5222 25869 578 15358 9894 -15459 -22218 -7979 981 -23955 -24913 -7501
7427g501J4537m7680J4334J6122K4786M878Q517L913m710j4975J938M036n369
$$ -7501 7036 -40644 -26310 -10188 14598 19476 27993 31906 27196 12221 14159 18195 12826
7414A2826N90L6224j1696j3594K5684m7765P732J792O467l1680k1031M8847J7188
$$ 12826 13416 49640 37944 24350 50034 2269 10001 11793 18260 -13420 -34451 14396 31584
7401C1584k0574l506J034q92l690M996N544Q521j0583k4314L1679K323j5607k2979
$$ 31584 11010 7504 8538 7646 3956 8952 14496 23017 12434 -11880 19799 22122 6515 -16464
7387a6464K0833LR335l64K6255j4780p708j0982j4863O939J9668j91L950l3332
$$ -16464 4369 4372 13707 13343 39598 24818 17110 6128 -8735 -1796 17872 17681 21631 -11701
7373a1701K3945O751j2828K9245k942l8556L0137J5182k8570j7259M913J3381
$$ -11701 12244 18995 6167 35412 32470 -6086 24051 39233 10663 -6596 -1683 11698
7361A1698q297J1840K4070j2932k2737l5230L961M5330J242n05j5725J9158j2745
$$ 11698 3401 15241 39311 26379 3642 -31588 -27627 17703 18945 18440 2715 21873 9128
7348I128M36P683n349j2368j1297J6405k524q161Q159J0015j730q584n002J0475
$$ 9128 9564 17247 11898 -470 -11767 4638 2114 -6047 2112 12127 10397 1813 -3189 7286
7334G286j076j1248K0438k84P592l399q132j0194r288J0562J3419l2800o531K9330
$$ 7286 6210 -5038 15400 15116 22708 19309 11177 983 -8305 2257 15676 -17124 -23655 5675
7320E675K537k8413J52J2365K0690j3493l3137l769J7635k3962J6284K5308J5956
$$ 5675 8212 -20201 -20049 -7684 13006 -487 -33624 -37393 -19758 -43720 -27436 -2128 13828
7307A3828P047r002k8601j4618j1553L9338L8761k4547P22j6531j57j167r704
$$ 13828 20875 11873 -16728 -31346 -42899 -3561 35200 10653 11375 -5156 -5313 -6480 -16184
7294a6184R190K249r191J1244K0144n264k1762k998K0924n071j1098r860K4491
$$ -16184 -6994 -4745 -13936 -2692 17452 12188 -9574 -12572 8352 3281 -7817 -17677 6814
7281F814j1872J2319L1776l7187j3797J179R306J1033j0782J5312J2265k961K7717
$$ 6814 -5058 7261 39037 1850 -11947 -10768 -1462 9571 -1211 14101 26366 23405 51122
7268E1122j8733l255J714j8538L149q828j6016k3332L8465K5409l484J8445k5660
$$ 51122 32389 29134 30848 12310 15459 6631 -9385 -32717 5748 31157 27673 46118 20458
7255B0458Q247j1778O966L006j259q35o668k8860J8432M592J4295q480J0693k6096
$$ 20458 28705 16927 23893 26899 25640 24805 18137 -10723 7709 12301 26596 18116 28809 2713
7241B713r607K2607k2381K7436J1349K327l5260J5077j1692p339N329J0212j824
$$ 2713 -6894 15713 -6668 20768 32117 34444 -816 14261 2569 -4770 559 10771 8947
7228H947O3L886J0540J341L784k842L151k592j7281K938m018k0349J722K8958
$$ 8947 9010 12896 23436 24777 28561 25719 28870 26278 8997 11935 7917 -12432 -10710 18248
7214A8248r460J2282J0014J6530l3523j517r850P780J3557o728r814O821J6828
$$ 18248 8788 21070 31084 47614 14091 12574 2724 10504 24061 17333 7519 14340 31168
7201C1168L909j4118j7935q385N201J5469K911L1354Q366O169j4076o750P505
$$ 31168 35077 20959 3024 -5361 -160 15309 18220 49574 57940 64109 50033 43283 50788
7188E0788j0722j267R324j0749M657M400n868j0509O075J4587j0895j4662k7581
$$ 50788 40066 38799 48123 37374 42031 46431 40563 30054 36129 50716 39821 25159 -2422
7175b422J6127P500j8700K4431n341Q487Q150m648k4826L205p422J6500k677K457
$$ -2422 13705 21205 2505 26936 21595 30082 38232 33584 8758 11963 4541 21041 18364 20821
7161B0821M801J1445r526l5773j2115K2300j0496r402l456J0134L177j8069K3314
$$ 20821 25622 37067 27541 -8232 -20347 1953 -8543 -17945 -21401 -11267 -8090 -26159 -2845
7148b845J7993J9316P661j0836M653n491j308J0691n462q664j1994J0257P997
$$ -2845 15148 34464 42125 31289 35942 30451 29143 39834 34372 25708 13714 23971 31968
7135C1968J2409j1393n962N088m103J0180J6933L404k9900m170N245k2325K4619
$$ 31968 44377 32984 27022 32110 28007 38187 55120 58524 28624 24454 29699 7374 31993
7122C1993p403j3801j6053M0653j4140l512L118j2514K703O046J1967N537k361
$$ 31993 24590 10789 -5264 35389 21249 17737 20855 8341 11044 17090 29057 34594 32233
7109C2233K669k2862M783R016M753k0518p013m310P733R134k7220K1595k574j5517
$$ 32233 34902 12040 16823 25839 30592 10074 3061 -1249 6484 15618 -11602 9993 7419 -8098
7095h098m937K674k342J9254J0851J334L336j9586J7209J7341l122J0131j0864
$$ -8098 -13035 -10361 -12703 6551 17402 18736 22072 2486 19695 37036 33914 44045 33181
7082C3181r403P922j8648J33J120m798R204r652J0305j6182J0360k1632J6371
$$ 33181 23778 31700 13052 13185 14305 9507 18711 9059 19364 3182 13542 -8090 8281
7069H281J9536p87n58R902N865j3884j7792o998j8342l841Q01L4804P625J5326
$$ 8281 27817 27030 26472 36374 42239 28355 10563 3565 -14777 -18618 -17817 16987 24612 39938
7055C9938j5657k7690L8201p902j3799j0437K3689j6887N041J2031j0445J8179
$$ 39938 24281 -3409 34792 26890 13091 2654 26343 9456 14497 26528 16083 34262
7043C4262q241j2926l908K0726K815N900r481j6005K518K160J073J8265M375M084
$$ 34262 26021 13095 9187 29913 32728 38628 29147 13142 15660 17820 18893 37158 41533 45617
7029D5617l840p207L876k660N473j8991q319l2799J6440L9882l554j0997J6498
$$ 45617 41777 34570 38446 35786 41259 22268 13949 -18850 -2410 37472 33918 22921 39419
7016C9419J2761j0679k7841o584L0824M558M460J4805Q938J0878k7509j5078j6158
$$ 39419 52180 41501 13660 7076 37900 42458 46918 61723 70661 81539 54030 38952 22794
7003B2794L8681l190k2488l398M41l3719m5319K1727L3671J5394r23j7510J480
$$ 22794 61475 58285 35797 32399 32840 -879 -46198 -24471 9200 24594 23671 6161 7641
6990G641K4191J826j1148J1464j2925p02L30O034k0736r083K5809L937O099R677
$$ 7641 31832 33658 22510 33974 21049 20347 20677 26711 5975 -3108 22701 26638 32737 42414
6976D2414P178O171j8289j1197O86q777l016J1456q57j1123J1777J7557j6160
$$ 42414 49592 55763 37474 26277 26963 18186 15170 26626 25769 14646 26423 43980 27820
6963B7820k112J2729N603k6026j7072Q381j1838K9994m755J9472L030o912j6986
$$ 27820 25708 38437 44040 18014 942 9323 -2515 27479 22724 42196 45226 38314 21328
6950B1328J6350k1962j601L0560N172n627O541J995N408j316N270q96k4020r655
$$ 21328 37678 15716 14115 44675 49847 44220 50761 52756 58164 56848 62118 61222 37202 27547
6936B7547J1176K097p253L888N939j9327J0037j2296L1130k409m8132R369O132
$$ 27547 38723 40820 33567 37455 43394 24067 34104 21808 52938 50529 2397 11766 17898
6923A7898j1850J8306J4937L057j4475j0685J5436J1869k6800l172j1870J524
$$ 17898 6048 24354 39291 42348 27873 17188 32624 44493 17693 14521 2651 4175
6911D175J8680M439R925n081n256m393J9883l634J333M064K0101O843l1504j1517
$$ 4175 22855 27294 37219 32138 26882 22489 42372 38738 40071 44135 64236 71079 39575 28058
6897B8058J2860q193J0107j067p144k8329Q594J8147J7201p4l0161J572l965k761
$$ 28058 40918 32725 42832 41765 34621 6292 14886 33033 50234 50160 19999 21571 17606 14845
6883A4845p78J3575J0591L2215J0856L15l2869q777K061n210j2581j1233K8091
$$ 14845 14067 27642 38233 70448 81304 81619 48750 39973 42034 36824 24243 13010 41101
6870D1101n525J2457J8239l1729o506K2922j5826K2209k661P16q877K0133R176
$$ 41101 35576 48033 66272 34543 28037 50959 35133 57342 54681 55397 46520 66653 75829
6857G5829n245j5499Q77L392M492k7813J915j8435j099J1048P031p035P595j2756
$$ 75829 70584 55085 55962 59354 63846 36033 37948 19513 18414 29462 36493 29458 37053 24297
6843B4297J7230J4159j4544j6636J387k609j127K1949p433j6126N750J4753l060
$$ 24297 41527 55686 41142 24506 25893 23284 22157 44106 36673 20547 26297 41050 37990
6830C7990J5988M484L242j2840k2388K3831o930k054J5715l2706J0263J5417j2778
$$ 37990 53978 58462 61704 48864 26476 50307 43377 41323 57038 24332 34595 50012 37234
6817C7234O889q967K4605J4570K06o987P275K7330j2875j0395m2075K8331J1313
$$ 37234 44123 35156 59761 74331 74537 67550 74825 102155 89280 78885 36810 65141 76454
6804G6454l074J9771K593r774k0494O119O088k0193l4815J8391J7252m942N687
$$ 76454 73380 93151 95744 85970 65476 71595 77683 57490 22675 41066 58318 53376 59063
6791E9063M974k141N668P354j5522K9422L612K814k7664K1124q811l169j6340
$$ 59063 64037 61896 67564 74918 59396 88818 92430 95244 67580 88704 79893 76724 60384
6778F0384n898J3446J0916P900J175o363m034j366J5932J4508k1351L2997K4761
$$ 60384 54486 67932 78848 86748 87923 81560 77526 76160 92092 106600 85249 118246 143007
6765A43007n09J2496R47j1210j0904k070p686J4557j8801J4584M163l3894p637
$$ 143007 142498 154994 155941 144731 133827 131757 124071 138628 119827 134411 138574 104680 97043
6752I7043n165P884K6377K6482j8922k5005O002J9520k1868k973K5927r411j8074
$$ 97043 91878 99762 126139 152621 133699 108694 114696 134216 112348 109375 135302 125891 107817
6739A07817k736J6255J3120K6126k5525p828n135j0531N978J4126J5412P960Q453
$$ 107817 105081 121336 134456 160582 135057 127229 122094 111563 117541 131667 147079 155039 163492
6726A63492l035j8143J243L729j6646K1777J5111j8487r350o637K837J4264k6046
$$ 163492 160457 142314 143557 147286 130640 152417 167528 149041 139691 133054 135891 150155 124109
6713A24109K2512R002l012K7940k3629j2217J5890q887J1035J0696K931O936J9405
$$ 124109 146621 155623 152611 180551 156922 144705 160595 151708 162743 173439 176370 183306 202711
6700B02711m7382P418o371Q141K2574J8132k181j3398J6378j0671J625L2333K945
$$ 202711 155329 162747 156376 164517 187091 205223 203042 189644 206022 195351 196976 229309 232254
6687B32254q143J4184o815r772l513k2895N276P266J4407J5146j0506j3783K342
$$ 232254 224111 238295 231480 221708 218195 195300 200576 207842 222249 237395 226889 213106 215448
6674B15448K1684J1860J0756J6J1977M250J5910J0604R993j0433j7056r136L214
$$ 215448 237132 248992 259748 259764 271741 275991 291901 302505 312498 302065 285009 275873 279087
6661B79087K3814k9603k4855o600J8595L5636j0971J001K1684n751j143J4326
$$ 279087 302901 273298 248443 241843 260438 296074 285103 286104 307788 302037 300894 315220
6649C15220l956Q962n128K4142K7087j9355j1185K4436l686L5154J4843O794L9293
$$ 315220 311264 320226 315098 339240 366327 346972 335787 360223 356537 391691 406534 413328 452621
6636D52621J2710L7177K80q783J355K3806l590j1810j5259l1781j2714J4120J9693
$$ 452621 465331 502508 502788 494005 495360 519166 515576 503766 488507 456726 444012 458132 477825
6623D77825L8700K8476l816J8274q186n069L1453J1320P304L4877K8117m4552
$$ 477825 516525 545001 541185 559459 551273 546204 577657 588977 596281 631158 659275 614723
6611F14723j7965Q895j036l744K6852J5869j2187K2241N856K191p020n57k3711
$$ 614723 596758 605653 604617 600873 627725 643594 631407 653648 659504 661695 654675 654118 630407
6598F30407J8953l9041Q777N0951K962K5175k1664l7773n2453k5262j7750j7922
$$ 630407 649360 610319 619096 670047 673009 698184 676520 638747 586294 561032 543282 525360
6586E25360l6350k4770k9290J12k2923K7290J5596k5218L849j8742k9392K106
$$ 525360 489010 464240 434950 435062 412139 439429 455025 429807 433656 414914 385522 387628
6574C87628l370k3684k625K0099L8134J5700k9724K0003J8692j7928o416j2010
$$ 387628 384258 360574 357949 378048 416182 431882 402158 422161 440853 422925 416509 404499
6562D04499k1850j2125l088l060J3875k1536o207O159k5456N450J7451k323m868
$$ 404499 382649 370524 367436 364376 378251 356715 350508 356667 331211 336661 354112 351789 346921
6549C46921j0248K2454K890J6404J6235O523l548k1605k7663L3554O845k1177
$$ 346921 336673 359127 362017 378421 394656 401179 397631 376026 348363 381917 388762 367585
6537C67585q603m225J3696j4536j0758L086J5762J8175j1554L952l0736j2598
$$ 367585 358982 354757 368453 353917 343159 346245 362007 380182 368628 372580 341844 329246
6525C29246j0341K4736J4158q713l722O498M260K1328j2665k3725j6564K1121
$$ 329246 318905 343641 357799 349086 345364 351862 356122 377450 364785 341060 324496 345617
6513C45617L4730k3821N787o764j330K1243J6528l115K0514R255j0619k863K6251
$$ 345617 380347 356526 362313 355549 354219 375462 391990 388875 409389 418644 408025 405162 431413
6500D31413o099j4750J8417Q573K057J1999K289J1974j684K3608P792l676J2934
$$ 431413 425314 410564 428981 437554 439611 451610 453899 465873 464189 487797 495589 491913 504847
6487E04847k553J6084O134K7810L7087m1178l7415J4535J7728N844j6428N7k801
$$ 504847 502294 518378 524512 552322 589409 548231 510816 525351 543079 548923 532495 532552 529751
6474E29751J5865P302l942n843l291j4679J7838L782O382J8385o850k784L655
$$ 529751 545616 552918 548976 543133 539842 525163 543001 546783 553165 571550 564700 561916 565571
6461E65571J5721q361q510J0656R22J5835J7520o735l148l982k1047K0155p574
$$ 565571 581292 572931 564421 575077 575999 591834 609354 602619 599471 595489 574442 594597 587023
6448E87023P062J0851j4805J5559J8465N647L444j8981K3050O907K5589J8002
$$ 587023 594085 604936 590131 605690 624155 629802 633246 614265 637315 644222 669811 687813
6436F87813O298K5976j8187K2470J9705K4758l9198R328L0464m423k9508L7988
$$ 687813 694111 720087 701900 724370 744075 768833 729635 738963 769427 765004 735496 773484
6424G73484K7552j6701L0303K9369J8441J1930K1535J1923J8067K1430J3411M8233
$$ 773484 801036 784335 814638 844007 862448 874378 895913 907836 925903 947333 960744 1008977
6412A008977M444M2666L0309L3167P825l1888q128K018K3808J4618j4598L4539
$$ 1008977 1013421 1056087 1086396 1119563 1127388 1095500 1087372 1089390 1113198 1127816 1113218 1147757
6400A147757L0872N8627L2652J4360L4550J2918L5975M7708P8627L8640J2801
$$ 1147757 1178629 1237256 1269908 1284268 1318818 1331736 1367711 1415419 1494046 1532686 1545487
6389A545487L8312J1559q63L242L3215J9108O3243J4569L5442K6669K3852J2367
$$ 1545487 1583799 1595358 1594495 1597737 1630952 1650060 1713303 1727872 1763314 1789983 1813835 1826202
6377A826202K803M2343L0921K9842O5191L9489M6338Q5652N6942O1989R456M4705
$$ 1826202 1829005 1871348 1902269 1932111 1997302 2036791 2083129 2168781 2225723 2287712 2297168 2341873
6365B341873N4848M7870M5883N1374K6963N6405L4830O0292O9168P7435M7195
$$ 2341873 2396721 2444591 2490474 2541848 2568811 2625216 2660046 2720338 2789506 2866941 2914136
6354B914136Q6386P7874M3166O0771O0083R8381Q7961P4735J14474J01824R1721
$$ 2914136 3000522 3078396 3121562 3182333 3242416 3340797 3428758 3503493 3617967 3719791 3811512
6343C811512R1493J27696J07859J31954J43873J57935J44991J42865J50918J38872
$$ 3811512 3903005 4030701 4138560 4270514 4414387 4572322 4717313 4860178 5011096 5149968
6333E149968J80682J63046J77374J87025J79251J96258K21984J88487K04569J97051
$$ 5149968 5330650 5493696 5671070 5858095 6037346 6233604 6455588 6644075 6848644 7045695
6323G045695K04634K39647K32711K78491L07994L60657L90630L94775M27726M59008
$$ 7045695 7250329 7489976 7722687 8001178 8309172 8669829 9060459 9455234 9882960 10341968
6313A0341968N35053N78485O17311P24850Q39743J009446J160234J357909J607576
$$ 10341968 10877021 11455506 12072817 12797667 13637410 14646856 15807090 17164999 18772575
6304A8772575J882001K284404K842920L603973M544186N589218O165646M445372
$$ 18772575 20654576 22938980 25781900 29385873 33930059 39519277 45684923 50130295
6296E0130295q7600l970403m952858m135115k814311j503536l54205P16459J773833
$$ 50130295 50042695 46072292 41119434 36984319 34170008 32666472 32312267 33028726 34802559
6287C4802559K809508L862446M057605K358368j36713r05448J50143J834048L483800
$$ 34802559 37612067 41474513 45532118 47890486 47753773 46848325 46998468 48832516 52316316
6278E2316316M177435K612549q81663m038116m999013m074206k421072o92273
$$ 52316316 56493751 59106300 58224637 54186521 49187508 45113302 42692230 41999957
6270D1999957R53160J952945Q90510j832338l489814l165467k060184q66966K66624
$$ 41999957 42953117 44906062 45796572 43964234 40474420 37308953 35248769 34381803 34648427
6261C4648427J495370K798166M065038N301663N055933J254558m402146p432121
$$ 34648427 36143797 38941963 43007001 48308664 53364597 54619155 50217009 42784888
6253D2784888p266363o025705m658905l542056k635331k001973j571302j258277
$$ 42784888 35518525 29492820 24833915 21291859 18656528 16654555 15083253 13824976
6245A3824976j057659q84911p67308p36800o37004n69088n34546m30873m25953
$$ 13824976 12767317 11882406 11115098 10378298 9741294 9172206 8637660 8206787 7780834
6236G780834l88595l14084k72837k87612k75938k83828k91461k63394k23640k18761
$$ 7780834 7392239 7078155 6805318 6517706 6241768 5957940 5666479 5403085 5179445 4960684
6226D960684k12633j96210j61685j63403j67822j09206j65568j28185j01180r2107
$$ 4960684 4748051 4551841 4390156 4226753 4058931 3949725 3784157 3655972 3554792 3462685
6216C462685q3430r1265q9497o2274o8331o8175j22601q0404q2008p5316k7382
$$ 3462685 3379255 3287990 3198493 3136219 3067888 2999713 2877112 2796708 2714700 2639384 2612002
6205B612002q3948q8031o2663q8650m8575p7981m1905k8144m3035m8570j00364
$$ 2612002 2528054 2440023 2377360 2288710 2240135 2162154 2120249 2092105 2049070 2000500 1900136
6194A900136m1614k3317m1530l3532l1872l9338l5510r337k3969n0918k6020k2028
$$ 1900136 1858522 1835205 1793675 1760143 1728271 1688933 1653423 1644086 1620117 1569199 1543179 1521151
6182A521151j6374k98j9817n351k8933k6042j6012j957J3576K80J4000J5274j6273
$$ 1521151 1504777 1504479 1484662 1479311 1450378 1424336 1408324 1406367 1419943 1420223 1434223 1449497 1433224
6169A433224l5542m4308n0759n5777k9140k8863r888j5171J0854o867J595k9473
$$ 1433224 1397682 1353374 1302615 1246838 1217698 1188835 1178947 1163776 1174630 1167763 1169358 1139885
6157A139885m0440n114o395J3570J495J7447l060k4339p471J1991j3218k2933
$$ 1139885 1099445 1094331 1087936 1101506 1103001 1120448 1117388 1093049 1085578 1097569 1084351 1061418
6145A061418k8658n255N226J3577L2387L8594J1176L7061K9675M1175L0462K0729
$$ 1061418 1032760 1027505 1032731 1046308 1078695 1117289 1128465 1165526 1195201 1236376 1266838 1287567
6133A287567j1592K577L0059j8685j4338J847k1465j7199q578K624j9670k7888
$$ 1287567 1275975 1278552 1308611 1289926 1275588 1277435 1255970 1238771 1230193 1232817 1213147 1185259
6121A185259l3853L901J5087P78K2712n859k088N7501M4080J5692J624O5595P7804
$$ 1185259 1151406 1155307 1170394 1171172 1193884 1188025 1185937 1243438 1287518 1303210 1304834 1370429 1448233
6108A448233P1222M7816M9009J0778m20j1305n7803o0497m2484k979n4325n779
$$ 1448233 1519455 1567271 1616280 1627058 1626638 1615333 1557530 1497033 1454549 1451570 1397245 1391466
6096A391466l8419k4653k5968l4816p899j5015j0326j1759q705k2022L966k5762
$$ 1391466 1353047 1328394 1302426 1267610 1259711 1244696 1234370 1222611 1213906 1191884 1195850 1170088
6084A170088J1786J1546o209J9287L1247K1218O472j2476m2603m2907n098k1321
$$ 1170088 1181874 1193420 1187211 1206498 1237745 1258963 1265435 1252959 1210356 1167449 1162351 1141030
6072A141030k7169j0990L905K4271M3110n219l1476k9385l4077l1441m6504m0831
$$ 1141030 1113861 1102871 1106776 1131047 1174157 1168938 1137462 1108077 1074000 1042559 996055 955224
6060I55224l0109m572j1456P788l162j0119k3386j6629j9638k4462O806J8638
$$ 955224 925115 920543 909087 916875 913713 903594 880208 863579 843941 819479 826285 844923
6048H44923O056K391L0814N967j0222o7956k0435J190k1328j8594j9557K2904
$$ 844923 850979 853370 884184 890151 879929 811973 791538 792728 771400 752806 733249 756153
6036G56153j8757r880k3229k0032m268R109L7455K1137L0002K0930k9117l506
$$ 756153 737396 727516 704287 684255 679987 689096 726551 747688 777690 798620 769503 765997
6024G65997J2451K876J0768J8641Q541R217l3414o5273n9962j8562l082j8771
$$ 765997 778448 781324 792092 810733 819274 828491 795077 729804 669842 651280 648198 629427
6012F29427P872q999j0335k6180O983J9425k262j1547P729K875J9336J541k8382
$$ 629427 637299 628300 617965 591785 598768 618193 615931 604384 612113 614988 634324 635865 607483
5999F07483J456K7203J2894k452j758l537K1234K4411N682J3516K3295K3953J5595
$$ 607483 608939 636142 649036 646584 644826 641289 662523 686934 692616 706132 729427 753380 768975
5986G68975P303M3114J0206j9384l2512j408n817M05m762o477K5482q326P82L0386
$$ 768975 776278 819392 829598 810214 777702 776294 770477 770882 766120 759643 785125 776799 777581 807967
5972H07967M0935Q103m25K8821k1975L9833M2476K242J4109K7982J4659m3915
$$ 807967 848902 857005 856580 885401 863426 903259 945735 947977 962086 990068 1004727 960812
5960I60812j4652R715M638M6120M5615J6487k3352k6618k2265n148l649O743l554
$$ 960812 946160 955875 960513 1006633 1052248 1068735 1045383 1018765 996500 991352 987703 994446 990892
5947I90892L4013L3961K934M6457M8602L647k9651j2465P125L171R415k4375j7255
$$ 990892 1024905 1058866 1061800 1108257 1156859 1160506 1130855 1118390 1125515 1128686 1138101 1113726 1096471
5934A096471j5018k1478j1523l7878R345j2901M794P352J8606n535k6759J1727
$$ 1096471 1081453 1059975 1048452 1010574 1019919 1007018 1011812 1019164 1037770 1032235 1005476 1017203
5922A017203l6335j3790L4193L7459J6821J3258L8652N687p998k8633m9277j0929
$$ 1017203 980868 967078 1001271 1038730 1055551 1068809 1107461 1113148 1105150 1076517 1027240 1016311
5910A016311l3168r78m783Q867m5420k0469J4662M4746R892k4507j2098n331m282
$$ 1016311 983143 982165 977382 986249 940829 920360 935022 979768 989660 965153 953055 947724 943442
5897I43442j8198O873K976Q730j3373K6086K3630M57J1904j1540K8043N0036J4900
$$ 943442 925244 932117 935093 943823 930450 956536 980166 980623 992527 980987 1009030 1059066 1073966
5884A073966J3482K948L926j1574J1354K3955R706L213K5069k0049K1753K6569
$$ 1073966 1087448 1090396 1094322 1082748 1094102 1118057 1127763 1130976 1156045 1135996 1157749 1184318
5872A184318n72K7100N3242J8147K0419J6103N6950M4834J3605J9946M5526R970
$$ 1184318 1183746 1210846 1264088 1282235 1302654 1318757 1375707 1420541 1434146 1454092 1499618 1509588
5860A509588J8349J6634K7291M2649J4784L6762Q750J9607M1747J7663M1931K2692
$$ 1509588 1527937 1544571 1571862 1614511 1629295 1666057 1674807 1694414 1736161 1753824 1795755 1818447
5848A818447M0455L6794L5702L1894J8270L4931Q37N6239P6321M6214O3564P2307
$$ 1818447 1858902 1895696 1931398 1963292 1981562 2016493 2017330 2073569 2149890 2196104 2259668 2331975
5836B331975O2911R2182R4028Q9712O2699N0975K7936P190J4629P288J2099J996
$$ 2331975 2394886 2487068 2581096 2670808 2733507 2784482 2812418 2819608 2834237 2841525 2853624 2855620
5824B855620J2859L6243J3893M9872N5419j105J2218J0020L5463L2623N5954J01969
$$ 2855620 2868479 2904722 2918615 2968487 3023906 3022801 3035019 3045039 3080502 3113125 3169079 3271048
5812C271048J27877J11821P8147Q2332Q1136N9824J02944P4492N3823J15348J07758
$$ 3271048 3398925 3510746 3588893 3671225 3752361 3812185 3915129 3989621 4043444 4158792 4266550
5801D266550P7344R6907Q0042Q5647Q8048P2817J04372R0192Q8460J23803J44709
$$ 4266550 4343894 4440801 4520843 4606490 4694538 4767355 4871727 4961919 5050379 5174182 5318891
5790E318891J67913J57669J53288J88356J63318J86076K21308K01784K26016K34975
$$ 5318891 5486804 5644473 5797761 5986117 6149435 6335511 6556819 6758603 6984619 7219594
5780G219594K31985K45757K19621K55982K64592K48418K44705K78396K88599K87339
$$ 7219594 7451579 7697336 7916957 8172939 8437531 8685949 8930654 9209050 9497649 9784988
5770I784988K61042L05089L76198M06065M46093N26465N76604O60157P27600Q03864
$$ 9784988 10046030 10351119 10727317 11133382 11579475 12105940 12682544 13342701 14070301 14874165
5760A4874165P63733Q44995J012917J219978J466117J729728K075121K527693
$$ 14874165 15637898 16482893 17495810 18715788 20181905 21911633 23986754 26514447
5752B6514447L142337M032125N086138O251255P127116N736313P98664m210594
$$ 26514447 29656784 33688909 38775047 45026302 52153418 57889731 58688395 54477801
5744E4477801n866343n148490l650969k066969o47904O55150J826445K941853
$$ 54477801 48611458 43462968 39811999 37745030 37097126 37752276 39578721 42520574
5736D2520574L823569L029809M24361j609256j476456j80142J439653L179379
$$ 42520574 46344143 49373952 49798313 48189057 46712601 46532459 47972112 51151491
5728E1151491M625023M676747K371937j399806m125120m399629l090397j371087
$$ 51151491 55776514 60453261 62825198 61425392 57300272 52900643 49810246 48439159
5720D8439159K94490O91582j065452l297171l808949l031787j872917q13416K38442
$$ 48439159 48733649 49425231 48359779 45062608 41253659 38221872 36348955 35535539 35773981
5711C5773981J310990K410761L445091M479532M593664J864468k870132n938913
$$ 35773981 37084971 39495732 42940823 47420355 52014019 53878487 51008355 45069442
5703D5069442o189396n251983m051331l033566k228590j726115j323178j043762
$$ 45069442 38880046 33628063 29576732 26543166 24314576 22588461 21265283 20221521
5695B0221521p65222o08350n32820m33746l40501k31835j50951r5878l2789k0899
$$ 20221521 19456299 18847949 18315129 17881383 17540882 17309047 17158096 17062218 17029429 17008530
5685A7008530K6887L5819J03850P7944J14226J87948J84633J90001K02995K09151
$$ 17008530 17035417 17071236 17175086 17253030 17367256 17555204 17739837 17929838 18132833 18341984
5675A8341984K43529K05911K17762K24964K64239K75872L57760M19912N56752
$$ 18341984 18585513 18791424 19009186 19234150 19498389 19774261 20132021 20551933 21108685
5666B1108685O55301P69404Q16843R17186J032561J217392J432440J656125J876310
$$ 21108685 21763986 22533390 23350233 24267419 25299980 26517372 27949812 29605937 31482247
5657C1482247K279064K831028L532168M256858N251416O389756Q133104J0670379
$$ 31482247 33761311 36592339 40124507 44381365 49632781 56022537 64155641 74826020
5649G4826020J4115984J7924469K2412274K6778677K0705134k262417k3540887
$$ 74826020 88942004 106866473 129278747 156057424 176762558 174500141 150959254
5642A50959254k8074665k4163592j8598422j3814727r910430p312324n537147
$$ 150959254 122884589 98720997 80122575 66307848 56397418 49085094 43547947
5635D3547947m348702l395527k788694k303709j978916j672631j418737j257066
$$ 43547947 39199245 35803718 33015024 30711315 28732399 27059768 25641031 24383965
5627B4383965j112912j026450r28928p78135o60936n81556n99632n93011o13789
$$ 24383965 23271053 22244603 21315675 20537540 19876604 19295048 18695416 18102405 17488616
5618A7488616o19721o20916n95867m89061l92700k69394k17872j40827j22427
$$ 17488616 16868895 16247979 15652112 15163051 14770351 14500957 14283085 14142258 14019831
5609A4019831j14898j14563q4007j02086j27254p0065q4786j55282k11550k28279
$$ 14019831 13904933 13790370 13706363 13604277 13477023 13406958 13322172 13166890 12955340 12727061
5599A2727061k78252k87606l30093l52058k98714k73841j76806j26692j29636
$$ 12727061 12448809 12161203 11831110 11479052 11180338 10906497 10729691 10602999 10473363
5590A0473363j52615k05314k07208k48652k98606k43020k22303k09543k06385
$$ 10473363 10320748 10115434 9908226 9659574 9360968 9117948 8895645 8686102 8479717
5581H479717k09938k22384j57265j45330j42526j34371j51988j83150j89091k08474
$$ 8479717 8269779 8047395 7890130 7744800 7602274 7467903 7315915 7132765 6943674 6735200
5571F735200j68081j73401j21218j04110j32319j16202n9992q7201p6358j04811
$$ 6735200 6567119 6393718 6272500 6168390 6036071 5919869 5859877 5772676 5696318 5591507
5561E591507n6774n2838Q758m8707k2044k3230o581L601k913r244p088Q926K5294
$$ 5591507 5534733 5481895 5490653 5441946 5419902 5396672 5390091 5393692 5390779 5381535 5374447 5383373 5408667
5548E408667O157l5099k8341k0885k6524p1183p1910p3594m2654p2098p5638q6015
$$ 5408667 5414824 5379725 5351384 5330499 5303975 5232792 5160882 5087288 5044634 4972536 4896898 4810883
5536D810883q7851r5940j03585o1164j4125k8384j7171j9035m0331p978R050M654
$$ 4810883 4723032 4627092 4523507 4462343 4448218 4419834 4402663 4383628 4343297 4335319 4344369 4349023
5524D349023J5599q474M4K7792K2033k2937k2011J3969j1808k0028n8992o7005
$$ 4349023 4364622 4356148 4356192 4383984 4406017 4383080 4361069 4375038 4363230 4343202 4284210 4217205
5512D217205m6711k2359m1667l9947L0423K5853p44K606j5132P32j0132m2441
$$ 4217205 4170494 4148135 4106468 4066521 4096944 4122797 4122053 4124659 4109527 4110259 4100127 4057686
5500D057686m8152j4268m5757l6706n0994o9159p0633q7533p6293q3570k6041
$$ 4057686 4009534 3995266 3949509 3912803 3861809 3792650 3722017 3634484 3558191 3474621 3448580
5489C448580q9906o9834j9343j4575l0743p2811p5338p7221m6837l1086o3560
$$ 3448580 3358674 3288840 3269497 3254922 3224179 3151368 3076030 2998809 2951972 2920886 2857326
5478B857326n1131l6055l7049j7659k3495l4382o0720n4021o4306r5992p8140
$$ 2857326 2806195 2770140 2733091 2715432 2691937 2657555 2596835 2542814 2478508 2382516 2304376
5467B304376l9127o7971k7755j1939q9759o6802n1399l9830l5228l9613k3809
$$ 2304376 2265249 2197278 2169523 2157584 2067825 2001023 1949624 1909794 1874566 1834953 1811144
5456A811144n9709l7564j4515j1015m5439Q872o243k6930j4459k1881k9659m0633
$$ 1811144 1751435 1713871 1699356 1688341 1642902 1651774 1645531 1618601 1604142 1582261 1552602 1511969
5444A511969l2528j8539o526l2270L7569J7146m6153m2442l1718k3088k729k7340
$$ 1511969 1479441 1460902 1454376 1422106 1459675 1476821 1430668 1388226 1356508 1333420 1330691 1303351
5432A303351M694Q141J5218M530N005K7429L3453L2381Q0164O1216N1251O6823
$$ 1303351 1308045 1316186 1331404 1335934 1340939 1368368 1401821 1434202 1514366 1575582 1626833 1693656
5420A693656N7731Q3603J65317J58826K06422J30021q3118k41335k12758j70034
$$ 1693656 1751387 1834990 2000307 2159133 2365555 2495576 2412458 2171123 1958365 1788331
5410A788331j17501q5130j03684p8252p7697l8667k4841L0458j5280k1241m3710
$$ 1788331 1670830 1585700 1482016 1403764 1326067 1287400 1262559 1293017 1277737 1256496 1212786
5399A212786j3403n0261k9271R30k5351r503L959l238p154l1175l9065k0131k2194
$$ 1212786 1199383 1149122 1119851 1120781 1095430 1085927 1089886 1086648 1079494 1048319 1009254 989123 966929
5386I66929n548m974K9228J8713M1035k1035j8310n9443l1856j2353k7629k5377
$$ 966929 961381 956407 985635 1004348 1045383 1024348 1006038 946595 914739 902386 874757 849380
5374H49380k3165j7208M433l3694j9215p406k829K2212j9042j2360L179l2667
$$ 849380 826215 809007 813440 779746 760531 753125 750296 772508 753466 741106 744285 711618
5362G11618m613J5761R960j7111J4782K3884l0203o057K8020j2831R152j1079
$$ 711618 707005 722766 732726 715615 730397 754281 724078 718021 746041 733210 742362 731283
5350G31283L928p558K561L0333K3993K3336M3179M9230L260P791m3352n2215k7658
$$ 731283 735211 727653 730214 760547 784540 807876 851055 900285 903545 911336 867984 815769 788111
5337G88111m85j9531K1140o752K3023J0993L2393K2900l5553N139L9023L4932
$$ 788111 787626 768095 789235 782483 805506 816499 848892 871792 836239 841378 880401 915333
5325I15333k6406J2355M2223L306M273K3475q30j7928J4900r815Q676j5706o880
$$ 915333 888927 901282 943505 946811 951084 974559 973729 955801 970701 960886 969562 953856 946976
5312I46976j0254j6460R174l5551j1544j2391N333L6810L6535M3701L9429O444
$$ 946976 936722 920262 929436 893885 882341 869950 875283 912093 948628 992329 1031758 1038202
5300A038202l2218m9960k0477O466K1675Q868K527L7774J5856K3004K5118M814
$$ 1038202 1005984 956024 935547 942013 963688 972556 975083 1012857 1028713 1051717 1076835 1081649
5288A081649n681j1461n3935J975K761j5914m7993j4066j9809j2179k9008O093
$$ 1081649 1075968 1064507 1010572 1012547 1015308 999394 951401 937335 917526 905347 876339 882432
5276H82432q409m6374n0515l3741l165L4684N7693L8983M3431J7558M2510M4209
$$ 882432 874023 827649 777134 743393 740228 774912 832605 871588 915019 932577 975087 1019296
5264A019296J2696N3511j6967p580O2390Q0207K9238j2324P651L3595l7461r016
$$ 1019296 1031992 1085503 1068536 1060956 1123346 1203553 1232791 1220467 1228118 1261713 1224252 1215236
5252A215236n4526j6804m9176m7192J3337K1103K3763R695M376K0660J6380L6351
$$ 1215236 1160710 1143906 1094730 1047538 1060875 1081978 1105741 1115436 1119812 1140472 1156852 1193203
5240A193203K4749K8489K1301M0445J0198J8732J708k3043k7178j8647j8229M436
$$ 1193203 1217952 1246441 1267742 1308187 1318385 1337117 1338825 1315782 1288604 1269957 1251728 1256164
5228A256164N0544N1168N0015J5720L8250L7704L3039K1640N1879K9537J8080
$$ 1256164 1306708 1357876 1407891 1423611 1461861 1499565 1532604 1554244 1606123 1635660 1653740
5217A653740K8951J8622N889Q2005K1033K5142K1624J3185j6725l636J1913N4267
$$ 1653740 1682691 1701313 1707202 1789207 1810240 1835382 1857006 1870191 1853466 1849830 1861743 1916010
5205A916010O7311O6454K1517N6502N5000M7453N8118M7010M5415M2902N8081
$$ 1916010 1983321 2049775 2071292 2127794 2182794 2230247 2288365 2335375 2380790 2423692 2481773
5194B481773Q6336O1768P6670R8706J17113J30016J17702Q7329J53344J14368
$$ 2481773 2568109 2629877 2706547 2805253 2922366 3052382 3170084 3257413 3410757 3525125
5184C525125R5781N9929O2830L1420P9804R3360J15789J09804P8703Q6344Q7591
$$ 3525125 3620906 3680835 3743665 3775085 3854889 3948249 4064038 4173842 4252545 4338889 4426480
5173D426480P7364Q9557J18809J63510J62603J16062J14340J36737J13269J70818
$$ 4426480 4503844 4593401 4712210 4875720 5038323 5154385 5268725 5405462 5518731 5689549
5163E689549J54541J79038J49145J96688J68246J60127J51309J29195J17466J37544
$$ 5689549 5844090 6023128 6172273 6368961 6537207 6697334 6848643 6977838 7095304 7232848
5153G232848K07596K11941J72336K38200K34072K67589K53247L58156L79728M60937
$$ 7232848 7440444 7652385 7824721 8062921 8296993 8564582 8817829 9175985 9555713 10016650
5143A0016650M45472M65030M82293M85021M63803N51908N74052N47024N98641
$$ 10016650 10462122 10927152 11409445 11894466 12358269 12910177 13484229 14031253 14629894
5134A4629894O49949O07442O01253N56525N38202M83369M91054N19931N91224
$$ 14629894 15279843 15887285 16488538 17045063 17583265 18066634 18557688 19077619 19668843
5125A9668843O61535P83417R80321J132669J209558J271036J444449J768784K105162
$$ 19668843 20330378 21113795 22094116 23226785 24436343 25707379 27151828 28920612 31025774
5116C1025774K476809K804682L341577M144576N132907O080995P149955Q782123
$$ 31025774 33502583 36307265 39648842 43793418 48926325 55007320 62157275 70939398
5108G0939398J0972719J4417481J9306011K5727649L2325767M2942390M5912061
$$ 70939398 81912117 96329598 115635609 141363258 173689025 216631415 262543476
5101B62543476J4849166l1624374m8127544m2316695l2333084k3656731j7249002
$$ 262543476 277392642 245768268 197640724 155324029 122990945 99334214 82085212
5094H2085212j2422832r418573p302197n841723m612584l899162l294106k879030
$$ 82085212 69662380 60243807 52941610 47099887 42487303 38588141 35294035 32415005
5086C2415005k366693k045287j728630j616824j407932j273848j045277r37558
$$ 32415005 30048312 28003025 26274395 24657571 23249639 21975791 20930514 19992956
5078A9992956r14113r95627r51566r88420r40700q89017p84919o95271n56764
$$ 19992956 19078843 18083216 17131650 16143230 15202530 14313513 13528594 12833323 12276559
5069A2276559m92490m16932l42966k43928j93734j42365k59064m02943m20033
$$ 12276559 11784069 11367137 11024171 10780243 10586509 10444144 10185080 9782137 9362104
5060I362104l11822l08559k50556k55961k50238l11178k85836k81624k64541k86839
$$ 9362104 9050282 8741723 8491167 8235206 7984968 7673790 7387954 7106330 6841789 6554950
5050F554950k37214k35669k46560k39214k09917k09269j47196j52040j32053j43105
$$ 6554950 6317736 6082067 5835507 5596293 5386376 5177107 5029911 4877871 4745818 4602713
5040D602713j04442j26417j13819j40770j01921j13438r0275p9620o6409m7145
$$ 4602713 4498271 4371854 4258035 4117265 4015344 3901906 3811631 3732011 3665602 3618457
5030C618457o6139j09629j14064j15935m7975q3685n3328o0931o3777r9957o6987
$$ 3618457 3552318 3442689 3328625 3212690 3164715 3081030 3027702 2966771 2902994 2803037 2736050
5019B736050j01638r6101n8704k260J8636m5351o3752m8882m7542k0197l6009
$$ 2736050 2634412 2538311 2479607 2477347 2495983 2450632 2386880 2337998 2290456 2270259 2234250
5008B234250n0689l3864o6831k7412k9400k9434k0594j7749m0410m0561m2020
$$ 2234250 2183561 2149697 2082866 2055454 2026054 1996620 1976026 1958277 1917867 1877306 1835286
4997A835286j8166j5160l7717n3086n6116n2108m8821m2237p328k5850o36J3716
$$ 1835286 1817120 1801960 1764243 1711157 1655041 1602933 1554112 1511875 1504547 1478697 1478061 1491777
4985A491777o719j938l3540J1042n77l6726L0132j3648j9657L520k0759o2591
$$ 1491777 1485058 1483120 1449580 1460622 1460045 1423319 1453451 1439803 1420146 1423666 1402907 1340316
4973A340316k7369l5012m8170o1868l6574k8402l8897m9878l1877L9425J5280
$$ 1340316 1312947 1277935 1229765 1167897 1131323 1102921 1064024 1014146 982269 1021694 1036974
4962A036974J1949j0200J4719j4426k4392N6555j9091l542l6002j5290k4299l0333
$$ 1036974 1048923 1038723 1053442 1039016 1014624 1071179 1052088 1048546 1012544 997254 972955 942622
4950I42622k006m2891m0056k2507J3858j4994j4007P226R226K1887j2897j8093
$$ 942622 940616 897725 857669 835162 849020 834026 820019 827245 836471 858358 845461 827368
4938H27368L6416K6510m0850k1690O530l01n606L8269K8567l145j5704p8204o4817
$$ 827368 863784 890294 849444 827754 834284 833983 828377 866646 895213 892068 876364 798160 733343
4925G33343m6716k1701o317k5275n1589j7351p794k8346k2083m0848n5244J2744
$$ 733343 686627 664926 658609 633334 581745 564394 556600 528254 506171 465323 410079 422823
4913D22823O271K0070L4828j911l431N907K5812m071K47l1776j1150k5248O090
$$ 422823 429094 449164 483992 482081 478650 484557 510369 506298 506545 474769 463619 438371 444461
4900D44461L846J1972J5980n087q23L5642J7810k1097l1569j3421l1979o63N999
$$ 444461 448307 460279 476259 471172 470349 505991 523801 502704 471135 457714 425735 425072 431071
4887D31071p64j7059P561M3084J9288k5733j1854j4306P175q468J7668R847o131
$$ 431071 430307 413248 420809 463893 483181 457448 445594 431288 438463 429995 447663 457510 451379
4874D51379M572J6047j3614q055L671M006J1385J264N152K1769Q677P848q432
$$ 451379 455951 471998 458384 450329 454000 458006 469391 470655 475807 497576 506253 514101 505669
4861E05669o9087O742L3819J3627j1318k9377L8196K4912Q066k1532o462l863
$$ 505669 436582 443324 477143 490770 479452 450075 488271 513183 521249 499717 493255 489392
4849D89392k6526l7923K0935M329n030M265M06J0197L0712M3604j0247n384J5867
$$ 489392 462866 424943 445878 450207 445177 449442 449848 460045 490757 534361 524114 518730 534597
4836E34597q778l456J2193j1015K7037N178P580J6903J214j0650n345O125K005
$$ 534597 525819 522363 534556 523541 550578 555756 563336 580239 581453 570803 565458 571583 573588
4823E73588L569M5583J6747K1786L582J1972k2180M4271J5608K5871L8403J4006
$$ 573588 577157 622740 639487 661273 664855 676827 654647 698918 714526 740397 778800 792806
4811G92806M9485N9181J0056J0900L8651J5902K6640R651P980K7582L0683R159
$$ 792806 842291 901472 911528 922428 961079 976981 1003621 1013272 1021252 1048834 1079517 1088676
4799A088676K3391k885J4389M8863J8793L7892M4270R5402J11245Q2580J10492
$$ 1088676 1112067 1109182 1123571 1172434 1191227 1229119 1273389 1368791 1480036 1562616 1673108
4788A673108J57287J53618K40825K66762J58964q3780j87634j87907j68281j48271
$$ 1673108 1830395 1984013 2224838 2491600 2650564 2566784 2379150 2191243 2022962 1874691
4778A874691r3865q4152n4997o0739l8947o3252n6347k5496j2106l7435l4368
$$ 1874691 1780826 1696674 1641677 1580938 1541991 1478739 1422392 1396896 1384790 1347355 1312987
4767A312987l2435n0825l3371J012j5974k7628k198J6235K1547j7089j2008k9094
$$ 1312987 1280552 1229727 1196356 1197368 1181394 1153766 1151568 1167803 1189350 1172261 1160253 1131159
4755A131159O332J504N520j005L2402L6978j025J0187M693j786Q701O452K0152
$$ 1131159 1137491 1138995 1144515 1143510 1175912 1212890 1211865 1222052 1226745 1224959 1233660 1240112 1260264
4742A260264j6845l1694L1176k641j8629j0477n1468k4006k3679j0014k0758p402
$$ 1260264 1243419 1211725 1242901 1240260 1221631 1211154 1159686 1135680 1112001 1101987 1081229 1073827
4730A073827r646O512N826j7383K9228J6184J0184L3750J4672J996J9168L9388
$$ 1073827 1064181 1070693 1076519 1059136 1088364 1104548 1114732 1148482 1163154 1165150 1184318 1223706
4718A223706M3786J8040K3578K7121K7179J9389R039J5108j7125l1404k7614o46
$$ 1223706 1267492 1285532 1309110 1336231 1363410 1382799 1391838 1406946 1389821 1358417 1330803 1330157
4706A330157j9082l9326m1131l7451l6336r389j3019j5281k8975k4670l4517k5985
$$ 1330157 1311075 1271749 1230618 1193167 1156831 1147442 1134423 1119142 1090167 1065497 1030980 1004995
4694A004995L210J0490o43O225k6181J836k580J2454m962K814m2221n2110k6577
$$ 1004995 1008205 1018695 1018052 1024277 998096 999932 997352 1009806 1004844 1007658 965437 913327 886750
4681H86750n8962m0409k9119m007l2598m7603k6826l2204l4256r090k834l4643
$$ 886750 827788 787379 758260 754253 721655 674052 647226 615022 580766 571676 568842 534199
4669E34199k2419k3812q766j3254L657m8664l0265n461j6981k6797J1404J7614
$$ 534199 511780 487968 479202 465948 469605 420941 390676 385215 368234 341437 352841 370455
4657C70455k3269l114k154N478k4639l9197j57n862J4284j6092j7355J2548k1973
$$ 370455 347186 344072 341918 347396 322757 283560 283403 277541 291825 275733 258378 270926 248953
4644B48953J9552j0050k0928K6522Q828j2348n768K592J1929J359q238j5695m129
$$ 248953 268505 258455 237527 264049 272877 260529 254761 257353 269282 270641 262403 246708 242579
4631B42579k1078R055J1900k973j6388m068k9130J1606J3863j4757Q780j0580
$$ 242579 221501 230556 242456 239483 223095 219027 189897 201503 215366 200609 209389 198809
4619A98809j4619j3214J1491O388j0878L235L359N034L4320j2938j0690M899j0103
$$ 198809 184190 170976 182467 188855 177977 181212 184571 189605 223925 210987 200297 205196 195093
4606A95093J5972r375j6766K7094j2358k2639j1171R302k619k0184k138q449L4968
$$ 195093 211065 201690 184924 212018 199660 177021 165850 175152 172533 152349 150211 141762 176730
4593A76730J4181k4339j5158J9558k2557J3016L613M296k0371k3164J6071j0440
$$ 176730 190911 166572 151414 170972 148415 161431 165044 169340 148969 125805 141876 131436
4581A31436j423K7032j7103j7386J0452j1947K3515L668j0953J1718l551K082
$$ 131436 130013 157045 139942 122556 133008 121061 144576 148244 137291 149009 145458 147540
4569A47540j4923N12Q570l4205M126N008j1188L6117K1568p451K688J9011j0535
$$ 147540 132617 133129 141699 107494 111620 116628 105440 141557 163125 155674 158362 177373 166838
4556A66838J2077J1669k104m3329k4577J5216J4087k6174q524J7827j1521O862
$$ 166838 178915 190584 188480 145151 120574 135790 149877 123703 115179 133006 121485 128347
4544A28347k414K328J415m605j0767n416j905j3837K575J4238K5457l83p656j1213
$$ 128347 125933 128261 129676 125071 114304 108888 106983 93146 95721 109959 135416 135033 127377 116164
4530A16164j3478o839K852j3174J3851L438j1633J2590j0160n034N259K4035K4527
$$ 116164 102686 95847 98699 85525 99376 102814 91181 103771 93611 88577 93836 117871 142398
4517A42398o064k0388k1259P194K531o62K1716K1512o733m923l604J3303P626
$$ 142398 136334 115946 94687 101881 104412 103750 125466 146978 140245 135322 131718 145021 152647
4504A52647k4486j1764K1080L197m403J339P945K4988o668j2714J687o186k1315
$$ 152647 128161 116397 137477 140674 136271 137610 145555 170543 163875 151161 152848 146662 125347
4491A25347k7228l642L2577J9020l070J4952j6797l1693l444J4651J646o034q
$$ 125347 98119 94477 127054 146074 143004 157956 141159 109466 106022 120673 122319 116285 116277
4478A16277j4616N0486j3888j0117O712J503R813N1L497k3044J0211o176L321
$$ 116277 101661 152147 138259 128142 134854 136357 146170 146221 149718 126674 136885 130709 134030
4465A34030J963m2467M3112M690j172j697o827q904J6219p827M975r685J5664
$$ 134030 135993 93526 136638 141328 140156 138459 131632 122728 138947 131120 136095 126410 142074
4452A42074k4611j928J8256j3217J2267K3525j1389J4135j1911L083n730k209
$$ 142074 117463 115535 133791 120574 132841 156366 144977 159112 147201 150284 144554 142345
4440A42345q240p632K1148j864j449j2529m413K7392K509k7960J2247j7168o83
$$ 142345 134105 126473 147621 145757 144308 131779 127366 154758 157267 129307 141554 124386 123703
4427A23703k0826K1208L643J2038Q953P475j758J3661J1463q340j5625m045r144
$$ 123703 102877 124085 127728 139766 148719 156194 154436 168097 179560 171220 155595 151550 142406
4414A42406J3696O888N668J4104n290k3655q489j1786O094J0479J1055R734p621
$$ 142406 156102 162990 168658 182762 177472 153817 145328 133542 139636 150115 161170 170904 163283
4401A63283J8742O273j978n223j2443J0562o047l178j0904j2927K3600L806j3306
$$ 163283 182025 188298 186320 181097 168654 179216 173169 169991 159087 146160 169760 173566 160260
4388A60260J1353J0710j1023J9857N485k628p421K6080K05j7404J5920l7183j7484
$$ 160260 171613 182323 171300 191157 196642 194014 186593 212673 212878 195474 211394 174211 156727
4375A56727L1508K5045R576k2388P938j1191J8202J4053j928o084K7982o508Q197
$$ 156727 188235 213280 222856 200468 208406 197215 215417 229470 227542 221458 249440 242932 251129
4362B51129j1738k0428J3918K0635l948j1838K803N577K7824n410m815J7955L649
$$ 251129 239391 218963 232881 253516 249568 237730 240533 246110 273934 268524 263709 281664 285313
4349B85313r260K344k0880j1510N073J7526k275L4294R016L0837j4221J6912k2326
$$ 285313 276053 278397 257517 246007 251080 268606 266331 300625 309641 340478 326257 343169 320843
4336C20843J3267K0211L7526q856K067J0399j3126j4985k0290Q752Q113q532j860
$$ 320843 334110 354321 391847 382991 385058 395457 382331 367346 347056 355808 363921 355389 353529
4323C53529j8470O995K3839O829j2172m7535p396j1651r831M7364J2111j0228
$$ 353529 335059 342054 365893 372722 360550 313015 305619 293968 284137 331501 343612 333384
4311C33384J35j1568k0295J4387R076j574L0001J0201K2927J0267K5892L517K9282
$$ 333384 333519 321951 301656 316043 325119 323545 353546 363747 386674 396941 422833 426350 455632
4298D55632J998N948k0303l6604j5080J0958l496r433k0431o282J1491K565K2666
$$ 455632 457630 463578 443275 406671 391591 402549 399053 389620 369189 362907 374398 376963 399629
4285C99629k2924R258O725j347j132Q956j5153l1398n68j2570J0738r848j4893
$$ 399629 376705 385963 392688 391341 390209 399165 384012 352614 352046 339476 350214 340366 325473
4272C25473j0360J4309J8477J9207P443J126q399m34Q698M083j8112O433J9502
$$ 325473 315113 329422 347899 367106 374549 375675 367276 366842 375540 379623 361511 367944 387446
4259C87446m2263L15o814l3314q642q614L1640k2805j4435q250k1179N3343J4970
$$ 387446 345183 345498 338684 305370 296728 288114 319754 296949 282514 274264 253085 306428 321398
4246C21398o517j6810m717M295n854K4959J0509j5100k1531q380p599K1214J5262
$$ 321398 314881 298071 293354 297649 291795 316754 327263 312163 290632 282252 274653 295867 311129
4233C11129p671J5823O490j7398J6240L972k157k7345l2175J7205m206q261K916
$$ 311129 303458 319281 325771 308373 324613 328585 326428 299083 266908 284113 279907 271646 274562
4220B74562L426K3030l2517J1564j467k8220j9091J7042R089O761M542r335l76
$$ 274562 277988 301018 268501 280065 278598 250378 231287 248329 257418 264179 268721 259386 259010
4207B59010n316R637K3987L992j3922J2227o7J283j1092o567L186j4436L0958
$$ 259010 253694 263331 287318 291310 277388 289615 289548 290831 279739 273172 276358 261922 292880
4194B92880J7593m494j5112k4946j4879K212j39N397K3667k787j8824K867J7191
$$ 292880 310473 305979 290867 265921 251042 253254 253115 258512 282179 279392 260568 263435 280626
4181B80626j609j3103J3218l2253j6206L3170L0953j1863O083R974k3265J7562
$$ 280626 279017 265914 279132 246879 230673 263843 294796 282933 289016 298990 275725 293287
4169B93287l322K7561L65J4688l2763J8839r870k3316p536N288l460k0476K7835
$$ 293287 289965 317526 317891 332579 299816 318655 308785 285469 277933 283221 279761 259285 287120
4156B87120J2520o585r784O568J3473m227O462O042J0066k747l4605J2948n33
$$ 287120 299640 293055 283271 289839 303312 299085 305547 311589 321655 318908 284303 297251 296718
4143B96718K8738J7072J7795l3599J282J4064J548K3401l9369J2081l01o919Q849
$$ 296718 325456 342528 360323 326724 328006 342070 343618 367019 327650 339731 339430 332511 341360
4130C41360K9696k1501n882K2137J2573o56N19Q524m843J9284J9310r143J1259
$$ 341360 371056 349555 343673 365810 378383 377727 378246 386770 381927 401211 420521 411378 422637
4117D22637P870K003j896P566K9696L6270k6671J703L8233l792j548J1633R142
$$ 422637 430507 432510 430614 438180 467876 504146 477475 479178 517411 513619 512071 523704 532846
4104E32846K398J8829J248K890J8883J8514P023K0984M386J6378K8168K7485J0930
$$ 532846 535244 554073 555321 558211 577094 595608 602631 623615 628001 644379 672547 700032 710962
4091G10962K405K8928R75J0521K0565J5654L4008j3670j0142M5401L4380K2830
$$ 710962 713367 742295 743270 753791 774356 790010 824018 810348 800206 845607 879987 902817
4079I02817J9370p270P531M828K7434L2720J9662K3580N8208L5149k1709K7092
$$ 902817 922187 914917 922448 927276 954710 987430 1007092 1030672 1088880 1124029 1102320 1129412
4067A129412N424L5261N7400K3249J3993R283M431L3576K4638L5479J2876Q856
$$ 1129412 1134836 1170097 1227497 1250746 1264739 1274022 1278453 1312029 1336667 1372146 1385022 1393878
4055A393878K6969M5883P028M9959K726j2307L8090M9533L6514K2679M2203M2813
$$ 1393878 1420847 1466730 1473758 1523717 1526443 1514136 1552226 1601759 1638273 1660952 1703155 1745968
4043A745968M7403M7309O3645O9229O4100P6530O8910N7356N3193P4239O0032
$$ 1745968 1793371 1840680 1904325 1973554 2037654 2114184 2183094 2240450 2293643 2367882 2427914
4032B427914P2465Q3841N5608P3911P1298R3644N4507O4380O8534O0249N0643
$$ 2427914 2500379 2584220 2639828 2713739 2785037 2878681 2933188 2997568 3066102 3126351 3176994
4021C176994M4976L9785K6380k3014K7709k103p956l1162j7230p1267m3368m1339
$$ 3176994 3221970 3261755 3288135 3265121 3292830 3290727 3282771 3251609 3234379 3163112 3119744 3078405
4009C078405n6975o3411p6889p9283l4769l2543n2935n9563m6741o8971m9315
$$ 3078405 3021430 2958019 2881130 2801847 2767078 2734535 2681600 2622037 2575296 2506325 2457010
3998B457010k9932j7695o9177p2656l0173k7215k3997l8784m7967o2339k9528
$$ 2457010 2427078 2409383 2340206 2267550 2237377 2210162 2186165 2147381 2099414 2037075 2007547
3987B007547m1155n6032l3698l7321n0194m7040n7097n4941k0390l2275l5318
$$ 2007547 1966392 1910360 1876662 1839341 1789147 1742107 1685010 1630069 1609679 1577404 1542086
3976A542086k5845k1905k3321p684l3504m731l8754l1803l387k6667k3940L522
$$ 1542086 1516241 1494336 1471015 1463331 1429827 1425096 1386342 1354539 1351152 1324485 1300545 1304067
3964A304067j9144k3941j9411n683R87j3120j5102n7275j1449l1249J4756j855
$$ 1304067 1284923 1260982 1241571 1235888 1236875 1223755 1208653 1151378 1139929 1108680 1123436 1121581
3952A121581k7577l1577j2899m747m5635l0317k9779k2787J967m6820o649q201
$$ 1121581 1094004 1062427 1049528 1044781 999146 968829 939050 916263 918230 871410 864761 856560
3940H56560L579m0181J1268P685r946k0559j6985l462l4807l0862k200r270j3735
$$ 856560 860139 819958 831226 838911 828965 808406 791421 787959 753152 722290 720090 710820 697085
3927F97085k6133q346l0502J5116j1124J1481K462j6315k4392P129M376o987j8151
$$ 697085 670952 662606 632104 647220 636096 647577 650039 633724 609332 616461 620837 613850 595699
3914E95699m6142j0793J7007j5120k247n491K921q008j6481j3806k260q74N551
$$ 595699 549557 538764 555771 540651 538404 532913 535834 527826 511345 497539 495279 494405 499956
3901D99956n70j7494J5100Q084k2304j6227j2646k609K3593j6180j1363j2402
$$ 499956 499386 481892 496992 505076 482772 466545 453899 451290 474883 458703 447340 434938
3889D34938r740m613j7827M654j396j6292l09j3519J4789J042R576L2736J9950
$$ 434938 425198 420585 402758 407412 406016 389724 389415 375896 390685 391727 401303 434039 453989
3876D53989m3526Q0l856K5277j2723j1047N89l9248q335R633K2007k7133k8962
$$ 453989 410463 410543 406687 431964 419241 408194 408783 369535 361200 370833 392840 365707 336745
3863C36745J9939Q939l7436j0924M629k0251J3151R982N952k6293L3452o32k5528
$$ 336745 356684 365623 328187 317263 321892 301641 314792 324774 330726 304433 337885 337253 311725
3850C11725r153K4191J1412j4162k2437N157K9646J0358l1527k8214n908k3134
$$ 311725 302572 326763 338175 324013 301576 306733 336379 346737 315210 286996 281088 257954
3838B57954J3978J8504j3974l486j181M27J5181k3344j6578L6652o231q168J1958
$$ 257954 271932 290436 276462 272976 271795 272222 287403 264059 247481 284133 277902 269734 281692
3825B81692j7925q553J7271K3870K463j7818j7585J4578k6040J496O686k8363
$$ 281692 263767 255214 272485 296355 298818 281000 263415 277993 251953 253449 260135 231772
3813B31772L5225l356k6305m252q378q739M921J9891n027K214J8664J1662K070
$$ 231772 266997 263641 237336 233084 224706 215967 220888 240779 235752 237966 256630 268292 270362
3800B70362o880M055k1017N808l486N731J0002o963K0432j3171M281k5530k1802
$$ 270362 263482 267537 246520 252328 248842 254573 264575 257612 278044 264873 269154 243624 221822
3787B21822J1040p88Q667j6550J744j4164q08k63J2792K6621k767j6562j6332
$$ 221822 232862 232074 240741 224191 225935 211771 210963 210700 223492 250113 247346 230784 214452
3774B14452L2604m180l4045J0281K4700m4939j2188q945l4276L8306K6900J0433
$$ 214452 247056 242876 208831 219112 243812 198873 186685 177740 143464 181770 208670 219103
3762B19103n221r661m77j1049L276l706P31K159L852j8142J2996k368p394n569
$$ 219103 213882 204221 203744 192695 195971 192265 192996 195155 199007 180865 193861 191493 184099 178530
3748A78530K071R104J5862K483K0702j3446k8219J0805L965J950j2987l667q467
$$ 178530 180601 189705 205567 208050 228752 215306 187087 197892 201857 203807 190820 187153 178686
3735A78686j1748L3798j1186j4244j144j566oJ0195l182k374O651j2426K1338
$$ 178686 166938 200736 189550 175306 174162 172596 172590 182785 179603 177229 183880 171454 192792
3722A92792m28n042j9521l837m132R836J2633q481Q096j7843K7072J8302j6188
$$ 192792 192364 187322 167801 163964 159832 169668 182301 173820 181916 164073 191145 209447 193259
3709A93259m964L002p643j9241J3240M639k626J6258N536k2012j0356m440J3219
$$ 193259 188295 191297 183654 164413 177653 182292 179666 195924 201460 179448 169092 164652 177871
3696A77871N517J2725k6298k7792J1947k511o264J6890Q900J31J313j2794K3003
$$ 177871 183388 196113 169815 142023 153970 151459 145195 162085 170985 171116 172429 159635 182638
3683A82638j6832Q348K1851k6306j5555K6476m507k4272l926n643j9557L31J0420
$$ 182638 165806 174154 196005 169699 154144 180620 176113 151841 147915 142272 122715 123046 133466
3670A33466P079M067j2274K2902j8739n0J5741k1605M332p401J0829J2769J2984
$$ 133466 140545 144612 132338 155240 136501 136451 152192 130587 134919 127518 138347 151116 164100
3657A64100j591J2344J9426j7496q455m5511o436q051P251L5330N805k0234O58
$$ 164100 162509 174853 194279 176783 168328 122817 116381 108330 115581 150911 156716 136482 137140
3644A37140M0632r24j7079k7739l3107L3895J2063j5398M452n82k907j8526j4749
$$ 137140 177772 176848 159769 132030 98923 132818 144881 129483 133935 133353 130446 111920 97171
3631I7171J2026J2668N047K930j5846m560K4538o430r55k2521j776J8364n61J8161
$$ 97171 109197 121865 126912 129842 113996 109436 133974 127544 126589 104068 102292 120656 120095 138256
3617A38256l207j4254r381n348P643P922k1017k5632L8870P767J1735j1044N408
$$ 138256 135049 120795 111414 106066 113709 121631 100614 74982 113852 121619 133354 122310 127718
3604A27718P735l3240M269J8689J4103k432J7976q349k0851J576j9911j3186K2810
$$ 127718 135453 102213 106482 125171 139274 136842 154818 146469 125618 127194 107283 94097 116907
3591A16907K3992J019l576M995j8588l2168l321J3161m931K3397J31k230j116
$$ 116907 140899 141918 138342 143337 124749 92581 89260 102421 97490 120887 121018 118788 117672
3578A17672j8757K2374L5099J963k3356L122n641l7878P537P418K8716J5595k0763
$$ 117672 98915 121289 156388 158351 134995 138117 132476 94598 102135 109553 138269 153864 133101
3565A33101j4283K6695q577k4690K5965j5382o014L7315Q196M776k8607K3309
$$ 133101 118818 145513 136936 112246 138211 122829 116815 154130 162326 167102 138495 161804
3553A61804K7026k2210N548k0505l572J7699r405j0619J7032J9862k1580J5113
$$ 161804 188830 166620 172168 151663 148091 165790 156385 145766 162798 182660 161080 176193
3541A76193J3448j0092j7893k5361M5729J9205J746K4233J4506L388j1445Q3P945
$$ 176193 189641 179549 161656 136295 182024 201229 202975 227208 241714 245102 233657 233740 241685
3528B41685j285M2091j1026P581K0477L1519J8219K810K4700k741K4052J6055
$$ 241685 240400 282491 271465 279046 299523 331042 349261 352071 376771 374030 398082 414137
3516D14137J1007j6305j8144K5839l8947k2475J2473K2020K6579J6626r576O19
$$ 414137 425144 408839 390695 416534 377587 355112 367585 389605 416184 432810 423234 423853
3504D23853J9886Q565j1222r707J6916L315J4604J7710O262k1794J6178q08P436
$$ 423853 443739 452304 441082 431375 448291 451606 466210 483920 490182 468388 484566 483758 491194
3491D91194q309j631n449l1281j0598n92j7798l089j2645j51J1506j6072K2134
$$ 491194 482885 481254 475805 444524 433926 433334 415536 412447 399802 399651 411157 395085 417219
3478D17219l807n29p618l5037j1144M251k315j778j570J3872K2626R104q673L0236
$$ 417219 413412 412883 405265 370228 359084 363335 361020 359242 357672 371544 394170 403274 394601 424837
3464D24837j0996K834M3322L2957N0115M2691L9097k4451k0096O675k4126O151
$$ 424837 413841 416675 459997 492954 543069 585760 624857 600406 580310 586985 562859 569010
3452E69010J4160k4796K2924j298L9475M9698J6656N5496l631J5736n003j6173
$$ 569010 583170 558374 581298 580000 619475 669173 685829 741325 737694 753430 748427 732254
3440G32254j8096o6032n2508l7950m0338k9273l334j4986J3661k1387J3061N5366
$$ 732254 714158 648126 595618 557668 517330 488057 484723 469737 483398 462011 475072 530438
3428E30438N7815K7712K1168o3512o3895k7814p0823k4480l5035l5920j2678l8241
$$ 530438 588253 615965 637133 573621 509726 481912 411089 386609 351574 315654 302976 264735
3416B64735Q208j6270j8104K2639j7220l0221j2848K997Q584q176M255q332L115
$$ 264735 272943 256673 238569 261208 243988 213767 200919 203916 212500 204324 208579 200247 203362
3403B03362O680o498J3080k6855J7059K3578K3441K6635L4494j3414l2415l798
$$ 203362 210042 203544 216624 189769 206828 230406 253847 280482 314976 301562 269147 265349
3391B65349j6089l4289l8482M26M712l5093k2975R006J5692j5602j5023L986n955
$$ 265349 249260 214971 176489 176915 181627 146534 123559 132565 148257 132655 117632 121618 115663
3378A15663j630n302k873K7795n79n662J2214j2858p276o581J2775j2240j1869
$$ 115663 114033 108731 105858 133653 133074 127412 139626 126768 119492 112911 125686 113446 101577
3365A01577k315r037J4999n205K1552j0296P537k609l1559j0105L325j0077k675
$$ 101577 99262 90225 105224 100019 121571 111275 118812 116203 84644 74539 77864 67787 65112
3352F5112J3720R343j1991l996j0434J2062K7913J9514q856j1323m1246K007j4358
$$ 65112 78832 88175 76184 72188 61754 73816 101729 121243 112387 101064 59818 61825 47467
3339D7467J0352J5370L0236j5028m3034m494L8326l055j1619J8074K1513p658
$$ 47467 57819 73189 103425 88397 45363 40869 79195 76140 64521 82595 104108 96450
3327I6450l8154k045k10J0827m345N600p527j3841k3624J9652J2304n358J760
$$ 96450 58296 56251 56041 66868 62523 68123 60596 46755 23131 42783 55087 49729 51489
3314E1489J0293l0757L2340K8041j8480j8271N648j4985L312J759N475k7875J2443
$$ 51489 61782 31025 63365 91406 72926 54655 60303 45318 48630 50389 55864 27989 40432
3301D0432n921L797K4045j6343j5890l276j5234Q05N101m619k387J0707J269j828
$$ 40432 34511 38308 62353 46010 30120 26844 11610 12415 17516 12897 10510 21217 22486 20658
3287B0658J5600n524o988k229L795L3085n792j707j4526m209j3833J498J7034
$$ 20658 36258 30734 23746 21517 25312 58397 52605 50898 36372 32163 18330 19828 36862
3274C6862J0252N044J2802J847m0340j8285K3247R736j1023k173p784j5358J7649
$$ 36862 47114 52158 64960 66807 26467 8182 31429 41165 30142 27969 20185 4827 22476
3261B2476J0996q687L489K1824l2991K686L8618l6390J05k3579K5428m933j2676
$$ 22476 33472 24785 28274 50098 17107 19793 58411 22021 22126 -1453 23975 19042 6366
3248F366k350K6177p612P177J5594K385n876k5390k1408k8M543M158J4390J0626
$$ 6366 4016 30193 22581 29758 45352 47737 41861 16471 -4937 -4965 -422 3736 18126 28752
3234B8752m604K596K209L0339P66j9290J0185k1725M74k8760o493M389K3721K49
$$ 28752 24148 26744 28953 59292 60058 40768 50953 29228 29702 942 -5551 -1162 22559 22808
3220B2808j2041L6494K244j6339P764J1504k4194j9656K3844J283K718Q326M718
$$ 22808 10767 47261 49505 33166 40930 52434 28240 8584 32428 33711 36429 44755 49473
3207D9473m633k6833J5480k1904J662O386p847J1356j2482j2692J6171M338J5547
$$ 49473 44840 18007 33487 11583 13245 19631 11784 23140 10658 -2034 14137 18475 34022
3194C4022K0825r795k839J4238k7415r013J1802O828J1430k4997P807P836k0061
$$ 34022 54847 45052 42213 56451 29036 20023 31825 38653 50083 25086 32893 40729 20668
3181B0668J7929l7888q37L986q615K6456n410M906L3197j2249k4502O450J6965
$$ 20668 38597 709 -128 3858 -4757 21699 16289 21195 54392 42143 17641 24091 41056
3168D1056R769L054o125j855N2325l1290j3274j1978k361L3780j4442j0047j8729
$$ 41056 50825 53879 47754 45899 98224 66934 53660 41682 39321 73101 58659 48612 29883
3155B9883l966L0222m302J8348o573j6156J057J1143o674o530L962K08m40r086
$$ 29883 25917 56139 51837 70185 63612 47456 48513 59656 52982 46452 50414 50622 50182 41096
3141D1096K8879K1184R641j7470k1538J5939J5836j9925J608j2683q856O816J819
$$ 41096 69975 91159 100800 83330 61792 77731 93567 73642 75250 62567 53711 60527 62346
3128F2346k0723n404J9936l49k2103l79j992J3140J6891p403R029J0710J1442
$$ 62346 41623 36219 56155 55806 33703 33324 31332 44472 61363 53960 62989 73699 85141
3115H5141Q599J5255l2287k1748J4990R013m570J7461o381R570j789O017N953
$$ 85141 93740 108995 76708 54960 69950 78963 74393 91854 85473 95043 93254 99271 105224
3102A05224m566P109J3584j0040k2181N420J2867j5457k9749o396J0990j297J113
$$ 105224 100658 107767 121351 111311 89130 94550 107417 91960 62211 55815 66805 65508 66621
3089F6621P17k3185j011r13m155Q974k959j4136K6193o365j0711K9730m052r377
$$ 66621 67338 44153 43142 42229 38074 47048 44089 29953 56146 49781 39070 68800 64748 55371
3075E5371o584J1416n592k728N909K65r389L258J6246k9145j4176K056M830l308
$$ 55371 48787 60203 54611 51883 57792 58057 48668 51926 68172 39027 24851 26907 31737 28429
3061B8429J8535Q783J607k2510j754Q107o598M271o479j4133J3183J8738j0931
$$ 28429 46964 55747 57354 34844 33090 41197 34599 38870 32391 18258 31441 50179 39248
3048C9248n507j5186r660N194k309p319k0205K5157J5852p042j9068p159J6725
$$ 39248 33741 18555 8895 14089 11780 4461 -15744 9413 25265 18223 -845 -8004 8721
3035H721M594q535n427M206l4081R898K291O661M728j0616J0209j628m417m939
$$ 8721 13315 4780 -647 3559 -30522 -20624 -18333 -11672 -6944 -17560 -7351 -8979 -13396 -18335
3021a8335m838J7444M210M647K5805R657J5126k1678l6270m298k2574N85j472
$$ -18335 -23173 -5729 -1519 3128 28933 38590 53716 32038 -4232 -8530 -31104 -30519 -31991
3008c1991k160K6315J1996k2580l3571L1270J7698p181Q588M016l609l88j14P556
$$ -31991 -34151 -7836 4160 -18420 -51991 -20721 -3023 -10204 -1616 2400 -1209 -1597 -1711 5845
2994E845l585k2070m907r750J7615K7973J3878l203M674k712j7028L186j4921
$$ 5845 2260 -19810 -24717 -34467 -16852 11121 24999 21796 26470 23758 6730 9916 -5005
2981e005J2800K825k6000J6329k3367L003J7556L3702o174j6458K5854r066j1298
$$ -5005 7795 10620 -15380 949 -22418 -19415 -1859 31843 25669 9211 35065 25999 14701
2968A4701k0978n809p939J0128k521J4322r965P986R065r341j6952p117O3j2216
$$ 14701 -6277 -12086 -20025 -9897 -12418 1904 -8061 -75 8990 -351 -17303 -24420 -24357 -36573
2954c6573J6781j5980P569J9015L3302o365j3972j0813K309N994r345K3039r627
$$ -36573 -19792 -35772 -28203 -9188 24114 17749 3777 -7036 -4727 1267 -8078 14961 5334
2941E334J0623k4957k2025q830K2007j058K823o137K3970Q663l3956K0386L9710
$$ 5334 15957 -9000 -31025 -39855 -17848 -18906 -16083 -22220 1750 10413 -23543 -3157 36553
2928C6553j2094p950K781l4826j8006l562K4310p454N800J0922J628P383k1297
$$ 36553 24459 16509 19290 -15536 -33542 -37104 -12794 -20248 -14448 -3526 -1898 5485 -15812
2915a5812J6174k57k851J6089j7569l130O006m706M117q50n780M191j7379j842
$$ -15812 362 105 -2746 13343 -4226 -7356 -1350 -6056 -1939 -2789 -8569 -4378 -21757 -23599
2901b3599j2507K2452J9441J6121J4002k9907j9545J5573k1394p453l057R794
$$ -23599 -36106 -13654 5787 21908 35910 6003 -13542 2031 -19363 -26816 -29873 -20079
2889b0079J2406k781M621j2267K3922k1057o525N675J9763J1902O213j6891j7567
$$ -20079 -7673 -10454 -5833 -18100 5822 -15235 -21760 -16085 3678 15580 21793 4902 -12665
2876a2665p933j3326K4070M217L08l6160p895M1753M1860m4129O841J2049m825
$$ -12665 -20598 -33924 -9854 -5637 -5329 -41489 -49384 -7631 34229 -9900 -3059 8990 4165
2863D165j2014K3962p089n196J0117n849J3801M806m233l6274k6506l308J9290
$$ 4165 -7849 16113 9024 3828 13945 8096 21897 26703 22470 -13804 -40310 -43618 -24328
2850b4328J7725J2524o205O733j2435l001j4607q444J2753L157j4995J4131K461
$$ -24328 -6603 5921 -284 6449 -5986 -8987 -23594 -32038 -19285 -16128 -31123 -16992 -14531
2837a4531P115J450M022K3076k1052J807L076p857o41j3368O347p241k3136K3751
$$ -14531 -7416 -5966 -1944 21132 80 1887 4963 -2894 -3535 -16903 -10556 -17797 -40933 -17182
2823a7182L859K0966O393k1756j3996J4645J123k0317o921Q772O399K0399J2806
$$ -17182 -13323 7643 14036 -7720 -21716 -7071 -5948 -26265 -33186 -24414 -18015 2384 15190
2810A5190k8932K0430j7370j6704m380J2851j2524J9909J9976N42k232k4967Q534
$$ 15190 -13742 6688 -10682 -27386 -31766 -18915 -31439 -11530 8446 8988 6756 -18211 -9677
2797i677L666k7135r350K5019J6965J5946j1241r810L882M377l1320p342K5628
$$ -9677 -6011 -33146 -42496 -17477 -512 15434 4193 -5617 -1735 2642 -28678 -36020 -10392
2784a0392j472L945j1144l938R095j0889K0390L185q028o587q321r109J215J9179
$$ -10392 -11864 -7919 -19063 -23001 -13906 -24795 -4405 -1220 -9248 -15835 -24156 -33265 -32050 -12871
2770a2871j23J2307K211j667r267k7274j3076K3700n004J4426j7519K2413j203
$$ -12871 -12994 -687 1524 -143 -9410 -36684 -49760 -26060 -31064 -16638 -34157 -11744 -12947
2757a2947M778L505P656K6701k1817k349N477n429k1100m316J9538R713j113j4455
$$ -12947 -8169 -4664 2992 29693 7876 5527 11004 5575 -15525 -19841 -303 9410 8297 -6158
2743f158o524K5755J913m25j4463j5196J0093J3760k188k14J6002q029j5646J4834
$$ -6158 -12682 13073 14986 14561 98 -15098 -5005 8755 6567 6353 22355 14326 -1320 13514
2729A3514p296j3069j2817K6489n629r144R698l5839L7805L792L53M638k081j9271
$$ 13514 6218 -6851 -19668 6821 1192 -7952 1746 -34093 3712 7504 7857 12495 10414 -8857
2715h857j1632O099n299J3694q328L985n693M405K125J5084k0636J5718j0054
$$ -8857 -20489 -14390 -19689 -5995 -14323 -10338 -16031 -11626 -9501 5583 -15053 665 -9389
2702i389J734J2594j0242N975k2178k4832L1243j1605Q759r229J4517k1622l605
$$ -9389 -7655 4939 -5303 672 -21506 -46338 -15095 -26700 -17941 -27170 -12653 -34275 -37880
2689c7880J8373K4889J0756m6892j2880L7150j2695J8122Q387M375j9612k2141
$$ -37880 -19507 5382 16138 -30754 -43634 -6484 -19179 -1057 7330 11705 -7907 -30048
2677c0048L2604j0069o066k9611R193R909N481j4147j4177J7981L1871k3262n443
$$ -30048 2556 -7513 -13579 -43190 -33997 -24088 -18607 -32754 -46931 -28950 2921 -20341 -25784
2664b5784J224J8599j4029j730p26J9426J2414P900r66j3000k6465m310j143R652
$$ -25784 -24560 -5961 -19990 -21720 -22446 -3020 9394 17294 16328 3328 -23137 -27447 -28590 -18938
2650a8938Q165K2124j5817j0936K1313j525k6501J7510Q5r011k286P43K3694M389
$$ -18938 -10773 11351 -4466 -15402 5911 4386 -22115 -4605 -4520 -13531 -15817 -15074 8620 13009
2636A3009q105o618o830k829L0434k4491j9908l628J7746l730k946p506n790L4215
$$ 13009 4904 -1714 -8544 -11373 19061 -5430 -25338 -28966 -11220 -14950 -17896 -25402 -31192 3023
2622C023J9123m668k4207j284l0638j5139R735L8019K2315j1471J1412j9031N626
$$ 3023 22146 17478 -6729 -8013 -38651 -53790 -44055 -6036 16279 4808 16220 -2811 2815
2609B815j0316k3486M461J944j2205J9625l111j0017K6948J5298j3130q054K021
$$ 2815 -7501 -30987 -26526 -24582 -36787 -17162 -20273 -30290 -3342 11956 -1174 -9228 -7207
2596g207J3073k202o097j1773k5555o903J2464J0493m169R979j086P900J0163
$$ -7207 5866 3664 -2433 -14206 -39761 -46664 -34200 -23707 -27876 -17897 -18983 -11083 -920
2583i20j6216m613J6072K4417j7435j6183M011K4271K6921K109j586L863r149
$$ -920 -17136 -21749 -5677 18740 1305 -14878 -10867 13404 40325 42434 40848 44711 35562
2570C5562m082j8100r152J557k855n638O187k1510L071L0724j5523K4035j283
$$ 35562 31480 13380 4228 5785 2930 -2708 3479 -18031 -14960 15764 241 24276 22993
2557B2993j0848j7208r224K2576J1508k5254k1270J9409q122J0069J0132m928
$$ 22993 12145 -5063 -14287 8289 19797 -5457 -26727 -7318 -15440 -5371 4761 -167
2545a67k0896J8870j824o420n194k0485J5077K6718j2197j4666J7456J7370j706
$$ -167 -21063 -2193 -4017 -10437 -15631 -36116 -21039 5679 -6518 -21184 -3728 13642 11936
2532A1936k1978M324o593n30M537K590P719n343J18Q614N918Q713q573N13p472
$$ 11936 -10042 -5718 -12311 -12841 -8304 -5714 2005 -3338 -3220 5394 11312 20025 11452 11965 4493
2517D493J5716l570j4068j006r204J267j0012J0606J4784o582r57j3522k223K9088
$$ 4493 20209 16639 2571 1565 -7639 -6372 -16384 -5778 9006 2424 1467 -12055 -14278 14810
2503A4810n955J6085j1830l2500O398L0452R673j6669J0079j7036L740k078n126
$$ 14810 8855 24940 13110 -19390 -12992 17460 27133 10464 20543 3507 7247 5169 43
2490D3j6498L3273J1400m6378M214K6841k95J9053n926q99j636l411k7033N200
$$ 43 -16455 16818 28218 -18160 -13946 12895 12600 31653 25727 24828 23192 19781 -7252 -2052
2476b052K1231j5756O72k1108J5496k120k117q587j84K4284K1576m682j3045r996
$$ -2052 19179 3423 4095 -17013 -1517 -3637 -5754 -14341 -14525 9759 31335 26653 13608 3612
2462C612O444O680N484J782j3822P657k9462l631J9561J3950J0088k106q994j572
$$ 3612 10056 16736 22220 24002 10180 17837 -11625 -15256 4305 18255 28343 26237 17243 15671
2448A5671J0500J1330K008l8734J4589L8584q277j9046j5066J5955L3999j9652
$$ 15671 26171 37501 39509 775 15364 53948 45671 26625 11559 27514 61513 41861
2436D1861m420n150J460K433k4081N03O363j2454j3048J7136K0264J1350J1252
$$ 41861 37441 32291 33751 36184 12103 12606 18969 6515 -6533 10603 30867 42217 53469
2423E3469N64n897P964k4938J4089P993p325m937Q736J555j7780P898J4368j2106
$$ 53469 54033 48136 56100 31162 45251 53244 45919 40982 49718 51273 33493 41391 55759 43653
2409D3653k7420M231K2283J1766j0451Q130N820j2072P671J073j0637J471L7601
$$ 43653 16233 20464 42747 54513 44062 52192 58012 45940 53611 54684 44047 45518 83119
2396H3119n404k2772M5k815K4111N821J9800J9657J7792k1667M623M578L660j3639
$$ 83119 77715 54943 54988 52173 76284 82105 101905 121562 139354 117687 122310 126888 130548 116909
2382A16909r18J3898K6963J9542k9604q021P785N747J6312j926p095N730J6287
$$ 116909 115991 129889 156852 176394 146790 138769 146554 152301 168613 166687 159592 165322 181609
2369A81609l72K028O023K2n931J265J278J8415K3912J2893J523O89K7962J7139
$$ 181609 181237 183265 189288 189310 183379 184644 185922 204337 228249 241142 242665 243354 271316 288455
2355B88455o393q358L8586J24L194K3028J0684J0504N702J0694O455K3796M5337
$$ 288455 282062 273704 312290 312414 315608 338636 349320 359824 365526 376220 382675 406471 451808
2342D51808M0820O597K5634J0752L0144L6548J3431K8917J7129J6581K5163J4028
$$ 451808 492628 499225 524859 535611 565755 602303 615734 644651 661780 678361 703524 717552
2330G17552N3755J9576J7509M0237M2623O9882Q2809P5619J18959J25255J07981
$$ 717552 771307 790883 808392 848629 891252 961134 1043943 1119562 1238521 1363776 1471757
2319A471757R0754O5524Q9596J56815K12008K72354L29174L92421N36236P51811
$$ 1471757 1562511 1628035 1717631 1874446 2086454 2358808 2687982 3080403 3616639 4368450
2309D368450J004897J269074J829042K147501Q09797j446674k109406j754147
$$ 4368450 5373347 6642421 8471463 10618964 11428761 9982087 7872681 6118534
2301F118534j320381r37088o94264m57365l16025k89643k12488j45798j24113
$$ 6118534 4798153 3861065 3166801 2709436 2393411 2103768 1891280 1745482 1621369
2292A621369p7309l1155n6249j18777j51105j01605n6635q2289n9232k6777l1105
$$ 1621369 1544060 1512905 1456656 1337879 1186774 1085169 1028534 946245 887013 860236 829131
2281H29131n5163n8947m5836l9395l6054m4332m7533k3324j0056j422j7518n8989
$$ 829131 773968 715021 669185 629790 593736 549404 501871 478547 468491 467069 449551 390562
2269C90562N33o534J0757m0256j8445j19k935O712l3391j2864j1773k8759N753
$$ 390562 391095 384561 395318 355062 336617 336498 333563 340275 306884 294020 282247 253488 259241
2256B59241L2853L193j9539J8268l1455n587j6427k0805k1266j227L4884n3046
$$ 259241 292094 295287 275748 294016 262561 256974 240547 219742 198476 197249 232133 179087
2244A79087k0968Q884K2006l9832m177P444K1691j4929k3480k4994J0862j8027
$$ 179087 158119 167003 189009 149177 145000 152444 174135 159206 135726 110732 121594 103567
2232A03567J8097P062j8876J0766j850j8702M543k216P113j1158O886L050j1480
$$ 103567 121664 128726 109850 120616 118766 100064 104607 102391 109504 98346 105232 108282 96802
2219I6802k77J5610k4258k0045J7681j504J6221k6996L492J7834O032q139J066
$$ 96802 96525 112135 87877 67832 85513 84009 100230 73234 76726 94560 100592 92453 93519
2206I3519O543l4449j496K136P151K8431j2505m5241j0566J6468J1394j1979m870
$$ 93519 100062 65613 64117 66253 73404 101835 89330 44089 33523 49991 61385 49406 44536
2193D4536O066p342J4140M930k3665J1265P750Q319J6390k8535j103R463k0951
$$ 44536 50602 43260 57400 62330 38665 49930 57680 65999 82389 53854 52751 62214 41263
2180D1263R409j9210J1644K127J9882j2233j2140Q686L78J5068j0391j8662k000
$$ 41263 50672 31462 43106 45233 65115 52882 40742 49428 49806 64874 54483 35821 33821
2167C3821J2266Q520j902m1304K825K6539J5493r573k0247n892L2623p859j864
$$ 33821 46087 54607 52705 11401 14226 40765 56258 46685 26438 20546 53169 45310 43446
2154D3446O740k5531j2067O846k1942k787J1539K1134M593K1550l8826j1912k825
$$ 43446 50186 24655 12588 19434 -2508 -5295 6244 27378 31971 53521 14695 2783 -42
2141d2N000K1422N742p76k838K1961j4226k3713N902K398j4382K396j0240J3647
$$ -42 4958 26380 32122 31346 28508 50469 36243 12530 18432 20830 6448 8844 -1396 12251
2127A2251O08q555O62K2572p607k9619L625K098J5777K4076n947r589J5399K748
$$ 12251 12859 4304 4966 27538 19931 -9688 -6063 -3965 11812 35888 29941 20352 35751 38499
2113C8499m357r471k5865J4872o550k2284M7077P541k3822J012m963k4234K5872
$$ 38499 34142 24671 -1194 13678 7128 -15156 31921 39462 15640 16652 11689 -12545 13327
2100A3327j2271l012j597M200M574R509L880o316P237J6931j633j8553J8425j2328
$$ 13327 1056 -1956 -3553 647 5221 14730 18610 12294 19531 36462 34829 16276 34701 22373
2086B2373k703N59L263p377P672K013l0396j7734J1353L9110j1511k6854K799
$$ 22373 19670 20229 23492 16115 23787 25800 -4596 -22330 -10977 28133 16622 -10232 -7433
2073g433J7599O884k0047L144J4979K5508J4581k5775q919L032n024o786L561
$$ -7433 10166 17050 -2997 147 15126 40634 55215 29440 20521 23553 18529 11743 15304
2060A5304r448O581n742O172J6509P158k8409k403q461J1712l184J4523j1555
$$ 15304 5856 12437 6695 12867 29376 36534 8125 5722 -2739 8973 5789 20312 8757
2047H757l0267Q002l298M4187m22M408n754N290M8479K2318j2447j030l7685j7367
$$ 8757 -21510 -13508 -16806 27381 26959 31367 25613 30903 79382 101700 89253 88223 50538 33171
2033C3171j1608K5953j4443j7905k251P203j8286n859R165L1634M74L1243m2902
$$ 33171 21563 47516 33073 15168 12917 20120 1834 -4025 5140 36774 37248 68491 25589
2020B5589p995J0880j843J6973Q38o816l1175R33J7384k3727j1006Q548R040M4194
$$ 25589 17594 28474 26631 43604 44442 37626 6451 7384 24768 1041 -9965 -1417 7623 51817
2006E1817o922l5858J2612J1494k0794q397J6537l949j3089l894K9240O258k3597
$$ 51817 44895 9037 21649 33143 12349 3952 20489 16540 3451 -443 28797 35055 11458
1993A1458M890N816r435j8405K2836J1638j0149m5807k025O611o36P715K6111
$$ 11458 16348 22164 12729 -5676 17160 28798 18649 -27158 -29183 -22572 -23208 -15493 10618
1980A0618m709Q07n636l029L722j0054j584P648L58P394J3596M779m4488J7588
$$ 10618 5909 6716 1080 -1949 1773 -8281 -9865 -2217 -1859 5535 19131 23910 -20578 -2990
1966b990K1369j0146L403j8630L309J0895l436J9492j0171k16P684q479p385P259
$$ -2990 18379 8233 11636 -6994 -3685 7210 3774 23266 13095 12879 20563 12084 4699 11958
1952A1958M303j3000l269Q478j8688J9655N926j5268j6114J4988j5279m123L8618
$$ 11958 16261 3261 -8 8470 -10218 9437 15363 95 -16019 -1031 -16310 -20433 18185
1939A8185r201n054O983p266J3674p659j0172J2510k5769n877j07J4382Q189L955
$$ 18185 8984 3930 10913 3647 17321 9662 -510 12000 -13769 -19646 -19753 -5371 2818 6773
1925F773J5048k7442j4199N1728J2424n944p950l866k8061q309j750M460J6478
$$ 6773 21821 -5621 -19820 31908 44332 38388 30438 26572 -1489 -9798 -11548 -7088 9390
1912I390Q843l4950L8393k133k5273j457m978J2520j1461J9771P266p437J326
$$ 9390 18233 -16717 21676 19543 -5730 -7187 -12165 355 -11106 8665 15931 8494 9820
1899I820J0042j0285r376J336J0781j052J22O599k3600n733L043K0043k1279j910
$$ 9820 19862 9577 201 1537 12318 11266 11388 17987 -5613 -11346 -8303 11740 -9539 -11449
1885a1449N701Q863K8879k1991o680j1173L821Q259L108j6112j0556k7612M0246
$$ -11449 -5748 3115 31994 10003 3323 -7850 -4029 4230 7338 -8774 -19330 -46942 -6696
1872f696J8101n401n114j7182J5883n799m058J1218J084j0651K734J2900r6k086
$$ -6696 11405 6004 890 -16292 -409 -6208 -10266 952 2036 -8615 -5881 7019 6923 4837
1858D837K074j7842P459O738l1503P485P08j9150L644L7970P443k8017J8913K155
$$ 4837 6911 -10931 -3472 3266 -28237 -20752 -20044 -39194 -35550 2420 9863 -18154 759 2914
1844B914j184J1044k509j6733J8855L619j2749J6976J5482N882j5766j5342k6312
$$ 2914 1730 12774 10265 -6468 12387 16006 3257 20233 35715 41597 25831 10489 -15823
1831a5823J4476J6073j4286l506k8783K0472R001o515J5111N003n338r16J6590
$$ -15823 -1347 14726 440 -3066 -31849 -11377 -2376 -8891 6220 11223 5885 4969 21559
1818B1559k1037J6341j2517k0253m834J5324Q435j3597J1384M655k4055L41j9176
$$ 21559 522 16863 4346 -15907 -20741 -5417 3018 -10579 805 5460 -18595 -18254 -37430
1805c7430K3865K9503k5303J2633n634p85N034J6564k0900J5069j4087k662K4245
$$ -37430 -13565 15938 -9365 3268 -2366 -3151 1883 18447 -2453 12616 -1471 -4133 20112
1792B0112J181l9756J8801Q512n046n262J801J7398j1533j0509J3725J4957j0530
$$ 20112 21293 -18463 338 8850 3804 -1458 343 17741 6208 -4301 9424 24381 13851
1779A3851j3847j6060J0393J296L868R204k9258J6309K8131l217o607K0562J4846
$$ 13851 4 -16056 -5663 -4367 -499 8705 -20553 -4244 23887 20670 14063 34625 49471
1766D9471N4l1268k5591K5368N066l1191J4982K1459j8613p29k7633q218j253
$$ 49471 49525 18257 -7334 18034 23100 -8091 6891 28350 9737 9008 -18625 -26843 -28096
1753b8096J5138J3361O906J150j2543J4059P512j9433J4604J4955k1549n0987
$$ -28096 -12958 403 7309 8459 -4084 9975 17487 -1946 12658 27613 6064 -44923
1741d4923K0168L2253k0024r720P623j0174N902J0100j694J0663L3586j7180k6078
$$ -44923 -24755 7498 -12526 -22246 -14623 -24797 -18895 -8795 -10489 174 33760 16580 -9498
1728i498K1594l181m942n92L407r944L24O0r510p564r043J384L254l064R89K3756
$$ -9498 12096 8915 3973 3381 6788 -3156 -2832 -2772 -12282 -19846 -28889 -27505 -24251 -27315 -26326 -2570
1712b570l5236J0055K6502n2j9074J1172K418k6793M524J3952K896L0281o614
$$ -2570 -37806 -27751 -1249 -1301 -20375 -9203 -6785 -33578 -29054 -15102 -12206 18075 11461
1699A1461m524j5546k4546j861L904k535K4127J4977j6829k481q895J2031j0355
$$ 11461 6937 -8609 -33155 -35016 -31112 -33647 -9520 5457 -11372 -13853 -22748 -10717 -21072
1686b1072j8452K4336J1728k6472M233J9990o37m354L088j2322k922J8593R784
$$ -21072 -39524 -15188 -3460 -29932 -25699 -5709 -6346 -10700 -7612 -19934 -22856 -4263 5521
1673E521J464q778J2367q308l7364R743P178M0571k3604j3311J2939r77L2300
$$ 5521 6985 -1793 10574 2266 -35098 -25355 -18177 22394 -1210 -14521 -1582 -2559 29741
1660B9741L973k0990J8420p766l280J2737O461j4052L213k190k1795L208L2747
$$ 29741 33714 12724 31144 23378 20098 32835 39296 25244 28457 26267 4472 7680 40427
1647D0427o451k8251L895rn316k628J3606Q468l0802k350R825J28j664J0775j574
$$ 40427 33976 5725 9620 9611 4295 1667 15273 23741 -7061 -9411 414 542 -1122 9653 8079
1632H079k1992L346K2297K0038j213j0970J1241r610j3388k944l484P894j0128
$$ 8079 -13913 -10567 11730 31768 30555 19585 30826 21216 7828 4884 1400 9294 -834
1619h34k5987K4227n239k7205K2717j0919L2966K772J5802K2210j2514m9329K498
$$ -834 -26821 -2594 -7833 -35038 -12321 -23240 9726 12498 28300 50510 37996 -11333 -8835
1606h835j3121J6738K4735r127l802n512K2145j3943k828j2352J0472j0582K086
$$ -8835 -21956 -5218 19517 10390 6588 1076 23221 9278 6450 -5902 4570 -6012 -3926
1593c926J7167J1601j1054j8850p401j7086R424k790J6528P918K16k268p259m356
$$ -3926 13241 24842 13788 -5062 -12463 -29549 -20125 -22915 -6387 1531 1747 -521 -7780 -12136
1579a2136r96L3155N429j6003j1563j3298K0273N16k3755K2507j5405p488N72
$$ -12136 -13132 20023 25452 9449 -2114 -15412 4861 5377 -18378 4129 -11276 -18764 -18192
1566a8192k0485J2909J7680M725J800j7658K6760j061j9123J0325J5109J6952
$$ -18192 -38677 -25768 -8088 -3363 -1563 -19221 7539 6478 -12645 -2320 12789 29741
1554B9741j0039m1325m467K8150j0247j2452j0822N850J9374j1525p299L3999
$$ 29741 19702 -21623 -26090 2060 -8187 -20639 -31461 -25611 -6237 -17762 -25061 8938
1542H938K1820l2401j9703q123J233J2891J4777K841r656j5311J7910Q246j0296
$$ 8938 30758 -1643 -21346 -29469 -28236 -15345 -568 2273 -7383 -22694 -4784 3462 -6834
1529f834J0235K1790k4351j0917J1249N892m796m765J1834K359k119j2334K5944
$$ -6834 3401 25191 840 -10077 1172 7064 2268 -2497 9337 11696 9577 -2757 23187
1516B3187r002j4123j2305K3905J4122Q603p948j8700l3965J7895P783L1420j4366
$$ 23187 14185 62 -12243 11662 25784 34387 26439 7739 -26226 -8331 -548 30872 16506
1503A6506l3143l939j5278p826K7666J0772Q479J0562j504j1380M744j4594J9192
$$ 16506 -16637 -20576 -35854 -43680 -16014 -5242 3237 13799 12295 915 5659 -8935 10257
1490A0257J6439k7499m132J1924j2223J9528l436j0383r00M142J0597j170k4226
$$ 10257 26696 -803 -4935 6989 -5234 14294 10858 475 -425 3717 14314 13144 -11082
1477a1082J9212J1838l552J3531o570J6003k7778K9234j5444k7929m0908K4872
$$ -11082 8130 19968 16416 29947 23377 39380 11602 40836 25392 -2537 -43445 -18573
$$ [...]
##END NTUPLES=NMR SPECTRUM
##END=
