##TITLE=1H_EC-3305(II-1)-8
 CDCl3
 8 sc, 
 20.11.2023
##JCAMPDX= 6.0         $$ Bruker NMR JCAMP-DX V2.0
##DATA TYPE= NMR SPECTRUM
##DATA CLASS= NTUPLES
##ORIGIN= UXNMR, Bruker Analytische Messtechnik GmbH
##OWNER= root
$$ XWIN-NMR		Version 3.5
$$ Mon Nov 20 15:57:51 2023 Russian Standard Time (UT+4h)  she@DPX200
##.OBSERVE FREQUENCY= 200.1313
##.OBSERVE NUCLEUS= ^1H
##.ACQUISITION MODE= SIMULTANEOUS
##.ACQUISITION SCHEME= undefined
##.AVERAGES= 8
##.DIGITISER RES= 18
##SPECTROMETER/DATA SYSTEM= spect
##.PULSE SEQUENCE= zg30
##.SOLVENT NAME= CDCl3
##.SHIFT REFERENCE= (INTERNAL, CDCl3, 0, 15.4979)
##AUDIT TRAIL= $$ (NUMBER, WHEN, WHO, WHERE, WHAT)
$$ ##TITLE= Audit trail, XWIN-NMR		Version 3.5
$$ ##JCAMPDX= 5.01
$$ ##ORIGIN= Bruker BioSpin GmbH
$$ ##OWNER= she
$$ F:/spectra/data/she/nmr/H-F/1/pdata/1/auditp.txt
$$ ##AUDIT TRAIL=  $$ (NUMBER, WHEN, WHO, WHERE, WHAT)
(   1,<2023-11-20 15:56:35.45 +0400>,<she>,<DPX200>,
      <created by zg, POWCHK disabled, PULCHK disabled
       configuration hash MD5:
       00 E9 B6 7A A2 85 ED C7 34 08 36 98 17 FE 4E 26
       data hash MD5: 16K
       96 9B 08 C6 41 84 BA 6F CD 9A 90 5F B1 CD 6A B9>)
(   2,<2023-11-20 15:56:38.26 +0400>,<she>,<DPX200>,
      <Start of raw data processing
       efp BC_mod = 2 LB = 0.24 FT_mod = 6 PKNL = 1 PHC0 = -23875.03 PHC1 = 19.05269 SI = 16K 
       data hash MD5: 16K
       E3 DF F1 6C 60 BE BF F6 F3 AA D2 D5 BE 0C D8 3F>)
(   3,<2023-11-20 15:56:55.95 +0400>,<she>,<DPX200>,
      <pk PHC0 = -3.223027 PHC1 = 4.8 
       data hash MD5: 16K
       25 3A 7E 9E 3A 2D 7C E6 37 35 00 45 71 BB 99 62>)
(   4,<2023-11-20 15:57:00.15 +0400>,<she>,<DPX200>,
      <abs ABSG = 5 
       data hash MD5: 16K
       66 6C 57 4A 66 6A DB FC E7 CC A3 59 A2 32 A2 C9>)
$$ ##END=
$$ 
$$ hash MD5
$$ 19 1A EC 3E CA 42 50 A7 B8 D6 E3 7F 89 09 9E 27
##$RELAX= 
##$RELAX= 
##$RELAX= 
##$RELAX= 
##$RELAX= 
##$RELAX= 
$$ Bruker specific parameters
$$ --------------------------
##$DU= <F:/spectra>
##$EXPNO= 1
##$NAME= <H-F>
##$PROCNO= 1
##$TYPE= <nmr>
##$USER= <she>
##$AMP= (0..31)
100 100 100 100 100 100 100 100 100 100 100 100 100 100 100 100 100 100 
100 100 100 100 100 100 100 100 100 100 100 100 100 100 
##$AQSEQ= 0
##$AQ_mod= 1
##$AUNM= <au_zg>
##$AUTOPOS= <>
##$BF1= 200.13
##$BF2= 200.13
##$BF3= 200.13
##$BF4= 200.13
##$BF5= 200.13
##$BF6= 200.13
##$BF7= 200.13
##$BF8= 200.13
##$BYTORDA= 1
##$CFDGTYP= 0
##$CFRGTYP= 5
##$CHEMSTR= <none>
##$CNST= (0..31)
1 1 145 1 1 1 1 1 1 1 1 1 1 1 1 1 1 1 1 1 1 1 1 1 1 1 1 1 1 1 1 1 
##$CPDPRG= <>
##$CPDPRG1= <>
##$CPDPRG2= <>
##$CPDPRG3= <>
##$CPDPRG4= <mlev>
##$CPDPRG5= <mlev>
##$CPDPRG6= <mlev>
##$CPDPRG7= <mlev>
##$CPDPRG8= <mlev>
##$CPDPRGB= <>
##$CPDPRGT= <>
##$D= (0..31)
0 1.2 0 0 0 0 0 0 0 0.06 0 0.03 0 0 0 0 0.0002 0 0 0 0 0 0 0 0 0 0 0 0 
0 0 0 
##$DATE= 1700481394
##$DBL= (0..7)
120 120 120 120 120 120 120 120 
##$DBP= (0..7)
150 150 150 150 150 150 150 150 
##$DBP07= 0
##$DBPNAM0= <>
##$DBPNAM1= <>
##$DBPNAM2= <>
##$DBPNAM3= <>
##$DBPNAM4= <>
$$ [...]
##$SUBNAM3= <"">
##$SUBNAM4= <"">
##$SUBNAM5= <"">
##$SUBNAM6= <"">
##$SUBNAM7= <"">
##$SUBNAM8= <"">
##$SUBNAM9= <"">
##$SW= 18.0517328524113
##$SWIBOX= (0..15)
0 0 2 0 0 0 0 0 0 0 0 0 0 0 0 0 
##$SW_h= 3612.71676300578
##$TD= 16384
##$TD0= 1
##$TE= 0
##$TE2= 300
##$TE3= 300
##$TEG= 300
##$TL= (0..7)
0 120 120 120 120 120 120 120 
##$TP= (0..7)
150 150 150 150 150 150 150 150 
##$TP07= 0
##$TPNAME0= <>
##$TPNAME1= <>
##$TPNAME2= <>
##$TPNAME3= <>
##$TPNAME4= <>
##$TPNAME5= <>
##$TPNAME6= <>
##$TPNAME7= <>
##$TPOAL= (0..7)
0.5 0.5 0.5 0.5 0.5 0.5 0.5 0.5 
##$TPOFFS= (0..7)
0 0 0 0 0 0 0 0 
##$TUNHIN= 0
##$TUNHOUT= 0
##$TUNXOUT= 0
##$USERA1= <user>
##$USERA2= <user>
##$USERA3= <user>
##$USERA4= <user>
##$USERA5= <user>
##$V9= 5
##$VALIST= <valist>
##$VCLIST= <CCCCCCCCCCCCCCC>
##$VD= 0
##$VDLIST= <DDDDDDDDDDDDDDD>
##$VPLIST= <PPPPPPPPPPPPPPP>
##$VTLIST= <TTTTTTTTTTTTTTT>
##$WBST= 1024
##$WBSW= 4
##$XGAIN= (0..3)
0 0 0 0 
##$XL= 0
##$YL= 0
##$YMAX_a= 296716
##$YMIN_a= -440449
##$ZGOPTNS= <>
##$ZL1= 120
##$ZL2= 120
##$ZL3= 120
##$ZL4= 120
##$ABSF1= 15.5122
##$ABSF2= -2.539649
##$ABSG= 5
##$ABSL= 3
##$ALPHA= 0
##$AQORDER= 0
##$ASSFAC= 0
##$ASSFACI= 0
##$ASSFACX= 0
##$ASSWID= 0
##$AUNMP= <proc_1d>
##$AZFE= 0.1
##$AZFW= 0.1
##$BCFW= 0
##$BC_mod= 2
##$BYTORDP= 0
##$COROFFS= 0
##$CY= -3
##$DATMOD= 1
##$DC= 0
##$DFILT= <>
##$DTYPP= 0
##$F1P= 0
##$F2P= 0
##$FCOR= 1
##$FTSIZE= 16384
##$FT_mod= 6
##$GAMMA= 0
##$GB= 0
##$INTBC= 1
##$INTSCL= 3.70164e-10
##$ISEN= 128
##$LB= 0.24
##$LEV0= 0
##$LPBIN= 0
##$MAXI= 10000
##$MC2= 0
##$MEAN= 0
##$ME_mod= 0
##$MI= 1.114404
##$NCOEF= 0
##$NC_proc= -6
##$NLEV= 6
##$NOISF1= 3.799351
##$NOISF2= 2.8
##$NSP= 0
##$NTH_PI= 0
##$NZP= 0
##$OFFSET= 15.49788
##$PC= 1
##$PHC0= -23878.25
##$PHC1= 23.85269
##$PH_mod= 1
##$PKNL= yes
##$PPARMOD= 0
##$PSCAL= 0
##$PSIGN= 0
##$REVERSE= no
##$SF= 200.130004766215
##$SI= 16384
##$SIGF1= 3
##$SIGF2= 2
##$SINO= 5.538805
##$SIOLD= 16384
##$SREGLST= <1H.CDCl3>
##$SSB= 0
##$STSI= 16384
##$STSR= 0
##$SW_p= 3612.71676300578
##$SYMM= 0
##$S_DEV= 0
##$TDeff= 16384
##$TDoff= 0
##$TI= <>
##$TILT= no
##$TM1= 0
##$TM2= 0
##$TOPLEV= 0
##$USERP1= <user>
##$USERP2= <user>
##$USERP3= <user>
##$USERP4= <user>
##$USERP5= <user>
##$WDW= 1
##$XDIM= 16384
##$YMAX_p= 497238228
##$YMIN_p= -882177
$$ End of Bruker specific parameters
$$ ---------------------------------
##NTUPLES= NMR SPECTRUM
##VAR_NAME=  FREQUENCY,     SPECTRUM/REAL,   SPECTRUM/IMAG
##SYMBOL=    X,             R,               I
##VAR_TYPE=  INDEPENDENT,   DEPENDENT,       DEPENDENT
##VAR_FORM=  AFFN,          ASDF,            ASDF
##VAR_DIM=   16384,         16384,           16384
##UNITS=     HZ,            ARBITRARY UNITS, ARBITRARY UNITS
##FACTOR=    0.220516191357247, 1,           1
##FIRST=     3101.59079466281, 0,            0
##LAST=      -511.125968342967, 0,           0
##MIN=       -511.125968342967, -882177,     0
##MAX=       3101.59079466281, 497238228,    0
$$ Real data points
##PAGE= N=1
##DATA TABLE= (X++(R..R)), XYDATA
$$ [...]
8760A1417011J04735K88264K78730K56276N0368k15584l54691m70847o11944p25279
8750A0017039p19112o95523m78135n05622m31724l57555k41432j35443j65321
8741F287172j45353k367M2288j2379M4005K00577J29595K68481M6442J89136L36749
8730G384346K14095L38483N14932O14530O39151P11763N37506M23127J81140j24005
8720A1435068l50297k79013j34100r3055o8137J37573K19865P0264p5396k11238
8710A0651534m05543p10912p97177p57243o46717p18165n96061m43659l96350
8701E179707n01676k51752j88132j69513j29497r5822j26624j68927N9208m2270
8691C564702j79502m7042R2226M6997K8947J8449p6113k6826p7533k2784o3347
$$ plain form
8760 11417011 11521746 11810010 12088740 12345016 12395384 12179800 11825109 11354262 10742318 10017039
8750 10017039 9297927 8602404 8124269 7618647 7186923 6829368 6587936 6452493 6287172
8741 6287172 6141819 6139452 6181740 6169361 6213366 6413943 6543538 6812019 6858461 7047597 7384346
8730 7384346 7598441 7936924 8451856 9066386 9705537 10417300 10954806 11377933 11559073 11435068
8720 11435068 11084771 10805758 10671658 10578603 10510466 10648039 10867904 10938168 10862772 10651534
8710 10651534 10245991 9535079 8737902 7980659 7333942 6615777 6019716 5576057 5179707
8701 5179707 4678031 4426279 4238147 4068634 3939137 3843315 3716691 3547764 3606972 3564702
8691 3564702 3385200 3338158 3430384 3477381 3506328 3524777 3448664 3421838 3344305 3321521 3258174
8680C258174j54836j53614j2914l0169q7376j14142j35195o3127r7562m3226q3400
8669B282613N868r0121K7684j35672j37858J954R3962P0246j36811j2970n2651
8658A916244N5204L5854J7875L8348J21859P4749o3362K7451p9354N9734O3377
8647B267979P1928j20615J8637l2443k9206o7455j38063p6205o9077J29791m8676
8636A906595r6703r7834Q0714R9179o588P163k7537K537o1651K3038J45948p3133
8624A901728r6368j2894O0358R2888Q2173P341P4174m6800o0785P8375M7484l843
8612B123831M3198j5544K6589R5497J7753P387n6114l65O2193K1234O9273Q1634
8600B476566J4344M593m9109Q7359o2665Q8352J97416j3274j5819l8123K7927
$$ plain form
8680 3258174 3103338 2949724 2936810 2906641 2819265 2705123 2569928 2506801 2409239 2366013 2282613
8669 2282613 2288481 2198360 2226044 2090372 1952514 1954468 2048430 2118676 1981865 1968895 1916244
8658 1916244 1971448 2007302 2025177 2063525 2185384 2260133 2196771 2224222 2144868 2204602 2267979
8647 2267979 2339907 2219292 2237929 2205486 2176280 2108825 1970762 1894557 1825480 1955271 1906595
8636 1906595 1809892 1712058 1792772 1891951 1885363 1892526 1864989 1867526 1805875 1828913 1974861 1901728
8624 1901728 1805360 1792466 1852824 1945712 2027885 2035226 2109400 2062600 2001815 2080190 2127674 2123831
8612 2123831 2167029 2151485 2178074 2273571 2291324 2298711 2242597 2242232 2304425 2325659 2394932 2476566
8600 2476566 2490910 2495503 2446394 2533753 2471088 2559440 2756856 2743582 2727763 2689640 2717567
8589B717567J33832J04494J63804J77230K60510K41266K19865J69591J58410K63389
8579D609958M88523M09372L14637L83977J92736n4336L7648N5139n8352k69827
8569F109475m1241K3579J33955K73498J29089J26506m9904j55725k51795k95771
8559F001666m22802k88857k76293j79243j00615j81414j90104j46266l1414n3649
8549D131009K0559K5507J60690J04990J39935K14567J13806L04301L89323L41177
8539E945864M89687N54399O83482O08022N33444M59924K26468L2568p7321k95589
8529I160948k95158j46657j59142J73620K35698J88727J9495j58329l37580l65097
8519H316525m46828n14318o60166o05786m92085m12579l72746k18443l23295k59326
$$ plain form
8589 2717567 2851399 2955893 3119697 3296927 3557437 3798703 4018568 4188159 4346569 4609958
8579 4609958 5098481 5507853 5822490 6206467 6399203 6344867 6382515 6437654 6379302 6109475
8569 6109475 6068234 6091813 6225768 6499266 6628355 6754861 6704957 6549232 6297437 6001666
8559 6001666 5578864 5290007 5013714 4834471 4733856 4552442 4362338 4216072 4184658 4131009
8549 4131009 4151568 4177075 4337765 4442755 4582690 4797257 4911063 5215364 5604687 5945864
8539 5945864 6435551 6989950 7673432 8281454 8814898 9274822 9501290 9533858 9456537 9160948
8529 9160948 8865790 8719133 8559991 8733611 8969309 9158036 9177531 9019202 8681622 8316525
8519 8316525 7869697 7355379 6695213 6089427 5597342 5184763 4812017 4593574 4270279 4010953
8509D010953j16292j07355p7560j27241j3301r0963p4771r3591R4611K74355J67546
8498C846391J34558M2539K32331L91717L38378K28254J33867j59430k20189k04059
8488D764357n0189j21886l1382L1480J07408J72046P5731q1668j86097k43119
8478D436681l03223l67966l37965k27421l71896k01470k25185j82766o2777k04306
8468A951706r2979o2492o2722l4210k9850q0100q7830r2329n1521M6018m7041
8457A356650q339j189J1471k6402q7504o4384M7939J31068J00332l8623j59946
8446A261073p6386l4854J1811K9065r0969p0405j28902O6104k0975n0657n3509
8435H41396L1151r449j42846K408P3574o8183m5057Q3339p651j38935o78q6997
$$ plain form
8509 4010953 3894661 3787306 3709746 3582505 3569204 3478241 3403470 3309879 3404490 3678845 3846391
8498 3846391 3980949 4023488 4255819 4647536 4985914 5214168 5348035 5188605 4968416 4764357
8488 4764357 4714168 4592282 4560900 4592380 4699788 4871834 4947565 4865897 4679800 4436681
8478 4436681 4133458 3765492 3427527 3200106 2828210 2626740 2401555 2218789 2156012 1951706
8468 1951706 1858727 1796235 1733513 1699303 1669453 1589353 1501523 1409194 1357673 1403691 1356650
8457 1356650 1348311 1347122 1358593 1332191 1244687 1180303 1228242 1359310 1459642 1421019 1261073
8446 1261073 1184687 1149833 1161644 1190709 1099740 1029335 900433 966537 945562 894905 841396
8435 841396 872547 863098 720252 722660 796234 728051 682994 766333 758682 619747 619069 532072
8423E32072L231J33183q1209r7280Q065L260m9872o8402K9371j00432L806N1709
8411C67502q7047K28183K0056j07684M6199n5583j3971p0772J25892j2251q6354
8400C54170R1204N2623j41634j54135J16505J4169l9468J3624M2437o6598r7230
8389A85667O548m8118j06579J44947J48510o1659j21780j8508O5066K0607r347
8378B05354R7981P2027q4431l1980R474j7590K2480Q6060k8579o1845n9940k187
8366B06824J28998n8908o4656k4658P180O7874K7654j8446P1791n2582j91825
8355I9246L1406J06496j4784K3958n5430n0545N1014n2094N1058R0653q8361J15975
8343C08592o1706p2221J15047k7119k1110m826N9112j1382j47508q0598L9024
$$ plain form
8423 532072 535303 668486 587277 489997 498062 501322 451450 383048 412419 311987 315793 367502
8411 367502 280455 508638 528694 421010 467209 411626 397655 326883 452775 440524 354170
8400 354170 445374 497997 356363 202228 318733 332902 293434 307058 349495 282897 185667
8389 185667 192215 144097 37518 182465 330975 269316 147536 129028 194094 214701 205354
8378 205354 303335 375362 290931 258951 268425 250835 273315 359375 330796 268951 209011 206824
8366 206824 335822 276914 212258 187600 194780 262654 290308 271862 343653 291071 99246
8355 99246 130652 237148 222364 246322 190892 140347 191361 139267 190325 280978 192617 308592
8343 308592 246886 174665 289712 262593 241483 236657 295769 284387 136879 56281 95305
8332I5305N9835j8340m5355Q2809p7485p017N2497l9586o1692J15096J1779q4630
8320H3216K0449l6199J9276o4746K1081K0094J6437K1358m3805j3086P3754M1552
8308A59381l6397L0955j8087N0754j13081O9630J8347j17993M5378M3313k2002
8297A10198p4790M2903L7408J8023O3897o6574J8670j3926j6301K9971R8969Q6955
8285C35403q0423O8740o145P684j7751k0538O8169j13057o1310K476o3338J9521
8273A39431j3693N8514J6509k3643L0773J09189J7669K8521j23327j8220J8510
8262B40233Q3753m7291q4461j3086P3194J4013j619L6435j06122J7637l0373M3127
8250B25440M5349l0071R2989j4832m7939J0250P5072P9835l0382J9894l1721l9571
$$ plain form
8332 95305 155140 136800 91445 174254 96769 89752 142249 102663 40971 156067 167846 83216
8320 83216 103665 67466 86742 21996 43077 63171 79608 100966 57161 44075 117829 159381
8308 159381 122984 153939 135852 186606 73525 143155 161502 43509 88887 132200 110198
8297 110198 35408 78311 115719 133742 197639 131065 149735 135809 119508 149479 248448 335403
8285 335403 254980 323720 317575 325259 307508 286970 355139 242082 180772 183248 119910 139431
8273 139431 125738 184252 200761 177118 207891 317080 334749 363270 239943 221723 240233
8262 240233 323986 276695 192234 179148 252342 266355 264736 301171 195049 212686 182313 225440
8250 225440 270789 240718 333707 318875 270936 281186 356258 436093 405711 425605 393884 354313
8238C54313l9462R772O0446Q059L7517J7894j59915M6270J6803p5329N7548o0975
8226B72941M7213J479K6325J2754L2625m6361o4623L2497R0454J1994K1270L3817
8214D72385j67217k6917K0253O6816K7738l6749m813m0443Q0219P5036J237j0909
8202D56636K3123J442n1784P5907p7100J38126j34193J36408J0475L18736j165845
8191b68069o14108N59444J5295K34825J05408J56276m1675K1414q007J75733j14814
8180B21722J53969N728o5934p8788O1936n6415M8449L8243n7195p5641j4020J03078
8168B85132O126O6361k9137k0341J6623K6513P3604k5443k9222M6139q188j5401
8156C92766P6878J13810n1336j06396O1342N4981q5846o0914j28125j0441J15083
$$ plain form
8238 354313 314851 324623 385069 393128 430645 448539 288624 334894 351697 276368 333916 272941
8226 272941 320154 321633 347958 360712 393337 346976 282353 314850 405304 417298 438568 472385
8214 472385 305168 278251 298504 365320 393058 356309 351496 311053 391272 466308 467545 456636
8202 456636 479759 481201 429417 505324 428224 566350 432157 568565 579040 897776 -268069
8191 -268069 -882177 -322733 -307438 -72613 32795 189071 147396 168810 160803 336536 221722
8180 221722 375691 381419 315485 236697 298633 242218 290667 328910 271715 196074 182054 285132
8168 285132 291258 357619 328482 308141 324764 351277 424881 399438 370216 416355 408167 392766
8156 392766 469644 583454 532118 425722 487064 542045 456199 395285 267160 256719 371802
8145C71802K7226J1653j63989m2332l4190R8559j7678p0968P7003M0364m2454
8134B54996j45113P4799O1917J3769m2469m6860J0957J638o1818J29303o5804
8123A85315N2396J36510p8577m998L2615J18203J7619P719j51296J5960P0130
8112D01596o1572N8864L8600p7113r956J29928K0139n6080r0527o7337P2183p515
8100C51210m078O0166j34448K7614j389O9821n3708j9169q1285r911J45577K6442
8088C76842q1519O5354j8359O8264K642m9159j5635L9235k8582K620n366m9138
8076C07199J54601m2335j6535n5538K6873K6815p6648m1786k9140j5253p3361
8065A64892K8209Q7206m6482n770n7577M1161K0822j15003q1473O344j8830j2089
$$ plain form
8145 371802 399028 410681 246692 204360 170170 268729 251051 180083 257086 297450 254996
8134 254996 109883 184682 246599 260368 217899 171039 181996 183634 121816 251119 185315
8123 185315 237711 374221 295644 290646 323261 441464 459083 466802 315506 331466 401596
8112 401596 340024 398888 437488 360375 350419 480347 500486 444406 353879 286542 358725 351210
8100 351210 347132 407298 272850 300464 299075 368896 315188 296019 214734 204823 350400 376842
8088 376842 295323 360677 342318 410582 413224 364065 348430 387665 359083 361703 356337 307199
8076 307199 461800 419465 402930 347392 374265 401080 324432 282646 253506 238253 164892
8065 164892 193101 280307 233825 228055 170478 211639 232461 117458 35985 42329 23499 11410
8053A1410O9560J41153r528j88j49388N5126J3871R649k5565K6114j9902l6862
8041H5450k4251m0243k9644L4060R0117m7748o9683J4389J15494r9996m9328L1233
8029I850j4010K6482j36574J870J8103N3620K1661L3476J08063j23967J2795j15264
8017a03895J2122R8688K2201n1684k0229J28106J34608r2991j11699M9397m3769
8006B0855L0105o1904O7098p737L1641m4613k8104M6725n6467j6747M4917N2390
7994G8159q4992K5518L664q2278J9891J6358p0427N8647J503N2014n5072j5551
7982e2566M3613n9870k4973P9447o1616P4862J7695j11158M9196P4233o9231K4971
7970a5397P4441Q0849q6408J2600K0467o0767q6986M8283L9820L0346J08440o8259
$$ plain form
8053 11410 80970 222123 212595 212407 63019 118145 132016 141665 116100 142214 122312 85450
8041 85450 61199 20956 -8688 25372 115489 67741 -1942 12447 127941 27945 -21383 9850
8029 9850 -4160 22322 -114252 -112382 -94279 -40659 -18998 14478 122541 -1426 11369 -103895
8017 -103895 -91773 6915 29116 -22568 -42797 85309 219917 126926 15227 64624 20855
8006 20855 50960 -10944 56154 48417 80058 35445 7341 54066 -2401 -19148 25769 78159
7994 78159 -6833 18685 22349 -59929 -40038 -23680 -94107 -35460 -33957 18057 -37015 -52566
7982 -52566 -8953 -68823 -93796 -14349 -75965 -1103 16592 -94566 -45370 28863 -40368 -15397
7970 -15397 59044 139893 53485 66085 86552 25785 -61201 -12918 26902 57248 165688 97429
7958I7429j72671M6692Q6504p333m8800j2319J8520j6139k9649m829L4590m6565
7946e4570J48575j6581m0804r1984K7917L1657L893J0531L6315N4908n6015k3384
7934C0458N4450l8084k3482M196k1097p7718K1522K2926P1699N0524l7837j46804
7922h9247j5277K2083N4973J31862l088j11392K646P548k3318j4070L536J1641
7910b2103K7808O3470j3976J4136m0973K0194Q956L6888m7635p4356P375K9026
7898H810M0203j2519j723K7806p8732q9159j2689L3964O3371R7546M319m984M7889
7885A24102p9701j05024J60823J744R128m5774Q40O8546j77832P8304J53299q4587
7873A03868M649L0271o9698J3835j811o860L7825Q3758o1822p4341P2573P1724
$$ plain form
7958 97429 -75242 -28550 57954 50621 1821 -10498 8022 -8117 -37766 -42595 -8005 -54570
7946 -54570 94005 77424 36620 -55364 -27447 4210 8103 18634 54949 109857 53842 30458
7934 30458 84908 46824 23342 27538 6441 -71277 -49755 -26829 44870 95394 57557 -89247
7922 -89247 -104524 -82441 -27468 104394 101306 -10086 -7440 108 -23210 -37280 -33744 -22103
7910 -22103 5705 69175 55199 69335 28362 48556 57512 94400 46765 -27591 -20216 8810
7898 8810 49013 36494 34771 62577 -16155 -105314 -118003 -84039 -20668 76878 81197 76213 124102
7885 124102 44401 -60623 100200 101944 111072 65298 66138 134684 -43148 35156 188455 103868
7873 103868 108517 138788 69090 82925 81114 74254 112079 195837 134015 59674 132247 203971
7861B03971n5783q9291J04332K4896j0761K0654q137J4591l6976K3709n7366m1077
7849I2762J58J0212l678r653O7378r6762L0115M4511m7855P4885N361l9448N1754
7836A79740j29874P4178k9592O5197M9135m2500q0407M9521J11802m2896N3734
7825B58038p317q680q9810K6606J09121L4892j54562L6624P1581k0705o6274P2889
7813B62403J11898P045q9703o2662J0843N5317j28891m8295l3919O7363o6625
7802H4774j53873J5767o5944Q9350J13599j3368L2400j10915J1586R1910N0490
7791A45776o0321k3391O9385q737l2428q1615j00588K5375M8446K6353O829j8948
7779c864R3138l479q000j0883m6236q9628j8822O08O7467M9176l4059M7604O5688
$$ plain form
7861 203971 148188 58897 163229 188125 177364 198018 189881 204472 167496 191205 133839 92762
7849 92762 92920 103132 99454 89801 157179 60417 90532 135043 87188 162073 167434 127986 179740
7836 179740 49866 124044 94452 159649 208784 166284 85877 135398 247200 204304 258038
7825 258038 250721 242041 152231 178837 287958 322850 168288 204912 276493 255788 189514 262403
7813 262403 374301 381346 291643 228981 239824 295141 166250 117955 84036 151399 84774
7802 84774 -69099 -53332 -119276 -29926 83673 70305 102705 -8210 3376 95286 145776
7791 145776 85455 62064 131449 122712 90284 8669 -91919 -66544 -18098 8255 15084 -3864
7779 -3864 89274 85795 77795 66912 20676 -68952 -87774 -87166 -19699 29477 -4582 43022 108710
7766A08710j04793M1033J27054j29795j7480M6667L8721J7879K4003j1189j04895
7755C5915j0450L1125J24400l7683k6554j28200M3040Q9960l3657n5033O4975
7744I7838j6335J5469j0947o5587j02446k4868R6621k6370l7291J35981L6498
7733I8563j21495P8043O8924l5729n3835k4122k8570P4354k3662J03420m7581
7722H8310o1880K3751q6076J6129M6238L0076n1197j44216R3773P8345R4631r8817
7710B9067q6438Q6172m6607N7649J5300j0476k3347j01319J18289j8049p639L0432
7698D3034j05416O5888O7002o5907K5180j1762R1845R3792j10161P6459q1865
7687H8089j2450p4322J1493K3033k0281L0736K2926j0894L3113P6262j06231J358
$$ plain form
7766 108710 3917 44950 172004 42209 24729 71396 110117 127996 151999 140810 35915
7755 35915 25465 56590 180990 143307 116753 -11447 31593 121553 87896 32863 97838
7744 97838 81503 96972 86025 20438 -82008 -106876 -10255 -36625 -73916 62065 98563
7733 98563 -22932 55111 124035 88306 34471 10349 -18221 56133 32471 135891 88310
7722 88310 26430 50181 -35895 -19766 26472 56548 5351 -138865 -45092 33253 127884 29067
7710 29067 -57371 28801 -17806 39843 55143 44667 21320 -79999 38290 20241 12602 43034
7698 43034 -62382 3506 70508 4601 29781 18019 109864 203656 93495 169954 88089
7687 88089 75639 1317 12810 35843 15562 46298 69224 58330 91443 167705 61474 62832
7675F2832M1155o09n3756j3473j45053l1286P0807M7241J5395m4128M7597N3226
7663D9948M5396k0689q9452n1547K7389M5121r871O4075K1082j5114N2797M996
7651A24131q187q7372K2690j9337k5959O079l7261m4541l8401p0844R9372P5149
7639d481l5472J6693N9841j0397p6958p267K2762N9032k8615J35948N0725j53911
7627B7900O4765Q3074k6352j14607K7462O2069l1916j46977o081k0434L367l7040
7615a14770Q648M9824P5195j4618p7388Q7031M4975M8701m8833j05317K5415K6101
7603D964M5476M6819l2350j83881j55627J22259K8167L0732P807J03333k6610
7592h911O1801L124M2984l3376N978j5412L5805l8427l6416k5874m7912l4100
$$ plain form
7675 62832 103987 103378 49622 36149 -108904 -140190 -69383 -22142 -6747 -50875 -3278 49948
7663 49948 95344 74655 -14797 -66344 -38955 6166 -3705 60370 81452 66338 119135 124131
7651 124131 115944 28572 51262 31925 5966 12045 -25216 -69757 -108158 -179002 -79630 -4481
7639 -4481 -39953 -23260 36581 26184 -50774 -58041 -35279 23753 -4862 131086 181811 27900
7627 27900 92665 175739 149387 34780 62242 124311 92395 -54582 -60663 -81097 -77730 -114770
7615 -114770 -106122 -56298 18897 4279 -73109 13922 58897 107598 58765 -46552 -21137 4964
7603 4964 50440 97259 64909 -118972 -274599 -152340 -124173 -93441 -85634 17699 -8911
7592 -8911 52890 56014 98998 65622 71600 56188 91993 53566 17150 -8724 -56636 -90736
7580i0736m1912L7737k6353J09541j37140P467P7032P269R373L5962J5126n4027
7568e0661R7867M4024n0192m4302o5914O2742k0356P9766N3375J1124k0680q3824
7556A2969j6549l5538Q0444O7823o467k6595j6860J5976j7782p362j168j3210
7544C5681J56899l9339l1286k6444L0069L224p3992N4606M4775o3417l160k1508
7532F6108j00818R811K9056J4252m4387O6630P2535l9912n3280N7388P6171m7392
7520A06162L1960j01101K0368r569n0784P1161n8115m9438L1180Q9499N9923p3694
7508F7552j38342J07170M5771n6417K6409q8438n1776L6861p253j6515k8059j3679
7496a16716J3426J11546L0969K7317O5847o3599j11225R122N654J6632l275J3579
$$ plain form
7580 -90736 -132648 -94911 -121264 -11723 -148863 -141396 -64364 -57095 -47722 -11760 3366 -50661
7568 -50661 47206 91230 41038 -3264 -69178 -6436 -26792 52974 106349 117473 96793 12969
7556 12969 -3580 -39118 41326 109149 102682 76087 59227 75203 57421 50059 48891 35681
7544 35681 192580 153241 121955 95511 125580 128804 54812 109418 154193 90776 87616 66108
7532 66108 -34710 -24899 4157 18409 -25978 40652 113187 73275 19995 77383 153554 106162
7520 106162 138122 37021 57389 47820 -2964 68197 10082 -39356 -8176 81323 141246 67552
7508 67552 -70790 36380 82151 25734 52143 -36295 -88071 -51210 -58463 -74978 -103037 -116716
7496 -116716 -103290 8256 39225 66542 132389 68790 -42435 -33313 -27659 -11027 -14302 -723
7484g23m1289J20976M9843l8496o2985m2336J05059n9961R974Q0501k1021N1642
7472A51184J05535k04387K9375J9901J2801J12790r5942o0689n9033M7353M2127
7461A01015k2955m5686K4162r3815L4323J11313K0624j06913L6807M9393O6645
7450A74913l4238l613K4447j7180P549p760j4000N2085M6272j06530j6972o929
7438I8044L1714j21O9898l2981n113P6550j4229p4346O0490L2641Q709p8846K9098
7425B01508N1409n3342k8984J0407L001o5324J0963j2132j09180Q1942J04116
7414A94384P7073K705l528K2932l7695m9035p7885l9052K7373N5636N2146q3218
7402A41836N1908M5807n230L2310n2634R3906p2102j9673O4785J0282k5096j17587
$$ plain form
7484 -723 -42012 78964 128807 90311 27326 -15010 90049 30088 40062 120563 99542 151184
7472 151184 256719 52332 81707 101608 114409 227199 131257 70568 11535 58888 101015
7461 101015 78060 32374 56536 -37279 -2956 108357 128981 22068 58875 108268 174913
7450 174913 140675 137062 161509 144329 151878 144118 130118 182203 228475 121945 104973 98044
7438 98044 129758 129637 199535 166554 161441 237991 223762 149416 209906 242547 251256 172410 201508
7425 201508 252917 199575 170591 180998 183999 118675 129638 117506 8326 90268 194384
7414 194384 271457 274162 270634 293566 255871 206836 128951 89899 117272 172908 225054 141836
7402 141836 193744 239551 234321 266631 213997 307903 235801 216128 280913 291195 266099 148512
7390A48512j9231L8731p6425J00024l0141M2195k8865O7293m8233m2672M7381
7379A98569j3068q1425O0246R9626Q2140p9094j13129N9389l5609M7998p6533
7368A49110J0667l254m6509p4030J06692r9896j053J26631L5496q6628p9239O2065
7356A00052l1157K7906M8775L497m6430r0882j0253J1446R8846n0933j74284M2621
7344g0796R0500L5738j5366q2608N4804M7583K8600n5974n6684O8884J02629N5798
7332B03108k3433O9206j37646m2530J9140L7330J7272o388J2440j00577M1579
7321H9501J7639P3378P864j0271O3777j01761r4988K306j2712P5395o3592n773
7309D0763n6177n1978l178R2425N6655Q490q044k9651j4176K6578n6922N8651
$$ plain form
7390 148512 129281 168012 91587 191611 161470 203665 174800 242093 193860 151188 198569
7379 198569 185501 104076 164322 263948 346088 266994 153865 213254 177645 225643 149110
7368 149110 159777 156523 110014 35984 142676 42780 41727 168358 203854 117226 37987 100052
7356 100052 68895 96801 145576 149073 102643 11761 1508 12954 111800 60867 -113417 -70796
7344 -70796 19704 55442 40076 -42532 12272 59855 88455 32481 -24203 44681 147310 203108
7332 203108 179675 248881 111235 68705 87845 125175 142447 136059 148499 47922 89501
7321 89501 107140 180518 188382 178111 241888 140127 45139 47445 34733 110128 46536 40763
7309 40763 -15414 -67392 -70570 21855 78510 87000 78956 49305 35129 61707 4785 63436
7297F3436P0726q440n6132K2349L8818r054o9785o5206J78367M6813k7088n0579
7285A34225L9130K6415n1410O125j7737l3266N4187k8905N799J3146P1914M8591
7273B68214j1958r0030o2027J36890l7578q7631L7164L169K9631N6427j9751r0205
7261A32315Q8530j27898M1410O3861p3189j05981j2927J9457n115L1982p43J03091
7249A54793n4413l5627j21386o2495J08726L0811K4817P7933K6505j33752l9822
7238b3910J42801r654p4761R5626J4151K1381l6367O4249q1904j09425J5180R534
7226B6901l9963J26016O7193n4003P4669o9503q1399m429L5327J10125O7116p5624
7214A82426j06988O9802m5906J1261L3634j9770M2158M435J49503j29386j66278
$$ plain form
7297 63436 134162 125722 69590 91939 130757 121703 51918 -13288 165079 211892 184804 134225
7285 134225 173355 199770 148360 154485 136748 103482 157669 128764 134563 147709 219623 268214
7273 268214 256256 166226 104199 241089 203511 115880 153044 156213 185844 242271 222520 132315
7261 132315 220845 92947 134357 198218 125029 19048 6121 25578 20463 52445 51702 154793
7249 154793 100380 64753 -56633 -119128 -10402 20409 45226 123159 149664 15912 -23910
7238 -23910 118891 109237 34476 130102 144253 165634 129267 193516 111612 2187 17367 26901
7226 26901 -13062 112954 180147 126144 200813 131310 49911 45482 80809 190934 258050 182426
7214 182426 75438 145240 99334 110595 144229 124459 166617 171052 320555 191169 24891
7203B4891m441J15211J18227j13192p8977m5902k4067N8973P8099k1152L3204
7192A40874K6283k9948k4157q3361r5971L9675N0559M2308L8832L4218M2080k8076
7180A53316k6056K033j9253o0520R2117o6118n87L8954N8646j2137j9041K0666
7168A62020J680o8963M6609L1444K5034k4197k862q1418j5173J12993m8297N0979
7156A89849K7785o9271k7798j0308l4789n3853N1764J3136j33080j08352J66482
7145A1565P5136j3285J63968q3212j01036J29673j8810j07192m8126P3615N945
7134H8241K0348K544N0873O4922j45714L9329l7090l7037M323J5704K1847l3634
7122E4656J38749n3668R546J9183p2008k1725J00844l6676p4739O1961P4K8589
$$ plain form
7203 24891 20450 135661 253888 140696 61719 15817 -8250 50723 128822 107670 140874
7192 140874 167157 137209 113052 29691 -66280 -26605 23954 66262 105094 139312 181392 153316
7180 153316 127260 129293 110040 49520 141637 75519 74932 113886 172532 160395 141354 162020
7168 162020 163700 94737 141346 172790 197824 173627 170765 89347 74174 187167 138870 189849
7156 189849 217634 148363 120565 110257 75468 21615 73379 86515 -46565 -154917 11565
7145 11565 86701 73416 237384 154172 53136 182809 163999 56807 8681 82296 88241
7134 88241 108589 111133 162006 226928 81214 120543 83453 46416 50739 66443 88290 54656
7122 54656 193405 139737 149283 168466 96458 74733 175577 138901 64162 126123 126197 154786
7110A54786O518J34274j79542k1795J33091J3352r3690p6921M4671j9749l6842
7099E8153O355N5225n1431p5295L1176J01593J7234j00198P8625J6456m5135K893
7087I5651J9488m9455p6705N4129O6940N9799M7262O6543L4912j14348k4443j06836
7075G2937n9613K0930M5125j3537m4410K00741K7988j05101J0793r4776j9021
7064D2056O9992k0430L5886M7234l3418n8075O6329k1231K2762J6260M82k991
7052A64856O3636m6785r1492M1927n3551n0354o5M0037J7063O2199P7434o8643
7040A56262p6418P6507Q9986n6146o1994M6734j4641O690j1839k9316m0902k112
7028H2811m6425M0933R2937l4491K9256J3550M5455J4914n5097M8933j0601O464
$$ plain form
7110 154786 161304 295578 116036 94241 227332 240684 146994 70073 114744 94995 58153
7099 58153 64508 119733 68302 -6993 24183 125776 143010 42812 121437 137893 92758 95651
7087 95651 115139 65684 -11021 43108 110048 169847 217109 283652 318564 204216 179773 72937
7075 72937 13324 34254 79379 65842 21432 222173 250161 145060 155853 61077 42056
7064 42056 112048 91618 127504 174738 141320 83245 149574 128343 151105 167365 167847 164856
7052 164856 228492 181707 90215 132142 78591 28237 28172 68209 85272 147471 224905 156262
7040 156262 79844 156351 246337 190191 128197 174931 160290 166980 155141 125825 84923 82811
7028 82811 36386 77319 170256 135765 165021 178571 224026 238940 183843 232776 222175 228639
7016B28639j17315l0616J23797P6277Q7023m9741j4583K1022m0846p2529O1825
7005B72953n702J8104J40690L1099n9072P5490L8959r152q5723j8485J5102o9455
6993C44808P8113q124Q134J08343k3432J02269J10020o7181o5693q0381o3308
6982D43568L5677J9324J322P129k3792M5523n8749R9747k7611j2009p1571j16862
6970C41696K5219j30666R4672J622j55532P7048K0145K4851l0205m0747K9613
6959B57716l2697k2722l1080N384J21356k4313j52659J06272N8682n9042O6929
6948B93826K5876r8402N061l5284M9359M2889M7944n3157p0176P3397Q855j8667
6936B71521r2995M9467J7145j1643L9417j10918J6991j8621n7226O5628M1222
$$ plain form
7016 228639 111324 80708 204505 280782 367805 318064 303481 324503 283657 211128 272953
7005 272953 267251 285355 426045 457144 398072 473562 512521 503369 417646 399161 414263 344808
6993 344808 422921 414797 422931 531274 507842 610111 720131 652950 587257 506876 443568
6982 443568 479245 498569 499891 507020 483228 528751 470002 569749 542138 530129 458558 341696
6970 341696 366915 236249 330921 332543 177011 254059 274204 299055 268850 228103 257716
6959 257716 225019 202297 171217 176601 297957 273644 120985 227257 285939 226897 293826
6948 293826 319702 221300 226361 191077 240436 283325 331269 278112 207936 281333 290188 271521
6936 271521 178526 227993 245138 233495 272912 161994 178985 160364 103138 168766 209988
6925B09988J0705R3713l6599l5447M3944J2052r484K934k6679O0264N212m7865
6913B82738l9444p0351Q8806J17084J50167p5708m9659j22140K4472J04502m9723
6902C60744J5231j8620l918m1080j9178M3225n6856R2333P7986Q203L9499K6754
6890E24323o6702q1415k6681l7867o3061j2956M2823r279N2586K7299L0485l0143
6878C49412j17402J20067o5764R341K5721O6257P3960r2478O096o8188J5699l4902
6866B87819L07M5032M480k7078l8880p783R484J6877k410k6087J041K088J1214
6853B76104K5470J1494j17978N5495O2870K8701p0994l558q7940N7317K5372k1978
6841B40375l3983N5762L7719K6277o215j39916J14132J4282k4779j08855k6645
$$ plain form
6925 209988 220693 314406 277807 242360 286304 298356 288872 291806 265127 325391 330603 282738
6913 282738 243294 172943 261749 378833 529000 453292 403633 281493 305965 410467 360744
6902 360744 375975 357355 353437 312357 293179 336404 279548 371881 449867 458070 497569 524323
6890 524323 457621 376206 349525 311658 248597 235641 278464 269185 321771 349070 379555 349412
6878 349412 232010 352077 286313 295654 321375 387632 461592 369114 375210 307022 322721 287819
6866 287819 288126 333158 337638 310560 271680 263897 273381 290258 287848 261761 262802 264890 276104
6853 276104 301574 313068 195090 250585 313455 342156 271162 267604 179664 236981 262353 240375
6841 240375 206392 262154 299873 326150 319935 180019 294151 308433 283654 174799 148154
6830A48154Q5709L7492Q064J21830k132n1307R2605j4224n9128j2341O744l6286
6818C25180p847n481L8822J20176J43600N8839L8800p0636m3112j2773j5595r4754
6806D75219m6333p872M8747j7937K0792O3449q8489K1450k7815j8170O0213N3332
6794E36586m2025m3427n1230M253O0005p488m1437N9527M2695k8911L6424J02552
6782F27524L8118N5216k5012J61177N0633K0502p5764j9611Q9862L0951J20691
6771A074287l1375r687J72773j17679k3062n8450l4311j41624J5219O4626j61471
6760G49246M9807P2242n8906k795Q3633M5543K6350j99943K3484P6949N9401j7302
6748I07709l2629Q632k6167j95854P6404P7976J25140r239k4571n4756N6135N4687
$$ plain form
6830 148154 233863 271355 279419 401249 399117 347810 440415 426191 367063 354722 361466 325180
6818 325180 317333 311852 350674 470850 614450 673289 712089 641453 598341 585568 569973 475219
6806 475219 428886 421014 469761 451824 472616 536065 447576 469026 441211 423041 483254 536586
6794 536586 494561 451134 399904 404157 464162 456674 415237 474764 517459 488548 524972 627524
6782 627524 665642 720858 695846 857023 907656 928158 852394 832783 922645 953596 1074287
6771 1074287 1042912 1033225 1205998 1088319 1065257 1006807 972496 830872 846091 910717 749246
6760 749246 799053 871295 812389 809594 893227 938770 965120 765177 788661 865610 925011 907709
6748 907709 875080 883712 857545 661691 738095 816071 941211 931972 907401 852645 908780 963467
6736I63467L0089J9654q0338J02152r3011p2155J0553J34023j05410n0767l7200
6725H21057L2277o0828M0967N6652k0750j20170J7059P0872J8707L3507j5791
6714H73559p8660P3924q8743m0586J1105J01691N2921j59639q4140N8935J3125
6703G33492P5796J76240j02840r2351L8651O2340Q7509j8181o0630k310o142J12414
6691A003988J04538K2293K4626M5662l9759L695N7161P8082O4626J2374n8475
6680A318811J31905q6222J6118J7362o1019J2254o292N313k53J6580J00083k0224
6668A444416K7605M6216Q0070o7226m958J15667J55825J34916J66994J76754L9112
6657B315391p429r3114j25897j78925j58016M734o6745J56722J01884J15519o7039
$$ plain form
6736 963467 993556 1013210 932872 1035024 942013 869858 880411 1014434 909024 858257 821057
6725 821057 853334 792506 833473 890125 869375 749205 766264 837136 855843 889350 873559
6714 873559 794899 868823 780080 739494 750599 852290 905211 745572 661432 720367 733492
6703 733492 809288 985528 882688 790337 828988 891328 978837 960656 900026 897716 891574 1003988
6691 1003988 1108526 1130819 1155445 1201107 1161348 1165043 1222204 1300286 1364912 1377286 1318811
6680 1318811 1450716 1364494 1380612 1397974 1336955 1349209 1342917 1348230 1347977 1364557 1464640 1444416
6668 1444416 1472021 1518237 1598307 1531081 1526123 1641790 1797615 1932531 2099525 2276279 2315391
6657 2315391 2307962 2214848 2088951 1910026 1752010 1756744 1689999 1846721 1948605 2064124 1997085
6646A997085J03623Q3163P4161K4074N775R2221J24010O3586O5031J21640J69845
6635B924214J39395J58186K9319l9856p5336j02445O6998J8680p5657L8288j6343
6624C065443q2685K1086k03247r8976J44025Q7550j03698J10483J21533J34876
6614C196390M1530P9577P2110K55227J87328J99184J63904L42989L37599M39488
6604E315326N54265O91072P69646M81176P5744k87235q26853p78775o35765m93063
6594D865538l38980k27626k50164j30909j01711P7087N306j13762j70019j36216
6584C478544j71690q8526r9480j31020P938j41017o665M0723M1731p1217L0412
6573B889733J0879j953J18521O3517O8348Q3227M2761J52860J68999K40880J32156
$$ plain form
6646 1997085 2100708 2183871 2258032 2282106 2287881 2380102 2504112 2567698 2632729 2754369 2924214
6635 2924214 3063609 3221795 3251114 3211258 3135922 3033477 3100475 3119155 3043498 3081786 3065443
6624 3065443 2982758 3003844 2800597 2701621 2845646 2933196 2829498 2939981 3061514 3196390
6614 3196390 3237920 3317497 3389607 3644834 3832162 4031346 4195250 4538239 4875838 5315326
6604 5315326 5869591 6560663 7330309 7811485 7887229 7599994 6773141 5994366 5358601 4865538
6594 4865538 4526558 4298932 4048768 3917859 3816148 3893235 3898541 3784779 3614760 3478544
6584 3478544 3306854 3218328 3118848 2987828 2995766 2854749 2848084 2888807 2930538 2859321 2889733
6573 2889733 2900612 2898659 3017180 3080697 3149045 3232272 3275033 3427893 3596892 3837772 3969928
6562C969928K4213j29814k52798k15346k76170j58482k4166j77153j03065p1166
6552B585981L7371O8940j58839m6019J49845Q6456j25781M0305J68041O5297j2494
6541B859103O8942j7071K710l8435n8248J8732j54295j62096o1393l2171K1140
6530B446918o4824o0775j34301p3905N7683o1099r5110K1551K4713l0945J05284
6519B135190J52173J24414Q8056J40950J39992L3440l3227j7622j6798P6272n3197
6508B769643k0442q5765o8946M4548J52261P7643O7849K220Q4046R6285j411k1979
6496C095952k1773K8075n2339o7125q0249k71180r8578k5211J3057J25896R0855
6485B737380Q111l4615q0123k205m0656j28133j21238m2483o77n0309M3807m8301
$$ plain form
6562 3969928 3994141 3864327 3611529 3396183 3120013 2961531 2937365 2760212 2657147 2585981
6552 2585981 2623352 2692292 2533453 2487434 2637279 2723735 2597954 2638259 2806300 2871597 2859103
6541 2859103 2928045 2910974 2913684 2875249 2817001 2835733 2681438 2519342 2457949 2425778 2446918
6530 2446918 2382094 2321319 2187018 2113113 2170796 2109697 2014587 2036138 2060851 2029906 2135190
6519 2135190 2287363 2411777 2499833 2640783 2780775 2814215 2780988 2763366 2746568 2822840 2769643
6508 2769643 2749201 2663436 2594490 2639038 2791299 2868942 2936791 2939011 3023057 3119342 3117931 3095952
6496 3095952 3074179 3102254 3049915 2982790 2902541 2631361 2532783 2507572 2520629 2646525 2737380
6485 2737380 2745491 2710876 2630753 2628548 2587892 2459759 2338521 2296038 2295361 2245052 2288859 2240558
6473B240558L4561J9625N2494j7225k9396J8485L3923l791j25691P7486l4933
6462B266096o6959K5674k4898K7730J21470k5308Q5115K554o6435N3895N1527
6451B450461K998J49366M1256p9740K1554N884N3987J65347l0578L0529J29814
6440B940878l9959j1148Q3130m4284o2842R4824m1571J04518q0529J5484P2366
6429C030867J94315N2762J72816J74951m4170R0348M1748J88855J99784J42232
6419D244508K75345K41640K7439r0571l2336l9590K2510J0694j3327J75113M1663
6408D863088O2103J05380J03359J98715J39767J43304J1394Q9224Q7865K65796
6398F069995J09942N6948M1930M835k4273L2448J722k5848O6613J08726k1279
$$ plain form
6473 2240558 2275119 2294744 2347238 2330013 2300617 2319102 2353025 2349234 2223543 2301029 2266096
6462 2266096 2199137 2224811 2199913 2227643 2349113 2323805 2408920 2411474 2345039 2398934 2450461
6451 2450461 2453459 2602825 2644081 2564341 2585895 2591779 2645766 2811113 2780535 2811064 2940878
6440 2940878 2900919 2889771 2972901 2928617 2865775 2960599 2919028 3023546 2943017 2958501 3030867
6429 3030867 3225182 3277944 3450760 3625711 3581541 3671889 3713637 3902492 4102276 4244508
6419 4244508 4519853 4761493 4788932 4698361 4666025 4626435 4648945 4659639 4646312 4821425 4863088
6408 4863088 4925191 5030571 5133930 5332645 5472412 5615716 5627110 5716334 5804199 6069995
6398 6069995 6179937 6236885 6278815 6283650 6259377 6291825 6293547 6267699 6334312 6443038 6421759
6387F421759q1086N8714j0124O3131J51306J55620O7316J59651J30460K78652
6377G395399K17396R0134K26474l8577j40643j32208o3042R5936j5909j5498M4770
6366G664232J30773J24905J67615J61095J30684K29587Q9210J05172K55182R3145
6356I151600K55134K29512J94979K20145K31034K11679L26902L52541M16343K57100
6346A1846969L41393K18816K02670N39663L97870L67155M17333M15967M64976
6337A5212812M40341M52912N19335O00478N55643O53852O39403O85763Q87882
6328B0648421P90318J051650J175367J130274J358352J517570J673980K022764
6320C1368696J934669K111879K418247K698266K956800L263195M019285M943678
$$ plain form
6387 6421759 6340673 6399387 6389263 6452394 6603700 6759320 6826636 6986287 7116747 7395399
6377 7395399 7612795 7702929 7929403 7890826 7750183 7617975 7554933 7650869 7634960 7619462 7664232
6366 7664232 7795005 7919910 8087525 8248620 8379304 8608891 8698101 8803273 9058455 9151600
6356 9151600 9406734 9636246 9831225 10051370 10282404 10494083 10820985 11173526 11589869 11846969
6346 11846969 12188362 12407178 12609848 13149511 13547381 13914536 14331869 14747836 15212812
6337 15212812 15653153 16106065 16625400 17225878 17781521 18435373 19074776 19760539 20648421
6328 20648421 21438739 22490389 23665756 24796030 26154382 27671952 29345932 31368696
6320 31368696 33303365 35415244 37833491 40531757 43488557 46751752 50771037 55714715
6312E5714715N820609P105992Q513422R589210Q188831L342906k650105n093099
6304I0532481m849008l432004k000515q49012L65806J490338L090633N021937
6296H9370656O172558M987068K201955j19910M94438K373955M374055N680037
6288A15534812M526515M10951m084780o304121n550770l621179j458013J83182
6280I9636597J503738Q16541k037096m585352m938778l745757k007768n10777
6272H4131348O24395J879811L784610O103703O558983L584427l242260q851487
6264I4573530j0568097r601073p949565o809754o033529n126641m405289l462668
6256D0616914l003563k475940j985254j943581j791323j677601j690160j448920
$$ plain form
6312 55714715 61535324 68641316 77154738 86743948 94932779 98275685 95625580 90532481
6304 90532481 85683473 82251469 80250954 79401942 79767748 81258086 84348719 89370656
6296 89370656 95543214 100530282 102732237 102612327 103106765 105480720 109854775 115534812
6288 115534812 120061327 120472278 116387498 110083377 104532607 100911428 99453415 99636597
6280 99636597 101140335 101956876 99919780 95334428 90395650 86649893 84642125 84131348
6272 84131348 84755743 86635554 90420164 96523867 103082850 106667277 103425017 94573530
6264 94573530 84005433 74404360 66454795 59645041 53611512 48484871 44079582 40616914
6256 40616914 37613351 35137411 33152157 31208576 29417253 27739652 26049492 24600572
6248B4600572j269358j142713q98574j007950p60175p19632n61175o27514m49193
6239A7164288m61636m72327m09114n87037l84989m79848n87594m91657m07806
6230A2882280l95068k94710l25899k14543l74689l56069j77470k20537k81421
6221A0241874l75850j10257k7502o3145j76188j84761j42920j36628j47238q7703
6211H789682k52483n8373p2555j25024j22124j26767k056P2305o1647j94913r7574
6200G748471k4246p0711m8993n8236K1823j07929R0202K0263J5033L2458n9416
6189G558719J00063P4378o019J374m3459J87540M6600j2851J39181L9128O8619
6178H153273N0316k32J28577K68636J01363P4398j14173m4427n9563l0400j13480
$$ plain form
6248 24600572 23331214 22188501 21289927 20281977 19521802 18802170 18240995 17613481 17164288
6239 17164288 16702652 16230325 15821211 15234174 14849185 14369337 13781743 13290086 12882280
6230 12882280 12487212 12192502 11866603 11652060 11277371 10921302 10743832 10523295 10241874
6221 10241874 9866024 9755767 9728265 9665120 9488932 9304171 9161251 9024623 8877385 8789682
6211 8789682 8537199 8478826 8406271 8281247 8159123 8032356 8030300 8102605 8040958 7846045 7748471
6200 7748471 7724225 7653514 7604521 7546285 7568108 7460179 7550381 7570644 7585677 7618135 7558719
6189 7558719 7658782 7733160 7727141 7728515 7685056 7872596 7919196 7906345 8045526 8084654 8153273
6178 8153273 8203589 8203357 8331934 8600570 8701933 8776331 8662158 8617731 8558168 8527768 8414288
6167H414288N5599l0903J72388J12912K56987J16243M5666J73760O2463J94487
6157I573890K98074K91382M42272N47016M07651K64326M33053M85710O14386P13540
6147A4071300O93043O12846N32757K63486j32761m61296m45775l90603m99575
6138A4243422l49867l49451j71967M4911J20521R2035Q5362K05411J65229M7850
6128A4133456K53485M37815O27818O37685Q83256R11992J129637J377088J507265
6119B1899497J517426J112347O09677l2478p54078j248586j392406j472566j314145
6110A8924688j107996q37189p46674m21868l04424k91897j95895p0371n7591M9116
6100A4939899j04795p273J45543J19146J91673K22363N22965M65914O47513M01195
$$ plain form
6167 8414288 8469887 8438984 8611372 8724284 8981271 9097514 9143180 9316940 9379403 9573890
6157 9573890 9871964 10163346 10605618 11152634 11560285 11824611 12257664 12743374 13357760 14071300
6147 14071300 14764343 15377189 15909946 16173432 16040671 15579375 15133600 14742997 14243422
6138 14243422 13893555 13544104 13372137 13417048 13537569 13629604 13714966 13920377 14085606 14133456
6128 14133456 14386941 14824756 15452574 16090259 16973515 17885507 19015144 20392232 21899497
6119 21899497 23416923 24529270 25138947 25106469 24352391 23103805 21711399 20238833 18924688
6110 18924688 17816692 16979503 16232829 15810961 15506537 15214640 15018745 14948374 14890783 14939899
6100 14939899 14835104 14827831 14973374 15092520 15284193 15506556 16029521 16495435 17142948 17544143
6090A7544143O0838l36187o22460q54440q85721r75509r25023o81137o48126m52004
6080A1224374m27305m13908k36492l06448k27277l12325m05995l44847k66721
6071H283056l53938l01277l32564k98982j32714k03519k67605j73183k05198k54472
6061E759604j27075j36976j76586j30727k1538k10335j54531q7571j29716j06516
6051D478033r1554l4240j16088j00996j64650j56013J268N0236K0094j3873q9624
6040C782593k1280m4260L8996K1123j07035J36953K1850m5789r4090R5519o2863
6029C721717j3459k6858R944m1148l7421r1494n1404j31990n0153J22305q7870
6018C322169M2944k6139j05041n2117R8102K5168J8951P867O473J1239O8391n1504
$$ plain form
6090 17544143 17604981 17268794 16646334 15791894 14906173 13930664 13005641 12324504 11676378 11224374
6080 11224374 10797069 10383161 10146669 9840221 9612944 9300619 8894624 8549777 8283056
6071 8283056 7929118 7627841 7295277 6996295 6863581 6660062 6392457 6219274 6014076 5759604
6061 5759604 5632529 5495553 5318967 5188240 5166702 4956367 4801836 4714265 4584549 4478033
6051 4478033 4386479 4352239 4236151 4135155 3970505 3814492 3815760 3865996 3886090 3872217 3782593
6040 3782593 3761313 3717053 3756049 3777172 3670137 3807090 3828940 3783151 3689061 3784580 3721717
6029 3721717 3708258 3681400 3691344 3650196 3612775 3521281 3469877 3337887 3287734 3410039 3322169
6018 3322169 3365113 3338974 3233933 3181816 3279918 3305086 3324037 3331904 3338377 3349616 3418007 3366503
6006C366503K4118p6733j44848L7513K23527N6567K4970J04448R7943n349P4757
5995C783416M2377j15104J08783j69782p1788m715k1028J29101j896R3152R7280
5984C869796Q5386J48805K38305L2753n3484P8305Q1886o5093M0420Q6750J02929
5973D646758r7093J0350m0063j16759J8802J09071m7970o0297L6722j32517P9686
5962D406690n259R2361N0393R7918J17643J50961O9970O1565K02908R1195L3598
5951E369943K3457J09384L1446j75595r7991n5719j42648j34941P0396j5509j0136
5940D972087n2852L693k1167O7914L5829R7321K08343J23200m30J33369p4741
5929E492566o3516J17115l9934j9419l7138j64910p5817J469j45831p4071p8343
$$ plain form
6006 3366503 3390621 3313888 3169040 3206553 3430080 3486647 3511617 3616065 3714008 3708659 3783416
5995 3783416 3825793 3710689 3819472 3649690 3577902 3573187 3552159 3681260 3679364 3772516 3869796
5984 3869796 3955182 4103987 4342292 4375045 4321561 4399866 4481752 4416659 4457079 4543829 4646758
5973 4646758 4549665 4560015 4519952 4403193 4421995 4531066 4483096 4422799 4459521 4327004 4406690
5962 4406690 4401431 4493792 4544185 4642103 4759746 4910707 4980677 5042242 5245150 5336345 5369943
5951 5369943 5393400 5502784 5534230 5358635 5260644 5204925 5062277 4927336 4997732 4982223 4972087
5940 4972087 4919235 4922928 4901761 4969675 5005504 5102825 5311168 5434368 5433938 5567307 5492566
5929 5492566 5429050 5546165 5506231 5486812 5449674 5284764 5208947 5210416 5064585 4990514 4912171
5918D912171J25169J48377o6210r8734N141k3444p8659o506P8862P694k8420Q8389
5906E063830k0765r3984P0760Q9235o97N2825N6699N6930R2267J06868J51621
5895E625589M0096J3580j22633j7326P6561M0988M846J80088J68736Q7346K02363
5884F300234J30609J64192J00548k5727J42724R0763J33418R7149N6N8215J32524
5873G324705J6793P7243O0260K8815K13726P1736M3348J67832J38834J76027P5685
5862H395004J81817J86642J57188K08281O9474o8428j7902p9716k555J81381K97940
5851I509126K60400K56889K96779K48371L82945J90677K11632K23376K08697K94938
5841A2083830K86245K17576J16945j1330m8078k5642L4208l4092J8303m2667M4950
$$ plain form
5918 4912171 5037340 5185717 5119507 5020773 5025914 5002470 4923811 4917305 4996167 5003861 4975441 5063830
5906 5063830 5043065 4949081 5019841 5109076 5108379 5161204 5217903 5274833 5367100 5473968 5625589
5895 5625589 5665685 5679265 5556632 5539306 5615867 5656855 5661701 5841789 6010525 6097871 6300234
5884 6300234 6430843 6595035 6695583 6669856 6812580 6903343 7036761 7133910 7133966 7192181 7324705
5873 7324705 7341498 7418741 7479001 7507816 7721542 7793278 7836626 8004458 8143292 8319319 8395004
5862 8395004 8576821 8763463 8920651 9128932 9198406 9129978 9112076 9032360 9029805 9211186 9509126
5851 9509126 9769526 10026415 10323194 10571565 10954510 11145187 11356819 11580195 11788892 12083830
5841 12083830 12370075 12587651 12704596 12693266 12645188 12619546 12653754 12619662 12637965 12595298 12640248
5830A2640248L2658L5940K7832j4209O6265N3933Q2035K33699K89199K42170L26496
5819A4016266M03380K39102R3378J5663N5669M6258K6762R24K89731K46117K8514
5808A5461764K68097J52167K49627J68260R0744J98379L21070L46684K75534M23217
5798A7955543M08677M28514N18071L56240M48998N01556M82668N26206N61702
5789B2188175N64012O50565P98698Q29418Q73691J059335J096024J390701J690381
5780C1141000J605163J495264R28537M78922M24508P46533J001301J215682J476602
5771D0513512J571194J636580J917514K112430K325444K493584K973275L777667
5763E9321200M852335N998837P489506Q868151J0456379J1333981R369671L591420
$$ plain form
5830 12640248 12672906 12708846 12736678 12722469 12788734 12842667 12924702 13158401 13447600 13689770 14016266
5819 14016266 14419646 14658748 14752126 14767789 14823458 14869716 14896478 14897402 15187133 15433250 15461764
5808 15461764 15729861 15882028 16131655 16299915 16390659 16589038 16910108 17256792 17532326 17955543
5798 17955543 18364220 18792734 19310805 19667045 20116043 20617599 21100267 21626473 22188175
5789 22188175 22752187 23402752 24201450 25030868 25904559 26963894 28059918 29450619 31141000
5780 31141000 32746163 34241427 35169964 35648886 36073394 36819927 37821228 39036910 40513512
5771 40513512 42084706 43721286 45638800 47751230 50076674 52570258 55543533 59321200
5763 59321200 64173535 70172372 77661878 86530029 96986408 108320389 117690060 121281480
5755A21281480l783723p528621p420343n472293l349889j623969J25798K105936
5747I4334376M253466N680395N330155K746878k85166q50918N26496K948325N542587
5738A20226594P224768P158743M244132j065045n514451o563281n172154k670961
5730A17868345k55616O28405r37621l813039n022755m719567l675786k092244
5722I7980122l23990J468481L373954N155836O977734P119985L960504k253945
5714A23458681p810429r604889q646793o822921m716271l260134k330674j485631
5706G8780939p28436j97647l23948m11217o93512q61451q70895n15000l22593
5697G3856240m78387p86536q55718o92903l45197m6880K57516M35776M86603N51528
$$ plain form
5755 121281480 117497757 109969136 102548793 97076500 93726611 92102642 92228440 94334376
5747 94334376 98587842 104268237 109598392 112345270 112060104 111209186 111735682 114684007 120226594
5738 120226594 127451362 134610105 138854237 137789192 132274741 125711460 120539306 117868345
5730 117868345 117612729 118241134 117303513 113490474 108467719 103748152 100072366 97980122
5722 97980122 97656132 99124613 102498567 107654403 114632137 121752122 125712626 123458681
5714 123458681 115648252 106043363 97396570 90573649 85857378 82597244 80266570 78780939
5706 78780939 78052503 77854856 77530908 77119691 76426179 75564728 74693833 74178833 73856240
5697 73856240 73377853 72591317 71735599 71042696 70697499 70650619 70908135 71343911 71830514 72382042
5687G2382042P18796Q90100J035520J227673J365064J579842J879430K448118
5679H3526585K876826K645567K146318J393297M46609J69951K47859O22586J306211
5670I5381809K102442K914053L906992N259092O852254Q548777J0448495J2447810
5662A47861724J3697572J4782224J7334064K1728376K8909773L7290039L8405653
5655C20009425K1076869j2407550l5566162l8097792l1376789k4431082j9997146
5648A79209773j6313999j3323632j0507739q313305o384022n111233m449765l991252
5640A10814826l469507l153998k818365k339639j913006j345034j041936n63308
5632I4170033M4467M85573M40230O11023N28060K42715J05849J41179L78424L08050
$$ plain form
5687 72382042 73100838 73990938 75026458 76254131 77619195 79199037 81078467 83526585
5679 83526585 86403411 89048978 91195296 92588593 93035202 93205153 93453012 94075598 95381809
5670 95381809 97484251 100398304 104305296 109564388 116416642 124965419 135413914 147861724
5662 147861724 161559296 176341520 193675584 215403960 244313733 281603772 320009425
5655 320009425 341086294 328678744 293112582 255014790 223638001 199206919 179209773
5648 179209773 162895774 149572142 139064403 130751098 124367076 119255843 114806078 110814826
5640 110814826 107345319 104191321 101372956 99033317 97120311 95775277 94733341 94170033
5632 94170033 94214500 94700073 95140303 95751326 96279386 96522101 96627950 96769129 97147553 97455603
5622I7455603l03210r82387j534639k004459k484212k578243k665120k388118
5614H2515215k009005j997046j653168j313634j319102j442675j213397j003906
5606G0563282n85646l62659l30878k01412j4471K98192P28128J138244J447282
5597G2680062J619768J959459K283668K631375L239607L984326M087978L231482
5589I5717725P07497k842880n229616n967220n516962m647710l704420k763309
5581F5753105k017899j604819j248520r38844n54305m15764o44451m89615m72910
5572E7365978m79825k50570j32260J34844R9186K10973L27930N59825R24305J190217
5562E9950603J398462J769011K273056K621202L335622L760503M167605L960485
$$ plain form
5622 97455603 97152393 96170006 94635367 92630908 90146696 87568453 84903333 82515215
5614 82515215 80506210 78509164 76855996 75542362 74223260 72780585 71567188 70563282
5606 70563282 69977636 69614977 69284099 69082687 69068216 69366408 70094536 71232780 72680062
5597 72680062 74299830 76259289 78542957 81174332 84413939 88398265 92486243 95717725
5589 95717725 96425222 93582342 88352726 82385506 76868544 72220834 68516414 65753105
5581 65753105 63735206 62130387 60881867 59943023 59388718 58972954 58328503 57838888 57365978
5572 57365978 56886153 56635583 56503323 56638167 56737353 56948326 57276256 57836081 58760386 59950603
5562 59950603 61349065 63118076 65391132 68012334 71347956 75108459 79276064 83236549
5554H3236549L289430J783005o16599k364593l072752l513178l361875k805964
5546G2574023k051753j398317p78769k47680n4488o4412j91859k81708j29159
5537F7375878l1231M266j02615j90685o3044K4287O1562P4424r1140l88085k61141
5526F6412476m46825m12625k19844J9321L78433O65527P56722P66309M81893m53259
5516F7948128j658271k665393k738554k306457j857879j520098j549480j817676
5508E1834320j674231j572233j482228j292696j251409j141138j127239j126015
5500D1167131j024674p40862q06427p80664j095289j153470p97418r20353q53812
5491C2994162n94266p21767o89042o97400o73990m61133o93095r38921q81918
$$ plain form
5554 83236549 86525979 88308984 87692385 85327792 82255040 78741862 75379987 72574023
5546 72574023 70522270 69123953 68345184 68097504 68043016 67978604 67786745 67505037 67375878
5537 67375878 67344647 67348913 67246298 67055613 66992569 67016856 67078418 67152842 67061702 66673617 66412476
5526 66412476 65965651 65553026 65333182 65352503 65730936 66396463 67153185 67919494 68401387 67948128
5516 67948128 66289857 63624464 60885910 58579453 56721574 55201476 53651996 51834320
5508 51834320 50160089 48587856 47105628 45812932 44561523 43420385 42293146 41167131
5500 41167131 40142457 39401595 38595168 37814504 36719215 35565745 34768327 33847974 32994162
5491 32994162 32399896 31678129 30989087 30291687 29617697 29156564 28463469 27524548 26642630
5482B6642630q49356q19812q30310p86308o50610o84676o17386o08527n91828
5473B0203817n89119n63891n12606m22399l94546m10445l76346m48729l87728
5464A6098008m45603k78410l39703m37030m85250m89984m18250m08626l22461
5455A2472691l27253k44927j79865k51403k55306k96729k27076j83251j56837
5446A0350044r2511j97690j11941r4948k01599k49838j75647j12194p8697j63066
5436H871913j78855L9503N7878n2364j19100Q6303N9580k6201L8448Q9094K61275
5425I127474K47179L32544R7370l02830k73483k63652l14516k65349k47668l3643
5415H103426q4228k39049j35969k49668q1897j17343k80023j14473q0812j12220
$$ plain form
5482 26642630 25793274 24973462 24143152 23356844 22706234 22021558 21404172 20795645 20203817
5473 20203817 19614698 19050807 18538201 18115802 17721256 17310811 16934465 16485736 16098008
5464 16098008 15652405 15373995 15034292 14597262 14112012 13622028 13203778 12795152 12472691
5455 12472691 12145438 11900511 11720646 11469243 11213937 10917208 10690132 10506881 10350044
5446 10350044 10257533 10059843 9947902 9852954 9651355 9401517 9225870 9113676 9034979 8871913
5436 8871913 8693058 8732561 8790439 8738075 8618975 8705278 8764858 8738657 8777105 8866199 9127474
5425 9127474 9374653 9707197 9804567 9501737 9228254 8964602 8650086 8384737 8137069 8103426
5415 8103426 8019198 7780149 7644180 7394512 7312615 7195272 6915249 6800776 6719964 6607744
5405F607744j25619n1214j2627o7277j00924n9635l1364r684r429P5135j9869
5394F195237J87040J69971J78252N8714Q7785J60909J77229L55115L69756L19279
5384H259287m8015m55655o55381n61030m64477j72732k04406k17804j47346j75238
5374E157203j79889l8183j75647j43494m234n5445m4482j1657N8161L6609n4809
5363D544133l0813N4840l8543J30008N8984o1533o5181J9050k7167q5693M070
5352D502155R259o5760j51344j6571p463l8996l9430j8424j40764M9849M2717
5341D125228J93K5957R1674O2070K8886J8841P6958Q2652J24439N2024j5819r32
5329D672171j3572O4942o1896m4510j65655n5285p048q0223q8297n5259q068R8279
$$ plain form
5405 6607744 6482125 6430911 6418284 6351007 6250083 6190448 6159084 6149400 6139971 6215106 6195237
5394 6195237 6382277 6552248 6730500 6789214 6876999 7037908 7215137 7570252 7940008 8259287
5384 8259287 8211272 7755617 7100236 6539206 6074729 5901997 5697591 5479787 5332441 5157203
5374 5157203 4977314 4939131 4763484 4619990 4615756 4560311 4515829 4504172 4562333 4598942 4544133
5363 4544133 4513320 4568160 4529617 4659625 4718609 4657076 4591895 4610945 4583778 4498085 4502155
5352 4502155 4511414 4445654 4294310 4277739 4270276 4231280 4191850 4173426 4032662 4082511 4125228
5341 4125228 4125421 4151378 4243052 4305122 4334008 4352849 4429807 4512459 4636898 4688922 4673103 4672171
5329 4672171 4658599 4723541 4661645 4617135 4451480 4396195 4389147 4308924 4220627 4165368 4157300 4255579
5317D255579k1955M8121l321J08618p928n3484L8101Q1844p4061J920J09009J0125
5305D492568N6875J46625J46369O3233J83802K22519J29171K26285j0213l759
5295E653475o9894j76325q7287r6864J15272j13562j00296N4070j25678n0224
5285E002687k0562L2442J33109J64961P5119L9949p3171M2176J86635J47317J10206
5274E840868M7726J47305J47020m880P9196K09039M2751Q6973j0404R1173K9473
5263F706240p448k16137k01018k08821k59143j49545j94547j22648L2007k2498
5253E356442r3862Q0298J0976n7711J2542m1171J54773j2635j1260O9295J23858
5242E591545k5173P4888M6687P3985J71478R2977J10884J87401R6693O8117J3842
$$ plain form
5317 4255579 4233624 4281745 4278424 4387042 4379114 4325630 4363731 4445575 4371514 4373434 4482443 4492568
5305 4492568 4549443 4696068 4842437 4905670 5089472 5311991 5441162 5667447 5657234 5653475
5295 5653475 5583581 5407256 5319969 5223105 5338377 5224815 5124519 5178589 5052911 5002687
5285 5002687 4982125 5014567 5147676 5312637 5387756 5427705 5354534 5396710 5583345 5730662 5840868
5274 5840868 5888594 6035899 6182919 6178039 6257235 6466274 6509025 6595998 6585594 6676767 6706240
5263 6706240 6698792 6482655 6281637 6072816 5813673 5664128 5469581 5346933 5378940 5356442
5253 5356442 5262580 5342878 5353854 5296143 5308685 5267514 5422287 5409652 5398392 5467687 5591545
5242 5591545 5566372 5641260 5687947 5761932 5933410 6026387 6137271 6324672 6421365 6489482 6503324
5231F503324J22337O9550j34887p1095n1075o6029l6461P9855J46504k4202K269
5220F540090N0014l4401r9767k552P8877L2923n2822R6555R4905L3228P7454K40345
5208G054849J99838n75K10161O8010K69259J55987J15561N4190J10409J13519
5198H351208P4175M2069R5763J32790J39186J75518J57537R4078J81042K19789
5188I663155J83352J55569K10354J70656K79433L31213K47887K33967K76794L43122
5178A2095502M04481L94647L45588K70848L43486M43351L71699L35546K09344
5169A5214492K91506K84492L13743K88086M11796M08714L85889M28947J98701
5160A8226366L44893N65646N28451N69514O80778P42187O36789O43025O40735
$$ plain form
5231 6503324 6625661 6695211 6560324 6489229 6438154 6372125 6335664 6415519 6562023 6537821 6540090
5220 6540090 6590104 6555703 6455936 6453384 6532261 6565184 6512362 6608917 6703822 6737050 6814504 7054849
5208 7054849 7254687 7254112 7464273 7532283 7801542 7957529 8073090 8127280 8237689 8351208
5198 8351208 8425383 8467452 8563215 8696005 8835191 9010709 9168246 9262324 9443366 9663155
5188 9663155 9846507 10002076 10212430 10383086 10662519 10993732 11241619 11475586 11752380 12095502
5178 12095502 12499983 12894630 13240218 13511066 13854552 14297903 14669602 15005148 15214492
5169 15214492 15505998 15790490 16104233 16392319 16804115 17212829 17598718 18027665 18226366
5160 18226366 18571259 19136905 19665356 20234870 20915648 21657835 22294624 22937649 23578384
5151B3578384Q29855R93753J157230J017113J040957J103263J120448J485130
5143C2326133J507668J621519J629616J598983J479441J381269J520991J598475
5135D4664095J465520J599637J708383K077424J993742K290884K700593L116554
5127F1616832L603877M332914N310353O407479P898632R590607J0945513J1469039
5119A21175246J2265329J5073209J8603036K2440900K6961213L3184420M3306656
5112B93010009O0808344P5386820O2392913N640142n4248547p2316990o0362600
5105C10310091m2680954l1904665k6989017k5883039k3799090j9900713j5388302
5098A23764311j1761018q878780p144054o391881o216798n818433n301358m617930
$$ plain form
5151 23578384 24408239 25401992 26559222 27576335 28617292 29720555 30841003 32326133
5143 32326133 33833801 35455320 37084936 38683919 40163360 41544629 43065620 44664095
5135 44664095 46129615 47729252 49437635 51515059 53508801 55799685 58500278 61616832
5127 61616832 65220709 69553623 74863976 81271455 89170087 98760694 109706207 121175246
5119 121175246 133440575 148513784 167116820 189557720 216518933 249703353 293010009
5112 293010009 353818353 429205173 491598086 497238228 442989681 370672691 310310091
5105 310310091 267629137 235724472 208735455 182852416 159053326 139152613 123764311
5098 123764311 112003293 103124513 95980459 89588578 83371780 77553347 72251989 67634059
5090F7634059m066686l462199k838298k131402j746176j853256k119431j905227
5082D7511384j476366j359702j237914j056962j030413j121611q63343k36706
5074C9128367K03351M63723j77264j659541k427495k470448k082888j607477j463246
5065B7907082j356870j028570p79735p52706o66140p47047q71701r02772p62298
5056B0039243p76270o38266n43049n83970m38935l55271l04062k74051j86571
5047A5938798j75295j64323j48891o4977j98304j49750j80167j73656L2238J3135
5037A4728808r3432Q6436K17390M12958N62519Q01117J111615R71645L9346p22282
5027A8116120j204686j054842q10701o23502o64327n28341l88575j91844j60660
$$ plain form
5090 67634059 63567373 60105174 57266876 55135474 53389298 51536042 49416611 47511384
5082 47511384 46035018 44675316 43437402 42380440 41350027 40228416 39365073 39128367
5074 39128367 39331718 39795441 39618177 37958636 35531141 33060693 30977805 29370328 27907082
5065 27907082 26550212 25521642 24741907 23989201 23323061 22576014 21704313 20801541 20039243
5056 20039243 19262973 18624707 18081658 17497688 17058753 16703482 16399420 16125369 15938798
5047 15938798 15763503 15599180 15450289 15385312 15187008 15037258 14857091 14683435 14715673 14728808
5037 14728808 14635376 14721812 14939202 15352160 15914679 16715796 17827411 18799056 18838402 18116120
5027 18116120 16911434 15856592 15045891 14422389 13758062 13229721 12841146 12649302 12488642
5018A2488642j57922j13296k03172k44944k76185j636K03453m995l80141o26732
5008A0683072n56954m46849k19359l27091l32127j68184k52949o8356j96286k38858
4998G876059j11177p5213n9276J41333J16267o6517L8675J38390P101j04913j1410
4987G889319m2028j90712j68136q8449k63840k42664r1184p6920j08019j41760
4977F475607j98941o4431J4370q8500M1084q0590j77605O4441o7601n2641r46
4966E864247K321K5096p356P1539N8191p222o145N2483j21426O1203J02863K18526
4954F314320J82336K35614J51845L64105N93020N86077O92059K49680l09080q62033
4944H197943p99948o47257m93205m55639l66998l31234k34200j41418L2125q9057
$$ plain form
5018 12488642 12330720 12217424 12014252 11769308 11493123 11491487 11694940 11689945 11309804 10683072
5008 10683072 10126118 9679269 9459910 9132819 8800692 8632508 8379559 8311203 8114917 7876059
4998 7876059 7764882 7689669 7630393 7771726 7887993 7821476 7860151 7998541 8005642 7900729 7889319
4987 7889319 7847291 7656579 7488443 7399994 7136154 6893490 6802306 6725386 6617367 6475607
4977 6475607 6276666 6212235 6226605 6138105 6179189 6098599 5920994 5985435 5917834 5865193 5864247
4966 5864247 5866568 5891664 5884308 5955847 6014038 6006816 6000671 6053154 5931728 5992931 6095794 6314320
4954 6314320 6496656 6732270 6884115 7248220 7841240 8427317 9119376 9369056 9059976 8197943
4944 8197943 7397995 6750738 6257533 5801894 5434896 5103662 4869462 4728044 4760169 4671112
4934D671112P9918J13308m0730n8517l7776j62107j41755j13647L2750J9908j11323
4923D251141K0073L2336p0555l6100J3990r0222J62862j22004l5449p5315K1547
4912D072304R812m2588l3618o857n1004l6463m4888o4201n1492R2344L5160k0191
4900C858318j62783Q6507J48768j18775j09748N3214O2673L6345j49453p034K7368
4889C725400O7214N1220r1380M6099N1887K7544l5305Q3809L3232M4893Q0830
4878D085443j9371N4850K0340n129M0958q4744J51050J03581J890N0463K1889
4867D421220M4806q9422k7782L8682R5407l4441J5440J41877J75519P9253K4912
4856D885471P4426J40016P8966p7502J62102J24680J05337J42294K9234J27526
$$ plain form
4934 4671112 4751030 4864338 4823608 4765091 4727315 4565208 4423453 4309806 4342556 4362464 4251141
4923 4251141 4271214 4303550 4232995 4196895 4210885 4120663 4283525 4161521 4126072 4050757 4072304
4912 4072304 4082116 4039528 4005910 3999053 3948049 3911586 3866698 3802497 3751005 3843349 3878509 3858318
4900 3858318 3695535 3782042 3930810 3812035 3702287 3755501 3818174 3854519 3705066 3698032 3725400
4889 3725400 3792614 3843834 3752454 3798553 3850440 3877984 3842679 3926488 3959720 4004613 4085443
4878 4085443 4066072 4120922 4141262 4136133 4177091 4092347 4243397 4346978 4348868 4399331 4421220
4867 4421220 4466026 4376604 4348822 4387504 4482911 4448470 4463910 4605787 4781306 4860559 4885471
4856 4885471 4959897 5099913 5178879 5101377 5263479 5388159 5493496 5635790 5665024 5792550
4846E792550K73245r3329J24948K20189P1263L0240J89828J73635J92030L9282
4836G013881J86555L49274K43570L15448K91873K29662L05188L17741M71847N39882
4826A0264921L96423M32539M85856M01165M71791N70720M95395L46054L04745
4817A4169609J63616K74702K75386K99782J49199J20517K53651J24913J45605
4808A5976980J51677J32625L26651L69216N22104M99038N30787P50257O78130
4799A9937465P56969Q44525Q83913R56088R02402P76769O65976K73868n2082n24286
4789B5421607n84472n31982l97636m97049o22951n73610n50301o49323n22243
4780B0492040l68443k91419j00094r2283r9221n7218O3148J01388J01102K22885
$$ plain form
4846 5792550 6065795 5972466 6097414 6317603 6388866 6419106 6608934 6782569 6974599 7013881
4836 7013881 7200436 7549710 7793280 8108728 8400601 8630263 8935451 9253192 9725039 10264921
4826 10264921 10661344 11093883 11579739 11980904 12452695 13023415 13518810 13864864 14169609
4817 14169609 14333225 14607927 14883313 15183095 15332294 15452811 15706462 15831375 15976980
4808 15976980 16128657 16261282 16587933 16957149 17479253 17978291 18509078 19259335 19937465
4799 19937465 20694434 21538959 22422872 23378960 24281362 25058131 25724107 25997975 25945893 25421607
4789 25421607 24837135 24305153 23907517 23410468 22787517 22213907 21663606 21014283 20492040
4780 20492040 20123597 19832178 19732084 19639801 19540580 19483362 19546510 19647898 19749000 19971885
4770A9971885J77891K79069L06106L30438L11787K57902L29346K98930J92009
4761B2455363K23636L16284O5928m9334o2917j59819k8418l2288j88995l27003
4751B2212437m17660k41685l11680l89646l51586l41033j78494k11739k28879
4742A9540035j52019K2141P1038J30283L65441N11685M91728O52673O45769N94771
4732B2873545N77204O58084N83527N09867M62354L12976J14204o7646l59960m18264
4722B5245891n17109o61497n09528o60265p00658o08909n83365n88328m20757
4713A9995475l28734m33266l23135j19546j37767j77852j25178o0084j14467k93776
4703A7881670j76688j00369k38861k68755m72286m31022m65895n48676m29262
$$ plain form
4770 19971885 20149776 20428845 20734951 21065389 21377176 21635078 21964424 22263354 22455363
4761 22455363 22678999 22995283 23061211 23011877 22948960 22789141 22760723 22728435 22539440 22212437
4751 22212437 21794777 21553092 21241412 20851766 20500180 20159147 19980653 19768914 19540035
4742 19540035 19388016 19410157 19481195 19611478 19976919 20488604 20980332 21633005 22278774 22873545
4732 22873545 23450749 24108833 24692360 25202227 25664581 25977557 26091761 26024115 25664155 25245891
4722 25245891 24728782 24067285 23557757 22897492 22196834 21587925 21004560 20416232 19995475
4713 19995475 19666741 19233475 18910340 18790794 18653027 18475175 18349997 18289913 18175446 17881670
4703 17881670 17704982 17604613 17365752 17096997 16624711 16193689 15727794 15179118 14749856
4694A4749856n88758n60738o01961o97278o51129o03547o79595o07322m91203
4685I268325m47448l85356l39280l06980l27785k97586k84429l36212k46153j08247
4675F188849k11659j38333j77236k09685k48323j57370n4152k8133j77514q4115
4665D702329N8090m7602k51353j98333o1266q4887n2824m3333o8527l945j24343
4654C824006j07217m2774n3229k2900j21194j06642p4096j26751j20175J1342
4644C060370M4869k5697K0538j04846o0009m0191l4945r0928J6815j00828J3968
4633B699116L3008j77795L3489m0844l3987K7498l9918m6226r1409o3768q6221
4622B212943p4584j4830M4293o370K8605N1683P0703o0200j85986R3521r2531
$$ plain form
4694 14749856 14161098 13600360 12998399 12301121 11649992 11046445 10366850 9759528 9268325
4685 9268325 8820877 8435521 8096241 7789261 7461476 7163890 6879461 6543249 6297096 6188849
4675 6188849 5977190 5838857 5661621 5451936 5203613 5046243 4992091 4963958 4786444 4702329
4665 4702329 4760419 4712817 4461464 4263131 4201865 4116978 4064154 4020821 3952294 3948349 3824006
4654 3824006 3716789 3674015 3620786 3597886 3476692 3370050 3295954 3169203 3049028 3060370
4644 3060370 3105239 3079542 3100080 2995234 2935225 2895034 2860089 2769161 2785976 2685148 2699116
4633 2699116 2732124 2554329 2587818 2546974 2512987 2540485 2500567 2454341 2362932 2299164 2212943
4622 2212943 2138359 2123529 2167822 2161452 2190057 2241740 2312443 2252243 2066257 2159778 2067247
4611B067247J6904O8575o0987p1327N2205L2246m948j02166j8952L7184M4316
4600B060297q3753R5367m784o2807L9291l0150J4900j13549o5557o902o1639J4172
4588A794886l8428j689j07622l2362o2068N3690J00999L4792L2059n7299K8982
4577A745940l4595L725n896q0035p6980k909K3857L5375n948J41901q9275J01695
4565A756855n5112j24512J119l2194Q5440n4931q5570N7090o3358P676l1466j03590
4553A357447Q4454J62647j23029j01028P0898M5954N2188j41009J12705L9047
4543A560274n7107k8105N1714m3180p3880r071j13821K5241J5392N9982o9751
4532A317688l8763K3792N3782L7622o0890k9363j1917J3903k9026j9779N5281
$$ plain form
4611 2067247 2084151 2152726 2091739 2020412 2072617 2104863 2099915 1997749 1978797 2015981 2060297
4600 2060297 1976544 2071911 2067127 2004320 2043611 2013461 2028361 1914812 1849255 1842353 1780714 1794886
4588 1794886 1756458 1754769 1647147 1614785 1552717 1606407 1707406 1742198 1774257 1716958 1745940
4577 1745940 1711345 1715070 1709174 1629139 1552159 1549250 1573107 1608482 1602534 1744435 1655160 1756855
4565 1756855 1701743 1577231 1578350 1546156 1631596 1576665 1491095 1548185 1484827 1492503 1461037 1357447
4553 1357447 1441901 1604548 1481519 1380491 1451389 1497343 1549531 1408522 1521227 1560274
4543 1560274 1503167 1475062 1526776 1483596 1409716 1400645 1286824 1312065 1327457 1387439 1317688
4532 1317688 1278925 1302717 1356499 1394121 1333231 1303868 1291951 1305854 1276828 1257049 1312330
4521A312330P4826q2310O2041K7901Q4220L3996o0131p067L1256j7673j41033
4510A318356R4195J1331p4831N8669O1364p0694P0494N782q804l4841k9593M3810
4498A445238m6997K0688p0385O821J6572n8212O7333J9192K4978K5442M8480L1959
4486A531109j21688O9684k052K4760K7857o1976l3586Q4416L5800o0566R2650
4475A586408q7124n4230J07679Q7829O2658q6182J9850K4063l2967L2312R6371
4464A756667n5228j1288L4138m6324R498j1031L0416M192j8982l6581q7897L7781
4452A605361N7250K0098O2484p1524l0695M1183q6914M8860M9554n3082k0101
4441A622474K8018n696P9630R2503L3037J43797m2553M8937J9439j07255k7741
$$ plain form
4521 1312330 1387156 1304846 1366887 1394788 1479008 1513004 1452873 1445806 1477062 1459389 1318356
4510 1318356 1412551 1423882 1349051 1407720 1469084 1398390 1468884 1474666 1465862 1431021 1401428 1445238
4498 1445238 1398241 1418929 1348544 1355365 1371937 1313725 1381058 1400250 1425228 1450670 1499150 1531109
4486 1531109 1409421 1479105 1477053 1501813 1529670 1467694 1434108 1518524 1554324 1493758 1586408
4475 1586408 1499284 1445054 1552733 1640562 1703220 1617038 1636888 1660951 1627984 1660296 1756667
4464 1756667 1701439 1690151 1724289 1677965 1687463 1676432 1706848 1711040 1692058 1655477 1567580 1605361
4452 1605361 1662611 1682709 1745193 1673669 1642974 1684157 1597243 1646103 1695657 1642575 1622474
4441 1622474 1650492 1644796 1724426 1816929 1849966 1993763 1951210 2000147 2019586 1912331 1884590
4430A884590J1887k3283P6763K9382n6811l6822m1060n911J1286Q7326K6016K3842
4418A987205j3714r2141k4505R4496J10085N394K7718J3908j4164j63695N6508
4407A987095J44139J9418K9078J39122J30585q1846l6953P4629J77245n209P6425
4396B653728P1750M6758K3404l0450J04542k0714j9948o6429m4327N047O7390
4385B790751r511Q5311l276q2523M6787J33952N9350k5952J40563L1469P6602
4374C243523L3440K02714O8356q6884J24386M3544J11212K4653K352J05661J27274
4363D000231L4672K023n847j40139R3281Q9707o5671J5837l8461L624P155Q1045
4351D077457o323N491O8979J88550J37071R1432J82953K29119J99806J08522N1782
$$ plain form
4430 1884590 1896477 1873194 1949957 1979339 1922528 1885706 1844646 1838735 1850021 1937347 1963363 1987205
4418 1987205 1973491 1881350 1856845 1951341 2061426 2066820 2094538 2108446 2094282 1930587 1987095
4407 1987095 2131234 2150652 2179730 2318852 2449437 2367591 2330638 2405267 2582512 2577303 2653728
4396 2653728 2725478 2772236 2795640 2765190 2869732 2849018 2829070 2762641 2718314 2723361 2790751
4385 2790751 2781240 2866551 2863275 2780752 2827539 2961491 3020841 2994889 3135452 3166921 3243523
4374 3243523 3276963 3479677 3548033 3461149 3585535 3629079 3740291 3764944 3767296 3872957 4000231
4363 4000231 4034903 4036926 4031079 3890940 3984221 4073928 4008257 4024094 3985633 3989257 3996412 4077457
4351 4077457 4071134 4076625 4145604 4334154 4471225 4562657 4745610 4974729 5174535 5283057 5334839
4340E334839q0148L1337j16011j43576Q427L2757j19025j41771o2644j3538j99269
4329D531378N5601p0052r9230J7277q8288o0791N1056r7969m2315J24888M1249
4318D362804N1317K3334Q8556M9276J70587J77212L38186K67574J20085N2062
4308E700993N8997N6709j02331l28532k26396q5570r9482j81319j86862j33325
4298D472882n4992k132p3543j00742K9431m5949l2107J00558l6616r0265k08377
4287C958148q1296J12169k2154m7773n390j0415P0247Q7348J07147p438J35323
4276D295916J23846k0585m9882k5517j6761o7151j55437j53536r8442r6660j85408
4265C550383j0280Q2682j17502m1356l2973k9442R8341K9785L762P3483j04225
$$ plain form
4340 5334839 5254691 5286028 5170017 5026441 5034868 5067625 4948600 4806829 4744185 4730647 4531378
4329 4531378 4586979 4516927 4417697 4434974 4346686 4285895 4336951 4238982 4196667 4321555 4362804
4318 4362804 4414121 4437455 4526011 4575287 4745874 4923086 5261272 5528846 5648931 5700993
4308 5700993 5759990 5816699 5714368 5385836 5159440 5073870 4974388 4793069 4606207 4472882
4298 4472882 4417890 4415758 4342215 4241473 4270904 4224955 4192848 4293406 4256790 4166525 3958148
4287 3958148 3876852 3989021 3966867 3919094 3913704 3903289 3973536 4060884 4168031 4160593 4295916
4276 4295916 4419762 4399177 4349295 4323778 4307017 4239866 4084429 3930893 3832451 3735791 3550383
4265 3550383 3540103 3622785 3505283 3463927 3430954 3401512 3499853 3529638 3533400 3606883 3502658
4254C502658j05527j72830M4925L2470j18766l7022K0855J12198K8582P4567l8260
4243C343850N2119o2430M7517Q5582l6046q0945q0869P5791K9951j3508K6615
4232C387627N528p8241J2786O2091K735m5526M1857o9695P1324J7183P7007Q1947
4220C566623O5123J3172k9056J13164P2482P8801j5555J16566J35659J94101J48557
4209D459637Q0871R3325o1240m0069k57258o1632J30203n9796j30779m9996j23157
4198C980109k2447K0459o9932o4517n3650p2343O0434M7908r5429L2721k1874
4187C741439L4963l530O1891j4461J7599Q0339l8569j940R3804J27523q047O6935
4175D157946L8278J0731k2609n811n1474J5874J71154j4557j6827N4599O6326
$$ plain form
4254 3502658 3397131 3224301 3269226 3301696 3182930 3145908 3166763 3278961 3307543 3382110 3343850
4243 3343850 3395969 3333539 3381056 3466638 3430592 3349647 3268778 3344569 3374520 3361012 3387627
4232 3387627 3393155 3314914 3327700 3389791 3392526 3347000 3388857 3319162 3390486 3407669 3484676 3566623
4220 3566623 3631746 3644918 3615862 3729026 3801508 3880309 3864754 3981320 4116979 4311080 4459637
4209 4459637 4540508 4633833 4572593 4532524 4275266 4213634 4343837 4284041 4153262 4103266 3980109
4198 3980109 3957662 3978121 3908189 3843672 3790022 3717679 3778113 3826021 3730592 3763313 3741439
4187 3741439 3776402 3772872 3834763 3820302 3837901 3918240 3879671 3877731 3971535 4099058 4091011 4157946
4175 4157946 4196224 4206955 4184346 4178535 4127061 4142935 4314089 4299532 4282705 4337304 4403630
4164D403630P9944Q877M1721R0855O7660Q3509P2779l4073O1346J33219j64823
4153D844644l4557R4055J0522N3444m2236L2222O3295N3864P5026J53642J07563
4142E411484N2841N7480l4822J51183J09843J3933J01699N6486o849J13607K05560
4131F232445J66100L7602J31258J56875J35735J22305K63550O304J89410J46495
4121G588079J85238L37927Q3892Q4658J38337K30372K29164K81364K30600J84509
4111I574140J70093K14474K37950K52968L11422L43794K66807L14571L41893Q6747
4101A2114859K35352K37091J28795K99619K96307K89064K27836J75914J84823
4092A4189660K62687J87085J68583J69875K73271K29360K93795K99611L35809
$$ plain form
4164 4403630 4483574 4492451 4534172 4625027 4692687 4776196 4848975 4814902 4876248 5009467 4844644
4153 4844644 4810087 4904142 4914664 4968108 4925872 4958094 5021389 5075253 5150279 5303921 5411484
4142 5411484 5464325 5521805 5486983 5638166 5748009 5761942 5863641 5920127 5913278 6026885 6232445
4131 6232445 6398545 6436147 6567405 6724280 6860015 6982320 7245870 7252174 7441584 7588079
4121 7588079 7773317 8111244 8195136 8279794 8418131 8648503 8877667 9159031 9389631 9574140
4111 9574140 9744233 9958707 10196657 10449625 10761047 11104841 11371648 11686219 12028112 12114859
4101 12114859 12350211 12587302 12716097 13015716 13312023 13601087 13828923 14004837 14189660
4092 14189660 14452347 14639432 14808015 14977890 15251161 15480521 15774316 16073927 16409736
4083A6409736L23487L42812M00240N68452N39285L64790K85219K61025K21959
4074A9717005J51532R7726j8079J71868J90612K06536J70386P0158K16351K14825
4064B1188920J52220N3756J61865J74494R2572J25782J52720J69449J14695J20015
4054B2506488L71843K77654L64362L62566M06392N82644L29524K16120K10465
4045B5628058L77033K82734K67792J18324P6307K02777P5192R6466m0373l777
4035B7080533O3005l715l9259n7452o8794K937N8287P7805P6731m1730P980j40209
4023B7016119j46746o0615j52198j91688j70343r2546J3590k5933l1564j01244
4013B6056832k1118k2132o8298l9468j41709j95795m7320j69517k44088k63478
$$ plain form
4083 16409736 16733223 17076035 17476275 18044727 18584012 18948802 19234021 19495046 19717005
4074 19717005 19868537 19966263 19948184 20120052 20310664 20517200 20687586 20757744 20974095 21188920
4064 21188920 21341140 21394896 21556761 21731255 21823827 21949609 22102329 22271778 22386473 22506488
4054 22506488 22878331 23155985 23520347 23882913 24289305 24871949 25201473 25417593 25628058
4045 25628058 26005091 26287825 26555617 26673941 26750248 26953025 27028217 27124683 27084310 27080533
4035 27080533 27143538 27139823 27100564 27043112 26974318 26977255 27035542 27113347 27190078 27148348 27156328 27016119
4023 27016119 26869373 26808758 26656560 26464872 26294529 26201983 26215573 26189640 26158076 26056832
4013 26056832 26035714 26013582 25945284 25905816 25764107 25568312 25520992 25351475 25107387 24843909
4003B4843909k98952k57024l06589l53480n45976n49740o54034n75750m19287
3994B0883077n00732l65901k58672k42847k59900q8455j21655k22883j41401j90465
3984A8490166k08572p9395j71872k99253j85573j51745j11790j56945k02873j70459
3974A6751689m0285J2100n9056l94095k35733m05450m23297k73648m17643k49715
3964A4264867j44039k68362l18635j66191k10311j88296k85009k08753j98716
3955A2276555l83858k37049k92180k29866j96159k50712k15202j70201j61015
3946A0140313k00484j03911k27788j71693j96556k29709j74308l37177k72901
3937H225786j25245k03842j73917j42666j50225j61458k13100p3702o5257j89878
$$ plain form
4003 24843909 24544957 24287933 23981344 23627864 23081888 22532148 21878114 21302364 20883077
3994 20883077 20382345 20016444 19757772 19514925 19255025 19166570 19044915 18822032 18680631 18490166
3984 18490166 18281594 18202199 18030327 17731074 17545501 17393756 17281966 17125021 16922148 16751689
3974 16751689 16711404 16723504 16664448 16270353 16034620 15629170 15205873 14932225 14514582 14264867
3964 14264867 14120828 13852466 13533831 13367640 13157329 12969033 12684024 12475271 12276555
3955 12276555 11892697 11655648 11363468 11133602 10937443 10686731 10471529 10301328 10140313
3946 10140313 9939829 9835918 9608130 9436437 9239881 9010172 8835864 8498687 8225786
3937 8225786 8100541 7896699 7722782 7580116 7429891 7268433 7055333 6981631 6916374 6726496
3927F726496l3326j66126j99466k19536p6642j30588p4258o1536j74944p2010
3917E518064j85979p4470O5139j22181q7032K1259r3190p8005j25365j40693k651
3906D694896N4800r4998j42460j10815p0653r655N4371q8115K1343J0221j61831
3895D157104J26881l4273Q7607L534n1466p4605K6689K5163o0581k7443J2438
3884D191048j8697r9738n7907k00665M4794q0680j81807m2321j27615Q4900P3359
3873C584671j08248j04057r5744K0855o6934n5037m373p727j38910K8952O3868
3862C117316m1014j01707k2510K6284O5254r1011L3226k6571o759o8681J0647
3851B894474k2279m6404l5316J27523j332p0377k5182P7156K6911q059k9862p684
$$ plain form
3927 6726496 6693170 6527044 6327578 6108042 6031400 5900812 5826554 5765018 5590074 5518064
3917 5518064 5332085 5257615 5322754 5200573 5113541 5134800 5041610 4963605 4838240 4697547 4694896
3906 4694896 4749696 4654698 4512238 4401423 4330770 4321115 4375486 4287371 4308714 4318935 4157104
3895 4157104 4283985 4249712 4337319 4340853 4289387 4214782 4241471 4266634 4206053 4178610 4191048
3884 4191048 4172351 4072613 4014706 3814041 3858835 3778155 3596348 3554027 3426412 3511312 3584671
3873 3584671 3476423 3372366 3276622 3297477 3230543 3175506 3171133 3163406 3024496 3053448 3117316
3862 3117316 3076302 2974595 2952085 2978369 3043623 2952612 2985838 2959267 2952508 2883827 2894474
3851 2894474 2872195 2825791 2790475 2917998 2916666 2846289 2821107 2898263 2925174 2917115 2887253 2879569
3839B879569o8554N262l7546q4977N1447k7931k7538L3636M587j11459K0667P131
3827B644294N4686J1396k0790l0567p587n009L1086k7784k7744p4136j871m5601
3815B500373J20015k3341o2749j5651M3281p6664Q8895p5589q9286J1982P8906
3804B500172K4528k4189q6479p5004P8265J34406O9376j48807N8690O9739j3193
3793B587504P4893j04832o3168J36769n6496q2256m9658P6099m3844o7007M4029
3782B452033L5741k975N9297J3068n0878K0620q2973N57p3168J21482k1711o1548
3770B409545N739O9062r9852P3617K4830m7509Q1879l8762O9573M9396p939j1775
3758B577804m1859K052O4189l4420q4162l0647N7017j38877J5033o4773p5005
$$ plain form
3839 2879569 2811015 2816277 2778731 2693754 2745201 2717270 2689732 2723368 2727955 2616496 2637163 2644294
3827 2644294 2698980 2710376 2689586 2659019 2651432 2646423 2677509 2649725 2621981 2547845 2545974 2500373
3815 2500373 2620388 2597047 2534298 2518647 2561928 2485264 2574159 2498570 2409284 2421266 2500172
3804 2500172 2524700 2500511 2414032 2339028 2417293 2551699 2621075 2472268 2530958 2600697 2587504
3793 2587504 2662397 2557565 2494397 2631166 2574670 2492414 2442756 2518855 2475011 2408004 2452033
3782 2452033 2487774 2484799 2544096 2557164 2506286 2526906 2443933 2444490 2371322 2492804 2471093 2409545
3770 2409545 2415284 2484346 2384494 2458111 2482941 2435432 2517311 2478549 2548122 2597518 2589579 2577804
3758 2577804 2535945 2537997 2602186 2567766 2483604 2452957 2509974 2371097 2386130 2321357 2246352
3747B246352J2852l0210k9571k9793L057k8683J5475J30582l3219m6967r7446
3736B112429O3779j0123m3654P5912p7878K6988Q5799P895J255N2246k0753q2258
3724B191637L5252k7323p0501J5176n8405q8287J53218J2213j55471l9948J13992
3713B081553K1126j72446n9648r9460j6351J66506J65132N927p2434k7256K975
3702A995624L1741l9294j12788J6106J5753N0559o0972k5277J00015N736p9180
3691A898023k8460J64773n3611j26889K5834O042m1494J0370j6840O1693o8351
3680A831090o6552j7650M2900P2037p9138q7933J40872P3881r5269j24918K1792
3669A711112J14995N3226m5284Q5130q7826l8096J503L6789J4652p4510O7658
$$ plain form
3747 2246352 2259204 2228994 2199423 2169630 2172687 2144004 2159479 2290061 2256842 2209875 2112429
3736 2112429 2176208 2166085 2122431 2198343 2120465 2147453 2233252 2241147 2242402 2294648 2273895 2191637
3724 2191637 2226889 2199566 2129065 2144241 2085836 1997549 2150767 2162980 2007509 1967561 2081553
3713 2081553 2102679 1930233 1870585 1771125 1754774 1921280 2086412 2092339 2019905 1992649 1995624
3702 1995624 2027365 1988071 1875283 1891389 1907142 1957701 1896729 1871452 1971467 1977203 1898023
3691 1898023 1869563 2034336 1980725 1853836 1879670 1885712 1844218 1854588 1837748 1899441 1831090
3680 1831090 1764538 1746888 1789788 1861825 1782687 1694754 1835626 1909507 1814238 1689320 1711112
3669 1711112 1826107 1879333 1834049 1919179 1831353 1793257 1794760 1831549 1846201 1771691 1839349
3658A839349J07225q1584L1386J48070K7379r5742j01395o133l0233J14375j01998
3647A850699L4144j8004j7814j02735j2769J20862P6397n6388q4237k2502Q5978
3636A853631M811L4153p4731L5267M4839k7589P2375J4807q9104j22219K4758
3625A770998l1642j950M6176O4431n7670j70754M0223j00463p958R60O2504M8632
3613A663487l4400N0569l6825m9987Q378L5776J35153M5109l2689r2682k6751
3602A665138L9426J2307Q0897m9050j4840o4543N6182k532j539l1532J29603j6208
3590A803309J8434K00454P2574n3975L2443l3230k5811M768j1043J40502K3191
3579B171616j6802l4782J4563J09288j14576m5393n405K6264L0483J19813J35227
$$ plain form
3658 1839349 1946574 1864990 1896376 2044446 2071825 1976083 1874688 1868555 1838322 1952697 1850699
3647 1850699 1884843 1866839 1849025 1746290 1733521 1854383 1930780 1874392 1790155 1767653 1853631
3636 1853631 1858442 1892595 1817864 1853131 1897970 1870381 1942756 1957563 1868459 1746240 1770998
3625 1770998 1739356 1737406 1783582 1848013 1790343 1619589 1659812 1559349 1551391 1552351 1614855 1663487
3613 1663487 1629087 1679656 1642831 1592844 1601222 1636998 1772151 1817260 1784571 1691889 1665138
3602 1665138 1704564 1716871 1797768 1748718 1733878 1669335 1725517 1722985 1721446 1689914 1819517 1803309
3590 1803309 1821743 2022197 2094771 2040796 2073239 2040009 2014198 2018966 2007923 2148425 2171616
3579 2171616 2154814 2120032 2134595 2243883 2129307 2083914 2078509 2104773 2135256 2255069 2390296
3568B390296j7950L2203j40019J28546J30180j16667q1610Q0737J00751o7198
3558B439269K2062P9554n4256p322J66237j8060q9981J23644j8162R3939N3368
3547B790292J40958J10042J420O2306n1073O570M7026J08040J6348M7821J04094
3536C383844K17M1331M4423J45267P5989k8269Q5514J99086J23984K40305L54148
3525D665839K24406M10647M45849N03102N34488N33634K71949J4596k47598m96129
3515F860783k77089k85870k64609j95308j25555k51775j34155P9965m7164j43921
3505E215302N6423Q0573J41456R1107J19505K90250L42148M11247N46068M89054
3495G783133L46507J19907l67053m28512m85985m82229l35626j46826j74467j49131
$$ plain form
3568 2390296 2372346 2404549 2264530 2393076 2523256 2406589 2324979 2405716 2506467 2439269
3558 2439269 2461331 2540885 2486629 2479307 2645544 2627484 2537503 2661147 2642985 2736924 2790292
3547 2790292 2931250 3041292 3042712 3105018 3053945 3060515 3107541 3215581 3231929 3279750 3383844
3536 3383844 3384061 3425392 3469815 3615082 3691071 3662802 3748316 3947402 4071386 4311691 4665839
3525 4665839 4890245 5300892 5746741 6249843 6784331 7317965 7589914 7604510 7356912 6860783
3515 6860783 6583694 6297824 6033215 5837907 5712352 5460577 5326422 5406387 5359223 5215302
3505 5215302 5271725 5352298 5493754 5584861 5704366 5994616 6336764 6748011 7294079 7783133
3495 7783133 8129640 8249547 7882494 7453982 6967997 6485768 6150142 6003316 5828849 5679718
3485E679718j02860n4145j16056K0828l8225j0922O0591o9326l4816K7460J31932
3474E494179J01155O0177P8686J16484J38003M2662J52775J38333K15000K79214
3464F816668K36406K62038K39340K88163M11059K46223L53118K90093J12467j34304
3454I121271l78826m73676l85864m94424p18964m84461m66479l59598k85722j86846
3444D886411k36827j70546j54730m9131j29682k43435j43775j22453k9700q0114
3434C526018j25850j17775j05784j0458o942j05021r4021J04421K0750q1093J890
3423C006135J26162M3306j7876n4839q0139j78227m8385o7666q4346R9067j5805
3412B727387p0272o8806n4804N7082N6862j47219l1747j21286j02845j9393n5823
$$ plain form
3485 5679718 5576858 5522713 5406657 5427485 5389260 5378338 5438929 5369603 5334787 5362247 5494179
3474 5494179 5595334 5655511 5734197 5850681 5988684 6031346 6184121 6322454 6537454 6816668
3464 6816668 7053074 7315112 7554452 7842615 8253674 8499897 8853015 9143108 9255575 9121271
3454 9121271 8742445 8268769 7882905 7388481 6669517 6185056 5718577 5358979 5073257 4886411
3444 4886411 4649584 4479038 4324308 4275177 4145495 3902060 3758285 3635832 3606132 3526018
3434 3526018 3400168 3282393 3176609 3166151 3159209 3054188 2960167 3064588 3085338 3004245 3006135
3423 3006135 3132297 3175603 3157727 3102888 3022749 2844522 2796137 2728471 2644125 2743192 2727387
3412 2727387 2657115 2588309 2533505 2590587 2647449 2500230 2468483 2347197 2244352 2224959 2169136
3401B169136J5704l5714r6114K8780o7255j6023J22588R0840K1068J62901J14671
3390B510582J11174j8410o223q7751k35047j210j8312n5619k3838n8547q3542
3379B033257K3343l0851m3027j18758O9l4033n322k4766j8735L0136P594K7180
3367A846087l9034p08O9460k4109M155j53855N6268m4685l6819L3688k399N3224
3355A761273l0503q983m2704J05286K1151r8223M2401r8367N4223P8329q9260
3344A694623p4250k9348n7462p6822m5611k1845P0805J16411K0474j1331Q3301
3333A668945l4261P8560M4095n1109j33053q9568o3152M5965r2077j21492r9628
3322A153225n7766n5200J3251N1380k1757n0752M0958M113j49712K8460J46279
$$ plain form
3401 2169136 2184840 2149126 2053012 2081792 2014537 1998514 2121102 2211942 2233010 2395911 2510582
3390 2510582 2621756 2603346 2597123 2509372 2274325 2273115 2254803 2199184 2175346 2116799 2033257
3379 2033257 2056600 2025749 1982722 1863964 1864033 1830000 1824678 1799912 1781177 1811313 1818907 1846087
3367 1846087 1807053 1806345 1875805 1851696 1855851 1701996 1758264 1713579 1676760 1710448 1708049 1761273
3355 1761273 1730770 1721787 1679083 1784369 1805520 1707297 1749698 1651331 1705554 1783883 1694623
3344 1694623 1620373 1591025 1533563 1456741 1411130 1389285 1460090 1576501 1596975 1585644 1668945
3333 1668945 1634684 1713244 1757339 1706230 1573177 1483609 1420457 1466422 1374345 1252853 1153225
3322 1153225 1095459 1040259 1053510 1104890 1083133 1032381 1073339 1077452 927740 956200 1102479
3311A102479J1883M3104r3194j16313M8057Q9653l555q0277o6345R5193R8004
3300A128689K0654j02871m5346o3654p5611N3965l3252L9949q4822J5341K4214
3289H77256j2617j8170r8724J1226M4850m0361J5960m9492O231M7163k7877j31737
3277F23708R5993m1055L0849J88q2508K8909O8702n9270j08273O9203N6006n1322
3265F31130k242n9401j5179J42312l9321k9397j5299J61364N4323j55722j2065
3254F60503j8019L4003Q2382p1208j1808n0078j3091R509N3392j07091k2121j5960
3242E30413J82221N1067q8361P3750K6797o9126P5584K0842m7391n3467k3993
3231F78336n7733m4255J31472J36776j07012l7318M281M5048Q4722j5936m6299
$$ plain form
3311 1102479 1114362 1157466 1064272 947959 996016 1085669 1082114 1001837 935492 1030685 1128689
3300 1128689 1149343 1046472 1001126 937472 861861 915826 882574 922523 837701 853042 877256
3289 877256 864639 846469 747745 758971 803821 763460 779420 729928 736159 783322 755445 623708
3277 623708 719701 678646 709495 709683 627175 656084 724786 665516 557243 626446 682452 631130
3265 631130 628888 569487 554308 696620 657299 627902 612603 773967 828290 672568 660503
3254 660503 642484 676487 758869 687661 675853 625775 612684 622193 675585 568494 546373 530413
3242 530413 712634 763701 675340 749090 775887 706761 782345 803187 755796 702329 678336
3231 678336 620603 576348 707820 844596 737584 700266 704547 749595 834317 818381 772082
3220G72082j0333J01342n2355k5742L2421J07802n5932j55801P5222O8282L4600
3209H91588N4386J0242J41071J14279P0458l0036N7424Q2060J07511J6733j8535
3198A497181o8097N262q6591j05889m2357J1437N9096m4679j85149O8072J64541
3187A272827j0527J8974N2806J14726o630m8223K9062p2261N619j2939Q1561J49435
3175A574430m2464P821J33946P147P5672K41537Q0668J1917n8951r3396j44207
3164A794120l1403n5270J0864k2614j15731m3991R110j2235J11546P7164p4757
3153A646803n2567r1372o3967j8167o7220K7426L4205j8240J03540O8977p069
3142A562349l1594k425k6916J1016n233P1131R5225p7890R970L4578j08236J2049
$$ plain form
3220 772082 761749 863091 810736 784994 817415 925217 869285 713484 788706 856988 891588
3209 891588 945974 956216 1097287 1211566 1282024 1251988 1309412 1391472 1498983 1515716 1497181
3198 1497181 1429084 1434346 1347755 1241866 1199509 1210946 1270042 1225363 1040214 1108286 1272827
3187 1272827 1262300 1281274 1334080 1448806 1442176 1393953 1423015 1350754 1356373 1343434 1424995 1574430
3175 1574430 1531966 1539787 1673733 1680880 1756552 1998089 2078757 2090674 2031723 1938327 1794120
3164 1794120 1762717 1707447 1718311 1695697 1579966 1535975 1545085 1532850 1644396 1721560 1646803
3153 1646803 1594236 1502864 1438897 1420730 1353510 1380936 1415141 1396901 1500441 1569418 1562349
3142 1562349 1530755 1528330 1501414 1512430 1507197 1578328 1673553 1595663 1605633 1640211 1531975 1544024
3130A544024l3742k9504n6394j6753N5291R8354j7835n1095O7728m6371m9194
3119A464509J76580J5803l6561o8326m5275k6857p5652n7130K2968n1717j19982
3108A198360k9589q8849k3788K7934R571K6659J5590R999j48027j14335M1163
3097I24688L8512K6784q5808L7445K1735L8099l3945M2784K2775l9458M4059n460
3085A032210l7737m4926l9732K1776k11946R106j20656o2994M5161J0292K4966
3074F25520L8989N65R308P7567j12447p9779M2446o2670J1166K2286j52325P1299
3062D91925L8579K3326R462j84290k9535j4861R533o034N5092j1582m7034o1054
3050B73527O968N8603n0485R5586j7223n5737N041j541j3202L286j85p7316k239
$$ plain form
3130 1544024 1510282 1480778 1424384 1407631 1462922 1561276 1543441 1492346 1560074 1513703 1464509
3119 1464509 1641089 1656892 1620331 1552005 1506730 1479873 1404221 1347091 1370059 1318342 1198360
3108 1198360 1168771 1079922 1056134 1084068 1093639 1120298 1135888 1145887 997860 883525 924688
3097 924688 963200 989984 904176 941621 963356 1001455 967510 1010294 1033069 993611 1037670 1032210
3085 1032210 994473 949547 909815 931591 719645 728751 608095 545101 590262 600554 625520
3074 625520 664509 665074 674382 751949 639502 559723 602169 539499 550665 572951 420626 491925
3062 491925 530504 553830 563292 379002 349467 334606 344139 338105 393197 381615 334581 273527
3050 273527 280495 339098 288613 384199 366976 311239 316280 314739 301537 304823 304638 227322 225083
3037B25083J02151l4920K7304j33186O4945L7692j14004q1151J51099L9693l4070
3026B50636L2502K5935k2248r3525M4182j5181l5673k548J7757P8835N3371n0370
3014B83673l7253q6556Q2073J3641m5091n4949J1345O1331k9938p4546P9275J5570
3002B18575q2815j6927J61189P0525k30469n0344J25787k5088Q53l8837L5997
2991A68446n0964n8095R1492J6636K43j21383L167J08233l5255j17483Q3667k7077
2979F1627k605Q0400Q6912o0250j09474l5684K2023R985M0158j6346R5309l7329
2967A34726k9765Q785r271N2352k3310K175k0608q4658P480Q0965K9704m4533
2955A04042L4341l3118M0908n226p9261P6166N0441P6318q7591p294k8705q803
$$ plain form
3037 225083 327234 292314 319618 186432 251377 289069 175065 93914 245013 284706 250636
3026 250636 283138 309073 286825 193300 237482 222301 186628 184080 201837 280672 334043 283673
3014 283673 246420 159864 241937 255578 210487 155538 166883 228214 198276 123730 203005 218575
3002 218575 135760 118833 280022 350547 120078 69734 195521 170433 171286 132449 168446
2991 168446 117482 59387 150879 167515 167758 46375 49542 157775 122520 5037 88704 61627
2979 61627 59022 139422 226334 166084 56610 20926 42949 52934 93092 76746 172055 134726
2967 134726 104961 113746 104475 156827 133517 135692 115084 30426 37906 118871 148575 104042
2955 104042 138383 105265 146173 140947 61686 137852 188293 264611 177020 169726 141021 132218
2943A32218O6341k3647o2305m754P4842J00549j15289o3580k190L699J5459j2612
2931A08731r6311m935M747L7668L1676l1850j1199N3433J2521o2785l6589j21638
2919a16531L8279J2746j9241K4353N0735M7061P6346p7691j05696k5814P2772
2908b2681L4972l5274K908J6743o9652O9718O5067o9226K8196N0717J9921j16674
2896b5265j2498N696l0364K8615N6280p8849Q9463n8265j557L6959J18100J23362
2884B51677q1181r8306j40958M8824M7873r0027k5038o3790J15595N4109j0593
2873H185Q2262l5481p7845L9434N5834M296k3019L6541j08214K1751N6802n1431
2861I115j16020k0376J07471M8002J1044p1791j489O4145q583m5085Q6009M9321
$$ plain form
2943 132218 198559 174912 112607 107853 182695 283244 167955 104375 102185 105884 121343 108731
2931 108731 12420 7485 12232 49900 81576 49726 38527 91960 104481 41696 5107 -116531
2919 -116531 -78252 -65506 -84747 -60394 -9659 37402 113748 36057 -69639 -95453 -22681
2908 -22681 12291 -22983 -20075 -3332 -72984 -3266 61801 -7425 20771 71488 91409 -25265
2896 -25265 -37763 -32067 -62431 -33816 22464 -56385 33078 -25187 -26744 10215 128315 251677
2884 251677 170496 72190 -68768 -19944 27929 -62098 -87136 -150926 -35331 18778 8185
2873 8185 90447 54966 -22879 16555 72389 76685 53666 90207 -18007 3744 60546 9115
2861 9115 -106905 -127281 -19810 28192 39236 -32555 -34044 30101 21518 -23567 62442 111763
2849A11763Q3979j05713o313N1006j21694L1168J6184k24L822j38452R7425j3411
2837I540n9495L57l1742L743M7995l9452L4857m2393Q5709O7809j00104l4620
2825e7796J28406k0396p3102K1107l6921L2259L7165j32453M2866N0937N1861
2814D3933J7018l8699P3428N8143N311j06963l6262J6170J0322k0091J2126k8127
2802F309L0974P2611j38074q4475J17579J2267o7471k7022K6313N7451k7457J19809
2790I8814R7416j54430q8996L2300M5890K075r8614L4167K4917R2899m8025l2607
2778E806K4854n0157M7655m3228r439m3130K0137o7242N6472M0870J3465p3490
2766g7427m0936N2510P72Q5360J5710M4594j3802m6812l4971q8873P0547j03259
$$ plain form
2849 111763 195742 90029 83716 134722 13028 44196 60380 60156 63978 -74474 22951 9540
2837 9540 -49955 -49598 -81340 -77597 -29602 -69054 -34197 -76590 9119 76928 -23176 -57796
2825 -57796 70610 50214 -22888 -1781 -38702 -6443 30722 -101731 -58865 -7928 43933
2814 43933 60951 22252 95680 153823 159134 52171 15909 32079 42401 22310 34436 6309
2802 6309 37283 109894 -28180 -112655 4924 17191 -50280 -77302 -50989 6462 -20995 98814
2790 98814 196230 41800 -47196 -14896 30994 33069 -65545 -31378 -6461 86438 38413 5806
2778 5806 30660 -19497 28158 -15070 -24509 -67639 -47502 -114744 -58272 -17402 -3937 -77427
2766 -77427 -118363 -65853 -65081 20279 35989 80583 66781 19969 -15002 -103875 -33328 -136587
2754a36587p4539N5500P7843k5969N1908p4083l4568J5844J7849N6724P4493L0555
2742C4970o1901l2250L6269p626J3665o1877K5941J6667P3084n4122j3764l9290
2730g0234r0769k7699O4319K9560R211J21775j3460J3494m8098Q5239m257j24817
2718e5736K2564J3262K3009K0413r7209R4264p597J1755Q847R5937M512q8756
2706D5265M0898p5612k7426O309R8011l0413o2489n9325n2440J27623p2721P877
2694e4443L7586k2408l6106p2523L7398J17174q7646Q445K5441L2722J01041p9087
2682G594l0771j1997o6439K3576K9531k4768O863J4699m2151N3014j2385l975
2670e7209l3095J1646k6212M3804J1014k4876N4822R2299m4899o3783N0251L4202
$$ plain form
2754 -136587 -211126 -155626 -77783 -103752 -51844 -125927 -160495 -144651 -126802 -70078 4415 34970
2742 34970 -26931 -59181 -22912 -30538 -16873 -78750 -52809 -36142 36942 -17180 -30944 -70234
2730 -70234 -161003 -188702 -124383 -94823 -85612 36163 22703 36197 -11901 73338 69081 -55736
2718 -55736 -33172 -19910 3099 23512 -73697 20567 12970 24725 33572 129509 134021 45265
2706 45265 86163 10551 -16875 -10566 87445 57032 -5457 -64782 -117222 10401 -62320 -54443
2694 -54443 -16857 -39265 -75371 -147894 -110496 6678 -80968 -72523 -47082 -14360 86681 7594
2682 7594 -23177 -35174 -101613 -78037 -48506 -73274 -66411 -51712 -93863 -40849 -53234 -57209
2670 -57209 -90304 -78658 -104870 -61066 -50052 -74928 -20106 72193 27294 -36489 13762 47964
2658D7964q9479J3512O5677k7324J0402m3491o706l0256R0088J84583q8900j41935
2646a5865k1034J16689N703j05967l23k7698q586J7183j2078M2226k2438p5074
$$ plain form
2658 47964 -41515 -28003 37674 10350 20752 -22739 -29445 -59701 30387 214970 126070 -15865
2646 -15865 -36899 79790 85493 -20474 -20797 -48495 -57081 -39898 -51976 -9750 -32188 -107262
$$ [...]
##END NTUPLES=NMR SPECTRUM
##END=
