##TITLE=1H_EC-3305(II-1)-7
 CDCl3
 8 sc, 
 20.11.2023
##JCAMPDX= 6.0         $$ Bruker NMR JCAMP-DX V2.0
##DATA TYPE= NMR SPECTRUM
##DATA CLASS= NTUPLES
##ORIGIN= UXNMR, Bruker Analytische Messtechnik GmbH
##OWNER= root
$$ XWIN-NMR		Version 3.5
$$ Mon Nov 20 14:53:23 2023 Russian Standard Time (UT+4h)  she@DPX200
##.OBSERVE FREQUENCY= 200.1313
##.OBSERVE NUCLEUS= ^1H
##.ACQUISITION MODE= SIMULTANEOUS
##.ACQUISITION SCHEME= undefined
##.AVERAGES= 8
##.DIGITISER RES= 18
##SPECTROMETER/DATA SYSTEM= spect
##.PULSE SEQUENCE= zg30
##.SOLVENT NAME= D2O
##.SHIFT REFERENCE= (INTERNAL, D2O, 0, 15.4736)
##AUDIT TRAIL= $$ (NUMBER, WHEN, WHO, WHERE, WHAT)
$$ ##TITLE= Audit trail, XWIN-NMR		Version 3.5
$$ ##JCAMPDX= 5.01
$$ ##ORIGIN= Bruker BioSpin GmbH
$$ ##OWNER= she
$$ F:/spectra/data/she/nmr/H-F/1/pdata/1/auditp.txt
$$ ##AUDIT TRAIL=  $$ (NUMBER, WHEN, WHO, WHERE, WHAT)
(   1,<2023-11-20 14:51:25.60 +0400>,<she>,<DPX200>,
      <created by zg, POWCHK disabled, PULCHK disabled
       configuration hash MD5:
       00 E9 B6 7A A2 85 ED C7 34 08 36 98 17 FE 4E 26
       data hash MD5: 16K
       BC 2C 4C 6B E5 7B FE B9 43 97 79 B9 41 DD FF 66>)
(   2,<2023-11-20 14:51:29.03 +0400>,<she>,<DPX200>,
      <Start of raw data processing
       efp BC_mod = 2 LB = 0.24 FT_mod = 6 PKNL = 1 PHC0 = -23867.51 PHC1 = 8.252689 SI = 16K 
       data hash MD5: 16K
       A4 DB 5A 99 4F 6B 8B 6A DC EE 8B 0D 55 C4 F2 36>)
(   3,<2023-11-20 14:51:50.26 +0400>,<she>,<DPX200>,
      <pk PHC0 = 0.03182271 PHC1 = 0 
       data hash MD5: 16K
       21 68 0A B6 5C 34 6E 35 3D 72 B5 26 5F 90 17 9E>)
(   4,<2023-11-20 14:51:53.26 +0400>,<she>,<DPX200>,
      <abs ABSG = 5 
       data hash MD5: 16K
       42 A1 0F E4 93 FD D6 86 96 F1 66 AA B0 83 28 4B>)
$$ ##END=
$$ 
$$ hash MD5
$$ 98 CB BB 84 53 27 DC C3 98 7A 57 A8 AC BF 6F 5D
##$RELAX= 
##$RELAX= 
##$RELAX= 
##$RELAX= 
##$RELAX= 
##$RELAX= 
$$ Bruker specific parameters
$$ --------------------------
##$DU= <F:/spectra>
##$EXPNO= 1
##$NAME= <H-F>
##$PROCNO= 1
##$TYPE= <nmr>
##$USER= <she>
##$AMP= (0..31)
100 100 100 100 100 100 100 100 100 100 100 100 100 100 100 100 100 100 
100 100 100 100 100 100 100 100 100 100 100 100 100 100 
##$AQSEQ= 0
##$AQ_mod= 1
##$AUNM= <au_zg>
##$AUTOPOS= <>
##$BF1= 200.13
##$BF2= 200.13
##$BF3= 200.13
##$BF4= 200.13
##$BF5= 200.13
##$BF6= 200.13
##$BF7= 200.13
##$BF8= 200.13
##$BYTORDA= 1
##$CFDGTYP= 0
##$CFRGTYP= 5
##$CHEMSTR= <none>
##$CNST= (0..31)
1 1 145 1 1 1 1 1 1 1 1 1 1 1 1 1 1 1 1 1 1 1 1 1 1 1 1 1 1 1 1 1 
##$CPDPRG= <>
##$CPDPRG1= <>
##$CPDPRG2= <>
##$CPDPRG3= <>
##$CPDPRG4= <mlev>
##$CPDPRG5= <mlev>
##$CPDPRG6= <mlev>
##$CPDPRG7= <mlev>
##$CPDPRG8= <mlev>
##$CPDPRGB= <>
##$CPDPRGT= <>
##$D= (0..31)
0 1.2 0 0 0 0 0 0 0 0.06 0 0.03 0 0 0 0 0.0002 0 0 0 0 0 0 0 0 0 0 0 0 
0 0 0 
##$DATE= 1700477484
##$DBL= (0..7)
120 120 120 120 120 120 120 120 
##$DBP= (0..7)
150 150 150 150 150 150 150 150 
##$DBP07= 0
##$DBPNAM0= <>
##$DBPNAM1= <>
##$DBPNAM2= <>
##$DBPNAM3= <>
##$DBPNAM4= <>
$$ [...]
##$SUBNAM3= <"">
##$SUBNAM4= <"">
##$SUBNAM5= <"">
##$SUBNAM6= <"">
##$SUBNAM7= <"">
##$SUBNAM8= <"">
##$SUBNAM9= <"">
##$SW= 18.0517328524113
##$SWIBOX= (0..15)
0 0 2 0 0 0 0 0 0 0 0 0 0 0 0 0 
##$SW_h= 3612.71676300578
##$TD= 16384
##$TD0= 1
##$TE= 0
##$TE2= 300
##$TE3= 300
##$TEG= 300
##$TL= (0..7)
0 120 120 120 120 120 120 120 
##$TP= (0..7)
150 150 150 150 150 150 150 150 
##$TP07= 0
##$TPNAME0= <>
##$TPNAME1= <>
##$TPNAME2= <>
##$TPNAME3= <>
##$TPNAME4= <>
##$TPNAME5= <>
##$TPNAME6= <>
##$TPNAME7= <>
##$TPOAL= (0..7)
0.5 0.5 0.5 0.5 0.5 0.5 0.5 0.5 
##$TPOFFS= (0..7)
0 0 0 0 0 0 0 0 
##$TUNHIN= 0
##$TUNHOUT= 0
##$TUNXOUT= 0
##$USERA1= <user>
##$USERA2= <user>
##$USERA3= <user>
##$USERA4= <user>
##$USERA5= <user>
##$V9= 5
##$VALIST= <valist>
##$VCLIST= <CCCCCCCCCCCCCCC>
##$VD= 0
##$VDLIST= <DDDDDDDDDDDDDDD>
##$VPLIST= <PPPPPPPPPPPPPPP>
##$VTLIST= <TTTTTTTTTTTTTTT>
##$WBST= 1024
##$WBSW= 4
##$XGAIN= (0..3)
0 0 0 0 
##$XL= 0
##$YL= 0
##$YMAX_a= 364941
##$YMIN_a= -568115
##$ZGOPTNS= <>
##$ZL1= 120
##$ZL2= 120
##$ZL3= 120
##$ZL4= 120
##$ABSF1= 15.38659
##$ABSF2= -2.665257
##$ABSG= 5
##$ABSL= 3
##$ALPHA= 0
##$AQORDER= 0
##$ASSFAC= 0
##$ASSFACI= 0
##$ASSFACX= 0
##$ASSWID= 0
##$AUNMP= <proc_1d>
##$AZFE= 0.1
##$AZFW= 0.1
##$BCFW= 0
##$BC_mod= 2
##$BYTORDP= 0
##$COROFFS= 0
##$CY= -3
##$DATMOD= 1
##$DC= 0
##$DFILT= <>
##$DTYPP= 0
##$F1P= 0
##$F2P= 0
##$FCOR= 1
##$FTSIZE= 16384
##$FT_mod= 6
##$GAMMA= 0
##$GB= 0
##$INTBC= 1
##$INTSCL= 3.70164e-10
##$ISEN= 128
##$LB= 0.24
##$LEV0= 0
##$LPBIN= 0
##$MAXI= 10000
##$MC2= 0
##$MEAN= 0
##$ME_mod= 0
##$MI= 1.114404
##$NCOEF= 0
##$NC_proc= -6
##$NLEV= 6
##$NOISF1= 3.799351
##$NOISF2= 2.8
##$NSP= 0
##$NTH_PI= 0
##$NZP= 0
##$OFFSET= 15.47364
##$PC= 1
##$PHC0= -23867.48
##$PHC1= 8.252689
##$PH_mod= 1
##$PKNL= yes
##$PPARMOD= 0
##$PSCAL= 0
##$PSIGN= 0
##$REVERSE= no
##$SF= 200.130009617002
##$SI= 16384
##$SIGF1= 3
##$SIGF2= 2
##$SINO= 5.538805
##$SIOLD= 16384
##$SREGLST= <1H.CDCl3>
##$SSB= 0
##$STSI= 16384
##$STSR= 0
##$SW_p= 3612.71676300578
##$SYMM= 0
##$S_DEV= 0
##$TDeff= 16384
##$TDoff= 0
##$TI= <>
##$TILT= no
##$TM1= 0
##$TM2= 0
##$TOPLEV= 0
##$USERP1= <user>
##$USERP2= <user>
##$USERP3= <user>
##$USERP4= <user>
##$USERP5= <user>
##$WDW= 1
##$XDIM= 16384
##$YMAX_p= 374775025
##$YMIN_p= -279843
$$ End of Bruker specific parameters
$$ ---------------------------------
##NTUPLES= NMR SPECTRUM
##VAR_NAME=  FREQUENCY,     SPECTRUM/REAL,   SPECTRUM/IMAG
##SYMBOL=    X,             R,               I
##VAR_TYPE=  INDEPENDENT,   DEPENDENT,       DEPENDENT
##VAR_FORM=  AFFN,          ASDF,            ASDF
##VAR_DIM=   16384,         16384,           16384
##UNITS=     HZ,            ARBITRARY UNITS, ARBITRARY UNITS
##FACTOR=    0.220516191357247, 1,           1
##FIRST=     3096.73981044638, 0,            0
##LAST=      -515.976952559397, 0,           0
##MIN=       -515.976952559397, -279843,     0
##MAX=       3096.73981044638, 374775025,    0
$$ Real data points
##PAGE= N=1
##DATA TABLE= (X++(R..R)), XYDATA
$$ [...]
7981A04061r5128j4222m6700P0292Q0540o0680J7025p6252J7413j0126O7146q156
$$ 104061 8933 -5289 -51989 18303 98843 38163 55188 -21064 -3651 -13777 53369 45213
7969D5213l7323Q1848j0413o4731J9220J67972k3737J1882o1545k1785J9167J5244
$$ 45213 7890 89738 79325 14594 33814 201786 178049 189931 128386 106601 125768 141012
7957A41012r922m8251J7499j12780J1033J03257K5199q3023p9436K03678L5499
$$ 141012 131090 82839 100338 -12442 -1409 101848 127047 44024 -35412 168266 203765
7946B03765j02839k0612j4878K4608J9389J00817K2483m8010m1180j4043M8659
$$ 203765 100926 80314 65436 90044 109433 210250 232733 184723 143543 129500 178159
7935A78159j8896L8359j6155o5562j7695M1199M7594M9320L6309M3624j0017j44954
$$ 178159 159263 197622 181467 115905 98210 139409 187003 236323 272632 316256 306239 161285
7923A61285K0374N896n9344O4012J25338j1984j33857L7922M0847J291J975J04056
$$ 161285 181659 187555 128211 192223 317561 305577 171720 209642 250489 251780 253755 357811
7911C57811J36827o8977M8926k8774p2094J14612J49092j47179k4253O1554R7075
$$ 357811 494638 425661 474587 445813 373719 488331 637423 490244 465991 527545 624620
7900F24620J87540L6803j438Q2276J62387P1844J06795R5783j9130M967l4212
$$ 624620 812160 848963 847525 929801 1092188 1164032 1270827 1366610 1347480 1352447 1318235
7889A318235N1845L1988k9251J64043q9538q441J45431p6555J22551q6861j67664
$$ 1318235 1370080 1402068 1372817 1536860 1447322 1438881 1584312 1507757 1630308 1543447 1375783
7878A375783J6059r1158j72658o9103o8402q2444k9577L7057q5383q2469J10922
$$ 1375783 1391842 1300684 1128026 1058923 990521 908077 878500 915557 830174 747705 858627
7867H58627j9894l2895l1143J1891j8829q7025j8357Q4672J39525O372L6933l0165
$$ 858627 838733 805838 774695 786586 767757 680732 662375 747047 886572 892944 929877 899712
7855H99712N7825J44232J53063L8331O5471R2277o749R5018L6300n3908j1723
$$ 899712 957537 1101769 1254832 1293163 1358634 1450911 1444162 1539180 1575480 1521572 1509849
7844A509849o2175o0704k9072L385J24310O5272k89Q1234l9481j08642j51348
$$ 1509849 1447674 1386970 1357898 1361283 1485593 1550865 1550576 1631810 1592329 1483687 1332339
7833A332339j19832j11438r0426j8133j2466q7244j02824m0986q4806o7373l5815
$$ 1332339 1212507 1101069 1010643 992510 980044 892800 789976 748990 664184 596811 560996
7822E60996l3019M0941O5437j7813K2822L4085n2428p9125J01244k477j4599j88007
$$ 560996 527977 568918 634355 616542 639364 673449 621021 541896 643140 640663 626064 438057
7810D38057k5889o8865M0237j7512m4423J5249k4667n868j5012K41739K66775
$$ 438057 412168 343303 383540 366028 321605 336854 312187 306319 291307 533046 799821
7799G99821k22989r1352J6713q2829J17856n4215r3450J18989O9853j5465l8184
$$ 799821 576832 485480 502193 419364 537220 483005 389555 508544 578397 562932 524748
7788E24748j04521j4017l4690M7412O6141M851L3142J00369j05147o1434J31574
$$ 524748 420227 406210 371520 418932 485073 489924 523066 623435 518288 456854 588428
7777E88428l2129k1193O2925Q737k5642P1752R745q572p60p5649N3043J3045R8677
$$ 588428 556299 535106 598031 606768 581126 652878 662623 654051 653291 577642 630685 643730 742407
7764G42407J6715j85625J9761j8810o4547R4493j16631M0732k8484j67261K6924
$$ 742407 759122 573497 593258 574448 509901 604394 487763 528495 500011 332750 359674
7753C59674L4940m9773N3592k8250l3106J78577j18803l1548K8767M2315M9749
$$ 359674 394614 344841 398433 370183 337077 515654 396851 365303 394070 436385 486134
7742D86134j22241l2048J11171N8045J1670o3942J82004K2638o9469K5660n6719
$$ 486134 363893 331845 443016 501061 512731 448789 630793 653431 583962 609622 552903
7731E52903J16715k8571L541L3420J26542o2025j41225L8615r672q811K6833K6500
$$ 552903 669618 641047 644588 678008 804550 742525 601300 639915 630243 621432 648265 674765
7719F74765Q1263o8598r904j6190l1151l1480k8476k4141O9087Q907k4810O6832
$$ 674765 756028 687430 677526 661336 630185 598705 570229 546088 615175 624082 599272 666104
7707F66104j03269r4145J12143l9801q539O3765N8609K1340r1818O5994j06166
$$ 666104 562835 468690 580833 541032 532493 596258 654867 676207 584389 650383 544217
7696E44217l5002J90481Q4412j46175l4698N4104q5007L0249m3890j41029J03805
$$ 544217 509215 699696 784108 637933 603235 657339 572332 602581 558691 417662 521467
7685E21467O6242m6029o143p8386j6807o525K6130L2534M3425n0765l4138L1914
$$ 521467 587709 541680 535537 457151 440344 433819 459949 492483 535908 485143 451005 482919
7673D82919M3729K9685l2896q3210j17249k1376P2786j4003m4682P4146k3647
$$ 482919 526648 556333 523437 440227 322978 301602 374388 360385 315703 389849 366202
7662C66202j3717p8408l667m3130m2648M4533J7383N6584M0139m0411k242m8516
$$ 366202 352485 274077 270410 227280 184632 229165 246548 303132 343271 302860 300618 252102
7650B52102Q5108Q295j23964P7908n1797n3567l9210M4956j5010n7936k7915K2181
$$ 252102 337210 345505 221541 299449 247652 194085 154875 199831 184821 126885 98970 121151
7638A21151L1883J9260k450j17216P0843R0212j1255j8210j51240o4431M0087
$$ 121151 153034 172294 169844 52628 123471 213683 202428 184218 32978 -31453 8634
7627H634n4817Q2298J49841m1247j01859O0169j8726k5425m95j2598Q4139m1659
$$ 8634 -46183 36115 185956 144709 42850 103019 84293 58868 58373 45775 129914 88255
7615H8255J580N6198J1712n8358n2721q4826K7590j3663J6815k473P4584m4822
$$ 88255 89835 146033 157745 99387 46666 -38160 -10570 -24233 -7418 -9891 64693 19871
7603A9871J1643L5784r2076J73552p0561k6647N982Q4338l1550M5184q1847l8542
$$ 19871 31514 67298 -24778 148774 78213 51566 57548 141886 110336 155520 73673 35131
7591C5131N7086M951m8597L123J7370j00906N2046K566J0478N4977K950j4634
$$ 35131 92217 97168 48571 51694 69064 -31842 20204 22770 33248 88225 91175 76541
7579G6541p5517n9094L2425l2826M5577L8662P7665n656n2066L8313n3122p7194
$$ 76541 1024 -58070 -25645 -58471 -12894 25768 103433 97777 45711 84024 30902 -46292
7567d6292N5497K9123k5259M1879P4638l1550o7868K8950J2584P1231J6316N8918
$$ -46292 9205 38328 13069 54948 129586 98036 30168 59118 71702 142933 159249 218167
7555B18167J794j39948j1075N9219p0435l6485R2579l2622m9630Q757O7550J8623
$$ 218167 219961 80013 68938 128157 57722 21237 113816 81194 31564 40321 107871 126494
7543A26494L297Q05K5068l2882j25653J3469k573K3075J1792R8465l7775N2698
$$ 126494 129791 130596 155664 122782 -2871 10598 8025 31100 42892 141357 103582 156280
7531A56280L0519l5850L9330j9825O6067M064J3905o3918l1365P3758L766n5261
$$ 156280 186799 150949 190279 170454 236521 240585 254490 190572 159207 232965 236731 181470
7519A81470k6812K9726K9418N1042Q6733o0438K6836j4262o9038J6779k880p1095
$$ 181470 154658 184384 213802 264844 351577 291139 317975 303713 234675 251454 248574 177479
7507A77479N5412R8282k2501p985l8574N3957J700M4509Q525n7583l1980J26145
$$ 177479 232891 331173 308672 300687 262113 316070 317770 362279 370804 313221 281241 407386
7495D07386p5743q9840N3188j6556K5800R0884P1529m3679O6063M8668J16554
$$ 407386 331643 241803 294991 278435 304235 395119 466648 422969 489032 537700 654254
7484F54254L0823l681M5645j00037K9597K03169l1074R9551K6099m0090k5424
$$ 654254 685077 681396 727041 627004 656601 859770 828696 928247 954346 914256 888832
7473H88832L5222L9073k3820j5258o4189L9819Q3706j0365j18189O3376Q1511
$$ 888832 924054 963127 939307 924049 859860 899679 983385 973020 854831 918207 999718
7462I99718k7548o2781r3178P8024N5847K061J7278K6872J64146k788j59412Q350
$$ 999718 972170 909389 816211 894235 950082 952143 969421 996293 1160439 1157651 998239 1006589
7450A006589Q3187j8158P0047Q029l4185Q3121K2097q0273L0580J00424l5967
$$ 1006589 1089776 1071618 1141665 1149694 1115509 1198630 1220727 1140454 1171034 1271458 1235491
7439A235491j13162j03907J8931O7479p1599m882J9798l7498j9802q2014M527
$$ 1235491 1122329 1018422 1037353 1104832 1033233 1028351 1048149 1010651 990849 908835 913362
7428I13362n0579P6402K0391o4448o916M8138K0835K4811J6525l1112k8940n1709
$$ 913362 862783 939185 959576 895128 888212 936350 957185 981996 998521 967409 938469 886760
7416H86760l6160l6689l3255L6975M3408q492m4099p2906j44402N0314J03293
$$ 886760 850600 813911 780656 817631 861039 852547 808448 735542 591140 641454 744747
7405G44747L8948J4980j9245r1916j6315j53878O7333L7052l3391k6512j48787
$$ 744747 783695 798675 779430 687514 671199 517321 584654 621706 588315 561803 413016
7394D13016p688l1468j1309r012J4953j2984j5817m6014N9264l6356M4611J2643
$$ 413016 405328 373860 362551 353539 368492 355508 339691 293677 352941 316585 361196 373839
7382C73839r0754q0893l1001J4199N6199k8814p5983K3321L9758q1883L3023m4319
$$ 373839 283085 202192 171191 185390 241589 212775 136792 160113 199871 117988 151011 106692
7370A06692m51K5974L576R526l7471q8840J29313j2866j11270k7142O6651M1458
$$ 106692 106241 132215 135791 145317 107846 19006 148319 135453 24183 -2959 63692 105150
7358A05150O0942m8939l7048n9990r4350J12003J3693K4813O8185N3509m8637
$$ 105150 166092 117153 80105 20115 -74235 37768 51461 76274 144459 197968 149331
7347A49331l2367P609l4334N8259P282n5921p4455o5719M5781j6741P0154l8354
$$ 149331 116964 124573 90239 148498 155780 99859 25404 -40315 5466 -11275 58879 20525
7335B0525l2114J8169l7472O5409K9664N3096o1586q6221O0688l4271m4795J20693
$$ 20525 -11589 6580 -30892 34517 64181 117277 55691 -30530 30158 -4113 -48908 71785
7323G1785N3466O2812j29483j19230K4083N9500l0884k7545K4759M5277K1938
$$ 71785 125251 188063 58580 -60650 -36567 22933 -7951 -35496 -10737 34540 56478
7312E6478J3094j3012N9868q1457n0960N2860k3990l779p3045L177Q8842Q140
$$ 56478 69572 56560 116428 34971 -15989 36871 12881 9102 -63943 -60766 28076 36216
7300C6216K9869n7869O064k6252j5389J95975q1417K8839q7763k6851k6877N0165
$$ 36216 66085 8216 14280 -11972 -27361 168614 87197 116036 28273 1422 -25455 24710
7288B4710N7388k866N5512L4389m8647N3958L191L7121M4313M2611j0589N5053
$$ 24710 82098 79232 134744 169133 120486 174444 177635 214756 259069 301680 291091 346144
7276C46144J0177p469Q5275L9626K533j15147p9032n2776k9992P3779j14092m2952
$$ 346144 356321 348852 434127 473753 476286 361139 282107 229331 199339 273118 159026 116074
7264A16074J7276R2909o4164j23636O9631n2079n6711K7092p712L3187N7069l852
$$ 116074 133350 226259 162095 38459 108090 56011 -700 26392 18680 51867 108936 105084
7252A05084j19872j09565N4980J17444J7428p925j22243M7735L555p2314M5957
$$ 105084 -14788 -124353 -69373 48071 65499 57574 -64669 -16934 -13379 -85693 -39736
7241c9736N7696m4078Q046N7071m2841m346L0282J10079j3928o6253q115j4528
$$ -39736 17960 -26118 -18072 38999 -3842 -8188 22094 132173 118245 51992 43877 29349
7229B9349o3259L8993q5678J7520J08991R950n5560k0827L6707O5103L882K1448
$$ 29349 -33910 5083 -80595 -63075 45916 55866 306 -20521 16186 81289 85171 106619
7217A06619M6615K6821j66693M058M612k6334L0545m3092o0150N5869P8573j5454
$$ 106619 153234 180055 13362 17420 22032 -4302 26243 -16849 -76999 -21130 57443 41989
7205D1989j8268J3072m5328J32450j09704K2209Q395k4530M2390k6554k7455p3855
$$ 41989 23721 36793 -8535 123915 14211 36420 44815 20285 62675 36121 8666 -65189
7193f5189o0068o085L8235N8959M2153q099J03005r0191k9832k5423l1237l9943
$$ -65189 -125257 -131342 -93107 -34148 8005 -94 102911 12720 -17112 -42535 -73772 -113715
7181a13715O1293n8164m7564M1964j5601j0212O8390M2015J010J4321p9963o393
$$ -113715 -52422 -110586 -158150 -116186 -131787 -141999 -73609 -31594 -30584 -16263 -96226 -102619
7169a02619M2746m7967j4279o2464K05737J6093j06212J23225M893p9430M9069
$$ -102619 -59873 -107840 -122119 -184583 21154 37247 -68965 54260 59153 -20277 28792
7158B8792m3566L0475K989l7271L1691k3863K248J05173l1073m9629n984O869
$$ 28792 -14774 15701 18690 -18581 13110 -10753 -8505 96668 65595 15966 9982 16851
7146A6851r5342p3543M711j9859J15433M4468L5048p038l4q6597L8192P1907j6496
$$ 16851 -78491 -152034 -147323 -167182 -51749 -7281 27767 20729 20695 -65902 -27710 44197 27701
7133B7701q3377j5068J38314O9179p5871r780J4974l0124j28458r952O0576K5956
$$ 27701 -55676 -70744 67570 136749 60878 51098 66072 35948 -92510 -102462 -41886 -15930
7121a5930Q404P5815K4743m3182m0903j860q6331Q8995j39714m392N0676J5483
$$ -15930 -7526 68289 93032 49850 8947 7087 -79244 9751 -129963 -134355 -83679 -68196
7109f8196Q2252K5003j00955K2032J5579K2771j4053L4451N0500m1588Q5o4354
$$ -68196 14056 39059 -61896 -39864 -24285 -1514 -15567 18884 69384 27796 27881 -36473
7097c6473J18576j00789k6529q9022K5220M8815M4330m1856K9526M0863O2066
$$ -36473 82103 -18686 -45215 -134237 -109017 -60202 -15872 -57728 -28202 12661 74727
7086G4727l1079j05973Q4323k0800l957j235r3416n6822K7623Q3990O0851o9366
$$ 74727 43648 -62325 21998 1198 -2759 -3994 -97410 -154232 -126609 -42619 18232 -51134
7074e1134j3133J2544M736n5067N217J05931L0378N2576O8622j25321p4119N7895
$$ -51134 -64267 -51723 -46987 -102054 -96837 9094 39472 92048 160670 35349 -38770 19125
7062A9125Q6598Q1380M1842J5107r8681n6528M3545J5850j00812N2084L1465L7366
$$ 19125 105723 187103 228945 244052 145371 88843 132388 148238 47426 99510 130975 168341
7050A68341m4288l1612k0863m6435L1945R5823j4694n7609j285j8488j8422Q1642
$$ 168341 124053 92441 71578 25143 57088 152911 138217 80608 79323 60835 42413 124055
7038A24055j26296j04803Q4478N6001o1627K1383Q929m2255J3466K0673p050K4230
$$ 124055 -2241 -107044 -22566 33435 -28192 -6809 2120 -40135 -26669 -5996 -13046 11184
7026A1184k3953N4619J43334M9846n2313j4638q3507j14883J9113l6481K04885
$$ 11184 -12769 41850 185184 235030 182717 168079 84572 -30311 -11198 -47679 157206
7015A57206J60576j38200k8586O7391m9673o0831j5249j8406j00980L7800k4861
$$ 157206 317782 179582 150996 218387 168714 107883 92634 74228 -26752 11048 -13813
7004a3813k8151O2071j0599p4333K5475l7473O2086J7974o4780k3622p862J29501
$$ -13813 -41964 20107 9508 -64825 -39350 -76823 -14737 3237 -61543 -85165 -93027 36474
6992C6474L2793q731M3517j84197J8942R579m8321Q2008k2305J02698M0782L2980
$$ 36474 69267 60536 104053 -80144 -61202 -51623 -99944 -17936 -40241 62457 103239 136219
6980A36219r7858o2322R6370k4055q894k9210m1688P7111k7465j8596M6440L852
$$ 136219 38361 -23961 72409 48354 39460 10250 -31438 45673 18208 -388 46052 49904
6968D9904L678j5936j40640N1916J69552l0356p12Q8405j26539L458q883o076
$$ 49904 53582 37646 -102994 -51078 118474 88118 87406 175811 49272 52730 43847 37771
6956C7771O7848k6652J4621j19828j7382K4575R8092o8235n637k4144l2357J6250
$$ 37771 105619 78967 93588 -26240 -43622 -19047 79045 10810 5173 -18971 -51328 -35078
6944c5078Q0178j9920K0519J7911R781M3179q2974o0692q8722L7837R2126J15584
$$ -35078 45100 25180 45699 63610 73391 116570 33596 -27096 -115818 -77981 14145 129729
6932A29729K952j07414K5931k3742l2392j4124N7736m9805r4142R9142R3395M6239
$$ 129729 132681 25267 51198 27456 -4936 -19060 38676 -11129 -105271 -6129 87266 133505
6920A33505o0533L6002Q2934L6677j13355l41m6825R4544k7521m5627Q1358L8120
$$ 133505 72972 108974 191908 228585 115230 114889 68064 162608 135087 89460 170818 208938
6908B08938K6257j09285j2117o7116K0067p6761k2799P6841J7980k513o0574J59864
$$ 208938 235195 125910 113793 46677 66744 -10017 -32816 44025 62005 59492 -1082 158782
6896A58782n0005o3319P1134l2422k5341o1795N3540q6118q5915P662N0010k2683
$$ 158782 108777 45458 116592 84170 58829 -2966 50574 -35544 -121459 -113797 -63787 -86470
6884h6470K1243k699J71861K1206q4084R3432l1947m2066r0166R538M8872K3440
$$ -86470 -65227 -67926 103935 125141 41057 134489 102542 60476 -29690 -20152 28720 52160
6872E2160q5902L1175L5921o2069p421M7069j5229o7021L2674o4027J8428O8703
$$ 52160 -33742 -2567 33354 -28715 -36136 10933 -4296 -71317 -38643 -102670 -84242 -15539
6860a5539J2766M0293K5937j5547k4070M4039J1090O5106n9842L055O15j17529
$$ -15539 -2773 37520 63457 47910 23840 67879 78969 144075 84233 87288 87903 -29626
6848b9626L1760J03929J7735k7455p5515N4602o8424K1683j5490n3351Q3928M6830
$$ -29626 2134 106063 123798 96343 20828 75430 7006 28689 13199 -40152 43776 90606
6836I0606k2433J20409l887o0612J09154o3868m385p3113l9418j4859J8220L2954
$$ 90606 68173 188582 184695 124083 233237 169369 164984 91871 52453 37594 55814 88768
6824H8768O741N619J7010N7869N5275o7553k8455n0559K3192j1717N599J5625
$$ 88768 95509 101128 118138 176007 231282 163729 135274 84715 107907 96190 101789 117414
6812A17414p7501K186J07808m9383L8958m4441l4480M0653P8788j9788j22957
$$ 117414 39913 42099 149907 100524 139482 95041 60561 101214 180002 160214 37257
6801C7257L3745R8012J5270K5685K7271j28977M9501N5401j23572m2045P1764
$$ 37257 71002 169014 184284 209969 237240 108263 157764 213165 89593 47548 119312
6790A19312N0853O0576m3206n3653n5902J07190N4026O245K5795L4590q015L1351
$$ 119312 170165 230741 187535 133882 77980 185170 239196 245441 271236 305826 297811 329162
6778C29162j43401m0746L617o3817N1019O255o642j2126l3055K9512R3241O3424
$$ 329162 185761 145015 148632 84815 135834 142089 135447 123321 90266 119778 213019 276443
6766B76443j03414k9970O1640p698Q1464o3371L4627q2835n7937j7875m2736R3631
$$ 276443 173029 143059 204699 197001 278465 215094 249721 166886 108949 91074 48338 141969
6754A41969j1321k0266r5051O1581k0140J0944P8597p7182N65K7126o0854j3744
$$ 141969 130648 110382 15331 76912 56772 67716 146313 69131 69696 96822 35968 22224
6742B2224O0199k0244j9841K2363O8354K2175K8297p5831m4435Q5831Q2520P0387
$$ 22224 82423 62179 42338 64701 133055 155230 183527 107696 63261 149092 231612 301999
6730C01999l6468k5140k940k9601N6592n3539o2574L3328p0078L0152Q8614l7755
$$ 301999 265531 240391 237451 207850 264442 210903 148329 181657 111579 141731 230345 192590
6718A92590j1046L904N9124R859j3667p9685k4971N1998l6433J4464M2384j3617
$$ 192590 181544 185448 244572 254431 240764 161079 136108 188106 151673 166137 208521 194904
6706A94904K2434l0885n9481J19414J6662l6901M099K6024o6634k3777O6475J129
$$ 194904 217338 186453 126972 246386 263048 226147 230246 256270 189636 165859 232334 233463
6694B33463o5912l3108J09324J20538j00761J18231k3179j82851M3257J10263
$$ 233463 167551 134443 243767 364305 263544 381775 358596 175745 219002 329265
6684C29265p2546K2009Q7461o0260j486m5741P8745n988L8852N4925J23171j39954
$$ 329265 256719 278728 366189 305929 304443 258702 337447 331459 370311 425236 548407 408453
6672D08453j18255P5407P1007m9278M1553J01604L1277L309j1883j60660N4554
$$ 408453 290198 365605 436612 387334 428887 530491 561768 565077 553194 392534 447088
6661D47088J22181j05600l499n6792J150m117M6977N9345P6186o7933J09647M1625
$$ 447088 569269 463669 460170 403378 404528 400411 447388 506733 582919 514986 624633 666258
6649F66258j29803R4909J6038m9133j0411o977J7137o9149k5365Q3815O1834j02715
$$ 666258 536455 631364 647402 598269 587858 580881 598018 528869 503504 587319 649153 546438
6637E46438j4745J9992K8707J36249N6111l4314p8746O0119J35128j01755k7119
$$ 546438 531693 551685 580392 716641 772752 738438 659692 719811 854939 753184 726065
6626G26065R7769R226K2768j2105R045N2130o8124o7360J36633l1284Q6856J80434
$$ 726065 823834 833060 855828 843723 852768 904898 836774 769414 906047 874763 961619 1142053
6614A142053l8172K9606J69857j41254J6100J26819J8802Q0665J76204J46097
$$ 1142053 1103881 1133487 1303344 1162090 1178190 1305009 1323811 1404476 1580680 1726777
6604A726777J57103O1553O0587k7063l7287m3081j03182j16810p7471l5924o3186
$$ 1726777 1883880 1945433 2006020 1978957 1941670 1898589 1795407 1678597 1601126 1565202 1502016
6593A502016m2899o6026L4357K8232J76357Q8724L6432q762K18136K02246j2699
$$ 1502016 1459117 1393091 1427448 1455680 1632037 1720761 1757193 1748431 1966567 2168813 2156114
6582B156114L6953Q4125J90026K66156K65292K55550k4208j16390r1963j60362
$$ 2156114 2193067 2277192 2467218 2733374 2998666 3254216 3230008 3113618 3021655 2861293
6572B861293l01104k72153j65144k05687j94944r6527j8574p758o2413k1221k653
$$ 2861293 2560189 2288036 2122892 1917205 1722261 1625734 1607160 1599402 1536989 1515768 1513115
6561A513115Q5377l5340k4675L185O7866J79445J7493J69149Q8248O6060j2939
$$ 1513115 1598492 1563152 1538477 1541662 1609528 1788973 1806466 1975615 2063863 2129923 2116984
6550B116984R0823n804k13731j27003r1274l9040j39736m6575K7180l4764o2004
$$ 2116984 2207807 2202003 1988272 1861269 1769995 1730955 1591219 1544644 1571824 1537060 1475056
6539A475056q4463J30017o3030p0846o5864k7489J14660j10664l0744L9862Q853
$$ 1475056 1390593 1520610 1457580 1386734 1320870 1293381 1408041 1297377 1266633 1306495 1315348
6528A315348q6986J23976l2976m6194k8258K8179P2272N3588O5572n2113o2093
$$ 1315348 1228362 1352338 1319362 1273168 1244910 1273089 1345361 1398949 1464521 1412408 1350315
6517A350315O8766k2750r8917j01997J26565q0232n3858J66815J14139m8005q7824
$$ 1350315 1419081 1396331 1297414 1195417 1321982 1241750 1187892 1354707 1468846 1420841 1333017
6506A333017M9299L0346M1010r4211N9111J3690M6931Q3202j6169j00192o9239
$$ 1333017 1382316 1412662 1453672 1359461 1418572 1432262 1479193 1562395 1546226 1446034 1376795
6495A376795j6218l8373j0049M4315j9343J11605J54150o7332q7922n802m5434
$$ 1376795 1360577 1322204 1312155 1356470 1337127 1448732 1602882 1535550 1447628 1441826 1396392
6484A396392o1475n921O4181n7605k5809K1676L0915o838L2018K5412p3073j67244
$$ 1396392 1334917 1328996 1393177 1335572 1309763 1331439 1362354 1355516 1387534 1412946 1339873 1172629
6472A172629k1991j3664N0241P1536N247J4079R0438m896J3376j0333p3074J08376
$$ 1172629 1150638 1136974 1187215 1258751 1263998 1278077 1368515 1363619 1376995 1366662 1293588 1401964
6460A401964o2529P6760P2226K5363K6089n400L5249m0186K8724q1605K7293L8812
$$ 1401964 1339435 1416195 1488421 1513784 1539873 1534473 1569722 1529536 1558260 1476655 1503948 1542760
6448A542760P0564k5198l3422K9722j7639J30169N2138l1369J02255Q002N3208
$$ 1542760 1613324 1588126 1554704 1584426 1566787 1696956 1749094 1717725 1819980 1827982 1881190
6437A881190N1161K7734P0549K803J1539J14432J42095p5832O6332L7532r2456
$$ 1881190 1932351 1960085 2030634 2033437 2044976 2159408 2301503 2225671 2292003 2329535 2237079
6426B237079K9765L4032J68924J53583J11801O5409N2260J22382L3019m979j25762
$$ 2237079 2266844 2300876 2469800 2623383 2735184 2800593 2852853 2975235 3008254 3003275 2877513
6415B877513k7295K630N4585m7402k3640P7698M3354n733k4053O2469P3245Q4512
$$ 2877513 2850218 2852848 2907433 2860031 2836391 2914089 2957443 2951710 2927657 2990126 3063371 3147883
6403C147883J01034P1974J19209N0772J02802K36796J65277K48361J75249N9965
$$ 3147883 3248917 3320891 3440100 3490872 3593674 3830470 3995747 4244108 4419357 4479322
6393D479322K00663m6804r3946k61193k37693r0042p3754j38564r4510m1526J35958
$$ 4479322 4679985 4633181 4539235 4278042 4040349 3950307 3876553 3737989 3643479 3601953 3737911
6382C737911L6058L4709N7486l8489J33922K2380P6318J51953J66227R5777J77933
$$ 3737911 3773969 3808678 3866164 3827675 3961597 3983977 4060295 4212248 4378475 4474252 4652185
6371D652185J83201J79020J65318J33019M2270R6222L1729j01796R283L5711J21337
$$ 4652185 4835386 5014406 5179724 5312743 5355013 5451235 5482964 5381168 5390451 5426162 5547499
6360E547499R2691J03442P5935Q1154O9276N1307K14595K08450J76909P7856K99113
$$ 5547499 5640190 5743632 5819567 5900721 5969997 6021304 6235899 6444349 6621258 6699114 6998227
6349F998227K23763K03488K67696K37007M92710L34515L98688M20262N07220O12729
$$ 6998227 7221990 7425478 7693174 7930181 8422891 8757406 9156094 9576356 10083576 10696305
6339A0696305O82727Q54009R18923J104022J216794J581783K047951K390988K743366
$$ 10696305 11379032 12233041 13151964 14255986 15472780 17054563 19102514 21493502 24236868
6330B4236868L142054K750014J129640j617307l021266k715220j796474q78793
$$ 24236868 27378922 30128936 31258576 29641269 26620003 23904783 22108309 21229516
6322B1229516k4043N31140J053790J356702J909488K281250J893201Q32665k30167
$$ 21229516 21205473 21736613 22790403 24147105 26056593 28337843 30231044 31063709 30833542
6313C0833542r8288P03401J539927K050676J795327L14026j696261k789018k692253
$$ 30833542 30735254 31438655 32978582 35029258 36824585 37138611 35442350 32653332 29961079
6304B9961079j648603o77599K94623R58386R50356n4518j579558j893754j330790
$$ 29961079 28312476 27634877 27929500 28887886 29838242 29783724 28204166 26310412 24979622
6295B4979622n76745J90914J124688J675923K211970K508172K627862J633973
$$ 24979622 24402877 24593791 25718479 27394402 29606372 32114544 34742406 36376379
6287C6376379j214438l860824m413988l688494k808879j960607j178148j125971
$$ 36376379 35161941 31301117 26887129 23198635 20389756 18429149 17251001 16125030
6279A6125030q77507p09259m51340m81044l76949k04610j73453l1641K8154p1992
$$ 16125030 15247523 14538264 14086924 13605880 13228931 13024321 12850868 12819227 12847381 12775389
6269A2775389j24879l35276k64303j65766j20054O9571R5149L6006M9352N1456
$$ 12775389 12650510 12315234 12050931 11885165 11765111 11834682 11929831 11965837 12015189 12066645
6259A2066645J1965J09518J01840M254K19872K04255J53282J95673L19874L07891
$$ 12066645 12078610 12188128 12289968 12294222 12514094 12718349 12871631 13067304 13387178 13695069
6249A3695069Q9650J47907J50708K73019K65839K01194L78204L74510L00871K19945
$$ 13695069 13784719 13932626 14083334 14356353 14622192 14823386 15201590 15576100 15876971 16096916
6239A6096916K27842J85118J97241K36814K77027L34462L26988M57156L88314
$$ 16096916 16324758 16509876 16707117 16943931 17220958 17555420 17882408 18339564 18727878
6230A8727878N10652M43106M46302M74176N60941O55712O96361P76226Q19708
$$ 18727878 19238530 19681636 20127938 20602114 21163055 21818767 22515128 23291354 24111062
6221B4111062P65236Q48720P49518Q81827Q32971J055478J138271J297353J383106
$$ 24111062 24876298 25725018 26474536 27356363 28189334 29244812 30383083 31680436 33063542
6212C3063542J652208J963591K324029K809180L459873M204120M984360N894060
$$ 33063542 34715750 36679341 39003370 41812550 45272423 49476543 54460903 60354963
6204F0354963O757383O960777N015460j5777m861948o180293n137275l420276
$$ 60354963 67112346 74073123 79088583 79072806 74210858 68030565 62893290 59473014
6196E9473014j499538L49772J652249K681284L656635M718031N009181L738377
$$ 59473014 57973476 58323248 59975497 62656781 66313416 71031447 76040628 79779005
6188G9779005J129565l10829L19624K122859L852112M533746K950738r03107m777148
$$ 79779005 80908570 80597741 80917365 83040224 86892336 91426082 94376820 93473713 88696565
6179H8696565o010616n055672k896751p66553J170349K133539J013519j848878
$$ 88696565 82685949 77630277 74733526 73966973 75137322 77270861 78284380 76435502
6171G6435502m062616l678610k306974l67848J453226L148590M546293N737386
$$ 76435502 72372886 68694276 66387302 66019454 67472680 70621270 75167563 80904949
6163H0904949O532534O109256K723570l420509p541729p748450n864295l538450
$$ 80904949 87437483 93546739 96270309 92849800 85308071 77559621 71695326 68156876
6155F8156876j588467J96240J350141J934372J741806Q84162r12026k740660l939510
$$ 68156876 66568409 66764649 68114790 70049162 71790968 72675130 71763104 69022444 65082934
6146F5082934m284065l910576l323600k603992k094536j697054j117266n28174
$$ 65082934 60798869 56888293 53564693 50960701 48866165 47169111 46051845 45523671
6138D5523671j33427M50256Q35237J176798J807268K277358L053781L744453M646569
$$ 45523671 45390244 45840500 46675737 47852535 49659803 51937161 54990942 58735395 63381964
6129F3381964N738488O471308P596453Q285377Q227297O682847L052029k405157
$$ 63381964 69120452 75591760 83188213 91473590 99700887 106383734 109435763 107030606
6121A07030606p825984j0806299j0951114r264392p012384n302932l991065l093075
$$ 107030606 99204622 88398323 77447209 68182817 61170433 55867501 51876436 48783361
6113D8783361k488301k051291j470494j082106o45769l06644J39699O63060J092114
$$ 48783361 46295060 44243769 42773275 41691169 41045400 40738756 40878455 41541515 42633629
6104D2633629J617345K190651K814664L475833L945771M074088L298407J370100
$$ 42633629 44250974 46441625 49256289 52732122 56677893 60751981 64050388 65420488
6096F5420488j432031m062491n864277o149108n379157m569919l623899l001667
$$ 65420488 63988457 59925966 54061689 47912581 42533424 37963505 34339606 31337939
6088C1337939k544860k204852j908130j683702j581745j267588r75278j053853
$$ 31337939 28793079 26588227 24680097 22996395 21414650 20147062 19171784 18117931
6080A8117931q75006q23710p12902o94255n27687n75853n92615l67327l66769
$$ 18117931 17242925 16419215 15706313 15012058 14484371 13908518 13315903 12948576 12581807
6071A2581807l64853l00604m57523m59164m89342m90168l43715k69046l10139
$$ 12581807 12216954 11916350 11458827 10999663 10510321 10020153 9676438 9407392 9097253
6062I097253l86117l67125k7211n9101l18316j12677k09695j88995j82948k54095
$$ 9097253 8711136 8344011 8316800 8257699 7939383 7826706 7617011 7428016 7245068 6990973
6052F990973j63775j49562k05505k15108j37135r6806j74475j11359j00746K1490
$$ 6990973 6827198 6677636 6472131 6257023 6119888 6023082 5848607 5737248 5636502 5657992
6042E657992j22242m8398p3597j21211q2260l7328k1337o5763k836k7064m2107
$$ 5657992 5535750 5487352 5413755 5292544 5210284 5172956 5151619 5085856 5083020 5055956 5013849
6031E013849r2052p2560r5105q7146j01213O6768o7460j12659j5013n5004J10319
$$ 5013849 4921797 4849237 4754132 4666986 4565773 4632541 4565081 4452422 4437409 4382405 4492724
6020D492724k8687l3429p2961Q9837n837p7013p830k24J13542J7850r6997o2718
$$ 4492724 4464037 4430608 4357647 4447484 4441647 4364634 4356804 4356580 4470122 4487972 4390975 4328257
6008D328257j7779j5899j87705j80868N2142n4467j5309j4836J42384J098p2608
$$ 4328257 4310478 4294579 4106874 3926006 3978148 3923681 3908372 3893536 4035920 4037018 3964410
5997C964410Q4014p0157l4366n6215m1972J7973P0623p026R868m0441J20908J07735
$$ 3964410 4048424 3978267 3943901 3887686 3845714 3863687 3934310 3927284 3937152 3896711 4017619 4125354
5985D125354q3518q4486o5836N735Q9493p0308j32402M1805J41589O5499k2980
$$ 4125354 4041836 3957350 3891514 3897249 3986742 3916434 3784032 3825837 3967426 4032925 4009945
5974D009945L5962j02300l6091r281m6431j59293O0380k0004l5160n0248o7607
$$ 4009945 4045907 3943607 3907516 3898235 3851804 3692511 3752891 3732887 3697727 3647479 3579872
5963C579872J9743p3703p0242L6505O3595r5342J6941l896q493K8635J6132k5181
$$ 3579872 3599615 3525912 3455670 3492175 3555770 3460428 3477369 3473473 3464980 3493615 3509747 3484566
5951C484566p7101Q0986J26619K4696k5056R778j15111Q4124o8472P7161R7811
$$ 3484566 3407465 3488451 3615070 3639766 3614710 3624488 3509377 3593501 3525029 3602190 3700001
5940C700001n3732k1859M644L5951n3680q9471k5265N8176J8404j31696N1836
$$ 3700001 3646269 3624410 3629054 3665005 3611325 3521854 3496589 3554765 3573169 3441473 3493309
5929C493309N2876K8449m0195M0167N100N4000N0680j2771L7599j2631J542M0653
$$ 3493309 3546185 3574634 3534439 3574606 3579706 3633706 3684386 3671615 3709214 3696583 3698125 3738778
5917C738778M7538q9189M1760J43618m4758m0013J4509j6653m7988M7505q57O8253
$$ 3738778 3786316 3697127 3738887 3882505 3837747 3797734 3812243 3795590 3747602 3795107 3794250 3862503
5905C862503Q0534l0843l4251J13127M4361N0764J26326M6496o1293l8717O0887
$$ 3862503 3943037 3912194 3877943 3991070 4035431 4086195 4212521 4259017 4197724 4159007 4219894
5894D219894j13978N0492K8929J48692k2718o2991Q8073O3419R6792P4250J9292
$$ 4219894 4105916 4156408 4185337 4334029 4311311 4248320 4336393 4399812 4496604 4570854 4590146
5883D590146Q6930j0777K13338J46760o2157K163J07385J34904K2691j8826R6273
$$ 4590146 4677076 4666299 4879637 5026397 4964240 4966403 5073788 5208692 5231383 5212557 5308830
5872E308830J69026J76037Q1831J55965k9350O977Q9849J38038J49571J98826
$$ 5308830 5477856 5653893 5735724 5891689 5862339 5869316 5959165 6097203 6246774 6445600
5862F445600J41238K45342J52107J50899R9450J60862Q239m9437j58533o5212
$$ 6445600 6586838 6832180 6984287 7135186 7234636 7395498 7403737 7354300 7195767 7130555
5852G130555M5804l4707k3797K50879K04899K38586K02289J91210J54003J96548
$$ 7130555 7176359 7141652 7117855 7368734 7573633 7812219 8014508 8205718 8359721 8556269
5842H556269K17396J98686J65278O2804K06341K17259L50863J28552L04993L66812
$$ 8556269 8773665 8972351 9137629 9200433 9406774 9624033 9974896 10103448 10408441 10775253
5832A0775253J79048R7821l1832j63110l0143J029J37315o9799J2849J20643K00569
$$ 10775253 10954301 11052122 11020290 10857180 10827037 10828066 10965381 10895582 10908431 11029074 11229643
5821A1229643K3086J15445K81251J51588J84037K44086K53262L37103L12435K61800
$$ 11229643 11252729 11368174 11649425 11801013 11985050 12229136 12482398 12819501 13131936 13393736
5811A3393736K12988K70333M70463N20405K74741L88547L02329K63577K04556
$$ 13393736 13606724 13877057 14347520 14867925 15142666 15531213 15833542 16097119 16301675
5802A6301675J86836K32420K12145N03042N16809L54093N48413O80213P00290
$$ 16301675 16488511 16720931 16933076 17436118 17952927 18307020 18855433 19535646 20235936
5793B0235936P46839P84068P14651O76401R25616J010157J137506J304439J616599
$$ 20235936 20982775 21766843 22481494 23157895 24083511 25093668 26231174 27535613 29152212
5784B9152212J948846K046219K477832K916565L502966L948984L090043Q18723
$$ 29152212 31101058 33147277 35625109 38541674 42044640 45993624 49083667 49902390
5776D9902390j928896k855810k067007p84505L52084J286661J613498K136306
$$ 49902390 47973494 45117684 43050677 42266172 42618256 43904917 45518415 47654721
5768D7654721K693489K955670K884541J539104j53042q44289k83995Q16379K111714
$$ 47654721 50348210 53303880 56188421 57727525 57574483 56730194 56446199 57262578 59374292
5759E9374292L201730L679723J805473j426611l375137l529498k429837q45984
$$ 59374292 62576022 66255745 68061218 66634607 63259470 59729972 57300135 56454151
5751E6454151M71117J014262L95460p41031r36296j71326R21255J991028K980333
$$ 56454151 56925268 57939530 58334990 57593959 56657663 56486337 57407592 59398620 62378953
5742F2378953L506319L134923K843564L492771M005086L697946J288253j263236
$$ 62378953 65885272 69020195 71863759 75356530 79361616 83059562 84347815 83084579
5734H3084579l033591m108787l278362j783951j110745j415783r50456o63983
$$ 83084579 80050988 75942201 72663839 70879888 69769143 68353360 67402904 66738921
5726F6738921l98537M18027J424534K611490L612119M569029N627513O380387
$$ 66738921 66340384 66758411 68182945 70794435 74406554 78975583 84603096 90983483
5718I0983483O526640N884990L884251J221289q45726k042951l169503m199584
$$ 90983483 97510123 103395113 107279364 108500653 107654927 105611976 102442473 98242889
5710I8242889l651406k267164k286782l695555l903660l036667j764144n17071
$$ 98242889 94591483 92324319 90037537 86341982 82438322 79401655 77637511 77120440
5702G7120440M65907J058738J829382K723971L492327M569206N762770P182142
$$ 77120440 77586347 78645085 80474467 83198438 86690765 91259971 97022741 104204883
5694A04204883Q875425J0145915J0856474R727858M811531k277652p865040j0172387
$$ 104204883 113080308 123226223 134082697 143810555 148622086 146344434 138479394 128307007
5686A28307007r663072p392799m764546k219882l2940J921019L881918O052542
$$ 128307007 118643935 111251136 106486590 104266708 104233768 106154787 110036705 116089247
5678A16089247Q395404J1449004J4851149J8152510K2435340K5136531K0530503
$$ 116089247 124484651 135933655 150784804 168937314 191372654 216509185 237039688
5671B37039688J595093k2075392k9515168k5104049j7630969j0549062n820521
$$ 237039688 238634781 216559389 187044221 161940172 144309203 133760141 127939620
5664A27939620l670399l811333m978117n940388n852027m877463l198259j252525
$$ 127939620 124269221 120457888 115479771 109539383 103687356 98809893 95611634 94359109
5656I4359109M41177J002018l43311k287787k420014j874834k260340l993380
$$ 94359109 94800286 95802304 95458993 93171206 90751192 88876358 86616018 82622638
5648H2622638m759520m188695l475634k501662j721896j022884n00826J3506L20294
$$ 82622638 77863118 73674423 70198789 67697127 65975231 64952347 64451521 64465027 64785321
5639F4785321M61773R62903J498260K142230K616545K777491K905460K841759
$$ 64785321 65247094 66209997 67708257 69850487 72467032 75244523 78149983 80991742
5631H0991742J974688K428982L397496L148493J761974Q97127J130617K494938
$$ 80991742 82966430 85395412 88792908 91941401 93703375 94600502 95731119 98226057
5623I8226057M713630O697165P044850L970045k057876p526100r054761p421152
$$ 98226057 102939687 109636852 116681702 120651747 118593871 111067771 102013010 94591858
5615I4591858m767407k266190J3817J534401K951478M423368N064318M794742
$$ 94591858 89824451 87558261 87572078 89106479 92057957 96481325 101545643 106340385
5607A06340385K345259k80458j143917r28743R18195L098285M984715N369994
$$ 106340385 108685644 108405186 107261269 106332526 107250721 110349006 115333721 120703715
5599A20703715K894750j654994n707553o427568m416252j688144O85161J295796
$$ 120703715 123598465 121943471 116235918 109808350 105392098 103703954 104389115 105684911
5591A05684911l74587k879718l139416j823329j57363J214468J885925K505575
$$ 105684911 105310324 102430606 99291190 97467861 97310498 98524966 100410891 102916466
5583A02916466L446768M578827N836501O130739L687194j487427o216430p409105
$$ 102916466 106363234 110942061 116778562 122909301 126596495 125109068 118892638 111483533
5575A11483533o289570m290957j951282m82524m2235m74K48923P10015N53803
$$ 111483533 105193963 100903006 98951724 98469200 98426965 98426491 98675414 99385429 99939232
5566I9939232m40973j330494j224213k29138P90145J939012K414454K212605J751154
$$ 99939232 99498259 98167765 96943552 96714414 97504559 99443571 101858025 104070630 105821784
5557A05821784J589855K569104L902912N238952N832076N000038K021900j022456
$$ 105821784 107411639 109980743 113883655 119122607 124954683 129954721 131976621 130954165
5549A30954165j723723k06610K433773M676435N220517L669452N94668k133689
$$ 130954165 129230442 129023832 131457605 136134040 141354557 145024009 145618677 143484988
5541A43484988m984442p762823r282846q729745o995324m840633k765518j138004
$$ 143484988 138500546 130737723 121454877 112725132 105729808 100889175 98123657 96985653
5533I6985653K16630J443373K504427L080926L015794K705330L440148M944508
$$ 96985653 97202283 98645656 101150083 104231009 107246803 109952133 113392281 118336789
5525A18336789O419146O756655N077902K114811q77127l147508n537052p151779
$$ 118336789 124755935 131512590 136590492 138705303 137828176 134680668 129143616 121991837
5517A21991837p022624n175164k889724r24795p26789k712242n043928n898578
$$ 121991837 114969213 109794049 106904325 105979530 105252741 102540499 97496571 91597993
5509I1597993m929188l202676j518454n85665m50226r50337j765080j657124o65491
$$ 91597993 86668805 83466129 81947675 81362010 80911784 79961447 78196367 76539243 75873752
5500G5873752M63584J262885N69932j558045l493547m056496l775102l286983
$$ 75873752 76337336 77600221 78170153 76612108 73118561 69062065 65286963 61999980
5492F1999980l013304k696770k357372j728096j125940j260302j713754k151576
$$ 61999980 58986676 56289906 53932534 52204438 51078498 49818196 48104442 45952866
5484D5952866k414980k088657j791280j269887r74020r95409j471748k053467
$$ 45952866 43537886 41449229 39657949 38388062 37414042 36418633 34946885 32893418
5476C2893418k332084k246690j989728j613423j305304j028823r60503r39361
$$ 32893418 30561334 28314644 26324916 24711493 23406189 22377366 21416863 20477502
5468B0477502q16161q92380p93184p17945o30926m31375m16716m80415m51592
$$ 20477502 19661341 18768961 17975777 17257832 16626906 16195531 15778815 15298400 14846808
5459A4846808m41342k81437m16747m33276k68601k95270j79005l25614l02797
$$ 14846808 14405466 14124029 13707282 13274006 13005405 12710135 12531130 12205516 11902719
5450A1902719l17353k21295j83150k05043j46554j33275n5342P237j73579l0406
$$ 11902719 11585366 11364071 11180921 10975878 10829324 10696049 10640707 10647944 10474365 10443959
5440A0443959j685P422J83725J5964j09968k45259k31885k11320j13768j15424
$$ 10443959 10442274 10449696 10633421 10649385 10539417 10294158 10062273 9850953 9737185 9621761
5430I621761J2208J45361K73391K44064M48065N05639P14956O13444j40503j136739
$$ 9621761 9633969 9779330 10052721 10296785 10744850 11250489 11965445 12578889 12438386 11301647
5420A1301647j164635p54240o34131k06631r3999p7605K5098L1083p124N4791
$$ 11301647 10137012 9382772 8748641 8542010 8448011 8370406 8395504 8426587 8419463 8474254
5410H474254l679M2216M0061L5747Q7737N3949J42468L60375M70012L79861J35308
$$ 8474254 8470575 8512791 8552852 8588599 8676336 8730285 8872753 9233128 9703140 10083001 10218309
5399A0218309n55072q23024o50665m75294l80497k46151k01134k01504l26996
$$ 10218309 9663237 8840213 8189548 7714254 7333757 7087606 6886472 6684968 6357972
5390F357972j87571k08501j21925k5407o5485N4266m4097K7717l1836P6953J16146
$$ 6357972 6170401 5961900 5839975 5814568 5749083 5803349 5759252 5786969 5755133 5832086 5948232
5379E948232J45883J59418J21355R1408n6822k451N6999j81218j88483k85571
$$ 5948232 6094115 6253533 6374888 6466296 6409474 6407023 6464022 6282804 6094321 5808750
5369E808750j81234N2657L925n4619r0194j81886j88992p1535o1425n0936j17009
$$ 5808750 5627516 5680173 5684098 5629479 5539285 5357399 5168407 5096872 5035447 4984511 4867502
5358D867502K2601K7121R3377K3871j50541J14894P1615L4618m2750J95283Q2443
$$ 4867502 4890103 4917224 5010601 5034472 4883931 4998825 5070440 5105058 5062308 5257591 5340034
5347E340034N5436R0708J73457P8992L318Q9950k2831j73081l9791j63347Q868
$$ 5340034 5395470 5486178 5659635 5738627 5741945 5831895 5809064 5635983 5596192 5432845 5441713
5336E441713J06771l2775N3881K34445J78928J14922n7523m09469l91344l32681
$$ 5441713 5548484 5515709 5569590 5804035 5982963 6097885 6040362 5630893 5239549 4906868
5326D906868j60379q7025n5830l0964K8672j01490r2897k6648j41472M9832K8777
$$ 4906868 4746489 4659464 4603634 4572670 4601342 4499852 4406955 4380307 4238835 4288667 4317444
5315D317444l8544K7477Q6942J34365l4777N7981K8566j71757k19927j48910n0563
$$ 4317444 4278900 4306377 4393319 4527684 4492907 4550888 4579454 4407697 4187770 4038860 3988297
5304C988297o8045N4805J04321n3852K5232k6070Q283K3160J3671j2138K14177
$$ 3988297 3920252 3975057 4079378 4025526 4050758 4024688 4032971 4056131 4069802 4057664 4271841
5293D271841R883n1996J60847K4265L1383L4281Q9479o7452o7097L5076M1553
$$ 4271841 4281724 4229728 4390575 4414840 4446223 4480504 4569983 4502531 4435434 4470510 4512063
5282D512063m2248l2920n729j26585j32740m3276P214r7352m4141q2086l6292
$$ 4512063 4469815 4436895 4431166 4304581 4171841 4128565 4135779 4038427 3994286 3912200 3875908
5271C875908P8476n5614j21922R2858L325J06337m6554J7151K9506Q0520J34505
$$ 3875908 3954384 3898770 3776848 3869706 3873031 3979368 3932814 3949965 3979471 4059991 4194496
5260D194496L0163k1721l0879J28266J34250J76068M5150n7120r8565o7896q3654
$$ 4194496 4224659 4202938 4172059 4300325 4434575 4610643 4655793 4598673 4500108 4432212 4348558
5249D348558J34954Q0192j67145j2199l7608m3114p9012j13564L2643M246l5249
$$ 4348558 4483512 4563704 4396559 4384360 4346752 4303638 4224626 4111062 4143705 4147951 4112702
5238D112702m040N4637K3698P5900J2122k36405J7637k326J3626l4733q2552J5603
$$ 4112702 4108662 4163299 4186997 4262897 4275019 4038614 4056251 4053925 4067551 4032818 3950266 3965869
5226C965869J14060o4375J24272P8293k9823N2801J12723K33378O6359Q3064J87366
$$ 3965869 4079929 4015554 4139826 4218119 4188296 4241097 4353820 4587198 4653557 4736621 4923987
5215D923987l406K6704J0549k2591q8543R0723l5285k2696m3339N4836O345M9563
$$ 4923987 4920581 4947285 4957834 4935243 4846700 4937423 4902138 4879442 4836103 4890939 4897284 4946847
5203D946847L7167n7222R6912l916M8541J44855R5205K1317J5946Q7623O9787
$$ 4946847 4984014 4926792 5023704 5019788 5068329 5213184 5308389 5329706 5345652 5433275 5503062
5192E503062J14549J56566J86256J25997J25979J11288J9388L2536J40368J15962
$$ 5503062 5617611 5774177 5960433 6086430 6212409 6323697 6343085 6375621 6515989 6631951
5182F631951J19667J09071J34633J96718J50106J92221k0069K47961J56665J65384
$$ 6631951 6751618 6860689 6995322 7192040 7342146 7534367 7514298 7762259 7918924 8084308
5172H084308R9080J30109J82778J78083R0977J42117L23074L53618K98289L20623
$$ 8084308 8183388 8313497 8496275 8674358 8765335 8907452 9230526 9584144 9882433 10203056
5162A0203056K05762K40167K74492L44810L80518L06685K75801M97680M30815
$$ 10203056 10408818 10648985 10923477 11268287 11648805 11955490 12231291 12728971 13159786
5153A3159786N69986M69181L95610K85137L58490K55545L18199M22820O83025
$$ 13159786 13729772 14198953 14594563 14879700 15238190 15493735 15811934 16234754 16917779
5144A6917779N31274P05605P66390Q45552P70616J075521J297029J844624J988856
$$ 16917779 17449053 18154658 18921048 19766600 20537216 21612737 22909766 24754390 26743246
5135B6743246K339370K616751L367199L860653N023866O084476P879819R959379
$$ 26743246 29082616 31699367 35066566 38927219 43951085 50035561 57915380 67874759
5127F7874759J2876533J5235731J9878169K2576368J8919154j874642k5534361
$$ 67874759 80751292 95987023 115865192 138441560 157360714 155486072 129951711
5120A29951711k7531223k2137010j5382900r969694o929222n040021l695157k780518
$$ 129951711 102420488 80283478 64900578 54930884 48001662 42961641 39266484 36485966
5112C6485966k205320k090418j796678j226905n60566j42079P9870M1182o51558
$$ 36485966 34280646 32190228 30393550 29166645 28606079 28464000 28543870 28585052 27933494
5103B7933494j687713j592674j133393q59190j048751p74057p30384n48190n07299
$$ 27933494 26245781 24653107 23519714 22660524 21611773 20837716 20107332 19559142 19051843
5094A9051843k05820j73425J73800K40241K44592K95634J37693p2886k72283k29382
$$ 19051843 18846023 18672598 18846398 19086639 19331231 19626865 19764558 19691672 19419389 19190007
5084A9190007k42305j62159K31590L25804N20783L50068l5752n25745n15658l59811
$$ 19190007 18947702 18785543 19017133 19342937 19863720 20213788 20178036 19652291 19136633 18776822
5074A8776822M6068R7655J28419K14580L08452L38361M62157L87818L82618M33278
$$ 18776822 18822890 18920545 19048964 19263544 19571996 19910357 20372514 20760332 21142950 21576228
5064B1576228L94065J22017J84767L59325P35938Q33082Q42367P62907Q36897
$$ 21576228 21970293 22092310 22277077 22636402 23372340 24205422 25047789 25810696 26647593
5055B6647593O57443J020911R94112J223730J086107J223785J198470J389727
$$ 26647593 27305036 28325947 29320059 30543789 31629896 32853681 34052151 35441878
5047C5441878J322385J355961J237760J457240J501227J609259J823067K409610
$$ 35441878 36764263 38120224 39357984 40815224 42316451 43925710 45748777 48158387
5039D8158387K638622K821033J440924J67200J83804J103317K231789L711641
$$ 48158387 50797009 53618042 55058966 55226166 55409970 56513287 58745076 62456717
5031F2456717M280250N169334N871384P213655R029738J1402457J3733552J7689213
$$ 62456717 66736967 71906301 77777685 84991340 94021078 105423535 119157087 136846300
5023A36846300K2650829K9309326L4794237M4377167N2084196M7133769P579201
$$ 136846300 159497129 188806455 223600692 267977859 320062055 367195824 374775025
5016C74775025n4936903o9775468n8489052m2792366k7849498j7578152j1774074
$$ 374775025 319838122 250062654 191573602 148781236 120931738 103353586 91579512
5009I1579512q828910o943869n546647m895318m256376l426063k631055j554593
$$ 91579512 82750602 75806733 70260086 65364768 61108392 57682329 55051274 53496681
5001E3496681j122808j251517j210975r06014p64459p42764j299050j847292k494009
$$ 53496681 52373873 51122356 49911381 49005367 48240908 47498144 46199094 44351802 41857793
4992D1857793k864051k884945k482559k103767j740115j411405j126317r57570
$$ 41857793 38993742 36108797 33626238 31522471 29782356 28370951 27244634 26287064
4984B6287064r07309p19099o06114m86492l82495m31635m02079m42583j82291
$$ 26287064 25379755 24660656 24054542 23568050 23185555 22753920 22351841 21909258 21726967
4975B1726967N674o0982j94678j56384j53222K88459M99801N41315K64200q95912
$$ 21726967 21732641 21671659 21476981 21320597 21167375 21455834 21955635 22496950 22761150 21865238
4965B1865238j838432j557842j289791r49759o08163m62186n61250l24042l87885
$$ 21865238 20026806 18468964 17179173 16229414 15621251 15159065 14597815 14273773 13885888
4956A3885888k50096k85680k32180m07857l45776l04880k52561k59739k2851j49821
$$ 13885888 13635792 13350112 13117932 12710075 12364299 12059419 11806858 11547119 11524268 11374447
4946A1374447j60675p11r7376j1151j34480k35506r9585q5214j99254j31822n9090
$$ 11374447 11213772 11213061 11115685 11104534 10970054 10734548 10634963 10549749 10350495 10218673 10159583
4935A0159583j56778m6570k17162j49791l68213l1647j10348j18853k29841k16264
$$ 10159583 10002805 9956235 9739073 9589282 9221069 9189422 9079074 8960221 8730380 8514116
4925H514116j33917r1787q3003l4976Q1481R8428J21412J9091M1651k3156n0583
$$ 8514116 8380199 8288412 8205409 8170433 8251914 8350342 8471754 8490845 8532496 8509340 8458757
4914H458757R0522k3906k0560P7893O2315K1849N9129m990n4344R485J4259Q1905
$$ 8458757 8549279 8525373 8504813 8582706 8645021 8666870 8725999 8721009 8666665 8676150 8690409 8772314
4902H772314J35954J7433P1014J84140l9679k571P8761k3519N1709j18874n6210
$$ 8772314 8908268 8925701 8996715 9180855 9141176 9138605 9217366 9193847 9245556 9126682 9070472
4891I070472L3927j9186K6368R5061J52087K37803K31839R0355K37852K04651
$$ 9070472 9104399 9085213 9111581 9206642 9358729 9596532 9828371 9918726 10156578 10361229
4881A0361229K46222K14793J83604L77324L34697L53624L64882K76780Q0899M5862
$$ 10361229 10607451 10822244 11005848 11383172 11717869 12071493 12436375 12713155 12794054 12839916
4871A2839916P2746J58916J38966J32806K47338L01004J69519M05620L22430K59495
$$ 12839916 12912662 13071578 13210544 13343350 13590688 13891692 14061211 14466831 14789261 15048756
4861A5048756L27894M00630N29016L61518M16076L47433K91283L91566N52691
$$ 15048756 15376650 15777280 16306296 16667814 17083890 17431323 17722606 18114172 18666863
4852A8666863P45349O44968O16806Q40736Q16142R08053J206242J340287J451297
$$ 18666863 19412212 20057180 20673986 21514722 22330864 23238917 24445159 25785446 27236743
4843B7236743J568517J560595J773383J735444J837836J929464K097649K197791
$$ 27236743 28805260 30365855 32139238 33874682 35712518 37641982 39739631 41937422
4835D1937422K129581K048999J859829J565460J057502Q22652N78757M29373K88105
$$ 41937422 44067003 46116002 47975831 49541291 50598793 51421445 52000202 52429575 52717680
4826E2717680R3432o046r4757j65977N822K88433M39515O09626J049579J497974
$$ 52717680 52811112 52805066 52710309 52544332 52550154 52838587 53278102 53887728 54937307 56435281
4816E6435281J757192K151916K374973K744806K807623K981960K969743L036974
$$ 56435281 58192473 60344389 62719362 65464168 68271791 71253751 74223494 77260468
4808G7260468K846582K656656K147106J195357J44460r97416j718117k007029
$$ 77260468 80107050 82763706 84910812 86106169 86250629 85253213 83535096 81528067
4800H1528067k344363k440778k554614k744002l062880k757093k366655j870468
$$ 81528067 79183704 76742926 74188312 71444310 68381430 65624337 63257682 61387214
4792F1387214j258458p84489j18330K78574M85195J033908J500996J796924K117041
$$ 61387214 60128756 59344267 59225937 59504511 59989706 61023614 62524610 64321534 66438575
4783F6438575K449041K770199L012471K957725K796341K491521J695312R49194
$$ 66438575 68887616 71657815 74670286 77628011 80424352 82915873 84611185 85560379
4775H5560379J23378o36168j262946k236165k724975l061168l030631k957308
$$ 85560379 85683757 85047589 83784643 81548478 78823503 75762335 72731704 69774396
4767F9774396k867748k354505j824282j377369r92243o07502l73789L08292O18584
$$ 69774396 66906648 64552143 62727861 61350492 60358249 59750747 59376958 59685250 60303834
4758F0303834J095698J624756K131954K517015K606124K899584K665068K295337
$$ 60303834 61399532 63024288 65156242 67673257 70279381 73178965 75844033 78139370
4750G8139370J813456J498200J348379R80947L58204m60902j444965k318179k763704
$$ 78139370 79952826 81451026 82799405 83780352 84138556 83677654 82232689 79914510 77150806
4741G7150806l082121l076617k865178k634505k350977k152008j950533j702401
$$ 77150806 74068685 70992068 68126890 65492385 63141408 60989400 59038867 57336466
4733E7336466j248200r25704o78367l36045m4536K4967L3796M1553j29231k04754
$$ 57336466 56088266 55162562 54484195 54148150 54103614 54128581 54162377 54203930 54074699 53869945
4723E3869945n15567o48596q32163j080965j458304j873923k242001k476712k562066
$$ 53869945 53354378 52705782 51873619 50792654 49334350 47460427 45218426 42741714 40179648
4714D0179648k385517k095104k048366j921361j779657j691184j468878j539755
$$ 40179648 37794131 35699027 33650661 31729300 29949643 28258459 26789581 25249826
4706B5249826j368983j168679r79914r07444q01321p37903q04447j002761j007549
$$ 25249826 23880843 22712164 21732250 20824806 20023485 19285582 18481135 17478374 16470825
4697A6470825r75016q70993p35353n00580n28937n64321n20378m46616m32719
$$ 16470825 15495809 14624816 13889463 13388883 12859946 12295625 11775247 11328631 10895912
4688A0895912k89165l28074l69004k83047k07960k18402k13508j85920j89363
$$ 10895912 10606747 10278673 9909669 9626622 9418662 9200260 8986752 8800832 8611469
4679H611469j90119k07804l42096j92376n9301j67833j60471k19184j34304j91746
$$ 8611469 8421350 8213546 7871450 7679074 7619773 7451940 7291469 7072285 6937981 6746235
4669F746235j77736j52799j9828k06363j72348j62492n4403o9805k04553j11489
$$ 6746235 6568499 6415700 6395872 6189509 6017161 5854669 5800266 5730461 5525908 5414419
4659E414419k31172j11536j58477p8228p0834j23511k4011j62010O2462j25525
$$ 5414419 5183247 5071711 4913234 4835006 4764172 4640661 4616650 4454640 4517102 4391577
4649D391577j63961K0527r7050j27884r6589j07932K9717n6025j35378k0339J7177
$$ 4391577 4227616 4248143 4151093 4023209 3926620 3818688 3848405 3792380 3657002 3636663 3653840
4638C653840o5082j00911m9030O6382l1395l8266l0387j32779Q0278l7014o4865
$$ 3653840 3588758 3487847 3438817 3505199 3473804 3435538 3405151 3272372 3352650 3315636 3250771
4627C250771P1933o9990j09501l4583l9432k5563m7720L5470K921j60497k5044
$$ 3250771 3322704 3252714 3143213 3108630 3069198 3043635 2995915 3031385 3034306 2873809 2848765
4616B848765K5669J2163l9107o2164p2789k9705N9902o3911p3335j0362J4183
$$ 2848765 2874434 2886597 2847490 2785326 2712537 2682832 2742734 2678823 2605488 2595126 2609309
4605B609309k02689O2645R6642M0130L7454j05665n7751j23526j454R9260J6398
$$ 2609309 2406620 2469265 2565907 2606037 2643491 2537826 2480075 2356549 2355095 2454355 2470753
4594B470753q758q7255m025J17572k0736j57332K2365N6605k4273j1984j11635
$$ 2470753 2461995 2374740 2370715 2488287 2467551 2310219 2332584 2389189 2364916 2352932 2241297
4583B241297j13279k6937J27528n7179j21834L2286J8281N7928M9710o6340K292
$$ 2241297 2128018 2101081 2228609 2171430 2049596 2081882 2100163 2158091 2207801 2141461 2143753
4572B143753j1923o4484j7452M2630j3294P617J7732q0681n6836p9831R5917j6827
$$ 2143753 2131830 2067346 2049894 2092524 2079230 2086847 2104579 2023898 1967062 1887231 1983148 1966321
4560A966321j56245M1018m367K7153J8857J5423M9119k1990N679O6137p2770k8227
$$ 1966321 1810076 1851094 1846727 1873880 1892737 1908160 1957279 1935289 1940968 2007105 1934335 1906108
4548A906108n2258J7817J12601L3016k1374j62668r621L2379j51949l1706N5667
$$ 1906108 1853850 1871667 1984268 2017284 1995910 1833242 1823621 1856000 1704051 1672345 1728012
4537A728012J67307j2875r4982L8136j3935o9090Q6808L9575j59808M4145J07089
$$ 1728012 1895319 1882444 1787462 1825598 1811663 1742573 1829381 1868956 1709148 1753293 1860382
4526A860382O3806n8338l9858P0308N5595J30397m6570m3422k111J7904J6049
$$ 1860382 1924188 1865850 1825992 1896300 1951895 2082292 2035722 1992300 1990189 2008093 2024142
4515B024142N9879J3823j5271o5661q3555l4202l7603R032l3401m848L7062j19108
$$ 2024142 2084021 2097844 2082573 2016912 1933357 1899155 1861552 1870584 1837183 1832335 1869397 1750289
4503A750289L2797p202Q8708r960l2842j4059P4649J76722n4691j3389n4828O0969
$$ 1750289 1783086 1775884 1864592 1854632 1821790 1807731 1882380 2059102 2004411 1991022 1936194 1997163
4491A997163L0517m727Q7880O4649j7201n5038L2200k7625k8438J26198M2461
$$ 1997163 2027680 2022953 2110833 2175482 2158281 2103243 2135443 2107818 2079380 2205578 2248039
4480B248039r0109l0158J048N9594J10025J02486K3495L4612m88O526Q4705j60834
$$ 2248039 2157930 2127772 2128820 2188414 2298439 2400925 2424420 2459032 2458544 2465070 2549775 2388941
4468B388941j20564k1965N4409N2175M0053P6736K3907n3719j9470N3036O4741
$$ 2388941 2268377 2246412 2300821 2352996 2393049 2469785 2493692 2439973 2420503 2473539 2538280
4457B538280Q502R6012J16338J42734j8518j40111k2657O8984j4643O1335L5025
$$ 2538280 2546782 2642794 2759132 2901866 2883348 2743237 2720580 2789564 2774921 2836256 2871281
4446B871281J14376R2457L1654N9045J3797o0132N9665n5825m7735J8902q413
$$ 2871281 2985657 3078114 3109768 3168813 3182610 3122478 3182143 3126318 3078583 3097485 3089072
4435C089072k6894R7567K4749N7959m0735K0524l338M9091N7991k6588j5892j1
$$ 3089072 3062178 3159745 3184494 3242453 3201718 3222242 3218904 3267995 3325986 3299398 3283506 3283495
4423C283495Q3538J3354J1175R7355J27104K2328n0919M2451N108J19733N1479
$$ 3283495 3367033 3380387 3391562 3488917 3616021 3638349 3587430 3629881 3634989 3754722 3806201
4412C806201L5993K23639P2118p547L4886J3106J48114J61490K5182P8129l934
$$ 3806201 3842194 4065833 4137951 4130404 4165290 4178396 4326510 4488000 4513182 4591311 4587377
4401D587377k6768q6095K38020J00770N6741J05174J65283J91192J99179K88244
$$ 4587377 4560609 4474514 4712534 4813304 4870045 4975219 5140502 5331694 5530873 5819117
4391E819117M13456L97251L82161J13773j67694m36870l85329j04539l5850p4360
$$ 5819117 6232573 6629824 7011985 7125758 6958064 6521194 6135865 6031326 5995476 5921116
4381E921116o6207n905K6601k7222K0033k3534j22035n3941j70264k7591k6541
$$ 5921116 5854909 5849004 5875605 5848383 5868416 5844882 5722847 5668906 5498642 5471051 5444510
4370E444510l0698k8093L1598K4765p3047r1410L3874J05735R2538J1614J84441
$$ 5444510 5413812 5385719 5417317 5442082 5369035 5277625 5311499 5417234 5509772 5521386 5705827
4359E705827O5356P0162J02802M8870N6907Q0345K97725N6107P8566O8384P4339
$$ 5705827 5771183 5841345 5944147 5993017 6049924 6130269 6427994 6484101 6562667 6631051 6705390
4348F705390m46J853j96305j42732r8785j21872j27601j19535j32641p6788q5285
$$ 6705390 6704944 6706797 6510492 6367760 6268975 6147103 6019502 5899967 5767326 5690538 5605253
4337E605253j28049R789j09172j16794M5566k2561L8326Q3974L2895J9255J04729
$$ 5605253 5477204 5486993 5377821 5261027 5306593 5284032 5322358 5406332 5439227 5458482 5563211
4326E563211N0709j2773k5682o7780J20015n4027k9365m4910k28180j42200p1988
$$ 5563211 5613920 5601147 5575465 5507685 5627700 5573673 5544308 5499398 5271218 5129018 5057030
4315E057030j02597j54644r8569r5419m8930j28053n6556r5738m0301J06808M9226
$$ 5057030 4954433 4799789 4701220 4605801 4556871 4428818 4372262 4276524 4236223 4343031 4392257
4304D392257k0277l1219j54118j2034j1334j39620k5959l0532n9985j1613n396
$$ 4392257 4371980 4340761 4186643 4174609 4163275 4023655 3997696 3967164 3907179 3895566 3890170
4293C890170k2788j10438k3715K0627q0435l7250L1491L9662m2032r0267P8658
$$ 3890170 3867382 3756944 3733229 3753856 3673421 3636171 3667662 3707324 3665292 3575025 3653683
4282C653683M8276k1313P2930m3018j01729k8766M0094j25744O2121R2516q3985
$$ 3653683 3701959 3680646 3753576 3710558 3608829 3580063 3620157 3494413 3556534 3649050 3565065
4271C565065r494K7136l886O2982J88261k1646P436k2747j7683R7745n9833O7456
$$ 3565065 3555571 3582707 3578821 3641803 3830064 3808418 3815854 3793107 3775424 3873169 3813336 3880792
4259C880792l4607M665N7901P146N2348J12795j3649m3018R7181J24453k6986
$$ 3880792 3846185 3850850 3908751 3915897 3968245 4081040 4067391 4024373 4121554 4246007 4219021
4248D219021J25801J05513J25152k7947K1597O8828N1506J43558K09546J75855
$$ 4219021 4344822 4450335 4575487 4547540 4569137 4637965 4689471 4833029 5042575 5218430
4238E218430L5551J03603J68424K46231K20941K28125K68486M60245N30743M97780
$$ 5218430 5253981 5357584 5526008 5772239 5993180 6221305 6489791 6950036 7480779 7978559
4228G978559M26549K88801N03049M75032K89427P7823k28365l28005k52970k46950
$$ 7978559 8405108 8693909 9196958 9671990 9961417 10039240 9810875 9482870 9229900 8982950
4218H982950j17742j60497k24698l09670j92171j65988j72859k0988j15970j51786
$$ 8982950 8865208 8704711 8480013 8170343 7978172 7812184 7639325 7618337 7502367 7350581
4208G350581j61171j31024p6336r3970n7821m9191n20J28721N2374j5188K0353
$$ 7350581 7189410 7058386 6982050 6888080 6830259 6781068 6780548 6909269 6961643 6946455 6966808
4197F966808J82100J72430J5354J25852K0315J08708J56360J77274J06780R1781
$$ 6966808 7148908 7321338 7336692 7462544 7482859 7591567 7747927 7925201 8031981 8123762
4187H123762J41210O6611N9758k8409J11153J8359K1371Q9516M5129J49781K03513
$$ 8123762 8264972 8331583 8391341 8362932 8474085 8492444 8513815 8603331 8648460 8798241 9001754
4176I001754J10328K6794J24471R2859J28352Q6589J31165K41649m0136j2990
$$ 9001754 9112082 9138876 9263347 9356206 9484558 9571147 9702312 9943961 9903825 9890835
4166I890835J84822K24505J60952J94404J25629L6667K30943L66676J65498K10607
$$ 9890835 10075657 10300162 10461114 10655518 10781147 10817814 11048757 11415433 11580931 11791538
4156A1791538K85422K25584L02914L97246L89778M77276L84873M61525N56857
$$ 11791538 12076960 12302544 12605458 13002704 13392482 13869758 14254631 14716156 15273013
4147A5273013N65524O31269O31817N91634M83653M93634O67458K69833L59993
$$ 15273013 15838537 16469806 17101623 17693257 18176910 18670544 19338002 19607835 19967828
4138A9967828L44117L74668K95823L68203M54749N76392N07748Q08610O95754
$$ 19967828 20311945 20686613 20982436 21350639 21805388 22381780 22889528 23698138 24393892
4129B4393892Q39506R63407Q76039Q84571O03906N28842L91222O67901N25253
$$ 24393892 25233398 26196805 27072844 27957415 28561321 29090163 29481385 30149286 30674539
4120C0674539O46593O76928O91555O77080N91950N62336P23484O84731O07997
$$ 30674539 31321132 31998060 32689615 33366695 33958645 34520981 35244465 35929196 36537193
4111C6537193O49203O40288N13680L27299L75030O71177Q47775J196795J366994
$$ 36537193 37186396 37826684 38340364 38667663 39042693 39713870 40561645 41758440 43125434
4102D3125434J676180J730205J769191J422091Q84734L01143k465q1733m3611
$$ 43125434 44801614 46531819 48301010 49723101 50607835 50908978 50906513 50824780 50781169
4093E0781169K73005J92694K01296K30665K97448K65395L85019L69757M53398
$$ 50781169 51054174 51246868 51448164 51678829 51976277 52241672 52626691 52996448 53449846
4084E3449846N70010M86974K52991J14554j7887K5375K18150M82942J103774J415963
$$ 53449846 54019856 54506830 54759821 54874375 54856488 54881863 55100013 55582955 56686729 58102692
4074E8102692J716225K015905K193265J941292J526351J215080Q35104P53259
$$ 58102692 59818917 61834822 64028087 65969379 67495730 68710810 69545914 70299173
4066G0299173P95689Q78642O63837N09156L26102L50802J93375J67087L8190j92255
$$ 70299173 71094862 71973504 72637341 73146497 73472599 73823401 74016776 74183863 74222053 74029798
4056G4029798j72510k99472j01905K9367L3762K51572M07898N08376P05191O95712
$$ 74029798 73857288 73557816 73455911 73485278 73519040 73770612 74178510 74686886 75392077 76087789
4046G6087789L77144K8416l76653o40345q63899q45365n16803l17031l4803K12695
$$ 76087789 76464933 76493349 76116696 75476351 74612452 73767087 73250284 72933253 72898450 73111145
4036G3111145J85607J01558J20286K8953k40299k96535l37583l78559l20385l49677
$$ 73111145 73296752 73398310 73518596 73547549 73307250 73010715 72673132 72294573 71974188 71624511
4026G1624511m82845r04667j062591j182168j062674j004722j266291j877727
$$ 71624511 71141666 70236999 69174408 67992240 66929566 65924844 64658553 62780826
4018F2780826k168987k438426k224632j940533j523202p75227l79649r4644K9046
$$ 62780826 60611839 58173413 55948781 54008248 52485046 51709819 51330170 51235526 51264572
4009E1264572l8313M5643k60778m72878n04668m52735m84710p26474o32911n11472
$$ 51264572 51226259 51271902 51011124 50538246 50033578 49580843 49096133 48369659 47736748 47225276
3999D7225276o19330o11751n37424k57620o1388J32129p593l06525q10895j480558
$$ 47225276 46605946 45994195 45456771 45199151 45137763 45269892 45262299 44955774 44144879 42664321
3989D2664321j832177j762405j541259j254742r62592p15023m02721m03206n50798
$$ 42664321 40832144 39069739 37528480 36273738 35311146 34596123 34193402 33790196 33239398
3980C3239398n82451m59012n95241p43449p42221n45136n41659n90592m23347
$$ 33239398 32656947 32197935 31602694 30859245 30117024 29571888 29030229 28439637 28016290
3971B8016290l54853k60324k73034j86687j90809j25558j78245k53301k92753
$$ 28016290 27661437 27401113 27128079 26941392 26750583 26625025 26446780 26193479 25900726
3962B5900726l20644j88792j99852r448M7706L57007L23673K83113M9817k14615
$$ 25900726 25580082 25391290 25191438 25181990 25229696 25586703 25910376 26193489 26243306 26028691
3952B6028691l25607m74655p11610q19214r98525j009256j126128j211543j153878
$$ 26028691 25703084 25228429 24516819 23697605 22699080 21689824 20563696 19352153 18198275
3943A8198275r76568j055668j036900q39516p57381p12522o36702n72385m97790
$$ 18198275 17221707 16166039 15129139 14289623 13532242 12819720 12183018 11610633 11112843
3934A1112843m42793m22204m09253l51155m65827k90461l06337k64708l16164
$$ 11112843 10670050 10247846 9838593 9487438 9021611 8731150 8424813 8160105 7843941
3925G843941k30622j33367k35082k23865j77566r1399j42926j54587j24529j97981
$$ 7843941 7613319 7479952 7244870 7021005 6843439 6752040 6609114 6454527 6329998 6132017
3915F132017k01519o6228m7990k02633j99249r6044J9675o7750j08885k26278
$$ 6132017 5930498 5864270 5816280 5613647 5414398 5318354 5338029 5270279 5161394 4935116
3905D935116j67483p8222l777r1438o6860l4801n9789j27282j80768J01315o1542
$$ 4935116 4767633 4689411 4685634 4594196 4527336 4492535 4432746 4305464 4124696 4226011 4164469
3894D164469J9667j02059J1854l7256n3394k2253K9110k7980j7240j31400r4466
$$ 4164469 4184136 4082077 4093931 4056675 4003281 3981028 4010138 3982158 3964918 3833518 3739052
3883C739052n3205K8225n4511Q1954q5493q6368k8854K6949k773l6718p8062p7841
$$ 3739052 3685847 3714072 3659561 3741515 3656022 3569654 3540800 3567749 3564976 3528258 3450196 3372355
3871C372355p099R622m4160l7534N7733j42753k2743l0605k528k0991p3504J45432
$$ 3372355 3365256 3374878 3330718 3293184 3350917 3208164 3185421 3154816 3152288 3131297 3057793 3203225
3859C203225k0765m6868j0599n7283L8008J4591j02352j28420j10129k2161N9242
$$ 3203225 3182460 3135592 3124993 3067710 3105718 3120309 3017957 2889537 2779408 2757247 2816489
3848B816489J1958R4579j18616j532k2771p3855O9320J2658O584o2298q8137O6422
$$ 2816489 2828447 2923026 2804410 2802878 2780107 2706252 2775572 2788230 2794814 2732516 2644379 2710801
3836B710801M6102k2845J6429M3930K7174j33515j5329n6663m6939O3882j1942
$$ 2710801 2756903 2734058 2750487 2794417 2821591 2688076 2672747 2616084 2569145 2633027 2621085
3825B621085J14936k4685m6099j33788K2578J19669J31373R0246J759m6480r635
$$ 2621085 2736021 2711336 2665237 2531449 2554027 2673696 2805069 2895315 2897074 2850594 2840959
3814B840959n3889N2379m0801j0747N7748l9778m132J7328K0774o8950O8219J01037
$$ 2840959 2787070 2839449 2798648 2787901 2845649 2805871 2801739 2819067 2839841 2770891 2839110 2940147
3802B940147j2201R226k9889l7362m3744j09740N7167J08496r568r2925l862N836
$$ 2940147 2927946 2937172 2907283 2869921 2826177 2716437 2773604 2882100 2872532 2779607 2775745 2781581
3790B781581P161j5552j1379L853j0561n6813m9416M1331J6616k1684K6945l8693
$$ 2781581 2788742 2773190 2761811 2765664 2755103 2698290 2648874 2690205 2706821 2685137 2712082 2673389
3778B673389k3563m1076K8560J5563K4160j05021r4817J04030M5816j13743j12262
$$ 2673389 2649826 2608750 2637310 2652873 2677033 2572012 2477195 2581225 2627041 2513298 2401036
3767B401036Q762J43167o44o2958j2098J04241o2662j06625Q9405p6482J4366
$$ 2401036 2409798 2552965 2552321 2489363 2477265 2581506 2518844 2412219 2501624 2425142 2439508
3756B439508r3862p8081N8996K9993k4335N2721R3428M766L9356J0443j3208K6888
$$ 2439508 2345646 2267565 2326561 2356554 2332219 2384940 2478368 2483134 2522490 2532933 2519725 2546613
3744B546613L067l9844K6582o2648n3932m2136r899n5084Q4390J39772J8986j22274
$$ 2546613 2549680 2509836 2536418 2473770 2419838 2377702 2367803 2312719 2397109 2536881 2555867 2433593
3732B433593J9574j3407r2163P0571N211j50943m0188l2677q6381L3199j08154
$$ 2433593 2453167 2439760 2347597 2418168 2423379 2272436 2232248 2199571 2113190 2146389 2038235
3721B038235Q6997O3199K5051J39529j9178j55181K5233n7746J189L8681P8993
$$ 2038235 2125232 2188431 2213482 2353011 2333833 2178652 2203885 2146139 2147328 2186009 2265002
3710B265002o3089n2819l3250k4595L7895L4906l3581K8191Q73j3573n0432j16180
$$ 2265002 2201913 2149094 2115844 2091249 2129144 2164050 2130469 2158660 2159533 2145960 2095528 1979348
3698A979348k3976j8617L1977O277R6175q1517j73575K1843P348j8681L1880O4447
$$ 1979348 1955372 1936755 1968732 1975009 2071184 1989667 1816092 1837935 1845283 1826602 1858482 1922929
3686A922929k5406k967r1296o3697Q000M2605k2851k7686Q2099N041m0841q2699
$$ 1922929 1897523 1894556 1803260 1739563 1747563 1790168 1767317 1739631 1821730 1826771 1785930 1703231
3674A703231q154n8250N1042j2885k0761j2211q3032l2773P4596j3083K4655O8961
$$ 1703231 1695077 1636827 1687869 1674984 1654223 1642012 1558980 1526207 1600803 1587720 1612375 1681336
3662A681336J781L732P90J4105j11895n0688P1823l4638l7472J9728r2602J91536
$$ 1681336 1683117 1686849 1687639 1701744 1589849 1539161 1610984 1576346 1538874 1558602 1466000 1657536
3650A657536j5432N2585J6685l6355j0940R584n3962P265K8678Q2963L9114n2686
$$ 1657536 1642104 1694689 1711374 1675019 1664079 1673663 1619701 1626966 1655644 1738607 1777721 1725035
3638A725035O3745J0787J26790K7823P8662J09924K10063j3622p6815r6351j18043
$$ 1725035 1788780 1799567 1926357 1954180 2032842 2142766 2352829 2339207 2262392 2166041 2047998
3627B047998j83112l1986o4194m0562j5917m3529j14308r2773l7317M035l941
$$ 2047998 1864886 1832900 1768706 1728144 1712227 1668698 1554390 1461617 1424300 1428335 1424394
3616A424394L4483N3015Q2336O7308j00018l5454J32983O6887j4632J8253l5101
$$ 1424394 1458877 1511892 1594228 1661536 1561518 1526064 1659047 1725934 1711302 1729555 1694454
3605A694454p9556l2796M3457J13063K9891J753J3843q9796n9816m308P0260j1124
$$ 1694454 1614898 1582102 1625559 1738622 1768513 1770266 1784109 1694313 1634497 1630189 1700449 1689325
3593A689325j8778N5395r589l1190N0821J37300p3312r7047N5623L4234k1561
$$ 1689325 1670547 1725942 1716353 1685163 1735984 1873284 1799972 1702925 1758548 1792782 1771221
3582A771221n1213K7796K34831N5241J01107J22088N1599m0893N069J10433j36674
$$ 1771221 1720008 1747804 1982635 2037876 2138983 2261071 2312670 2271777 2276846 2387279 2250605
3571B250605o246l6916N999p2726k1898J33470l3055p110R3306n7654o8305J5072
$$ 2250605 2244359 2207443 2213442 2140716 2118818 2252288 2219233 2212123 2305429 2247775 2179470 2194542
3559B194542p3633o8136M0693P1453J35681P6580K6934O9891N4031N7108m4821
$$ 2194542 2120909 2052773 2093466 2164919 2300600 2377180 2404114 2474005 2528036 2585144 2540323
3548B540323n6983m4972q468O147l9585O4410J24385M7324l7734N379O2733l4181
$$ 2540323 2483340 2438368 2429900 2436047 2396462 2460872 2585257 2632581 2594847 2600226 2662959 2628778
3536B628778P8231Q7447N0684L3065Q957N167K1328M8645o5049L7138J05698k5079
$$ 2628778 2707009 2794456 2845140 2878205 2887162 2892329 2913657 2962302 2897253 2934391 3040089 3015010
3524C015010l1654Q1381n0585m5246L4032Q4902R3553p2347m581O4687M7138J8459
$$ 3015010 2983356 3064737 3014152 2968906 3002938 3087840 3181393 3109046 3104465 3169152 3216290 3234749
3512C234749l517J81655J66114M0213m6626N5992L5649J32496J63292J18983l0021
$$ 3234749 3231232 3412887 3579001 3619214 3572588 3628580 3664229 3796725 3960017 4079000 4048979
3501D048979O8407J87973M5491K09283K68825J18522K77593J55409K16474J41173
$$ 4048979 4117386 4305359 4350850 4560133 4828958 4947480 5225073 5380482 5596956 5738129
3491E738129J35477K11626J92076J04493Q940n5504k441J61864k5070p8494K1170
$$ 5738129 5873606 6085232 6277308 6381801 6390741 6335237 6332796 6494660 6469590 6391096 6412266
3480F412266j05764L0845j53528j49504k60956l83359k24482j90161j75851j92395
$$ 6412266 6306502 6337347 6183819 6034315 5773359 5390000 5165518 4975357 4799506 4607111
3470D607111j83539k96834m8410K5439j17400n4656k7170j11809j19930k18692
$$ 4607111 4423572 4126738 4078328 4103767 3986367 3931711 3904541 3792732 3672802 3454110
3460C454110k09430n8995l2225r6617r9674p8500R3402r2757q4952r7611N0189
$$ 3454110 3244680 3185685 3153460 3056843 2957169 2878669 2972071 2879314 2794362 2696751 2746940
3449B746940R4352j5718l1345j6000p7422M8638l0501j5359m1453L8190J18761
$$ 2746940 2841292 2825574 2794229 2778229 2700807 2749445 2718944 2703585 2662132 2700322 2819083
3438B819083K43165P5410Q6933J00089J39715P4294k2967N9964p1869j50670j78009
$$ 2819083 3062248 3137658 3224591 3324680 3464395 3538689 3515722 3575686 3503817 3353147 3175138
3427C175138k38541k42488j34036N2006r6779j12267k5472J59489Q1300j94029
$$ 3175138 2936597 2694109 2560073 2612079 2515300 2403033 2377561 2537050 2618350 2424321
3417B424321J09095J12477K8649J60884p3129k48540n6594J38807J22843k6567
$$ 2424321 2533416 2645893 2674542 2835426 2762297 2513757 2457163 2595970 2718813 2692246
3407B692246J19989J45964K30771K91119J05687l7999P5606l0262P9359J26037
$$ 2692246 2812235 2958199 3188970 3480089 3585776 3547777 3623383 3593121 3672480 3798517
3397C798517J8976j56335j20367l98671l35731j89290k28313j03457p5300P4055
$$ 3798517 3817493 3661158 3540791 3142120 2806389 2617099 2388786 2285329 2210029 2284084
3387B284084R9718K6136m3245J34592K34899O6457l833j03824m2323r0636J34683
$$ 2284084 2383802 2409938 2366693 2501285 2736184 2802641 2798808 2694984 2652661 2562025 2696708
3376B696708j3115m1571K5924j8786L8932q846l3258k6859P9069R5903J07205
$$ 2696708 2683593 2642022 2667946 2649160 2688092 2679246 2645988 2619129 2698198 2794101 2901306
3365B901306L8483N6079q4520k03404r3530n1233k25192j13491o1822j19390k0045
$$ 2901306 2939789 2995868 2911348 2707944 2614414 2563181 2337989 2224498 2162676 2043286 2023241
3354B023241J33060l1023R8841K52434K42451J16094q771j18390j5238p357j52516
$$ 2023241 2156301 2125278 2224119 2476553 2719004 2835098 2826327 2707937 2692699 2685342 2532826
3343B532826j59090j62152k71080j40298k07139j44618O8550L3096l5666l5839
$$ 2532826 2373736 2211584 1940504 1800206 1593067 1448449 1516999 1550095 1514429 1478590
3333A478590J51311k3510j1005j32900n2984j07107l0393Q7473p3815o9741j23023
$$ 1478590 1629901 1606391 1595386 1462486 1409502 1302395 1272002 1359475 1285660 1215919 1092896
3322A092896n3P4062p8935Q4188P5557Q5836J14248N731R365q7875l1655L4278
$$ 1092896 1092843 1166905 1087970 1172158 1247715 1333551 1447799 1453530 1462895 1375020 1343365 1377643
3310A377643j17963j15011m5180p3516j42278k0724J8802j1930q8597j5709n968
$$ 1377643 1259680 1144669 1099489 1025973 883695 862971 881773 869843 781246 765537 759569
3299G59569r6943m9920k7406L6085p7797M6612j488Q8303N3966l387m7755K5520
$$ 759569 662626 612706 585300 621385 543588 590200 588712 677015 730981 727594 679839 705359
3287G05359j35227N1958j5093k1325o5733j07682Q8872Q015n0374o0041L7243
$$ 705359 570132 622090 606997 585672 519939 412257 501129 509144 458770 398729 435972
3276D35972P4290M5583O5588P8702p7978j0780m9546o0773k4943J4237R8076K8486
$$ 435972 510262 555845 621433 700135 622157 611377 561831 501058 476115 490352 588428 616914
3264F16914j60514m1931P5622J58451K5833P6528L0923J515L1672k9482q2720
$$ 616914 456400 414469 490091 648542 674375 750903 781826 783341 815013 785531 702811
3253G02811N2313n537J2127O1352p8386Q8697o1324N2184P9206r605p8438L4518
$$ 702811 755124 749587 761714 823066 744680 833377 772053 824237 903443 893838 815400 849918
3241H49918Q0530J5800J24180Q9229J10388L765J7677J14773J7785q5034q2570
$$ 849918 930448 946248 1070428 1159657 1270045 1273810 1291487 1406260 1424045 1339011 1256441
3230A256441p446R2876j978p6895o4218M7103L968R7296j2229J7651R497l410
$$ 1256441 1248995 1341871 1339893 1262998 1198780 1245883 1249851 1347147 1334918 1352569 1362066 1358656
3218A358656J16751L2122Q4218J9263N3387P2761L5647J93669J04622J50719P9305
$$ 1358656 1475407 1507529 1591747 1611010 1664397 1737158 1772805 1966474 2071096 2221815 2301120
3207B301120m5244J19895J64875l7825Q0745Q4817n2110q7196j48051k12515j19573
$$ 2301120 2255876 2375771 2540646 2502821 2583566 2668383 2616273 2529077 2381026 2168511 2048938
3196B048938j2074j77754K0719N0528m5970P5345J21312K783O4573J13128J18818
$$ 2048938 2036864 1859110 1879829 1930357 1884387 1959732 2081044 2083827 2148400 2261528 2380346
3185B380346K3462n4048J92045O0437J38909J14397N330J65763K34521Q0307j8453
$$ 2380346 2403808 2349760 2541805 2602242 2741151 2855548 2860878 3026641 3261162 3341469 3323016
3174C323016J57412M0222n9208j6495l6822l7651j28971j56355p3098j00170j19045
$$ 3323016 3480428 3520650 3461442 3444947 3408125 3370474 3241503 3085148 3012050 2911880 2792835
3163B792835r8041k6478O8896J1711j38779L9161r577k8605J2694O6661l42N2092
$$ 2792835 2694794 2668316 2737212 2748923 2610144 2649305 2639728 2611123 2623817 2690478 2690136 2742228
3151B742228O0568L2763Q6070J02171K40680J84040R0111K58621J36439K07190
$$ 2742228 2802796 2835559 2921629 3023800 3264480 3448520 3538631 3797252 3933691 4140881
3141D140881R5120j46138k08478k87632m23805k94750k47883k08112j27998j34544
$$ 4140881 4236001 4089863 3881385 3593753 3169948 2875198 2627315 2419203 2291205 2156661
3131B156661j47345j3874M6973k12676o8038k2132k9187O4303j12969N1672J2784
$$ 2156661 2009316 1995442 2042415 1829739 1761701 1739569 1710382 1774685 1661716 1713388 1726172
3120A726172O0385m6681r202P2724M4275J2632m3842J00613N3147K0155l8870
$$ 1726172 1786557 1739876 1730674 1803398 1847673 1860305 1816463 1917076 1970223 1990378 1951508
3109A951508j07086j12772j61266m9812p1578p2760j25451l0848n3559p2642q553
$$ 1951508 1844422 1731650 1570384 1520572 1448994 1376234 1250783 1219935 1166376 1093734 1085181
3098A085181j04416o0744j60348K3221k7374P1693P7326p1566o1735M522p2999
$$ 1085181 980765 920021 759673 782894 755520 827213 904539 832973 771238 775760 702761
3087G02761q0933o673O3110j40813n3608K2M6371J2927M9589l7047n3124l454
$$ 702761 621828 615155 678265 537452 483844 483866 530237 543164 592753 555706 502582 499128
3075D99128l7480o0290j6504q269m7786m5704K9452L3108j01206K0742J4537P987
$$ 499128 461648 401358 384854 376585 328799 283095 312547 345655 244449 265191 279728 287715
3063B87715N6884r9023j05799Q8810J4451k7792M1176j3330n4464O9426O6983
$$ 287715 344599 245576 139777 228587 243038 215246 256422 243092 188628 258054 325037
3052C25037j27256O245l7462J6990N271N5979M8436r8419m0442J7020J16879o6560
$$ 325037 197781 204026 166564 183554 188825 244804 293240 194821 154379 171399 288278 221718
3040B21718r1163P8754p9671P7259m9966p1163l1081o139J0170m3678N7010j06732
$$ 221718 130555 209309 129638 206897 156931 85768 54687 48548 58718 15040 72050 -34682
3028c4682k4163Q3818k5598J34002R6969j04007K9528n9135n7873j934r7010M9866
$$ -34682 -58845 24973 -625 133377 230346 126339 155867 96732 38859 36925 -60085 -10219
3016a0219Q0312J5205M6705K8987p0865o0668l1180M9479M7391k2583P8709n7821
$$ -10219 70093 85298 132003 160990 90125 29457 -1723 47756 95147 72564 151273 93452
3004I3452p5902p4023J04545J01697l3938m442K2086m9189l2311k6546j0370r8924
$$ 93452 17550 -56473 48072 149769 115831 111389 133475 84286 51975 25429 15059 -83865
2992h3865P1075L8240J9949k3848n6084J14255J26420r9684r7217J08071m8301
$$ -83865 -12790 25450 45399 21551 -34533 79722 206142 106458 9241 117312 69011
2981F9011j19460n9501L5817L1670K7342l0589l3270J23314M8303r3084L5915
$$ 69011 -50449 -109950 -74133 -42463 -15121 -45710 -78980 44334 92637 -447 35468
2970C5468l2478m2743n6325J41966j3152r3371N3667l7698K160M9576J5786L6372
$$ 35468 2990 -39753 -96078 45888 32736 -60635 -6968 -44666 -42506 7070 22856 59228
2958E9228q973m0758M0317q2087J3205m754p9784q797N6417j629M4819O3811j1304
$$ 59228 50255 9497 49814 -32273 -19068 -23822 -103606 -112403 -55986 -57615 -12796 51015 39711
2945C9711o4689j3115l9649p0972J9966M2522m041N2149M922j9435q4008J01766
$$ 39711 -24978 -38093 -77742 -148714 -128748 -86226 -90267 -38118 -33196 -52631 -136639 -34873
2933c4873l6031q401K4454p1632M1032k4638Q7257q0963J10104N4847j40562p3310
$$ -34873 -70904 -79305 -54851 -126483 -85451 -110089 -22832 -103795 6309 61156 -79406 -152716
2921a52716K309J05334k2545J8068l9578o5453J104J13436M1642R932p3675P671
$$ -152716 -150407 -45073 -67618 -49550 -89128 -154581 -153477 -40041 1601 11533 -62142 -54471
2909e4471J08193Q275k7876p738j8994n4579r0665J7556N2426Q8593q906m9718
$$ -54471 53722 61997 34121 26383 7389 -47190 -137855 -120299 -67873 20720 11814 -37904
2897c7904N5653n0101M8757L7804p1206L6531n4100k6706J8752L2060o9655o817
$$ -37904 17749 -32352 16405 54209 -16997 19534 -34566 -61272 -42520 -10460 -80115 -86932
2885h6932J24003j2585p0584l4100j6161l6857j4134L8865P4202n261J8182J8330
$$ -86932 37071 24486 -46098 -80198 -96359 -133216 -147350 -108485 -34283 -39544 -21362 -3032
2873c032j00995n8598L4946M0188M240L9399J0980j0822r1378l4017P9317J21547
$$ -3032 -104027 -162625 -127679 -87491 -83251 -43852 -32872 -43694 -135072 -169089 -89772 31775
2861C1775m8898r3219R4210K6288j7130j10392P0669L3475O969r395k800K0962
$$ 31775 -17123 -110342 -16132 10156 -6974 -117366 -46697 -13222 -6253 -15648 -18448 2514
2849B514L1917r635l8400k6456m0936j11361R3256L276Q5440n4116q883k292M2538
$$ 2514 34431 24796 -13604 -40060 -80996 -192357 -99101 -95825 -10385 -64501 -73384 -75676 -33138
2836c3138L0202m1647Q6876q0435j34397M7446j2688L9858p8939K9322O8944K2926
$$ -33138 -2936 -44583 42293 -38142 -172539 -125093 -137781 -97923 -176862 -147540 -78596 -55670
2824e5670J01524o3532p3157M470N8118J8670m7165J616l9158K7724j1918K3112
$$ -55670 45854 -17678 -90835 -86365 -28247 -9577 -56742 -55126 -94284 -66560 -78478 -55366
2812e5366L6815L1365o8074p2622Q6939m2109J04851O8428q6244q1172j50001
$$ -55366 -18551 12814 -55260 -127882 -40943 -83052 21799 90227 3983 -77189 -227190
2801b27190M1936Q3896N5017p066j3797M7642L8614n6841p944P198q9567O6907
$$ -227190 -185254 -101358 -46341 -53407 -67204 -19562 19052 -37789 -45733 -38535 -128102 -61195
2789f1195o6841J22318J7652j8074O5572l2815l8297k2077m6532Q0290L0287o4448
$$ -61195 -128036 -5718 11934 -6140 59432 26617 -11680 -33757 -80289 1 30288 -34160
2777c4160p7385j30577J14977o7631l1785J38567k6129j588O7575N6124o1545
$$ -34160 -111545 -242122 -127145 -194776 -226561 -87994 -114123 -115711 -48136 7988 -53557
2766e3557N7017M7899j3238q2401j10692L9984J67526o551j18551L548k3417o5578
$$ -53557 3460 51359 38121 -44280 -154972 -114988 52538 45987 -72564 -69016 -92433 -158011
2754a58011P7454l1707J7695m8765P434O619l2562o7042M3944N043Q5242J82432
$$ -158011 -80557 -112264 -94569 -143334 -135900 -129281 -161843 -228885 -184941 -179898 -94656 87776
2742H7776j5117q0321J58470j19505o2845K525j0207J4184n9597n3647N8538K1032
$$ 87776 72659 -7662 150808 31303 -31542 -29017 -39224 -25040 -84637 -138284 -79746 -58714
2730e8714Q0749p7922k8485Q7453l6890N8865n3673j9700k8119J9796O1333l0680
$$ -58714 22035 -55887 -84372 3081 -33809 25056 -28617 -48317 -76436 -56640 4693 -25987
2718b5987n5473O7308J4771m1744M5315M8258p8107N3532j1295n4009n0663L8716
$$ -25987 -81460 -14152 619 -41125 4190 52448 -25659 27873 16578 -37431 -88094 -49378
2706d9378l2348j54592K6709M8047O5214J1704m2930M572m9671Q4124L3316l2985
$$ -49378 -81726 -236318 -209609 -161562 -96348 -84644 -127574 -123002 -172673 -88549 -55233 -88218
2694h8218K6259p4879J62126j3488m6822j7742k6711O067m4152R8407Q407j28571
$$ -88218 -61959 -136838 25288 11800 -35022 -52764 -79475 -73408 -117560 -19153 -10746 -139317
2682a39317K8431J07448l7618R691q144J533m7353l412l7172M9536P7778K7007
$$ -139317 -110886 -3438 -41056 -31365 -39509 -37976 -85329 -88741 -125913 -76377 1401 28408
2670B8408l5280J856p1681K429p3278o814J44289R4373k5854r9504k2847k5793
$$ 28408 -6872 -5016 -76697 -74268 -147546 -154360 -10071 84302 58448 -41056 -63903 -89696
2658h9696J7487R2851o2940Q466Q624j7859O3825N975k2103j15356j28863Q8129
$$ -89696 -72209 20642 -42298 -33832 -25208 -43067 20758 26733 4630 -110726 -239589 -151460
2646a51460K117L7904k722J32243l864r3298k8242M5407l0521O6884l0765p7651
$$ -151460 -149343 -111439 -114161 18082 14218 -79080 -107322 -61915 -92436 -25552 -56317 -133968
2634a33968O9538J27994p8971j81129J28890J67446k4447o6542O23n3370Q587
$$ -133968 -64430 63564 -15407 -196536 -67646 99800 75353 8811 9434 -43936 -35349
2623c5349l861Q9578j04707r539R6154J9646k6719J14781l0689n4032k3816P8235
$$ -35349 -39210 50368 -54339 -63878 32276 51922 25203 139984 109295 55263 31447 109682
2611A09682O0535l9274p2589M1176O2627P9713J6404j53527j8639P8281J7780
$$ 109682 170217 130943 58354 99530 162157 241870 258274 104747 86108 164389 182169
2600A82169k4492q1426r6216j4517M5426J01167m481O3q8105J8861J5645P013
$$ 182169 157677 76251 -19965 -34482 10944 112111 107630 107693 19588 38449 54094 61107
2588F1107q0965j01666M979j9813P4450n4419P0714K0549k1024J01444K7646q8537
$$ 61107 -19858 -121524 -116545 -136358 -61908 -116327 -45613 -25064 -46088 55356 83002 -5535
2576e535L402K6063k4193M051j28539J8273j1948J8984R3973k4461j8744M3958
$$ -5535 -2133 23930 -263 3788 -124751 -106478 -118426 -99442 -5469 -29930 -48674 -4716
2564d716p7361N7395K3751o730J01862Q1765j5659r7878p7318l6460J44704q1373
$$ -4716 -82077 -24682 -931 -7661 94201 175966 160307 62429 -14889 -51349 93355 11982
2552A1982j3434M2P0503p2171o1063J16288n0115m7551o161J12419j4494n3538
$$ 11982 -1452 -1410 69093 -3078 -64141 52147 2032 -45519 -51680 60739 46245 -7293
2540g293L4398M6771j15751R780K8230j4690K3477j0350l0363l2680q4694M6949
$$ -7293 27105 73876 -41875 -32095 -3865 -18555 4922 -5428 -35791 -68471 -153165 -106216
2528a06216K2788m1796M4223o1979M7964K9127O1157K504J0654l7311l4067j013
$$ -106216 -83428 -125224 -81001 -142980 -95016 -65889 -4732 -2228 8426 -28885 -62952 -63965
2516f3965L3465M1314N1606j6248j10327j18036J9205Q3094J02565L2914K6801
$$ -63965 -30500 10814 62420 46172 -64155 -182191 -162986 -79892 22673 55587 82388
2505H2388o1454l3843K5185K0734Q265j06859p3032P1557J59636j0363j01534
$$ 82388 20934 -12909 12276 33010 41275 -65584 -138616 -67059 92577 82214 -19320
2494a9320R9210o2023k892K0586M9473P475l1492R819j2905l7214L2P2723J4469
$$ -19320 79890 17867 14975 35561 85034 92509 61017 70836 57931 20717 20749 93472 107941
2481A07941P814K262o158p098M6745M7612o8980j81894J76299Q4304j48515K5360
$$ 107941 115755 118017 111859 104761 151506 199118 130138 -51756 124543 208847 60332 85692
2469H5692M5415J25814J0460J5360r3719p0289J5380L6387L5313m5767J5503j9508
$$ 85692 131107 256921 267381 282741 189022 118733 134113 170500 205813 160046 175549 156041
2457A56041O306L792J02211j9282q6448J35373L1798m92o9554M177M1487m924
$$ 156041 162347 166139 268350 249068 162620 297993 329791 329299 259745 263922 305409 300485
2445C00485R4833K4670N668o0298L03m339R026M0195m6085P9914O3112j40779
$$ 300485 395318 419988 425656 365358 365661 361322 370348 410543 364458 444372 507484 366705
2433C66705O100N4880N4841n6560K7768M8469m3317o8064J02839O102O744k7538
$$ 366705 372805 427685 482526 425966 453734 502203 458886 390822 493661 499763 506507 478969
2421D78969L2057l0172N6087N4711q0525O6952K5262L7967k770L9149J11677K790
$$ 478969 511026 480854 536941 591652 511127 578079 603341 641308 638538 677687 789364 792154
2409G92154L0735m7028M6015L9946J23017K4159J4107j2684n9376j4766L3475
$$ 792154 822889 775861 821876 861822 984839 1008998 1023105 1010421 951045 936279 969754
2398I69754K7160j8704k6898K6138J71563P2487P163Q0541j6546m5626O4762L3445
$$ 969754 996914 978210 951312 977450 1149013 1221500 1228663 1309204 1292658 1247032 1311794 1345239
2386A345239J4807J36287O2489R5080O4111K5827J69268Q3171m0591J67843O7705
$$ 1345239 1360046 1496333 1558822 1653902 1718013 1743840 1913108 1996279 1955688 2123531 2191236
2375B191236J05813Q3248J30419J22206O7865J74676J02872J24649j3794J58244
$$ 2191236 2297049 2380297 2510716 2632922 2700787 2875463 2978335 3102984 3089190 3247434
2365C247434N4557J43404J68482J73844J39285M36487L88903K75782L69119M35955
$$ 3247434 3301991 3445395 3613877 3787721 3927006 4363493 4752396 5028178 5397297 5833252
2355E833252M88766L11246M47445N15301P21306R31006J298805J582408K001445
$$ 5833252 6322018 6633264 7080709 7596010 8317316 9248322 10547127 12129535 14130980
2346A4130980K744852L470109L800001N070511O968962O854102m88937q444635
$$ 14130980 16875832 20345941 24145942 29216453 36185415 43039517 42550580 34105945
2338C4105945q344627o568163m455583k711596j767835j246042j009542p91530
$$ 34105945 25761318 19193155 14737572 12025976 10258141 9012099 8002557 7211027
2330G211027n69221m14444m70414k73093j79012j56663n04302m52658m64452m16714
$$ 7211027 6641806 6227362 5756948 5483855 5304843 5148180 4643878 4191220 3726768 3310054
2320C310054j21441j84930j77034k36363j13468j03783k33987j13638N983j57020
$$ 3310054 3188613 3003683 2826649 2590286 2476818 2373035 2139048 2025410 2031393 1874373
2310A874373R914q0368j90580j98330J05545M1063r9357m9782J1044j33710o4078
$$ 1874373 1884287 1803919 1613339 1415009 1520554 1561617 1462260 1412478 1423522 1289812 1225734
2299A225734k2799l5260o1683j9106j32347r0927K8604o944o6707k9988j5886
$$ 1225734 1202935 1167675 1105992 1086886 954539 863612 892216 885272 818565 788577 772691
2288G72691R16k6159O2794k3843n0110o350j04962n907j0298k6039K6964m497
$$ 772691 773607 747448 810242 786399 736289 729939 624977 619070 608772 582733 609697 605200
2276F05200o5394k1403o4171K6409j4620l1981k163n8849n6640P5403J04839o3120
$$ 605200 539806 518403 454232 480641 466021 434040 431877 373028 316388 391791 496630 433510
2264D33510N871r278j24708Q056n121j6884P4563n7360J9403j48j73690O1886
$$ 433510 439381 430103 305395 313451 308330 291446 366009 308649 328052 327904 154214 216100
2252B16100J28768j7668j03303L2592j44373O4815J11422O445j17129J768j2019
$$ 216100 344868 327200 223897 256489 112116 176931 288353 294798 177669 179437 167418
2241A67418L3748n2591J9240p1232O1341P7L704r9772o890L8986R0391q0871R847
$$ 167418 201166 148575 167815 96583 157924 158001 161705 61933 55043 94029 184420 103549 113396
2228A13396Q3491j16866m5152J36405J8409K57M608j10898L5665o9646o4561o0863
$$ 113396 196887 80021 34869 171274 189683 189940 194548 83650 119315 49669 -14892 -75755
2216g5755N4800q5832J28896Q7206o1415n9955J6730J4058j5161J2826j6710Q0098
$$ -75755 -20955 -106787 22109 109315 47900 -12055 4675 18733 3572 16398 -312 79786
2204G9786j15918O9327J59573p3860j34075k4106M2165M5109J07485Q4378q3384
$$ 79786 -36132 33195 192768 118908 -15167 -39273 2892 48001 155486 239864 156480
2193A56480j15318Q7208L2807q5054n8737J9175j3854l0005j9624J9177j07576
$$ 156480 41162 128370 161177 76123 17386 36561 22707 -7298 -26922 -7745 -115321
2182a15321O0449N3817j8832o788j40203P820J60510J42612m7230j58658L1692
$$ -115321 -54872 -1055 -19887 -26675 -166878 -159058 1452 144064 96834 -61824 -30132
2171c0132P7781o366J14512l97j11487j51210K1996K0785J9846J06361o3120J9041
$$ -30132 47649 41283 155795 155398 43911 -107299 -85303 -64518 -44672 61689 -1431 17610
2159A7610K9856j28278O8803R8396q3558q5583J8033R2462O2319M1100L085o282
$$ 17610 47466 -80812 -12009 86387 2829 -82754 -64721 27741 90060 131160 134245 127963
2147A27963K2760k155m7691P5829p1315k1146K3513P893r5072L5000n5832m0736
$$ 127963 150723 148568 100877 176706 105391 84245 107758 115651 20579 55579 -253 -40989
2135d0989L7374N7685j784M7183q1576p751N9384j02463L4084m3484p234J33379
$$ -40989 -3615 54070 52286 99469 17893 10142 69526 -32937 1147 -42337 -49571 83808
2123H3808j9783k0014q2944m7839m442K3484L8022k4906N2218l8723p0825M6343
$$ 83808 64025 44011 -38933 -86772 -91214 -67730 -29708 -54614 -2396 -41119 -111944 -65601
2111f5601q030l0360R472J5166L3987L6590p896K9509J7346r1211j2250J26357
$$ -65601 -73631 -103991 -94519 -79353 -45366 -8776 -16672 12837 30183 -61028 -73278 53079
2099E3079K9956p6506J1141j32102N4139M9772n6772N8466K0585o7488j0214O5366
$$ 53079 83035 6529 17670 -114432 -60293 -10521 -67293 -8827 11758 -55730 -65944 -578
2087e78L6127K4137o7470L3071J01744m6132j01527l7842K8181L7329j3356L3838
$$ -578 35549 59686 -7784 25287 127031 80899 -20628 -58470 -30289 7040 -6316 27522
2075B7522O2313N3207l7858M8840Q921r5951J4242O4909r7818k1509K4330r4185
$$ 27522 89835 143042 105184 154024 162945 66994 81236 146145 48327 26818 51148 -43037
2063d3037K5420l281K1613M348O6418M334n2805Q4870r315Q832p1927j2502R4440
$$ -43037 -17617 -20898 715 5063 71481 75815 23010 107880 98565 107397 35470 22968 117408
2050A17408j17816K3908R653K3697q4476J08882J0918o2484m8638J7027p0186
$$ 117408 -408 23500 33153 56850 -27626 81256 92174 29690 -18948 -1921 -72107
2039g2107j07692L1549L0388J5676r9566M0609J06570M4732J56480r8272q2473
$$ -72107 -179799 -148250 -117862 -102186 -201752 -161143 -54573 -9841 146639 48367 -34106
2028c4106k8444j075P1680K502L7215r9632K6041l9863O0586J0740j6126J15284
$$ -34106 -62550 -63625 8055 10557 47772 -51860 -25819 -65682 -5096 5644 -10482 104802
2016A04802m0700l1096p6103p3686M2138K3754O2664M3956m7329P1831P6000q2264
$$ 104802 64102 33006 -43097 -116783 -74645 -50891 11773 55729 8400 80231 156231 73967
2004G3967k5002N1891j44342l6458M4934j2139M5830p8184k9895k6428M3276L9300
$$ 73967 48965 100856 -43486 -79944 -35010 -47149 -1319 -79503 -109398 -135826 -92550 -53250
1992e3250M1755L9195j05133j19876J18312Q5309q393p416n695j08283j5685Q8467
$$ -53250 -11495 27700 -77433 -197309 -78997 6312 -2081 -9497 -15192 -123475 -139160 -50693
1980e0693o8473j43858J23222M1648m1259J714n4995J5735m0905P1802L7244j9135
$$ -50693 -119166 -263024 -139802 -98154 -139413 -137699 -192694 -176959 -217864 -146062 -108818 -127953
1968a27953P8093N2378l6895K619L1114K6360r1268k690P8263N4417o0336q4894
$$ -127953 -49860 2518 -34377 -31758 -644 25716 -65552 -68242 10021 64438 4102 -80792
1956h0792Q4437j1668n6810P4404r1768m4646Q9079J4723K7357M6474p5008q3420
$$ -80792 3645 -8023 -64833 9571 -82197 -126843 -37764 -23041 4316 50790 -24218 -107638
1944a07638P7088N6708o7227m9035n7704Q8497N0102m1685j220L4513P8849r2457
$$ -107638 -30550 26158 -41069 -90104 -147808 -59311 -9209 -50894 -52114 -17601 61248 -31209
1932c1209m829o9475k0599M0724P7188m4025k6201k907K9343O485j15838q327
$$ -31209 -36038 -105513 -126112 -85388 -8200 -52225 -78426 -81333 -51990 -45505 -161343 -169670
1920a69670J03849k2228k664J2952j5731O7827l6734M7955o0614q857L6594J8672
$$ -169670 -65821 -88049 -90713 -77761 -93492 -25665 -62399 -14444 -75058 -83915 -47321 -28649
1908b8649n455j2394L9080r458j13290Q3057m3794J37369J8857p2449m8203j4384
$$ -28649 -34104 -46498 -7418 -16876 -130166 -47109 -90903 46466 65323 -7126 -55329 -69713
$$ [...]
##END NTUPLES=NMR SPECTRUM
##END=
