##TITLE=1H_EC-3305(II-1)-6
 CDCl3
 8 sc, 
 20.11.2023
##JCAMPDX= 6.0         $$ Bruker NMR JCAMP-DX V2.0
##DATA TYPE= NMR SPECTRUM
##DATA CLASS= NTUPLES
##ORIGIN= UXNMR, Bruker Analytische Messtechnik GmbH
##OWNER= root
$$ XWIN-NMR		Version 3.5
$$ Mon Nov 20 14:58:42 2023 Russian Standard Time (UT+4h)  she@DPX200
##.OBSERVE FREQUENCY= 200.1313
##.OBSERVE NUCLEUS= ^1H
##.ACQUISITION MODE= SIMULTANEOUS
##.ACQUISITION SCHEME= undefined
##.AVERAGES= 8
##.DIGITISER RES= 18
##SPECTROMETER/DATA SYSTEM= spect
##.PULSE SEQUENCE= zg30
##.SOLVENT NAME= D2O
##.SHIFT REFERENCE= (INTERNAL, D2O, 0, 15.4769)
##AUDIT TRAIL= $$ (NUMBER, WHEN, WHO, WHERE, WHAT)
$$ ##TITLE= Audit trail, XWIN-NMR		Version 3.5
$$ ##JCAMPDX= 5.01
$$ ##ORIGIN= Bruker BioSpin GmbH
$$ ##OWNER= she
$$ F:/spectra/data/she/nmr/H-F/1/pdata/1/auditp.txt
$$ ##AUDIT TRAIL=  $$ (NUMBER, WHEN, WHO, WHERE, WHAT)
(   1,<2023-11-20 14:57:30.10 +0400>,<she>,<DPX200>,
      <created by zg, POWCHK disabled, PULCHK disabled
       configuration hash MD5:
       00 E9 B6 7A A2 85 ED C7 34 08 36 98 17 FE 4E 26
       data hash MD5: 16K
       8E 73 4F BC A3 98 14 13 BF D6 73 80 F5 60 4C 37>)
(   2,<2023-11-20 14:57:32.89 +0400>,<she>,<DPX200>,
      <Start of raw data processing
       efp BC_mod = 2 LB = 0.24 FT_mod = 6 PKNL = 1 PHC0 = -23867.48 PHC1 = 8.252689 SI = 16K 
       data hash MD5: 16K
       90 67 A8 E1 DD E6 05 F1 8C 9D C0 C4 CF FB 65 D2>)
(   3,<2023-11-20 14:57:49.50 +0400>,<she>,<DPX200>,
      <pk PHC0 = -0.4703737 PHC1 = -0.6 
       data hash MD5: 16K
       DE F1 44 35 1B 4E B4 0E 9F FC CB 1E 00 1B 16 12>)
(   4,<2023-11-20 14:57:52.75 +0400>,<she>,<DPX200>,
      <abs ABSG = 5 
       data hash MD5: 16K
       CC F8 0C 21 B3 69 9E 91 62 17 8E 87 44 A9 DC 9A>)
$$ ##END=
$$ 
$$ hash MD5
$$ DF 20 FE 68 D0 90 88 A8 E3 5E EC 85 80 64 EF 9A
##$RELAX= 
##$RELAX= 
##$RELAX= 
##$RELAX= 
##$RELAX= 
##$RELAX= 
$$ Bruker specific parameters
$$ --------------------------
##$DU= <F:/spectra>
##$EXPNO= 1
##$NAME= <H-F>
##$PROCNO= 1
##$TYPE= <nmr>
##$USER= <she>
##$AMP= (0..31)
100 100 100 100 100 100 100 100 100 100 100 100 100 100 100 100 100 100 
100 100 100 100 100 100 100 100 100 100 100 100 100 100 
##$AQSEQ= 0
##$AQ_mod= 1
##$AUNM= <au_zg>
##$AUTOPOS= <>
##$BF1= 200.13
##$BF2= 200.13
##$BF3= 200.13
##$BF4= 200.13
##$BF5= 200.13
##$BF6= 200.13
##$BF7= 200.13
##$BF8= 200.13
##$BYTORDA= 1
##$CFDGTYP= 0
##$CFRGTYP= 5
##$CHEMSTR= <none>
##$CNST= (0..31)
1 1 145 1 1 1 1 1 1 1 1 1 1 1 1 1 1 1 1 1 1 1 1 1 1 1 1 1 1 1 1 1 
##$CPDPRG= <>
##$CPDPRG1= <>
##$CPDPRG2= <>
##$CPDPRG3= <>
##$CPDPRG4= <mlev>
##$CPDPRG5= <mlev>
##$CPDPRG6= <mlev>
##$CPDPRG7= <mlev>
##$CPDPRG8= <mlev>
##$CPDPRGB= <>
##$CPDPRGT= <>
##$D= (0..31)
0 1.2 0 0 0 0 0 0 0 0.06 0 0.03 0 0 0 0 0.0002 0 0 0 0 0 0 0 0 0 0 0 0 
0 0 0 
##$DATE= 1700477849
##$DBL= (0..7)
120 120 120 120 120 120 120 120 
##$DBP= (0..7)
150 150 150 150 150 150 150 150 
##$DBP07= 0
##$DBPNAM0= <>
##$DBPNAM1= <>
##$DBPNAM2= <>
##$DBPNAM3= <>
##$DBPNAM4= <>
$$ [...]
##$SUBNAM3= <"">
##$SUBNAM4= <"">
##$SUBNAM5= <"">
##$SUBNAM6= <"">
##$SUBNAM7= <"">
##$SUBNAM8= <"">
##$SUBNAM9= <"">
##$SW= 18.0517328524113
##$SWIBOX= (0..15)
0 0 2 0 0 0 0 0 0 0 0 0 0 0 0 0 
##$SW_h= 3612.71676300578
##$TD= 16384
##$TD0= 1
##$TE= 0
##$TE2= 300
##$TE3= 300
##$TEG= 300
##$TL= (0..7)
0 120 120 120 120 120 120 120 
##$TP= (0..7)
150 150 150 150 150 150 150 150 
##$TP07= 0
##$TPNAME0= <>
##$TPNAME1= <>
##$TPNAME2= <>
##$TPNAME3= <>
##$TPNAME4= <>
##$TPNAME5= <>
##$TPNAME6= <>
##$TPNAME7= <>
##$TPOAL= (0..7)
0.5 0.5 0.5 0.5 0.5 0.5 0.5 0.5 
##$TPOFFS= (0..7)
0 0 0 0 0 0 0 0 
##$TUNHIN= 0
##$TUNHOUT= 0
##$TUNXOUT= 0
##$USERA1= <user>
##$USERA2= <user>
##$USERA3= <user>
##$USERA4= <user>
##$USERA5= <user>
##$V9= 5
##$VALIST= <valist>
##$VCLIST= <CCCCCCCCCCCCCCC>
##$VD= 0
##$VDLIST= <DDDDDDDDDDDDDDD>
##$VPLIST= <PPPPPPPPPPPPPPP>
##$VTLIST= <TTTTTTTTTTTTTTT>
##$WBST= 1024
##$WBSW= 4
##$XGAIN= (0..3)
0 0 0 0 
##$XL= 0
##$YL= 0
##$YMAX_a= 373086
##$YMIN_a= -516929
##$ZGOPTNS= <>
##$ZL1= 120
##$ZL2= 120
##$ZL3= 120
##$ZL4= 120
##$ABSF1= 15.47365
##$ABSF2= -2.578199
##$ABSG= 5
##$ABSL= 3
##$ALPHA= 0
##$AQORDER= 0
##$ASSFAC= 0
##$ASSFACI= 0
##$ASSFACX= 0
##$ASSWID= 0
##$AUNMP= <proc_1d>
##$AZFE= 0.1
##$AZFW= 0.1
##$BCFW= 0
##$BC_mod= 2
##$BYTORDP= 0
##$COROFFS= 0
##$CY= -3
##$DATMOD= 1
##$DC= 0
##$DFILT= <>
##$DTYPP= 0
##$F1P= 0
##$F2P= 0
##$FCOR= 1
##$FTSIZE= 16384
##$FT_mod= 6
##$GAMMA= 0
##$GB= 0
##$INTBC= 1
##$INTSCL= 3.70164e-10
##$ISEN= 128
##$LB= 0.24
##$LEV0= 0
##$LPBIN= 0
##$MAXI= 10000
##$MC2= 0
##$MEAN= 0
##$ME_mod= 0
##$MI= 1.114404
##$NCOEF= 0
##$NC_proc= -7
##$NLEV= 6
##$NOISF1= 3.799351
##$NOISF2= 2.8
##$NSP= 0
##$NTH_PI= 0
##$NZP= 0
##$OFFSET= 15.47695
##$PC= 1
##$PHC0= -23867.95
##$PHC1= 7.652689
##$PH_mod= 1
##$PKNL= yes
##$PPARMOD= 0
##$PSCAL= 0
##$PSIGN= 0
##$REVERSE= no
##$SF= 200.130008956843
##$SI= 16384
##$SIGF1= 3
##$SIGF2= 2
##$SINO= 5.538805
##$SIOLD= 16384
##$SREGLST= <1H.CDCl3>
##$SSB= 0
##$STSI= 16384
##$STSR= 0
##$SW_p= 3612.71676300578
##$SYMM= 0
##$S_DEV= 0
##$TDeff= 16384
##$TDoff= 0
##$TI= <>
##$TILT= no
##$TM1= 0
##$TM2= 0
##$TOPLEV= 0
##$USERP1= <user>
##$USERP2= <user>
##$USERP3= <user>
##$USERP4= <user>
##$USERP5= <user>
##$WDW= 1
##$XDIM= 16384
##$YMAX_p= 395717453
##$YMIN_p= -629220
$$ End of Bruker specific parameters
$$ ---------------------------------
##NTUPLES= NMR SPECTRUM
##VAR_NAME=  FREQUENCY,     SPECTRUM/REAL,   SPECTRUM/IMAG
##SYMBOL=    X,             R,               I
##VAR_TYPE=  INDEPENDENT,   DEPENDENT,       DEPENDENT
##VAR_FORM=  AFFN,          ASDF,            ASDF
##VAR_DIM=   16384,         16384,           16384
##UNITS=     HZ,            ARBITRARY UNITS, ARBITRARY UNITS
##FACTOR=    0.220516191357247, 1,           1
##FIRST=     3097.40208043903, 0,            0
##LAST=      -515.314682566749, 0,           0
##MIN=       -515.314682566749, -629220,     0
##MAX=       3097.40208043903, 395717453,    0
$$ Real data points
##PAGE= N=1
##DATA TABLE= (X++(R..R)), XYDATA
$$ [...]
$$ plain form
7704 413497 409716 448776 349266 427446 410463 400640 295603 351029 303885 176076 306066
7693 306066 215084 266637 375249 202298 189472 294533 306025 232229 169278 374241 239394
7682 239394 177224 526798 525011 625617 803557 829429 863228 532441 512944 731401 555255
7671 555255 564208 349518 312671 121300 126849 253269 214304 200443 294569 281647 304057
7660 304057 165010 323966 633026 332980 247458 251854 370539 306418 579207 457905
7650 457905 323418 354729 380421 609124 520263 406672 450888 405173 246720 179904 157403
7639 157403 175833 322640 244076 172538 103963 118503 456735 516708 482465 491270 356741
7628 356741 496758 253512 228079 290780 63446 137822 391828 387857 273215 293711 284431
$$ packed form
7704D13497l781L9060r9510P8180j6983r823j05037N5426m7144j27809J29990
7693C06066r0982N1553J08612j72951j2826J05061J1492p3796o2951K04963j34847
7682B39394o2170L49574j787J00606J77940K5872L3799l30787j9497K18457j76146
7671E55255Q953k14690l6847j91371N549J26420l8965j3861R4126j2922K2410
7660C04057j39047J58956L09060l00046q5522M396J18685o4121K72789j21302
7650D57905j34487L1311K5692K28703q8861j13591M4216m5715j58453o6816k2501
7639A57403J8430J46807p8564p1538o8575J4540L38232N9973l4243Q805j34529
7628C56741J40017k43246k5433O2701k27334P4376K54006l971j14642K0496r280
$$ plain form
7617 284431 307246 173692 288074 328815 325841 355338 538085 388642 520651 330156 218482
7606 218482 224876 109109 123814 107171 120847 137233 73515 239860 257720 78801 74130
7595 74130 3783 -176163 -128647 229982 324793 241028 75153 182357 244040 211091 145269
7584 145269 90792 51896 36019 191008 185180 121146 252420 340154 329296 174422 426666
7573 426666 446870 475232 405177 277567 378799 412126 461322 537387 422009 509464 534032
7562 534032 595051 679604 685617 600995 802212 906622 776324 538492 662202 694379 704449
7551 704449 797068 664944 548232 612960 845418 756974 722245 774356 773612 595841 615592
7540 615592 637523 693296 957230 1107896 1153827 1152140 1126458 1191371 1066999 1104719 1148696
$$ packed form
7617B84431K2815j33554J14382M0741k974K9497J82747j49443J32009j90495j11674
7606B18482O394j15767J4705j6643J3676J6386o3718J66345J7860j78919m671
7595G4130p0347j79946M7516L58629R4811q3765j65875J07204O1683l2949o5822
7584A45269n4477l8896j5877J54989n828o4034J31274Q7734j0858j54874K52244
7573D26666K0204K8362p0055j27610J01232L3327M9196P6065j15378Q7455K4568
7562E34032O1019Q4553O013q4622K01217J04410j30298k37832J23710L2177J0070
7551G04449R2619j32124j16712O4728K32458q8444l4729N2111p44j77771J9751
7540F15592K1931N5773K63934J50666M5931j687k5682O4913j24372L7720M3977
$$ plain form
7529 1148696 1364191 1409615 1430616 1462698 1502959 1606782 1501152 1343564 1454311 1525587
7519 1525587 1448363 1304445 1115288 1266283 1252691 1028261 830024 796059 776754 828575
7509 828575 843265 802471 1034211 1129785 1064884 926486 744074 708352 838268 818444 934570
7498 934570 746690 785120 823708 768669 876923 930978 695799 772086 952857 716922 760926
7487 760926 756624 716475 655011 592735 524149 492651 520669 609281 465681 381788 344580 471893
7475 471893 441304 528370 647506 681679 665480 411941 515101 394057 267678 381914
7465 381914 371617 329180 268870 225916 443358 381965 216911 144005 -27010 224570 448138
7454 448138 423661 433992 265264 362536 346866 372249 626391 375637 155214 241896 258997
$$ packed form
7529A148696K15495M5424K1001L2082M0261J03823j05630j57588J10747P1276
7519A525587p7224j43918j89157J50995j3592k24430j98237l3965j9305N1821
7509H28575J4690m0794K31740R5574o4901j38398j82412l5722J29916j9824J16126
7498I34570j87880L8430L8588n5039J08254N4055k35179P6287J80771k35935M4004
7487G60926m302m0149o1464o2276o8586l1498K8018Q8612j43600q3893l7208J27313
7475D71893l0589Q7066J19136L4173j6199k53539J03160j21044j26379J14236
7465C81914j0297m2437o0310m2954K17442o1393j65054p2906j71015K51580K23568
7454D48138k4477J0331j68728R7272j5670K5383K54142k50754k20423Q6682J7101
$$ plain form
7443 258997 349105 404415 300027 253398 372366 241123 206666 291061 248892 431901 291557
7432 291557 152911 271735 355505 57394 139256 237251 19669 228480 327809 313712 373343
7421 373343 382397 274069 235358 309508 238575 347585 341788 61507 185335 242111 396767
7410 396767 402187 307841 360254 361002 310289 229104 200450 84243 12943 -106918 110901 183766
7398 183766 146113 144202 79589 257045 349757 339270 101180 69959 136912 25812 303467
7387 303467 331908 287748 335563 -13611 -277226 -27891 164282 162482 192086 126251 76149
7376 76149 99851 252861 -6266 59225 199060 115225 235040 192903 310870 125921 27812
7365 27812 92875 214551 82249 -12233 183623 200373 228073 165205 60872 297811 161023
$$ packed form
7443B58997R0108N5310j04388m6629J18968j31243l4457Q4395m2169J83009j40344
7432B91557j38646J18824Q3770k98111Q1862R7995k17582K08811R9329j4097N9631
7421C73343R054j08328l8711P4150p0933J09010n797k80281J23828N6776J54656
7410C96767N420r4346N2413P48n0713q1185k8654j16207p1300j19861K17819P2865
7398A83766l7653j911o4613J77456R2712j0487k38090l1221O6953j11100K77655
7387C03467K8441m4160M7815l49174k63615K49335J92173j800K9604o5835n0102
7376G6149K3702J53010k59127O5491J39835q3835J19815m2137J17967j84949r8109
7365B7812O5063J21676j32302r4482J95856J6750K7700o2868j04333K36939j36788
$$ plain form
7354 161023 84383 165715 -144750 -143660 -154196 -233514 -106210 8307 184966 21922 45052
7343 45052 216170 346544 227253 214780 189755 95335 93212 -17442 -10167 -10245 107853 213909
7331 213909 327023 333692 129022 102499 255288 33020 -11788 170412 -46877 -28828 -38707
7320 -38707 -101117 103342 137672 161537 20728 -94326 -23741 162620 95799 40275 81459
7309 81459 83256 75631 75893 269783 171157 -102893 93730 63261 8359 50789 184745 -560
7297 -560 -25532 306017 283443 180832 95116 121907 209447 167807 -16234 -72522 -163309 -117201
7285 -117201 123575 192465 -11878 -72651 82742 75196 77138 168181 204236 212681 48820
7274 48820 -169034 64427 211074 288870 34681 -176169 41699 835 97427 225858
$$ packed form
7354A61023p6640Q1332l10465J090j0536p9318J27304J14517J76659j63044K3130
7343D5052J71118J30374j19291j2473k5025r4420k123j10654P275p8J18098J06056
7331B13909J13114O669k04670k6523J52789k22268m4808J82200k17289J8049r879
7320c8707o2410K04459L4330K3865j40809j15054P0585J86361o6821n5524M1184
7309H1459J797p625K62J93890r8626k74050J96623l0469n4902M2430J33956j85305
7297e60k4972L31549k2574j02611q5716K6791Q7540m1640j84041n6288r0787M6108
7285a17201K40776O8890k04343o0773J55393p546J942R1043L6055Q445j63861
7274D8820k17854K33461J46647P7796k54189k10850K17868m0864R6592J28431
$$ plain form
7264 225858 214912 133263 159950 162435 135787 25719 -20190 -39601 21786 259407 162286
7253 162286 40992 -57841 216370 113320 -41297 150490 268319 106215 227664 192681
7243 192681 226960 27071 -53000 161674 81486 169215 100424 273562 205634 220794 79835
7232 79835 92311 134315 256762 102560 -27985 159904 -28846 20200 156440 36614
7222 36614 153168 393772 516993 578051 321843 35118 301028 374549 41533 40743 -51695
7211 -51695 174608 211713 323864 282708 93901 71231 41675 242960 301362 308333 211655
7200 211655 174012 196475 121674 120035 -5353 -93311 22660 -44132 41846 98529 320753
7189 320753 127461 80204 256915 399713 493290 310246 267251 157834 385894 310308
$$ packed form
7264B25858j0946q1649K6687K485k6648j10068m5909j9411O1387K37621r7121
7253A62286j21294r8833K74211j03050j54617J91787J17829j62104J21449l4983
7243A92681L4279j99889q0071K14674q0188Q7729o8791J73138o7928J5160j40959
7232G9835J2476M2004J22447j54202j30545J87889j88750M9046J36240j19826
7222C6614J16554K40604J23221O1058k56208k86725K65910P3521l33016p90r2438
7211e1695K26303L7105J12151m1156j88807k2670k9556K01285N8402O971r6678
7200B11655l7643K2463p4801j639j25388q7958J15971o6792Q5978N6683K22224
7189C20753j93292m7257J76711J42798R3577j83044m2995j09417K28060p5586
$$ plain form
7179 310308 94801 90035 103467 -59344 -17957 1793 -80786 1886 -25068 -101714 -3400
7168 -3400 62348 -75773 -172551 -232911 -12567 38830 22655 -43673 -11353 83084 245882
7157 245882 251595 171646 254061 54210 117511 219791 124862 36933 -17161 178601 14533
7146 14533 146010 157237 97052 240287 21886 -30608 281004 220311 207315 294244 234490
7135 234490 75275 213415 105466 170689 359605 207616 228654 71045 58563 54237 1283
7124 1283 56947 113770 176189 112717 194250 319019 349087 188700 356215 402134 644406
7113 644406 643096 540671 646149 483978 565362 559130 577888 533512 773191 774895 650891
7102 650891 380729 407932 487956 391662 555799 556869 456659 524755 579444 683346 563039
$$ packed form
7179C10308k15507m766J3432j62811M1387J9750q2579Q2672k6954p6646R8314
7168c400O5748j38121r6778o0360K20344N1397j6175o6328L2320R4437J62798
7157B45882N713p9949Q2415j99851O3301J02280r4929q7929n4094J95762j64068
7146A4533J31477J1227o0185J43235k18401n2494L11612o0693j2996Q6929n9754
7135B34490j59215J38140j07949O5223J88916j51989K1038j57609j2482m326n2954
7124A283N5664N6823O2419o3472Q1533J24769L0068j60387J67515M5919K42272
7113F44406j310j02425J05478j62171Q1384o232J8758m4376K39679J704j24004
7102F50891k70162K7203Q0024r6294J64137J070j00210O8096N4689J03902j20307
$$ plain form
7091 563039 677718 632768 583893 536939 476807 355158 346619 307412 326180 308063 416177
7080 416177 347019 119252 159844 100413 324323 384666 159842 231278 313437 135745 129395
7069 129395 -30175 59757 215533 296986 195826 168195 377402 268907 341236 60945
7059 60945 -145840 131146 292764 400625 304160 362785 348827 396547 405389 476901 470718
7048 470718 516064 534011 593630 693863 846653 836088 772505 601301 536289 395729 118333
7037 118333 442114 561981 430602 640039 612205 406918 485848 548084 515613 494843 601328
7026 601328 458599 482477 225265 435676 503698 335601 231243 310172 419514 379546
7016 379546 452996 485783 548950 417486 261849 406657 242544 346857 498885 295386
$$ packed form
7091E63039J14679m4950m8875m6954o0132j21649q539l9207J8768j8117J08114
7080D16177o9158k27767M0592n9431K23910O0343k24824P1436Q2159j77692o350
7069A29395j59570Q9932J55776Q1453j01160k7631K09207j08495P2329k80291
7059F0945k06785K76986J61618J07861r6465N8625j3958M7720Q842P1512o183
7048D70718M5346J7947N9619J00233J52790j0565o3583j71204o5012j40560k77396
7037A18333L23781J19867j31379K09437k7834k05287P8930O2236l2471k0770J06485
7026F01328j42729K3878k57212K10411O8022j68097j04358P8929J09342l9968
7016C79546P3450L2787O3167j31464j55637J44808j64113J04313J52028k03499
$$ plain form
7006 295386 64224 24727 144416 109301 253017 248010 437960 373271 160301 109695 -79054
6995 -79054 185229 223692 310004 381297 115554 381936 469553 324586 431749 277336 231749
6984 231749 105394 186726 222288 120168 110683 187897 177857 132495 468137 332968 85107
6973 85107 192956 195147 88862 159207 123653 328943 391827 244507 74621 63832 196072
6962 196072 356730 233353 245677 140901 24559 -86910 93252 100748 29552 147066
6952 147066 38149 -8372 115870 111120 102606 93766 108967 68742 128171 206579 188949 110240
6940 110240 98484 312832 58206 61738 323827 298077 186103 118738 288874 350270 330258
6929 330258 386465 444227 459169 574353 485577 278182 111640 57817 218025 266098 47802
$$ packed form
7006B95386k31162l9497J19689l5115J43716n007J89950o4689k12970n0606j88749
6995g9054K64283L8463Q6312P1293k65743K66382Q7617j44967J07163j54413m5587
6984B31749j26355Q1332L5562j02120r485P7214j0040m5362L35642j35169k47861
6973H5107J07849K191j06285P0345l5554K05290O2884j47320j69886j0789J32240
6962A96072J60658j23377J2324j04776j16342j11469J80162P496p1196J17514
6952A47066j08917m6521J24242m750q514q840J5201m0225N9429P8408j7630p8709
6940A10240j1756K14348k54626L532K62089k5750j11974o7365J70136O1396k0012
6929C30258N6207N7762J4942J15184q8776k07395j66542n3823J60208M8073k18296
$$ plain form
6918 47802 185935 68311 33558 152072 273293 235958 322496 333614 334214 527448 443015
6907 443015 397137 119423 258616 246217 260336 103825 185274 175099 221226 197173 203890
6896 203890 63722 -54143 137251 139701 114747 66379 235468 229281 287545 306764 198244
6885 198244 23835 -141265 -41655 280703 473675 356016 320752 332984 309798 80472
6875 80472 -86716 178821 187353 203845 199367 344731 340601 41765 252581 241633 131828
6864 131828 232279 307494 372345 236447 438134 297403 253027 219198 118340 10719
6854 10719 79711 297472 341787 309203 280531 310553 180916 339928 452433 401135 305281
6843 305281 275355 269655 109675 81940 206311 201432 238461 126287 131179 110894 132238 126701
$$ packed form
6918D7802J38133j17624l4753J18514J21221l7335Q6538J1118O00J93234q4433
6907D43015m5878k77714J39193j2399J4119j56511Q1449j0175M6127k4053O717
6896B03890j40168j17865J91394K450k4954m8368J69089o187N8264J9219j08520
6885A98244j74409j65100R9610L22358J92972j17659l5264J2232k3186k29326
6875H0472j67188K65537Q532J6492m478J45364m130k98836K10816j0948j09805
6864A31828J00451P5215O4851j35898K01687j40731m4376l3829j00858j07621
6854A0719O8992K17761M4315l2584k8672L0022j29637J59012J12505n1298r5854
6843C05281k9926n700j59980k7735J24371m879L7029j12174M892k0285K1344n537
$$ plain form
6831 126701 128624 249600 352991 386523 253250 15754 118237 157932 117733 267961 362231
6820 362231 333301 277622 -68960 -72857 74054 77849 139488 185338 129188 44849 16734 215978
6808 215978 428798 317549 279444 315827 326883 211650 53030 203006 59954 61242 97433
6797 97433 82858 220863 425244 270243 210153 324204 530139 385235 446162 475243 418958
6786 418958 291786 207667 273354 165095 165096 264798 283365 358553 330149 192655 292506 226315
6774 226315 255332 287739 343308 239105 397967 384737 224597 70554 146771 192503 251577
6763 251577 354961 324878 285565 158309 244898 358870 431606 448171 245635 205008 143539
6752 143539 231598 189108 346710 200214 149913 324474 288726 278613 303358 317482 271700
$$ packed form
6831A26701J923J20976J03391L3532j33273k37496J02483L9695m0199J50228R4270
6820C62231k8930n5679l46582l897J46911L795O1639M5850n6150q4339k8115J99244
6808B15978K12820j11249l8105L6383J1056j15233j58620J49976j43052J288L6191
6797I7433j4575J38005K04381j55001o0090J14051K05935j44904O0927K9081n6285
6786D18958j27172q4119O5687j08259JR9702J8567P5188k8404j37494R9851o6191
6774B26315K9017L2407N5569j04203J58862j3230j60140j54043P6217M5732N9074
6763B51577J03384l0083l9313j27256Q6589J13972P2736J6565k02536m0627o1469
6752A43539Q8059m2490J57602j46496n0301J74561l5748j0113K4745J4124m5782
$$ plain form
6741 271700 177128 275158 327535 444118 414842 395606 452424 390575 300372 263787 346601
6730 346601 319470 115289 170691 95954 230939 392102 349749 386827 470363 424723 475473
6719 475473 549171 292294 159783 394647 486381 419250 459643 378555 295990 415402 367593
6708 367593 426362 382554 278687 408159 602928 660261 529416 676264 578275 400164
6698 400164 397631 533119 668843 578621 481145 344370 216385 173593 226882 503356 684950
6687 684950 891665 796782 651926 475081 455546 648159 689012 522982 598225 453383
6677 453383 565959 926977 760246 653401 588008 571702 796656 812801 703420 667932
6667 667932 736880 741338 754579 750556 887652 874630 855097 1017599 824274 903322 1058406
$$ packed form
6741B71700r4572R8030N2377J16583k9276j9236N6818o1849r0203l6585Q2814
6730C46601k7131k04181N5402p4737J34985J61163m2353L7078Q3536m5640N0750
6719D75473P3698k56877j32511K34864R1734o7131M0393q1088q2565J19412m7809
6708C67593N8769m3808j03867J29472J94769N7333j30845J46848r7989j78111
6698D00164k533J35488J35724r0222r7476j36775j27985m2792N3289K76474J81594
6687F84950K06715r4883j44856j76845j9535J92613M0853j66030P5243j44842
6677D53383J12576L61018j66731j06845o5393j6306K24954J6145j09381l5488
6667F67932O8948M458J3241m023J37096j3022j9533J62502j93325P9048J55084
$$ plain form
6656 1058406 1026319 885701 803367 869996 1037021 1152421 1199537 1315547 1380950 1204645
6646 1204645 1241704 1189632 1292262 1351989 1355519 1481910 1450839 1388356 1205131 1243542 1324790
6635 1324790 1487200 1459732 1602424 1377590 1368442 1487495 1370081 1289515 1093985 1189384
6625 1189384 1123813 1129673 1179756 1066804 986902 958990 1085760 821911 941313 1064362 1038665
6614 1038665 920585 1047897 1173570 983416 1124251 1284618 1292407 1219300 1161894 1276101
6604 1276101 1126086 852675 1146021 1287639 1209171 1023531 969047 864956 883811 962339
6594 962339 1124789 1029234 984235 985378 938277 983614 995709 993209 1012656 790409 796010 903415
6582 903415 898651 1003980 1028181 741995 684488 835195 828148 921670 975370 1009839 664337
$$ packed form
6656A058406l2087j40618q2334O6629J67025J15400M7116J16010O5403j76305
6646A204645L7059n2072J02630N9727L530J26391l1071o2483j83225L8411Q1248
6635A324790J62410k7468J42692k24834r148J19053j17414q0566j95530R5399
6625A189384o5571N860N0083j12952p9902k7912J26770k63849J19402J23049k5697
6614A038665j18080J27312J25673j90154J40835J60367P789p3107n7406J14207
6604A276101j50015k73411K93346J41618p8468j85640n4484j04091J8855P8528
6594I62339J62450r5555m4999J143m7101M5337J2095k500J9447k22247N601J07405
6582I03415m764J05329K4201k86186n7507J50707p047R3522N3700L4469l45502
$$ plain form
6571 664337 673672 851108 1033046 923503 945793 1062159 874527 924943 878743 1015937 1200568
6560 1200568 1048017 972809 1147191 1121314 841504 798739 864471 963848 901037 967475 1016999
6549 1016999 899960 925357 1009759 1148877 1130666 899222 980131 1084840 1279510 1189549
6539 1189549 1214297 1416197 1481707 1177958 1284538 1396119 1429620 1500220 1668790 1666902 1555340
6528 1555340 1514503 1526437 1567920 1392129 1438649 1499397 1555813 1594876 1629049 1757420 1535266
6517 1535266 1594059 1648365 1446833 1422725 1465751 1696894 1659739 1845544 1876292 1864704 1867769
6506 1867769 1840582 1784376 1983684 1898358 1986254 2118902 2057565 1796709 1716737 1571740 1512478
6495 1512478 1368478 1555418 1708512 1562798 1358607 1456252 1514376 1564057 1850160 1890239
$$ packed form
6571F64337R335J77436J81938j09543K2290J16366j87632N0416m6200J37194J84631
6560A200568j52551p5208J74382k5877k79810m2765O5732R9377o2811O6438M9524
6549A016999j17039K5397Q4402J39118j8211k31444Q0909J04709J94670q9961
6539A189549K4748K01900O5510l03749J06580J11581L3501P0600J68570j888j11562
6528A555340m0837J1934M1483j75791M6520O0748N6416L9063L4173J28371k22154
6517A535266N8793N4306k01532k4108M3026K31143l7155J85805L0748j1588L065
6506A867769k7187n6206J99308q5326Q7896J32648o1337k60856p9972j44997n9262
6495A512478j44000J86940J53094j45714k04191R7645N8124M9681K86103M0079
$$ plain form
6485 1890239 1734856 1884368 1758902 1724927 1874168 1880087 1710297 1695892 1700681 1649332 1506125
6474 1506125 1460554 1492404 1683865 1633436 1577530 1624244 1460264 1643367 1767577 1733044 1620908
6463 1620908 1737303 1546895 1322954 1316259 1527537 1675336 1675903 1485537 1471274 1715127 1902912
6452 1902912 1872058 1636798 1738951 1879268 1786490 1810054 1765188 1876113 1924481 1710150
6442 1710150 1674673 1682533 1866822 1952232 2172664 2153267 2148740 2210437 2191347 2471546 2479583
6431 2479583 2534858 2357131 2407130 2349700 2297850 2199353 2301797 2339364 2338023 2393303 2181084
6420 2181084 2025744 2257683 2518398 2413682 2312111 2375519 2267571 2256532 2364666 2567965
6410 2567965 2560988 2349972 2536390 2507211 2494322 2693191 2711387 2756609 2644747 2698325 2807092
$$ packed form
6485A890239j55383J49512j25466l3975J49241N919j69790j4405M789n1349j43207
6474A506125m5571L1850J91461n0429n5906M6714j63980J83103J24210l4533j12136
6463A620908J16395j90408k23941o695K11278J47799N67j90366j4263K43853J87785
6452A902912l0854k35260J02153J40317r2778K3564m4866J10925M8368k14331
6442A710150l5477P860J84289Q5410K20432j9397m527O1697j9090K80199Q037
6431B479583N5275j77727M9999n7430n1850r8497J02444L7567j341N5280k12219
6420B181084j55340K31939K60715j04716j01571O3408j07948j1039J08134K03299
6410B567965o977k11016J86418k9179j2889J98869J8196M5222j11862N3578J08767
$$ plain form
6399 2807092 2883026 2845491 2939180 3191540 3174811 3381703 3527227 3343961 3458278 3837978
6389 3837978 3877728 3679142 3856733 4016977 3935438 3946128 4075874 4157033 4246452 4321455 4530443
6378 4530443 4592772 4643880 4669996 4591905 4617933 4834836 5100295 5188239 5143116 5273482 5285944
6367 5285944 5037920 5168851 5286608 5150441 5391776 5395466 5567152 5905213 6355779 6338035
6357 6338035 6177177 6207512 6395031 6580464 6634458 6754790 7047119 7493111 7837633 8577900
6347 8577900 8948319 9214032 9482639 9132757 8604973 8332013 7842030 7607855 7626959 7814137
6337 7814137 7794611 7850039 8303409 8656581 8807376 8863179 9102419 9389989 9523735 9865580
6327 9865580 10381532 10708890 10853500 11259314 11479004 11335304 11066946 10744012 10186465 9905753
$$ packed form
6399B807092P5934l7535R3689K52360j6729K06892J45524j83266J14317L79700
6389C837978L9750j98586J77591J60244q1539J0690J29746Q1159Q9419P5003K08988
6378D530443O2329N1108K6116p8091K6028K16903K65459Q7944m5123J30366J2462
6367E285944k48024J30931J17757j36167K41335L690J71686L38061M50566j7744
6357F338035j60858L0335J87519J85433N3994J20332K92329M45992L44522P40267
6347H577900L70419K65713K68607l49882n27784k72960m89983k34175J9104J87178
6337G814137j9526N5428M53370L53172J50795N5803K39240K87570J33746L41845
6327I865580N15952L27358J44610M05814K19690j43700k68358l22934n57547k80712
$$ plain form
6317 9905753 9660812 9395962 9546578 9757308 9722555 9284439 9007242 8982954 8925191 8999105
6307 8999105 9015971 8896936 8902439 9212261 9346863 9304682 9310903 9510240 10075443 10511392 10909384
6296 10909384 11570106 12540467 13579212 14329464 15121805 16012815 16742374 17662465 18869968
6287 18869968 19824388 19664905 18367727 16701818 15176802 14156642 13369552 13097750 12805920
6278 12805920 12821003 12944961 13231061 13628916 13908547 14053722 14295776 14598274 15002452 15629335
6268 15629335 16073760 16472350 16655331 16721121 16894928 17207281 17609419 18073475 19190908
6259 19190908 20955471 23020292 25890901 29526697 33641574 34565788 32084378 28228086
6251 28228086 24951596 22949375 21393084 20527042 19937648 19817672 19915062 20328845 20372071
$$ packed form
6317I905753k44941k64850J50616K10730l4753m38116k77197k4288n7763P3914
6307H999105J6866j19035N503L09822J34602m2181O221J99337N65203M35949L97992
6296A0909384O60722R70361J038745P50252P92341Q91010P29559R20091J207503
6287A8869968R54420j59483j297178j665909j525016j020160p87090k71802k91830
6278A2805920J5083J23958K86100L97855K79631J45175K42054L02498M04178O26883
6268A5629335M44425L98590J82981O5790J73807L12353M02138M64056J117433
6259A9190908J764563K064821K870609L635796M114877R24214k481410l856292
6251B8228086l276490k002221j556291q66042n89394j19976R7390M13783M3226
$$ plain form
6242 20372071 20287018 20092911 19832601 19461002 19325191 19338998 19699443 20143488 20357103 20620138
6232 20620138 21321056 22130969 22996809 24074641 25579514 27516030 29655693 32713897 36402251
6223 36402251 40772231 43226846 41882522 38561557 35526720 33517479 32271115 32191117
6215 32191117 32539706 33187558 34593335 36397266 38189478 40740418 44193425 48469977
6207 48469977 54012020 60924797 68676589 73880180 74106614 70355943 65562021 61738743
6199 61738743 59950485 59631561 60594577 62352837 64212617 67068306 71689839 77174890
6191 77174890 81404561 82690129 82121686 81773480 83442055 87631890 93124292 96680255
6183 96680255 95660328 91005604 85412237 81181094 79395453 79879630 82289004 85212561
$$ packed form
6242B0372071q5053j94107k60310l71599j35811J3807L60445M44045K13615K63035
6232B0620138P00918Q09913Q65840J077832J504873J936516K139663L058204L688354
6223C6402251M369980K454615j344324l320965l034837k009241j246364p9998
6215C2191117L48589O47852J405777J803931J792212K550940L453007M276552
6207D8469977N542043O912777P751792N203591K26434l750671m793922l823278
6199F1738743j788258l18924R63016J758260J859780K855689M621533N485051
6191G7174890M229671J285568n68443l48206J668575M189835N492402L555963
6183I6680255j019927m654724n593367m231143j785641M84177K409374K923557
$$ plain form
6175 85212561 85829316 82989952 78582531 74770706 72666741 72396422 73919913 77179952
6167 77179952 81235121 86869626 94186882 101412699 104672583 101672417 95527666 88625317
6159 88625317 83264802 79949127 78378119 77885163 78287210 78846418 79436606 80278572 79910346
6150 79910346 77694312 74276290 70436863 66742751 63280386 60976471 59320192 58059472
6142 58059472 57409772 57437525 58488154 59937772 61863594 63915268 65599180 66789373 67557992
6133 67557992 68587542 70002940 72421629 76086015 81612805 88783775 96869658 104935765
6125 104935765 110345463 111063613 106242997 97531915 87729192 78925174 71780846 66681239
6117 66681239 62978821 60416767 58491595 57041193 55749958 55003806 54155316 53500800 52495977
$$ packed form
6175H5212561O16755k839364m407421l811825k103965k70319J523491L260039
6167G7179952M055169N634505P317256P225817L259884l000166o144751o902349
6159H8625317n360515l315675j571008m92956M02047N59208N90188Q41966l68226
6150G9910346k216034l418022l839427l694112l462365k303915j656279j260720
6142E8059472o49700K7753J050629J449618J925822K051674J683912J190193P68619
6133F7557992J029550J415398K418689L664386N526790P170970Q085883Q066107
6125A04935765N409698P18150m820616q711082r802723q804018p144328n099607
6117F6681239l702418k562054j925172j450402j291235p46152q48490o54516j004823
$$ plain form
6108 52495977 51522673 51090970 51153561 51783383 53118193 55418169 58508261 62318138 66013266
6099 66013266 68379833 68963999 66641227 62005255 56394872 51000844 46502542 42660215
6091 42660215 39741764 37387681 35436972 33797842 32300272 31456442 30497585 29834982 29497356
6082 29497356 29299775 29413217 29696621 30140872 30658762 31081899 30984519 30432201 29291428
6073 29291428 27942211 26368807 25152197 24010377 23050982 22259639 21602926 20941721 20505751
6064 20505751 20247095 20343147 20168557 20553933 20968970 21617409 22665546 23712440 25099476
6055 25099476 26787517 29093863 31653002 34497584 37518425 39685543 40432749 39458445
6047 39458445 36852590 33550492 30379688 27237655 24552886 23013730 21564121 20344182
$$ packed form
6108E2495977r73304m31703O2591O29822J334810K299976L090092L809877L695128
6099F6013266K366567N84166k322772m635972n610383n394028m498302l842327
6091D2660215k918451k354083j950709j639130j497570q43830r58857o62603l37626
6082B9497356j97581J13442K83404M44251N17890M23137r7380n52318j140773
6073B9291428j349217j573404j216610j141820r59395p91343o56713o61205m35970
6064B0505751k58656R6052j74590L85376M15037O48439J048137J046894J387036
6055B5099476J688041K306346K559139K844582L020841K167118P47206r74304
6047C9458445k605855l302098l170804l142033k684769j539156j449609j219939
$$ plain form
6039 20344182 19631145 19134357 18418242 17857545 17759525 17677568 17574209 17795513 17999502 18119633
6029 18119633 18524851 19462928 20545763 21947465 23358233 24725528 25688281 25924927 25245183
6020 25245183 23688889 22002293 20218450 18518569 17400686 16099208 14978649 14215132
6012 14215132 13572422 12864466 12451960 12077140 11472351 11096867 10878838 10472187 9944046
6003 9944046 9397145 8991284 8783225 8520094 8198740 8219608 8257080 8084476 7798785 7805607
5993 7805607 7879837 7885275 8120730 8204306 7949390 8041868 8371576 8355171 8162911 7783264 7324198
5982 7324198 6964762 6906478 6723667 6740047 6647247 6580751 6538829 6334458 5862783 5594862
5972 5594862 5392516 5265420 5182685 5356559 5114238 4989844 4963776 4806844 5001123 5008732
$$ packed form
6039B0344182p13037m96788p16115n60697r8020q1957j03359K21304K03989J20131
6029A8119633M05218R38077J082835J401702J410768J367295R62753K36646o79744
6020B5245183j556294j686596j783843j699881j117883j301478j120559p63517
6012A4215132o42710p07956m12506l74820o04789l75484k18029m06651n28141
6003I944046n46901m05861k08059k63131l21354K0868L7472j72604k85691O822
5993G805607P4230N438K35455Q3576k54916R2478L29708j6405j92260l79647m59066
5982G324198l59436n8284j82811J6380r2800o6496m1922k04371m71675k67921
5972E594862k02346j27096q2735J73874k42321j24394k6068j56932J94279P609
$$ plain form
5962 5008732 4878848 4930135 5021367 5140500 5202580 5123601 4897621 4740862 4797611 4551470
5952 4551470 4500524 4555708 4396874 4317055 4404067 4465512 4288336 4338267 4360001 4272805 4267697
5941 4267697 4300073 4347990 4425106 4356892 4440181 4334469 4194491 4339710 4343543 4569931 4492284
5930 4492284 4493281 4626145 4444730 4292790 4151245 4164456 4027161 4033549 4018214 4208726 4347644
5919 4347644 4472112 4432863 4377475 4448808 4278239 4271629 4136001 4233955 4396602 4444058 4314621
5908 4314621 4303873 4211355 4197415 4236021 4334229 4455385 4324995 4436635 4529379 4592783 4730963
5897 4730963 4602111 4646088 4593824 4465067 4333908 4301445 4364172 4426162 4396134 4460536 4707663
5886 4707663 4625779 4655878 4379253 4430871 4388541 4592222 4839876 4991094 4903298 4819251 4902033
$$ packed form
5962E008732j29884N1287R1232J19133O2080p8979k25980j56759N6749k46141
5952D551470n0946N5184j58834p9819Q7012O1445j77176M9931K1734q7196n108
5941D267697L2376M7917P7116o8214Q3289j05712j39978J45219L833K26388p7647
5930D492284R97J32864j81415j51940j41545J3211j37295O388j5335J90512J38918
5919D347644J24468l9249n5388P1333j70569o610j35628R7954J62647M7456j29437
5908D314621j0748r2518j3940L8606R8208J21156j30390J11640R2744O3404J38180
5897D730963j28852M3977n2264j28757j31159l2463O2727O1990l0028O4402K47127
5886D707663q1884L0099k76625N1618m2330K03681K47654J51218q7796q4047Q2782
$$ plain form
5875 4902033 5037163 5017638 5107128 5095746 5253776 5512567 5545337 5360724 5259223 5472875
5865 5472875 5502677 5478270 5473091 5791410 5734225 6050564 6078033 5995137 5984104 6041045 5988473
5854 5988473 5945808 5952720 6047283 6304845 6509258 6689077 6813515 7008911 7230552 7227614 7297614
5843 7297614 7328335 7318350 7100955 7250370 7361542 7168181 7150835 7327752 7424836 7626168
5833 7626168 7706849 7864736 8157021 8293616 8413044 8294838 8186527 8257098 8356581 8279777
5823 8279777 8576121 8559032 8275416 8248051 8491213 8348085 8420229 8924786 9155958 9192756
5813 9192756 9097122 9354898 9505626 9477132 9518508 9920772 10202330 10826576 11172676 11145434
5803 11145434 11064810 10964382 10772797 10625276 10473082 10327102 10517405 10616390 10401686 10415269
$$ packed form
5875D902033J35130j9525Q9490j1382J58030K58791L2770j84613j01501K13652
5865E472875K9802k4407n179L18319n7185L16339K7469q2896j1033N6941n2572
5854E988473m2665O912R4563K57562K04413J79819J24438J95396K21641k938P0000
5843G297614L0721r985k17395J49415J11172j93361j7346J76917R7084K01332
5833G626168Q0681J57887K92285J36595J19428j18206j08311P0571R9483p6804
5823H279777K96344j7089k83616k7365K43162j43128P2144N04557K31172L6798
5813I192756r5634K57776J50728k8494M1376M02264K81558O24246L46100k7242
5803A1145434q0624j00428j91585j47521j52194j45980J90303R8985k14704J3583
$$ plain form
5793 10415269 10582172 10994072 11147300 11259677 11721592 12300289 12706018 13290326 13702326
5784 13702326 13711409 13608532 13719160 13784164 13753957 13952390 14277565 14233120 14343314 14541801
5774 14541801 14905214 15342964 15384072 15680884 15730863 15934245 16258919 16942860 17531073 18263246
5764 18263246 18681218 19022935 19276104 19834307 20581902 21355566 21998018 22693242 23387064
5755 23387064 24249900 25050573 25880350 26830704 27467384 28000792 27845447 27372952 27327738 27120423
5745 27120423 27018804 27115684 27038798 26921704 26825023 27312964 27769993 28357822 29281227 30006265
5735 30006265 31192192 32318588 33822378 35698074 37762166 39870895 42051716 44802221
5727 44802221 47666740 50532641 53052057 54622033 56331238 58711840 62245173 66580918
$$ packed form
5793A0415269J66903M11900J53228J12377M61915N78697M05729N84308M12000
5784A3702326R083j02877J10628O5004l0207J98433L25175m4445J10194J98487
5774A4541801L63413M37750M1108K96812M9979K03382L24674O83941N88213P32173
5764A8263246M17972L41717K53169N58203P47595P73664O42452O95224O93822
5755B3387064Q62836Q00673Q29777R50354O36680N33408j55345m72495m5214k07315
5745B7120423j01619R6880p6886j17094r6681M87941M57029N87829R23405P25038
5735C0006265J185927J126396J503790J875696K064092K108729K180821K750505
5727D4802221K864519K865901K519416J569976J709205K380602L533333M335745
$$ plain form
5719 66580918 71499915 75687721 77314457 76061384 72387685 67469584 62965028 59123738
5711 59123738 56161410 54190306 52957355 52471002 52619746 53066399 53907804 55144401 56347640
5702 56347640 57428263 58886565 60787916 63165956 66139203 69970421 74989795 81865436
5694 81865436 90822029 101404121 111099089 116055426 114270983 106776128 96639763 86411610
5686 86411610 78160440 71478214 66183721 61741111 58366477 55891257 53952367 52575814
5678 52575814 51867630 51594356 51626106 51338729 51202538 51389874 51733371 52606849 54115229
5669 54115229 56104226 58905565 62418968 66024756 68783724 69335082 67310916 63471437
5661 63471437 59039029 54653852 50886501 47677853 45260805 43509704 42200441 41320770
$$ packed form
5719F6580918M918997M187806J626736j253073l673699m918101m504556l841290
5711E9123738k962328j971104j232951m86353J48744M46653Q41405J236597J203239
5702E6347640J080623J458302J901351K378040K973247L831218N019374O875641
5694H1865436Q956593J0582092R694968M956337j784443p494855j0136365j0228153
5686H6411610q251170o682226n294493m442610l374634k475220j938890j376553
5678E2575814p08184k73274L1750k87377j36191J87336L43497Q73478J508380
5669E4115229J988997K801339L513403L605788K758968N51358k024166l839479
5661F3471437m432408m385177l767351l208648k417048j751101j309263q79671
$$ plain form
5653 41320770 40622477 39869365 39315764 39049099 38898443 38688653 38671816 38747817 38887738 39152369
5643 39152369 39176579 39587031 40003451 40495019 40899263 41689441 42731423 43956356 45295834
5634 45295834 46917317 49206996 51396261 54024254 56748643 59660406 63664831 68719427
5626 68719427 74711094 81800748 90141745 98765135 106018644 107962097 103577819 96047194
5618 96047194 89103328 83856527 80863347 79788649 80827827 83266481 87623362 93658071
5610 93658071 99600294 103668086 103669156 102169587 101399248 102129897 105128454 110868785 118515516
5601 118515516 125608436 129354456 129761257 128942456 127161739 125057241 123230046 121174864
5593 121174864 118378763 113760741 108530513 105018225 103349513 102805664 103020705 103770071
$$ packed form
5653D1320770o98293p53112n53601k66665j50656k09790j6837P6001J39921K64631
5643C9152369K4210M10452M16420M91568M04244P90178J041982J224933J339478
5634D5295834J621483K289679K189265K627993K724389K911763M004425N054596
5626F8719427N991667P089654Q340997Q623390P253509J943453m384278p530625
5618I6047194o943866n246801k993180j074698J039178K438654M356881O034709
5610I3658071N942223M067792J070j499569p70339P30649K998557N740331P646731
5601A18515516P092920L746020M06801q18801j780717k104498j827195k055182
5593A21174864k796101m618022n230228l512288j668712n43849K15041P49366
$$ plain form
5585 103770071 105300170 108153075 113199094 119920560 126215790 128341766 125429623 119977333
5577 119977333 114526675 110223467 107338227 106594850 107714835 109487677 111116169 112425448
5569 112425448 113229305 112766733 110042623 105808677 102009289 99370375 98569082 99427685 100864443
5560 100864443 102006446 102454670 102743851 104250226 107386642 112104330 118271201 125156695
5552 125156695 129589796 130146283 128371419 126913806 127186808 129746591 134058267 137057129
5544 137057129 138061510 137448743 134709886 128496865 119539450 110687611 103251476 97413860
5536 97413860 93253527 90331163 88550559 87564390 87266127 87712316 88959578 91575903 95353911
5527 95353911 100657020 107691852 115675441 122470784 126145030 127082687 126203603 123025085
$$ packed form
5585A03770071J530099K852905N046019O721466O295230K125976k912143n452290
5577A19977333n450658m303208k885240p43377J119985J772842J628492J309279
5569A12425448Q03857m62572k724110m233946l799388k638914q01293Q58603J436758
5560A00864443J142003M48224K89181J506375L136416M717688O166871O885494
5552A25156695M433101N56487j774864j457613K73002K559783M311676K998862
5544A37057129J004381o12767k738857o213021q957415q851839p436135n837616
5536I7413860m160333k922364j780604r86169k98263M46189J247262K616325L778008
5527I5353911N303109P034832P983589O795343L674246R37657q79084l178518
$$ plain form
5519 123025085 117410258 111099189 105627929 102298412 101094442 100894519 99492889 95412852
5511 95412852 89984344 84842897 81385964 79518541 78745732 78419900 77617603 75573246 72989344
5502 72989344 70931505 69449250 69231453 69722821 69901887 68589080 66395860 64126464 61928963
5493 61928963 59460331 56501073 54064700 52156955 50929459 50086205 48953981 47303701
5485 47303701 45233809 43224966 41685669 40430686 39822496 39262924 38462095 36934615 34988988
5476 34988988 32856213 30870365 29350694 28267290 27186611 26264298 25358179 24670083 23989034
5467 23989034 23456524 23096501 22780848 22227375 22113660 22316781 22213035 22233671 22065559 21978459
5457 21978459 21650802 21261212 21393220 21333706 21098868 21014419 20536448 20615175 20758789 21111015
$$ packed form
5519A23025085n614827o311069n471260l329517j203970j99923j401630m080037
5511I5412852n428508n141447l456933j867423p72809l25832q02297k044357k583902
5502G2989344k057839j482255k17797M91368J79066j312807k193220k269396k197501
5493F1928963k468632k959258k436373j907745j227496q43254j132224j650280
5485D7303701k069892k008843j539297j254983o08190n59572q00829j527480j945627
5476C4988988k132775j985848j519671j083404j080679r22313r06119o88096o81049
5467B3989034n32510l60023l15653n53473j13715K03121j03746K0636j68112q7100
5457B1978459l27657l89590J32008n9514k34838q4449m77971P8727J43614L52226
$$ plain form
5447 21111015 21372291 21455388 21471287 21453255 21696041 21854667 22151293 22669318 22742887 23073578
5437 23073578 23396716 23410842 23134006 22980277 22642087 22436175 22499138 22803376 23226300 23624883
5427 23624883 24341019 25261217 26274354 27477297 29088332 31114193 33882477 37301797
5419 37301797 41411636 46748125 53099838 60448922 69269555 77011976 79726714 75330350
5411 75330350 66603456 57706859 49772331 43520331 38862000 35327241 32709653 30564984
5403 30564984 28887466 27528325 26360746 25132461 24302694 23458503 22563825 22072580 21595214
5394 21595214 21145701 20772963 20577632 19934162 19770613 19543321 19244126 19200369 19099378 19104575
5384 19104575 19499130 19764612 19787757 19782897 19871147 19970039 20088135 20197836 20408951 20623776
$$ packed form
5447B1111015K61276Q3097J5899j8032K42786J58626K96626N18025P3569L30691
5437B3073578L23138J4126k76836j53729l38190k05912O2963L04238M22924L98583
5427B3624883P16136R20198J013137J202943J611035K025861K768284L419320
5419C7301797M109839N336489O351713P349084Q820633P742421K714738m396364
5411G5330350q726894q896597p934528o252000m658331l534759k617588k144669
5403C0564984j677518j359141j167579j228285q29767q44191q94678m91245m77366
5394B1595214m49513l72738j95331o43470j63549k27292k99195m3757j00991N197
5384A9104575L94555K65482K3145m860Q8250R8892J18096J09701K11115K14825
$$ plain form
5374 20623776 20969903 21222553 21795208 22524663 23114043 23681049 23924862 24187905 24582875
5365 24582875 25574874 26801842 28489017 30480537 32925306 36066536 40188509 45278183
5357 45278183 51213788 56492756 60079732 60747882 58693443 54866875 50555495 46869779
5349 46869779 43629865 40859445 38739802 37113553 35840048 35025405 34357221 34010160 33855274
5340 33855274 34073886 34315699 35055527 36199354 37473689 39367004 41691696 44510607 47827458
5331 47827458 51960954 56816076 63523626 72248280 83358023 97517594 114981508 134042319
5323 134042319 149713072 154846293 148206967 134558418 119609836 105722601 93389633
5316 93389633 83058235 74735433 68067376 62353629 57774525 54302104 51525970 49281488
$$ packed form
5374B0623776L46127K52650N72655P29455N89380N67006K43813K63043L94970
5365B4582875R91999J226968J687175J991520K444769L141230M121973N089674
5357D5278183N935605N278968L586976O68150k054439l826568m311380l685716
5349D6869779l239914k770420k119643j626249j273505q14643o68184l47061j54886
5340C3855274K18612K41813P39828J143827J274335J893315K324692K818911L316851
5331D7827458M133496M855122O707550Q724654J1109743J4159571J7463914J9060811
5323A34042319J5670753N133221o639326j3648549j4948582j3887235j2332968
5316I3389633j0331398q322802o668057n713747m579104l472421k776134k244482
$$ plain form
5308 49281488 47515347 46382944 45845207 45777458 46023994 46493203 47768112 49456619 51947242
5299 51947242 55157746 59576799 65301417 72767168 82864089 95920501 112550236 132145689
5291 132145689 150081564 158411527 154347414 141918789 126359135 111376373 97592955
5284 97592955 85740351 75633998 67287713 61145191 56040700 51969936 48574178 45497980
5276 45497980 43237641 41097879 39627057 38541076 37374252 36575606 36106044 35862442 35830719
5267 35830719 36041047 36977453 38568098 40487736 43309399 47150477 52342207 58825846
5259 58825846 64503840 67799610 67974322 65085545 60359384 55306882 50717368 46772406
5251 46772406 43346742 40792655 39353596 38579096 38323177 38285973 38364176 38425251 37898575
$$ packed form
5308D9281488j766141j132403n37737o7749K46536M69209J274909J688507K490623
5299E1947242L210504M419053N724618P465751J0096921J3056412J6629735J9595453
5291A32145689J7935875Q329963m064113j2428625j5559654j4982762j3783418
5284I7592955j1852604j0106353q346285o142522n104491m070764l395758l076198
5276D5497980k260339k139762j470822j085981j166824p98646m69562k43602l1723
5267C5830719K10328R36406J590645J919638K821663L841078N191730O483639
5259E8825846N677994L295770J74712k888777m726161n052502m589514l944962
5251D6772406l425664k554087j439059p74500k55919l7204P8203O1075n26676
$$ plain form
5242 37898575 36675223 34994819 33337179 31814854 30206011 28645724 27210046 25899494
5234 25899494 24669315 23728945 22918990 22406781 22080026 22070124 22111874 22280854 22383307 22467504
5224 22467504 22574082 22800453 23071257 23633000 24420085 25499261 27068482 28989552 31050993
5215 31050993 32821981 34790319 36298872 37361907 38182761 38633769 38341112 37533042 36493797
5206 36493797 35391927 33864468 32090674 30489607 28714347 27442550 26274736 25263132
5198 25263132 24470919 23496453 22822740 22104700 21524053 21093842 20452133 19942441 19657640
5189 19657640 19822009 20010286 20504550 20828821 21319870 22018196 22917004 23769101 24507192
5180 24507192 25577274 27121226 28798004 30533920 31854498 32190632 31595944 29849532
$$ packed form
5242C7898575j223352j680404j657640j522325j608843j560287j435678j310552
5234B5899494j230179r40370q09955n12209l26755r902M1750J68980J02453Q4197
5224B2467504J06578K26371K70804N61743P87085J079176J569221J921070K061441
5215C1050993J770988J968338J508553J063035Q20854M51008k92657q08070j039245
5206C6493797j101870j527459j773794j601067j775260j271797j167814j011604
5198B5263132p92213r74466o73713p18040n80647m30211o41709n09692k84801
5189A9657640J64369J88277M94264L24271M91049O98326Q98808Q52097P38091
5180B4507192J070082J543952J676778J735916J320578L36134n94688j746412
$$ plain form
5172 29849532 27641702 25686691 24032330 22369507 21078235 20301748 19579709 18725692 17948710
5163 17948710 17235717 16463698 16033166 15662046 15209758 14993100 14618205 14325565 14072518
5154 14072518 13905218 13641951 13622320 13641437 13888941 14025386 14282704 14547652 14991280 15766147
5144 15766147 16714022 17416590 17491663 17232007 16729909 15870077 15171323 14690953 14665973 14535152
5134 14535152 14524546 14546428 14525509 14729296 14963310 15068481 15545379 16022909 16143876 15987436
5124 15987436 15610618 15595823 15953934 15982470 16289184 17098203 18070518 19364765 20912460
5115 20912460 22712710 22628690 21480672 20255376 19386442 19033028 18510292 18075778 17660032
5106 17660032 17090441 17030132 16879494 16772662 16786121 16832642 16542188 16863304 17051337 16925335
$$ packed form
5172B9849532k207830j955011j654361j662823j291272p76487p22039q54017p76982
5163A7948710p12993p72019m30532l71120m52288k16658l74895k92640k53047
5154A4072518j67300k63267j9631J9117K47504J36445K57318K64948M43628P74867
5144A5766147R47875P02568P5073k59656n02098q59832o98754m80370k4980j30821
5134A4535152j0606K1882k0919K03787K34014J05171M76898M77530J20967j56440
5124A5987436l76818j4795L58111K8536L06714Q09019R72315J294247J547695
5115B0912460J800250q4020j148018j225296q68934l53414n22736m34514m15746
5106A7660032n69591o0309j50638j06832J3459M6521k90454L21116J88033j26002
$$ plain form
5096 16925335 17297420 17592553 17726549 18191274 18532296 18919629 19120389 19372110 19755938
5087 19755938 20075499 20500823 20767400 21123070 21359538 21736018 22297108 22855487 23616396
5078 23616396 23810646 24353126 25147252 25852518 26758080 28113229 29325511 30758603 32434965
5069 32434965 34076906 36064793 38221127 41114397 44700872 49182689 55312601 63170456
5061 63170456 73581280 87467386 105964502 122704566 122747274 108766249 92174873 78988281
5053 78988281 69494347 62361530 57894116 54756252 52824284 51515592 50287316 49756178
5045 49756178 49372451 49185489 48704584 48406157 48216764 48059709 48258377 48620228 49378404
5036 49378404 50533308 52019594 53876683 56239703 59399503 63363837 68465580 74532190
$$ packed form
5096A6925335L72085K95133J33996M64725L41022L87333K00760K51721L83828
5087A9755938L19561M25324K66577L55670K36468L76480N61090N58379P60909
5078B3616396J94250N42480P94126P05266R05562J355149J212282J433092J676362
5069C2434965J641941J987887K156334K893270L586475M481817O129912P857855
5061F3170456J0410824J3886106J8497116J6740064M2708j3981025j6591376j3186592
5053G8988281r493934p132817m467414l137864j931968j308692j228276n31138
5045D9756178l83727j86962m80905k98427j89393j57055J98668L61851P58176
5036D9378404J154904J486286J857089K363020L159800L964334N101743O066610
$$ plain form
5028 74532190 82685725 93027327 106350584 123583697 146672618 176692491 216210363
5021 216210363 268608031 327345613 349434941 316148263 259358269 206612157 168126837
5014 168126837 139241306 118845794 104799472 94923661 87334376 81200490 76383777 72589877
5006 72589877 69569850 66813051 63915816 61545510 59449615 58000551 57368858 57560364
4998 57560364 58130579 57290175 54615199 51399945 48360266 46624441 45463772 44604334 43820057
4989 43820057 42818302 41509988 40189319 39092008 38269192 37814948 37688634 37814501 38270711
4980 38270711 38608509 38171875 37133699 35975225 35042836 34058398 33106166 32344469 31539872
4971 31539872 30958468 30241304 29596812 28806208 28213317 27973612 27645177 27141400 26825170
$$ packed form
5028G4532190Q153535J0341602J3323257J7233113K3088921L0019873L9517872
5021B16210363N2397668N8737582K2089328l3286678n6789994n2746112l8485320
5014A68126837k8885531k0395512j4046322r875811p589285o133886m816713l793900
5006G2589877l020027k756799k897235k370306k095895j449064o31693J91506
4998E7560364N70215q40404k674976l215254l039679j735825j160669q59438p84277
4989D3820057j001755j308314j320669j097311q22816m54244j26314J25867M56210
4980C8270711L37798m36634j038176j158474r32389r84438r52232p61697q04597
4971C1539872n81404p17164o44492p90604n92891k39705l28435n03777l16230
$$ plain form
4962 26825170 26694097 26782944 27021594 27166357 27396479 27552540 27759724 28017909 28267639 28466857
4952 28466857 28747201 29085806 29465421 29521353 29929476 30331228 30679366 31074699 31568246 32006167
4942 32006167 32597280 33153753 33829842 34732471 35444168 36025529 36561745 37339487 38326407
4933 38326407 39238068 40430664 41720415 43067861 44630422 46443954 48466713 50487870
4925 50487870 52835649 55089477 56766963 58165416 59791297 61941938 64694194 66625938
4917 66625938 67057651 67136536 67210822 68236995 70314225 73532864 77687226 83333040 90775483
4908 90775483 98557208 104648670 109917882 116621741 126410376 139956639 159334721 185487121
4900 185487121 220548462 267497660 328257032 383377747 395717453 370533333 330225507
$$ packed form
4962B6825170j31073Q8847K38650J44763K30122J56061K07184K58185K49730J99218
4952B8466857K80344L38605L79615N5932M08123M01752L48138L95333M93547M37921
4942C2006167N91113N56473O76089R02629P11697N81361N36216P77742R86920
4933C8326407R11661J192596J289751J347446J562561J813532K022759K021157
4925E0487870K347779K253828J677486J398453J625881K150641K752256J931744
4917F6625938M31713P8885P4286J026173K077230L218639M154362N645814P442443
4908I0775483P781725O091462N269212O703859R788635J3546263J9378082K6152400
4900A85487121L5061341M6949198O0759372N5120715J2339706k5184120m0307826
$$ plain form
4893 330225507 283552408 236488511 195451886 165023913 143048687 127063484 115117952
4886 115117952 106057577 98865963 93655281 89678756 86912920 85678815 86231847 88360845
4878 88360845 92505117 99439087 106906308 107353311 99396168 88239722 78364659 71207330
4870 71207330 65808998 61850584 58937056 56826889 55090017 53664280 52388523 51321860
4862 51321860 50302645 49175433 48532428 48034204 47789026 47764457 47922587 47706075 47099919
4853 47099919 46771884 46281589 45658793 45517507 45219857 44925946 44837492 44909904 45298435 45779767
4843 45779767 46545195 47428119 48626721 50031719 51574949 53301091 54957744 56844857
4835 56844857 58908245 61190404 63123307 65021721 66577337 67879388 68822718 69469869
$$ packed form
4893C30225507m6673099m7063897m1036625l0427973k1975226j5985203j1945532
4886A15117952r060375p191614n210682l976525k765836j234105N53032K128998
4878H8360845M144272O933970P467221M47003p957143j1156446r875063p157329
4870G1207330n398332l958414k913528k110167j736872j425737j275757j066663
4862E1321860j019215j127212o43005m98224k45178k4569J58130k16512o06156
4853D7099919l28035m90295o22796j41286k97650k93911q8454P2412L88531M81332
4843D5779767P65428Q82924J198602J404998J543230J726142J656653J887113
4835E6844857K063388K282159J932903J898414J555616J302051R43330O47151
$$ plain form
4827 69469869 69833022 70276465 70617464 70707558 70824110 70661770 70839799 71047524 71550905 72198057
4817 72198057 73238263 74741282 77130228 79538679 82078085 85201809 88375320 91483320
4809 91483320 94742768 97902392 101336458 104756860 107516665 109499294 110608302 110491564
4801 110491564 109660038 108554770 107286176 105609636 103695401 101260335 99097874 96799376
4793 96799376 95001635 93474518 92280586 91888247 92092758 92741000 93721942 94990847 96497786
4784 96497786 98526288 100775342 103467123 106654435 110141311 113434370 116758976 119899191
4776 119899191 122167023 123840826 125058467 125660087 124992720 124242793 122842538 120850488
4768 120850488 119027174 117270666 115900064 115031352 114430894 114101277 113928218 113861359 113876531
$$ packed form
4827F9469869L63153M43443L40999R0094J16552j62340J78029K07725N03381O47152
4817G2198057J040206J503019K388946K408451K539406L123724L173511L108000
4809I1483320L259448L159624L434066L420402K759805J982629J109008j16738
4801A10491564q31526j105268j268594j676540j914235k435066k162461k298498
4793I6799376j797741j527117j193932l92339K04511O48242R80942J268905J506939
4784I6497786K028502K249054K691781L187312L486876L293059L324606L140215
4776A19899191K267832J673803J217641O01620o67367p49927j400255j992050
4768A20850488j823314j756508j370602q68712o00458l29617j73059o6859J5172
$$ plain form
4759 113876531 114167047 114434619 114634009 115088442 115873615 116944949 118465696 120325880 122074601
4750 122074601 123705845 125420580 127272983 129003397 130602027 131674551 132002403 131252239
4742 131252239 129967148 128322646 126558902 124506498 122485102 120908549 119443248 118013463
4734 118013463 116740598 114935923 113321421 111918923 110226505 108222206 106305303 104544816
4726 104544816 102676071 100913356 99332707 97331578 95631021 94036681 92515036 90890752
4718 90890752 88887923 86362401 83848781 81221847 78200203 75585180 73276167 70868140
4710 70868140 68613772 66757229 65131391 63453457 62363322 61807591 62168398 63019753 64745687
4701 64745687 65995865 63997919 58888182 52827584 47430311 43219525 39823542 37148201
$$ packed form
4759A13876531K90516K67572J99390M54433P85173J071334J520747J860184J748721
4750A22074601J631244J714735J852403J730414J598630J072524L27852p50164
4742A31252239j285091j644502j763744k052404k021396j576553j465301j429785
4734A18013463j272865j804675j614502j402498j692418k004299j916903j760487
4726A04544816j868745j762715j580649k001129j700557j594340j521645j624284
4718I0890752k002829k525522k513620k626934l021644k615023k309013k408027
4710G0868140k254368j856543j625838j677934j090135n55731L60807Q51355J725934
4701F4745687J250178j997946n109737o060598n397273m210786l395983k675341
$$ plain form
4693 37148201 35057127 33154985 31460645 29962365 28600406 27464590 26359372 25226677
4685 25226677 24356332 23553191 23113631 22406723 21522775 20770312 20367786 19820321 19214577
4676 19214577 18669772 18268652 17816445 17535464 17077959 16432780 16236577 15588097 15350985
4667 15350985 14832739 14470707 14366166 13976310 13581924 13283871 13128599 12882261 12729062
4658 12729062 12599611 12322885 12083794 11717654 11369324 11304858 11185395 10885508 10834856 10888968
4648 10888968 11120926 10852575 10704100 10638467 10473827 10359917 10325765 10602553 10613755 10716778
4638 10716778 10983328 10935414 10812234 10626647 10320947 10126981 9693460 9179846 8809070 8769430
4628 8769430 8532388 8442355 8007740 8071424 7897792 7970423 8011539 7910574 7879482 7958886 7990775
$$ packed form
4693C7148201k091074j902142j694340j498280j361959j135816j105218j132695
4685B5226677q70345q03141m39560p06908q83948p52463m02526n47465o05744
4676A9214577n44805m01120m52207k80981m57505o45179j96203o48480k37112
4667A5350985n18246l62032j04541l89856l94386k98053j55272k46338j53199
4658A2729062j29451k76726k39091l66140l48330o4466j19463k99887n0652N4112
4648A0888968K31958k68351j48475o5633j64640j13910l4152K76788J1202J03023
4638A0716778K66550m7914j23180j85587l05700j93966m33521n13614l70776l9640
4628H769430k37042r0033m34615O3684j73632P2631M1116j00965l1092P9404L1889
$$ plain form
4617 7990775 7735216 7793049 8260228 8708328 8864530 9174349 9320904 9178595 9234348 9156046
4607 9156046 9028003 8741695 8409732 8030755 7766579 7669735 7441416 7316050 7474534 7369854
4597 7369854 7489513 7578567 7465260 7536955 7472753 7474244 7808663 7815727 7790548 8055441 8545066
4586 8545066 9125464 9417280 9660653 9965138 10307739 10571585 10611490 10941065 11310025 11152671
4576 11152671 10907253 10757136 10635128 10181099 9739813 9247914 8847743 8645061 8290006
4567 8290006 8268255 7992975 8052618 8029686 7987378 8094225 8243719 8506542 8700028 9070818
4557 9070818 9093394 9437129 9881633 10248727 10446012 10517152 10468389 10356915 10237463 10135786
4547 10135786 9669003 9030519 8739820 8566135 7958537 7523215 7446963 7275562 6891972 6781857
$$ packed form
4617G990775k55559N7833M67179M48100J56202L09819J46555j42309N5753p8302
4607I156046j28043k86308l31963l78977k64176r6844k28319j25366J58484j04680
4597G369854J19659Q9054j13307P1695o4202J491L34419P064k5179K64893M89625
4586H545066N80398K91816K43373L04485L42601K63846L9905L29575L68960j57354
4576A1152671k45418j50117j22008m54029m41286m91899m00171k02682l55055
4567H290006k1751k75280N9643k2932m2308J06847J49494K62823J93486L70790
4557I070818K2576L43735M44504L67094J97285P1140m8763j11474j19452j01677
4547A0135786m66783o38484k90699j73685o07598m35322p6252j71401l83590j10115
$$ plain form
4537 6781857 6444386 6293753 6527791 6313785 6119132 6058295 6049663 6121102 5855327 5967770
4527 5967770 5997641 5874482 5916502 6161078 6316640 6559035 6821211 7075966 7268013 7266319
4517 7266319 7272818 7179580 7130872 7045965 6887508 6733973 6507764 6314991 6311251 6170966 6122296
4506 6122296 5986824 6126021 6354569 6243282 6268518 6162032 6302995 6455970 6707714 7012424
4496 7012424 7156326 7230441 7388729 7561538 7775071 7711710 7634492 7698382 7550425 7330591
4486 7330591 6954610 6617869 6459561 6430404 6070126 5881508 5823644 5923560 5989116 6199587
4476 6199587 6162798 6065443 6180224 6171666 5892983 5931912 6307372 6289725 6081083 5964836 5983305
4465 5983305 6001056 5741986 5814471 6034713 5915820 5879246 5930836 6023117 5903760 6055911
$$ packed form
4537F781857l37471j50633K34038k14006j94653o0837q632P1439k65775J12443
4527E967770K9871j23159M2020K44576J55562K42395K62176K54755J92047j694
4517G266319O499r3238m8708q4907j58457j53535k26209j92773l740j40285m8670
4506F122296j35472J39197K28548j11287K5236j06486J40963J52975K51744L04710
4496G012424J43902P4115J58288J72809K13533o3361p7218O3890j47957k19834
4486G330591l75981l36741j58308k9157l60278j88618n7864R9916O5556K10471
4476F199587l6789r7355J14781q558k78683L8929L75460j7647k08642j16247J8469
4465E983305J7751k59070P2485K20242j18893l6574N1590R2281j19357J52151
$$ plain form
4455 6055911 6036775 5983522 6093066 5953553 5869904 6058424 6023586 6201437 6362502 6206743
4445 6206743 6412511 6875215 6796592 6650983 6835090 7002317 7170363 7289066 7139855 7405439
4435 7405439 7622740 7549550 7594840 7962868 8189089 8414132 8401007 8230742 8548570 8788220
4425 8788220 9069773 9159180 9277631 9405639 9597260 9562013 9673977 9759344 9807186 9857440
4415 9857440 9670205 9868431 10161467 10315568 10364741 10571478 10887218 10819300 10586577 10433665
4405 10433665 10278169 10249871 10275432 10334925 10366865 10567476 10688904 10849445 10900247 11025594
4395 11025594 11170323 11278172 11638062 12121054 12998902 13904297 14935202 16023539 16688470
4386 16688470 16256937 15231456 14399378 13801355 12911844 12670782 12216680 12044715 11854999
$$ packed form
4455F055911j9136n3253J09544j39513q3649J88520l4838J77851J61065j55759
4445F206743K05768M62704p8623j45609J84107J67227J68046J18703j49211K65584
4435G405439K17301p3190M5290L68028K26221K25043j3125j70265L17828K39650
4425H788220K81553Q9407J18451J28008J91621l5247J11964Q5367M7842N0254
4415I857440j87235J98226K93036J54101M9173K06737L15740o7918k32723j52912
4405A0433665j55496k8298K5561N9493L1940K00611J21428J60541N0802J25347
4395A1025594J44729J07849L59890M82992Q77848R05395J030905J088337O64931
4386A6688470m31533j025481q32078n98023q89511k41062m54102j71965j89716
$$ plain form
4377 11854999 11771936 11638449 11338800 11248492 11336008 11317316 11371174 11358688 11563574 11566470 11547444
4366 11547444 11639080 11552193 11366000 11252192 11369560 11294379 11141880 11006657 11129840 11020494
4356 11020494 11076558 10976867 11066370 11124058 11151819 11336770 11598329 11468055 11195348 10937470
4346 10937470 10796298 10590704 10448338 10393540 10684106 10791844 10634828 10441258 10229925 10155011
4336 10155011 9956294 9829715 9768019 9630216 9667744 9571110 9160996 8969415 9019116 9122115
4326 9122115 8920645 9010055 8791330 8559722 8639282 8395896 8220485 8134080 8171104 8019205
4316 8019205 8125816 8214846 8133457 8147798 7928014 7669170 7559592 7431566 7567833 7289129
4306 7289129 7199053 7411102 7263713 7223950 7174142 7272451 7314215 7268002 7172161 6953920 6830009
$$ packed form
4377A1854999q3063j33487k99649r0308Q7516j8692N3858j2486K04886K896j9026
4366A1547444R1636q6887j86193j13808J17368p5181j52499j35223J23183j09346
4356A1020494N6064r9691Q9503N7688K7761J84951K61559j30274k72707k57878
4346A0937470j41172k05594j42366n4798K90566J07738j57016j93570k11333p4914
4336A0155011j98717j26579o1696j37803L7528r6634m10114j91581M9701J02999
4326I122115k01470Q9410k18725k31608P9560k43386j75411q6405L7024j51899
4316H019205J06611Q9030q1389J4341k19784k58844j09578j28026J36267k78704
4306G289129r0076K12049j47389l9763m9808R8309M1764m6213r5841k18241j23911
$$ plain form
4295 6830009 6931436 6854072 6686332 6924575 7149549 6877971 6809824 6842479 6726355 6673762
4285 6673762 6805237 6742223 6734795 6757742 6888644 6964304 6818001 6793148 6861937 6781891 6783291
4274 6783291 6798325 6846638 7036343 7188094 7273425 7353137 7296647 7287902 7253135 7285300 7191581
4263 7191581 7110875 7221970 7272442 7331117 7217828 7440411 7635104 7701131 7680186 7671649 7583783
4252 7583783 7707864 7734521 7820764 7746234 7750467 7680568 7866788 7915962 7936141 8074496 8266631
4241 8266631 8309772 8461247 8338064 8412074 8519991 8495138 8437455 8855807 8955801 8652158
4231 8652158 8845240 8871182 8880593 8903747 9082203 9115883 9137045 9188238 9424263 9575905 9716611
4220 9716611 9697696 9704943 9909658 10167816 10377730 10470475 10669345 10894679 10736409 10843936
$$ packed form
4295F830009J01427p7364j67740K38243K24974k71578o8147L2655j16124n2593
4285F673762J31475o3014p428K2947J30902P5660j46303k4853O8789q0046J400
4274F783291J5034M8313J89705J51751Q5331P9712n6490q745l4767L2165r3719
4263G191581q0706J11095N0472N8675j13289K22583J94693O6027k0945q537q7866
4252G583783J24081K6657Q6243p4530M233o9899J86220M9174K0179J38355J92135
4241H266631M3141J51475j23183P4010J07917k4853n7683M18352R9994l03643
4231H652158J93082K5942R411K3154J78456L3680K1162N1193K36025J51642J40706
4220I716611j8915P247K04715K58158K09914R2745J98870K25334j58270J07527
$$ plain form
4210 10843936 10935364 11002703 11003231 11221647 11381765 11282969 11550146 11601077 11623824 11715606 11676646
4199 11676646 11851830 11930576 12125407 12179271 12322265 12463184 12539309 12553828 12785091 13055678
4189 13055678 13258400 13311367 13336933 13751695 13974465 14103378 14230738 14146689 13999355 14066408
4179 14066408 14252061 14382515 14670403 14815457 14773305 14888729 14954672 15226314 15472277 15744034
4169 15744034 15964293 16155314 16322022 16440556 16599526 16495600 16853388 17149280 17516760
4160 17516760 17932069 18160203 18565150 19128289 19310062 19668576 19811772 20089507 20561340
4151 20561340 21015496 21589045 21949948 22636254 23274841 23890079 24374492 25144104 25862572
4142 25862572 26280062 26740999 27524528 27911904 28352216 28968374 29328014 29902688 30427738
$$ packed form
4210A0843936R1428O7339N28K18416J60118r8796K67177N0931K2747R1782l8960
4199A1676646J75184P8746J94831N3864J42994J40919P6125J4519K31263K70587
4189A3055678K02722N2967K5566M14762K22770J28913J27360q4049j47334O7053
4179A4066408J85653J30454K87888J45054m2152J15424O5943K71642K45963K71757
4169A5744034K20259J91021J66708J18534J58970j03926L57788K95892L67480
4160A7516760M15309K28134M04947N63139J81773L58514J43196K77735M71833
4151B0561340M54156N73549L60903O86306O38587O15238M84413P69612P18468
4142B5862572M17490M60937P83529L87376M40312O16158L59640N74674N25050
$$ plain form
4133 30427738 31011161 31727233 32511087 33340112 34418757 35561553 36519106 37688066 38821503
4124 38821503 39697292 40642740 41607803 42378845 43081426 44137247 45301322 46347280 47047637
4115 47047637 47926906 49082656 49956841 50955417 51905430 52645652 53461611 54391731 54986769
4106 54986769 55724489 56875913 57964787 59502212 61226751 63435571 65758754 67765690
4098 67765690 69616965 70818874 71638392 72088966 72233793 72456270 72911253 73506486 74057301
4089 74057301 74682337 75293834 76082960 76898495 77673575 78724175 79416559 80006119 80777813
4080 80777813 81115582 81464608 82271793 83009402 84131578 85892092 87823997 89895998 92133458
4071 92133458 94516578 96943365 98938354 100522848 101797764 102729142 103869408 105283684
$$ packed form
4133C0427738N83423P16072P83854Q29025J078645J142796R57553J168960J133437
4124C8821503Q75789R45448R65063P71042P02581J055821J164075J045958P00357
4115D7047637Q79269J155750Q74185R98576R50013P40222Q15959R30120N95038
4106E4986769P37720J151424J088874J537425J724539K208820K323183K006936
4098F7765690J851275J201909Q19518M50574J44827K22477M54983N95233N50815
4089G4057301O25036O11497P89126Q15535P75080J050600O92384N89560P71694
4080H0777813L37769L49026Q07185P37609J122176J760514J931905K072001K237460
4071I2133458K383120K426787J994989J584494J274916R31378J140266J414276
$$ plain form
4063 105283684 106458497 107516821 108227043 108785153 109488915 110142382 110731272 111188820 111355096
4054 111355096 111649687 111819662 112005370 112577510 113165285 114283138 115430077 116894541 118483235
4045 118483235 119895847 120976065 121359659 121540855 121203840 120736595 120386764 120502123 120859304
4036 120859304 121448259 121959879 122328344 122419780 121957188 121721739 121226576 120770094 120168179
4027 120168179 119378768 119210083 118638379 117814369 116571145 115258984 113716446 112243022 110593110
4018 110593110 108757356 106626407 104263953 102026929 99903235 98220226 97335117 96758191
4010 96758191 96168923 95886959 95456524 94990858 94250413 93376706 92407404 91132906 89598736
4001 89598736 87963456 86471526 84762977 83263166 82126777 80857042 79945267 79512084
$$ packed form
4063A05283684J174813J058324P10222N58110P03762O53467N88890M57548J66276
4054A11355096K94591J69975J85708N72140N87775J117853J146939J464464J588694
4045A18483235J412612J080218L83594J81196l37015m67245l49831J15359L57181
4036A20859304N88955N11620L68465R1436m62592k35449m95163m56482o01915
4027A20168179p89411j68685n71704q24010j243224j312161j542538j473424j649912
4018A10593110j835754k130949k362454k237024k123694j683009q85109n76926
4010I6758191n89268k81964m30435m65666p40445q73707r69302j274498j534170
4001H9598736j635280j491930j708549j499811j136389j269735r11775m33183
$$ plain form
3993 79512084 79322283 79038536 78601050 77728845 76149469 74057537 71775851 69800943 68179231
3984 68179231 66763996 65633402 64823409 64181080 63187253 62392399 61556794 60737758 59859022
3975 59859022 59004719 58009083 56740558 55654716 54808495 53927149 52889516 51804413 51215264
3966 51215264 50457806 49874005 49325037 48350889 47516248 46561068 45516451 44712643 44056397
3957 44056397 43517317 42958354 42320929 41844814 41410482 41071684 40760980 40427209 40078600
3948 40078600 39914585 39909897 39495664 39040979 38546981 37749917 37233060 36558352 35958272 35343184
3938 35343184 35085421 35240847 35196556 35495945 35965120 36388398 36794606 37291096 37705910 38683913
3928 38683913 39513063 40316006 41616071 43187738 45337874 47937320 50739692 53548407
$$ packed form
3993G9512084j89801k83747m37486q72205j579376k091932k281686j974908j621712
3984F8179231j415235j130594q09993o42329r93827p94854q35605q19036q78736
3975E9859022q54303r95636j268525j085842q46221q81346j037633j085103n89149
3966E1215264p57458n83801n48968r74148q34641r55180j044617q03808o56246
3957D4056397n39080n58963o37425m76115m34332l38798l10704l33771l48609
3948D0078600j64015m688m14233m54685m93998p97064n16857o74708o00080o15088
3938C5343184k57763J55426m4291K99389M69175M23278M06208M96490M14814R78003
3928C8683913Q29150Q02943J300065J571667K150136K599446K802372K808715
$$ plain form
3920 53548407 56391297 58514376 59560483 59450302 57931061 55515657 52499688 49040424
3912 49040424 45771107 42966954 40366589 38385225 36568736 35088827 33800549 32768920
3904 32768920 32258150 31456023 30849119 30186154 29926652 29775991 29210285 28487733 27974376
3895 27974376 27341559 26806900 26475934 25951186 25434335 25108735 24577114 24192447 24009141
3886 24009141 23964901 24103201 24180971 24039530 23820615 23805322 23201388 22518843 21995421 21328083
3876 21328083 20522366 20155693 19970279 19868057 19742293 19846381 19827284 19624994 19924830 19889465
3866 19889465 19748587 19650032 19641163 19639243 19656935 19494590 19637930 19682905 19583634 19363465 18820563
3855 18820563 18266674 17866106 17528299 17371455 17179435 16900963 16692421 16669414 16952195 16888520
$$ packed form
3920E3548407K842890K123079J046107j10181j519241k415404l015969l459264
3912D9040424l269317k804153k600365j981364j816489j479909j288278j031629
3904C2768920n10770q02127o06904o62965k59502j50661n65706p22552n13357
3895B7974376o32817n34659l30966n24748n16851l25600n31621l84667j83306
3886B4009141m4240J38300P7770j41441k18915j5293o03934o82545n23422o67338
3876B1328083q05717l66673j85414j02222j25764J04088j9097k02290K99836l5365
3866A9889465j40878r8555q869j920J7692j62345J43340M4975r9271k20169n42902
3855A8820563n53889m00568l37807j56844j92020k78472k08542k3007K82781o3675
$$ plain form
3845 16888520 16970089 17140663 17530446 18101030 18415097 18611069 19106804 19514350 19821705 20020380
3835 20020380 19978827 20255541 20504031 20660171 20964955 21380818 21665055 22140974 22987249 23574435
3825 23574435 23786801 23358496 22705314 22277132 21611124 20982067 20642734 20134706 19923522
3816 19923522 20033220 20210371 20332988 20736713 20821685 20960428 21269618 21360748 21969999 22563867
3806 22563867 22805406 22929046 23191751 22974460 22835753 23001509 22979030 22869263 23225755 23461835
3796 23461835 23305740 23441890 23833272 24327380 24882197 25195539 25353936 24790361 24024274
3787 24024274 23209826 22679999 22415759 22259779 22195141 22377042 22956833 23469303 23928146 24418196
3777 24418196 25017641 25656799 26069764 26535917 26902740 27292289 27848879 28235985 28378861
$$ packed form
3845A6888520Q1569J70574L89783N70584L14067J95972M95735M07546L07355J98675
3835B0020380m1553K76714K48490J56140L04784M15863K84237M75919Q46275N87186
3825B3574435K12366m28305o53182m28182o66008o29057l39333n08028k11184
3816A9923522J09698J77151J22617M03725Q4972J38743L09190R1130O09251N93868
3806B2563867K41539J23640K62705k17291j38707J65756k2479j09767L56492K36080
3796B3461835j56095J36150L91382M94108N54817L13342J58397n63575p66087
3787B4024274q14448n29827k64240j55980o4638J81901N79791N12470M58843M90050
3777B4418196N99445O39158M12965M66153L66823L89549N56590L87106J42876
$$ plain form
3768 28378861 28297869 28499277 28593194 28403808 28193928 27665601 26897696 26334116 25697395 25126249
3758 25126249 25008234 24993732 24610985 24508647 24377662 24157653 23863346 23652272 23242081 22854264
3748 22854264 22687598 22585833 22607662 22698819 22995032 23369718 23784701 24056730 24165220 24035384
3738 24035384 24028164 23924982 23734399 23496706 23508280 23951554 23901530 23476987 22954993 22897248
3728 22897248 22786930 22643336 22631383 22812207 22934018 23387109 23698926 23711131 23484826 22767316
3718 22767316 21829438 21090025 20480933 19866448 19484156 19125791 18653433 18456168 18479767 18330950
3708 18330950 18398400 18104779 18134802 18409378 18806725 19273577 19838809 20242857 20066997 20065348
3698 20065348 20071723 19738513 19274416 18975513 18631585 18414097 18123280 18070351 17736810 17636563
$$ packed form
3768B8378861q0992K01408R3917j89386k09880n28327p67905n63580o36721n71146
3758B5126249j18015j4502l82747j02338j30985k20009k94307k11074m10191l87817
3748B2854264j66666j01765K1829R1157K96213L74686M14983K72029J08490j29836
3738B4035384p220j03182j90583k37693J1574M43274n0024m24543n21994n7745
3728B2897248j10318j43594j1953J80824J21811M53091L11817J2205k26305p17510
3718B2767316r37878p39413o09092o14485l82292l58365m72358j97265K3599j48817
3708A8330950O7450k93621L0023K74576L97347M66852N65232M04048j75860j649
3698B0065348O375l33210m64097k98903l43928k17488k90817n2929l33541j00247
$$ plain form
3688 17636563 17888312 17704417 17758674 17421579 17334571 17233822 16968981 16949862 16987405 17092447
3678 17092447 17195911 17254799 17559034 17927555 17705907 17832447 17862231 18019462 18278488 18712606
3668 18712606 19091929 19471205 20079138 20606761 21062805 21453920 21920939 22375417 23224906
3659 23224906 24494832 26021179 28062062 31024548 34809998 39263513 40521566 37878531
3651 37878531 33647131 30231259 27875458 26368101 25385932 24633544 24420047 24163539 24042247
3642 24042247 24149297 24199665 24517492 25053206 25287381 25241953 25316278 25418203 25408810 26025309
3632 26025309 26636496 27596607 29019268 30367378 32253386 34314765 36746931 40434163
3624 40434163 45467862 52439128 61347078 65708248 61878216 53830253 46201386 41039842
$$ packed form
3688A7636563K51749j83895N4257l37095q7008j00749k64841j9119L7543J05042
3678A7092447J03464N8888L04235L68521k21648J26540K9784J57231K59026M34118
3668A8712606L79323L79276O07933N27623M56044L91115M67019M54478Q49489
3659B3224906J269926J526347K040883K962486L785450M453515J258053k643035
3651C7878531m231400l415872k355801j507357r82169p52388k13497k56508j21292
3642B4042247J07050N0368L17827N35714K34175m5428P4325J01925r393O16499
3632B6025309O11187R60111J422661J348110J886008K061379K432166L687232
3624D0434163N033699O971266Q907950M361170l830032q047963p628867n161544
$$ plain form
3616 41039842 37096568 34544103 33080564 32226887 31878459 31689095 31833288 31797890 31771510
3607 31771510 31887311 31969060 31956426 31971096 31775287 30942061 30014553 29413420 28978851 28968777
3597 28968777 29157912 29628829 30723209 31941634 33693498 36109133 39443339 43630482
3589 43630482 46463287 45471337 42118636 38743491 36244578 34347065 33186320 32572761
3581 32572761 32434532 32553382 32934923 33416371 34146212 35124173 35931590 36467865 36435150 36100949
3571 36100949 35586732 35321282 35183323 34697574 34127447 33545702 33473283 33607230 33606965 33607870 33883651
3560 33883651 34260356 34689315 35164434 35725047 36556234 37447139 38274823 39216724 40217559
3551 40217559 41224322 42110845 42537399 42398142 42235271 42550731 42941844 43915804 44594877
$$ packed form
3616D1039842l943274k552465j463539q53677l48428j89364J44193l5398k6380
3607C1771510J15801Q1749j2634J4670j95809q33226r27508o01133m34569j0074
3597B8968777J89135M70917J094380J218425J751864K415635L334206M187143
3589D3630482K832805r91950l352701l375145k498913j897513j160745o13559
3581C2572761j38229J18850L81541M81448P29841R77961Q07417N36275l2715l34201
3571C6100949n14217k65450j37959m85749n70127n81745p2419J33947k65R05K75781
3560C3883651L76705M28959M75119N60613Q31187Q90905Q27684R41901J000835
3551D0217559J006763Q86523M26554j39257j62871L15460L91113R73960O79073
$$ plain form
3542 44594877 44705846 45068564 45146410 45621268 46373939 46983205 47647003 47809273 48007408 48224464
3532 48224464 48080031 47943667 48002896 47873361 47759178 47938071 47862275 47947681 48296724 48631898
3522 48631898 49507282 50284642 51186740 52239732 53366301 54498864 55675341 56792405 57993899
3513 57993899 59114919 60514839 62302101 64410338 66887296 69745001 73155132 76543444
3505 76543444 78784574 80401757 80987183 80779682 80278970 80158945 80500666 81254057 82441228
3496 82441228 84006798 86057131 88504512 91212448 93644736 96510484 99479930 102832314
3488 102832314 106430989 110093196 114157798 118670196 123496789 128559312 133855014 139515439
3480 139515439 145530590 151968111 158320949 164424836 170096598 175362974 179509625 181882546
$$ packed form
3542D4594877J10969L62718P7846M74858P52671O09266O63798J62270J98135K17056
3532D8224464j44433j36364N9229j29535j14183J78893p5796Q5406L49043L35174
3522D8631898Q75384P77360R02098J052992J126569J132563J176477J117064J201494
3513E7993899J121020J399920J787262K108237K476958K857705L410131L388312
3505G6543444K241130J617183N85426k07501n00712j20025L41721P53391J187171
3496H2441228J565570K050333K447381K707936K432288K865748K969446L352384
3488A02832314L598675L662207M064602M512398M826593N062523N295702N660425
3480A39515439O015151O437521O352838O103887N671762N266376M146651K372921
$$ plain form
3472 181882546 183015071 184761701 189542569 198687069 212295787 228974122 242836108 246379655
3464 246379655 238281399 224655104 210583946 196495604 182042929 167522491 153444799
3457 153444799 141677054 132746115 126026056 120725689 116512806 113397615 111149954 109718182
3449 109718182 109006114 109238210 110352217 112575415 116035240 120682687 127167606 135204622
3441 135204622 144605779 155340215 168767905 186761457 211193222 243526792 283147641
3434 283147641 323128504 342825469 333827936 309592089 283447864 255774145 224136516
3427 224136516 193543160 167972805 148508967 133895412 122488469 113719423 106335555
3420 106335555 100295466 95142978 91091002 87759710 85248567 83533616 82543488 82421191
$$ packed form
3472A81882546J132525J746630M780868R144500J3608718J6678335J3861986L543547
3464B46379655q098256j3626295j4071158j4088342j4452675j4520438j4077692
3457A53444799j1767745q930939o720059n300367m212883l115191k247661j431772
3449A09718182p12068K32096J114007K223198L459825M647447O484919Q037016
3441A35204622R401157J0734436J3427690J7993552K4431765L2333570L9620849
3434B83147641L9980863J9696965q997533k4235847k6144225k7673719l1637629
3427B24136516l0593356k5570355j9463838j4613555j1406943q769046p383868
3420A06335555o040089n152488m051976l331292k511143j714951r90128j22297
$$ plain form
3412 82421191 82910427 84367361 86000039 88067604 91155503 95660494 102335743 111806826
3404 111806826 124787427 141358084 158914408 170582714 169814532 159125010 144783627
3397 144783627 130052359 115118835 100588508 88478499 78952806 71171660 65379475
3390 65379475 60424735 56208357 52523167 49373949 46911499 44593028 42219868 39926744
3382 39926744 38272114 36813932 35485064 34521457 33366891 32030980 31024526 30322044
3374 30322044 29537652 28855455 28386804 27916223 27439405 26838814 26154991 25462708 24883087
3365 24883087 24326723 23924932 23393030 22611799 21923504 21406768 20990502 20598121 20307181
3356 20307181 19786465 19276258 18948704 18568256 18343253 18169891 17962843 17486676 17260760
$$ packed form
3412H2421191M89236J456934J632678K067565L087899M504991O675249R471083
3404A11806826J2980601J6570657J7556324J1668306p68182j0689522j4341383
3397A44783627j4731268j4933524j4530327j2110009r525693p781146n792185
3390F5379475m954740m216378l685190l149218k462450k318471k373160k293124
3382C9926744j654630j458182j328868r63607j154566j335911j006454p02482
3374C0322044p84392o82197m68651m70581m76818o00591o83823o92283n79621
3365B4883087n56364m01791n31902p81231o88295n16736m16266l92381k90940
3356B0307181n20716n10207l27554l80448k25003j73362k07048m76167k25916
$$ plain form
3347 17260760 17027348 16627761 16351221 16106022 15850646 15789227 15605938 15454812 15418937 15521988
3337 15521988 15365808 15108880 15165061 15017442 14702849 14272378 14090561 14017183 13817965 13459520
3327 13459520 13260955 12949999 12742059 12490236 12494480 12460984 12282934 12367809 12252788 12055542
3317 12055542 12030965 12197368 12117072 11990257 12062292 12078079 11991950 11954270 11762439 12059579
3307 12059579 12151802 11912568 11660028 11617289 11480499 11361083 11214909 11144940 10878984 10758526
3297 10758526 10531804 10524015 10557132 10355447 10298505 10136682 10046699 9990228 10157262 10249992 10157631
3286 10157631 10253855 10283626 10380851 10474773 10658004 11029491 10990870 10858381 11070856 10977671
3276 10977671 10806868 10827516 10652307 10695646 10536121 10488632 10552168 10691846 10684786 10595999 10550048
$$ packed form
3347A7260760k33412l99587k76540k45199k55376o1419j83289j51126l5875J03051
3337A5521988j56180k56928N6181j47619l14593m30471j81817p3378j99218l58445
3327A3459520j98565l10956k07940k51823M244l3496j78050Q4875j15021j97246
3317A2055542k4577J66403q0296j26815P2035J5787q6129l7680j91831K97140
3307A2059579R2223k39234k52540m2739j36790j19416j46174o9969k65956j20458
3297A0758526k26722p789L3117k01685n6942j61823q9983n6471J67034R2730r2361
3286A0157631R6224K9771R7225R3922J83231L71487l8621j32489K12475r3185
3276A0977671j70803K0648j75209M3339j59525m7489O3536J39678p060q8787m5951
$$ plain form
3265 10550048 10575498 10615381 10840989 11119363 10950925 10690781 10739807 10848080 11118281 11396102
3255 11396102 11352223 11321956 11491935 11717973 12091472 12530411 12939372 13530353 14015346 14287080
3245 14287080 14534879 14921427 15230240 15594088 15952203 16184765 16441328 17093899 17644807
3236 17644807 18152983 18680222 19065341 19818816 20397950 20991489 21670715 22655905 23906374
3227 23906374 25894453 28598243 31337255 33686567 36035002 38025447 39055974 38526571
3219 38526571 37451039 36050793 34601620 33791794 34013186 34900753 36548307 38120110 39267205
3210 39267205 39535982 38289505 36648473 34799325 33056912 32022302 31591234 31401168 31747427
3201 31747427 32390106 33085619 33599046 33701815 33726868 34255321 35672571 38149834 41739504
$$ packed form
3265A0550048K5450L9883K25608K78374j68438k60144M9026J08273K70201K77821
3255A1396102m3879l0267J69979K26038L73499M38939M08961N90981M84993K71734
3245A4287080K47799L86548L08813L63848L58115K32562K56563O52571N50908
3236A7644807N08176N27239L85119P53475N79134N93539O79226R85190J250469
3227B3906374J988079K703790K739012K349312K348435J990445J030527n29403
3219C8526571j075532j400246j449173q09826K21392Q87567J647554J571803J147095
3210C9267205K68777j246477j641032j849148j742413j034610m31068j90066L46259
3201C1747427O42679O95513N13427J02769K5053N28453J417250K477263L589670
$$ plain form
3192 41739504 46294706 51708891 56757814 60144818 60698461 58756918 55488688 52043189
3184 52043189 49132765 47571170 47663255 48937474 51164517 53347519 53599622 51559993 48452687
3175 48452687 44806030 41827337 39736971 38500252 37849421 37460633 37227271 37613287 37639666
3166 37639666 37687841 37894401 37905991 38331507 38864776 39685829 41045471 42107070 42873919
3157 42873919 43868947 44233576 43770198 43021996 42340810 41676233 40845437 40430971 40435832 41026121
3147 41026121 41866499 43210498 44510861 45331154 45266605 45202987 45043727 45428862 46213722
3138 46213722 47012841 47609077 47276576 46073934 44305249 42376866 40557872 38413947 36346648
3129 36346648 35088622 33970530 32925240 32334616 31913423 31459141 31357151 31241360 31345665
$$ packed form
3192D1739504M555202N414185N048923L387004N53643j941543l268230l445499
3184E2043189k910424j561595R2085J274219K227043K183002K52103k039629l107306
3175D8452687l646657k978693k090366j236719o50831l88788k33362L86016K6379
3166C7639666M8175K06560J1590M25516N33269Q21053J359642J061599P66849
3157D2873919R95028L64629m63378p48202o81186o64577q30796m14466M861N90289
3147D1026121Q40378J343999J300363Q20293o4549o3618j59260L85135P84860
3138D6213722P99119N96236l32501j202642j768685j928383j818994k143925k067299
3129C6346648j258026j118092j045290n90624m21193m54282j01990j15791J04305
$$ plain form
3120 31345665 31631774 31757208 32110141 32609930 32903197 33550905 34395014 35097918 35643063
3111 35643063 36284173 36574727 36481316 36238264 35853351 34943747 33987737 32938276 31773892
3102 31773892 30465250 29255834 27949331 26783099 25903194 25078943 24309772 23810629 23416216
3093 23416216 23015390 22831677 22834111 22815596 22761193 22500903 22211501 22192928 21606357 21261492
3083 21261492 20913484 20488832 20035171 19153822 18317765 17532448 16842304 16157880 15406055
3074 15406055 14538468 13803184 13241526 12914395 12624434 12317150 11715343 11154966 11040934
3065 11040934 10678302 10490554 10297120 10009127 9657174 9321541 9180957 9050048 8851989
3056 8851989 8553365 8130063 8092687 8070691 7759304 7508597 7286492 6798751 6517239 6416800
$$ packed form
3120C1345665K86109J25434L52933M99789K93267O47708Q44109P02904N45145
3111C5643063O41110K90554r3411k43052l84913r09604r56010j049461j164384
3102C1773892j308642j209416j306503j166232q79905q24251p69171m99143l94413
3093B3416216m00826j83713K434j8515n4403k60290k89402j8573n86571l44865
3083B1261492l48008m24652m53661q81349q36057p85317o90144o84424p51825
3074A5406055q67587p35284n61658l27131k89961l07284o01807n60377j14032
3065A1040934l62632j87748j93434k87993l51953l35633j40584j30909j98059
3056H851989k98624m23302l7376k1996l11387k50707k22105m87741k81512j00439
$$ plain form
3046 6416800 6242900 6104432 5933085 5831093 5866552 5798010 5784128 5850390 5492685 5249964
3036 5249964 5134795 5208782 4884578 4887976 4672687 4585614 4714617 4366105 4189914 4295034
3026 4295034 4174063 4057534 3770307 3647131 3725289 3852519 3803631 3721824 3494407 3310644
3016 3310644 3420813 3207602 3270687 3192192 3108199 3079986 2931604 2805086 2744039 2793302 2890317
3005 2890317 2770918 2634522 2642264 2519754 2269149 2151598 2360260 2236163 2224600 2260258
2995 2260258 2186073 2133597 2019948 1933229 1811896 1943515 1792913 1844637 1924170 1846621 1709840
2984 1709840 1700122 1664463 1700378 1811068 1865231 1719923 1608312 1524385 1564980 1392147 1211784
2973 1211784 1277665 1435103 1459693 1222917 1233949 1415024 1547607 1425208 1044143 894567
$$ packed form
3046F416800j73900j38468j71347j01992L5459o8542j3882O6262l57705k42721
3036E249964j15169P3987l24204L398k15289q7073J29003l48512j76191J05120
3026D295034j20971j16529k87227j23176P8158J27230m8888q1807k27417j83763
3016C310644J10169k13211O3085p8495q3993k8213j48382j26518o1047M9263R7015
3005B890317j19399j36396P742j22510k50605j17551K08662j24097j1563L5658
2995B260258p4185n2476j13649q6719j21333J31619j50602N1724P9533p7549j36781
2984A709840r718l5659L5915J10690N4163j45308j11611q3927M0595j72833j80363
2973A211784O5881J57438K4590k36776J1032J81075J32583j22399l81065j49576
$$ plain form
2963 894567 1048548 1052648 996047 1111141 1114555 1089683 946751 909910 880573 978564 1080521
2952 1080521 1038428 1093080 965405 912026 940452 841398 870109 940125 802675 705266 831296
2941 831296 835954 716241 751531 858038 831099 837767 792771 800092 883491 797557 759897 726313
2929 726313 630902 618548 521547 690307 797809 545044 751874 697011 769420 785047 849553
2918 849553 785359 860242 745384 664584 862779 902128 904063 907684 807389 873785 721667
2907 721667 379865 271662 526315 559372 682227 870821 821011 676543 467556 438349
2897 438349 564665 609875 434554 583427 662984 646205 593525 651499 634580 669240 524942
2886 524942 473423 449448 672513 793314 483459 657178 647614 577374 668111 691597 655476
$$ packed form
2963H94567J53981M100n6601J15094L414k4872j42932l6841k9337R7991J01957
2952A080521m2093N4652j27675n3379K8426r9054K8711P0016j37450r7409J26030
2941H31296M658j19713L5290J06507k6939O668m4996P321Q3399q5934l7660l3584
2929G26313r5411j2354r7001J68760J07502k52765K06830n4863P2409J5627O4506
2918H49553o4194P4883j14858q0800J98195L9349J935L621j00295O6396j52118
2907G21667l41802j08203K54653L3057J22855J88594m9810j44468k08987k9207
2897D38349J26316M5210j75321J48873P9557j6779n2680N7974j6919L4660j44298
2886E24942n1519k3975K23065J20801l09855J73719r564p0240R0737K3486l6121
$$ plain form
2875 655476 489244 591788 579700 647748 563494 477573 457331 486061 468049 258868 553550
2864 553550 645388 425707 610241 569410 505003 459883 447478 218063 282070 526555 440676
2853 440676 448177 193138 185921 419693 371525 387889 254703 257270 148097 345824 418339
2842 418339 397379 240443 284024 257352 323566 323407 26671 87949 87645 372973 505691 334423
2830 334423 202978 380365 366046 216582 151980 199607 332241 303289 228930 398003 260502
2819 260502 400140 277918 82612 186342 321954 272095 388985 406707 224781 212830
2809 212830 168765 69571 220268 369817 438780 292843 100895 69910 97295 147601 71164
2798 71164 183357 136527 111049 24903 77938 198908 326340 225586 115624 249655 475803
$$ packed form
2875F55476j66232J02544j2088O8048q4254q5921k0242K8730j8012k09181K94682
2864E53550R1838k19681J84534m0831o4407m5120j2405k29415O4007K44485q5879
2853D40676P501k55039p217K33772m8168J6364j33186K567j09173J97727P2515
2842D18339k0960j56936M3581k6672O6214j59k96736O1278l04K85328J32718j71268
2830C34423j31445J77387j4319j49464o4602M7627J32634k8952p4359J69073j37501
2819B60502J39638j22222j95306J03730J35612m9859J16890J7722j81926j1951
2809B12830m4065r9194J50697J49549O8963j45937j91948l0985K7385N0306p6437
2798G1164J12193m6830k5478q6146N3035J20970J27432j00754j09962J34031K26148
$$ plain form
2787 475803 277244 33227 90048 51315 -131455 -25987 251514 321509 379187 163875
2777 163875 60169 -83662 -260412 -213406 -137059 -179979 -247091 -155275 -229645 -169085 -36921
2766 -36921 -66129 -77493 -173320 -48122 -45150 -245454 -291980 -34397 -85288 -151278 -180901
2755 -180901 -305695 -132322 -384119 -370528 -159318 -234319 -195702 -74260 49091 -71521
2745 -71521 -136647 -129206 22130 -199045 -131460 -74618 -116924 -168248 -150645 -132187 -258116
2734 -258116 -342433 -181299 -186623 -194242 161029 323577 99104 -203501 -71995 80432 101246
2723 101246 66646 145204 252883 70341 -108841 -10985 72762 -95507 -250113 -316842 -295439
2712 -295439 -359087 -306706 -229879 -16449 61888 27104 53471 -182772 40442 125696 90034
$$ packed form
2787D75803j98559k44017N6821l8733j82770J05468K77501O9995N7678k15312
2777A63875j03706j43831j76750M7006P6347m2920o7112R1816p4370O0560J32164
2766c6921k9208j1364r5827J25198K972k00304m6526K57583n0891o5990k9623
2755a80901j24794J73373k51797J3591K11210p5001L8617J21442J23351j20612
2745g1521o5126P441J51336k21175O7585N6842m2306n1324J7603J8458j25929
2734b58116q4317J61134n324p619L55271J62548k24473l02605J31506J52427K0814
2723A01246l4600P8558J07679j82542j79182R7856Q3747j68269j54606o6729K1403
2712b95439o3648N2381P6827K13430P8337l4784K6367k36243K23214Q5254l5662
$$ plain form
2701 90034 47895 46327 -60357 -5624 -128487 -432844 -392398 -140817 -58400 -185145 -266736
2690 -266736 -159772 -22146 222557 82104 -45080 -44411 -133623 -482253 -526858 -259866 -295134
2679 -295134 -440444 -252036 -278437 -257645 -171779 -249776 -209596 -95576 -96086 -206149 -296412
2668 -296412 -290049 -131686 -259468 -137122 -5506 -157134 -119512 28826 -59016 -62544 -137901
2657 -137901 -210593 -56590 -37706 -140345 -98300 -83001 2254 -64736 -256462 -254814 -415838
2646 -415838 -380519 -253534 -264717 -306328 -363313 -171747 -248390 -284603 -195161 -26552 74034
2635 74034 -50832 -205424 -347729 -219953 -164120 -48658 56513 -17667 8637 -189567
2625 -189567 -238252 -155296 -351613 -404839 -391989 -110138 -63663 -90533 -177093 -252646 -306834
$$ packed form
2701I0034m2139j568j06684N4733j22863l04357M0446K51581Q2417j26745q1591
2690b66736J06964J37626K44703j40453j27184O69q9212l48630m4605K66992l5268
2679b95134j45310J88408k6401K0792Q5866p7997M0180J14020n10j10063r0263
2668b96412O363J58363j27782J22346J31616j51628L7622J48338q7842l528p5357
2657a37901p2692J54003J8884j02639M2045J5299Q5255o6990j91726J648j61024
2646d15838L5319J26985j1183m1611n6985J91566p6643l6213Q9442J68609J00586
2635G4034j24866j54592j42305J27776N5833J15462J05171p4180K6304j98204
2625a89567m8685Q2956j96317n3226J2850K81851M6475k6870q6560p5553n4188
$$ plain form
2614 -306834 -172681 -15759 -65244 -35278 -127706 25312 278552 266485 148832 264568
2604 264568 260657 301090 71850 -41544 -24774 -15706 -92535 -72698 -70126 20638 245317 111825
2592 111825 204280 10345 -61303 -70189 -143603 -66605 -235877 -336936 -113377 -142271 -195569
2581 -195569 -375777 -325039 -106838 -265142 -193098 -209475 -270309 -73436 -157436 -328424 -192778
2570 -192778 -112145 -137061 -243125 -241995 78952 5801 -276759 -205782 -270670 -53477 -137784
2559 -137784 -131380 -52821 -82652 -231407 -61711 -71276 -158730 -217122 -319662 -349342 -348164 -143795
2547 -143795 -34597 -222209 -21997 168230 109429 -145860 -305720 -141680 -90772 -19570
2537 -19570 -74859 -222921 -288441 -121269 -217419 -141334 69921 -66050 -360561 -350698 -193026
$$ packed form
2614c06834J34153J56922m9485K9966r2428J53018K53240j2067j17653J15736
2604B64568l911M0433k29240j13394J6770R068p6829J9837K572R0764K24679j33492
2592A11825R2455j93935p1648q886p3414P6998j69272j01059K23559k8894n3298
2581a95569j80208N0738K18201j58304P2044j6377o0834J96873q4000j70988J35646
2570a92778Q0633k4916j06064J130L20947p3151k82560P0977o4888K17193q4307
2559a37784O404P8559k9831j48755J69696r565q7454n8392j02540k9680J178K04369
2547a43795J09198j87612K00212J90227n8801k55289j59860J64040N0908P1202
2537a9570n5289j48062o5520J67172r6150P6085K11255j35971k94511R863J57672
$$ plain form
2526 -193026 36237 42082 4788 32484 -68089 -61779 -61316 34858 -76411 -175367 -123415 -153978
2514 -153978 -36574 213141 350265 301924 86092 -203971 -23974 -34487 -52420 153927
2504 153927 -91452 -35219 100743 11307 -156540 -126556 -87634 -79081 -93939 -55839 -95588
2493 -95588 -235696 -473280 -339894 -244645 -140748 176084 68214 -60821 -18194 10888
2483 10888 40904 39254 122310 175119 129043 310558 198484 266971 105421 32105 -3676
2472 -3676 -9152 -41667 66071 35799 29821 34022 41049 119461 129933 54554 296352 408737
2460 408737 304612 171331 253936 103833 129904 292245 111069 71606 158123 245137 208088
2449 208088 156286 322070 220865 305917 416316 330169 389323 207214 385663 466379 517448
$$ packed form
2526a93026K29263N845l7294K7696j00573O310M63R6174j11269r8956N1952l0563
2514a53978J17404K49715J37124m8341k15832k90063J79997j0513j7933K06347
2504A53927k45379N6233J35962q9436j67847K9984L8922Q553j4858L8100l9749
2493i5588j40108k37584J33386R5249J03897L16832j07870j29035M2627K9082
2483A0888L0016j650Q3056N2809m6076J81515j12074O8487j61550p3316l5781
2472c676n476l2515J07738l0272n978M201P027P8412J0472p5379K41798J12385
2460D08737j04125j33281Q2605j50103K6071J62341j81176l9463Q6517Q7014l7049
2449B08088n1802J65784j01205Q5052J10399q6147N9154j82109J78449Q0716N1069
$$ plain form
2438 517448 416082 281805 459813 271691 243919 243548 380336 363888 311375 258682 251514
2427 251514 510079 520302 697835 827337 707876 983153 905736 682415 824486 774544
2417 774544 1021330 1197414 1121931 1037506 1060208 1024920 1115203 1246474 1238883 1219376 1141827
2406 1141827 1169081 1222934 1245606 1297976 1222778 1325754 1278064 1310119 1412659 1506948 1602329
2395 1602329 1814139 1761916 1822295 1948787 1920778 1954285 2129954 2203933 2168089 2095040 2210438
2384 2210438 2429609 2675392 2668734 2772203 2728834 2932531 2964175 3141311 3359019 3531696
2374 3531696 3583949 3606894 3698555 4040531 4109026 3944154 4231175 4409364 4732792 5145428
2364 5145428 5239196 5481207 5737774 6148296 6310624 6423191 6805463 7262541 7646158 8074981
$$ packed form
2438E17448j01366j34277J78008j88122k7772l71J36788j6448n2513n2693p168
2427B51514K58565J0223J77533J29502j19461K75277p7417k23321J42071m9942
2417G74544K46786J76084p5483q4425K2702l5288R0283J31271p591j9507p7549
2406A141827K7254N3853K2672N2370p5198J02976m7690L2055J02540R4289R5381
2395A602329K11810n2223O0379J26492k8009L3507J75669P3979l5844p3049J15398
2384B210438K19171K45783o658J03469m3369K03697L1644J77136K17708J72677
2374C531696N2253K2945R1661L41976O8495j64872K87021J78189L23428M12636
2364E145428R3768K42011K56567M10522J62328J12567L82272M57078L83617M28823
$$ plain form
2354 8074981 8868288 9853247 10682241 11067902 11458997 12123777 13337170 14807724 16710023
2345 16710023 19325436 22740754 27323446 33222682 40355401 50361263 64233784 81329743
2337 81329743 87278024 76746483 59900584 45953196 36717208 29818306 24849872 21334772
2329 21334772 18746578 16665564 15283182 13854116 12810605 12356180 11844791 10995430 10278476
2320 10278476 9354931 8147795 7487183 6995359 6443540 6129586 5688999 5203076 4785603
2311 4785603 4642938 4401563 4193810 4060207 3874636 3588577 3481608 3448813 3274356 2975727
2301 2975727 2708957 2741789 2595618 2497754 2260302 1983107 2148761 2206772 1963073 1946061
2291 1946061 1883997 1612762 1686414 1757704 1824598 1705854 1491501 1354309 1178019 1354649
$$ packed form
2354H074981P93307R84959Q28994L85661L91095O64780J213393J470554J902299
2345A6710023K615413L415318M582692N899236P132719J0005862J3872521J7095959
2337H1329743N948281j0531541j6845899j3947388r235988o898902m968434l515100
2329B1334772k588194k081014j382382j429066j043511m54425n11389q49361p16954
2320A0278476r23545j207136o60612m91824n51819l13954m40587m85923m17473
2311D785603j42665k41375k07753j33603j85571k86059j06969l2795j74457k98629
2301B975727k66770L2832j46171r7864k37452k77195J65654N8011k43699j7012
2291A946061o2064k71235P3652P1290O6894j18744k14353j37192j76290J76630
$$ plain form
2281 1354649 1408647 1099103 988916 1061272 1066808 1123473 997417 780089 823658 865541 868039
2270 868039 828902 778886 753207 710656 670982 491665 492529 544195 482569 409589 417113 566535
2258 566535 359463 324294 454535 418722 354406 404529 481172 259832 430330 389913 253066
2247 253066 232070 62654 208413 344430 251359 135628 406875 412034 159428 134740 -34531
2236 -34531 -24997 -32472 60649 118017 -27861 99714 109530 146802 -157084 83596 108574 136949
2224 136949 69248 -164852 -36975 38864 -34662 48666 -73243 -142014 72694 -35085 -187153
2213 -187153 -358676 -244550 -163230 -22773 -24895 150478 65605 109303 199600 15569 -241459
2202 -241459 -304996 -35881 -36929 180679 253289 67937 176473 200307 187954 175065 406257
$$ packed form
2281A354649N3998l09544j10187P2356N536N6665j26056k17328M3569M1883K498
2270H68039l9137n0016k5679m2551l9674j79317Q64N1666o1626p2980P524J49422
2258E66535k07072l5169J30241l5813o4316N0123P6643k21340J70498m0417j36847
2247B53066k0996j69416J45759J36017r3071j15731K71247N159k52606k4688j69271
2236c4531R534p475R3121N7368j45878J27575R816L7272l03886K40680K4978K8375
2224A36949o7701k34100J27877P5839p3526Q3328j21909o8771K14708j07779j52068
2213a87153j71523J14126Q1320J40457k122J75373q4873M3698R0297j84031k57028
2202b41459o3537K69115j048K17608P2610j85352J08536K3834j2353j2889K31192
$$ plain form
2191 406257 284028 -149379 -216250 -22921 -103205 -198136 -391061 -179024 -72963 103020
2181 103020 -31371 -67006 -82428 -258374 -118035 -109983 4328 -227043 -416843 -279878
2171 -279878 -109073 -61196 -48601 -104642 -131890 -59265 -123620 -355870 -413071 -198470 -213613
2160 -213613 -160621 -83658 -287403 -297782 -372877 -463267 -400649 -277173 -254440 -110948 28966
2149 28966 146407 -103889 -406919 -576356 -298255 -167505 -95437 39324 -192844 -264724
2139 -264724 -253615 -221301 -193579 -98646 -275326 -121408 -171065 -270491 -238064 -150586 -150075 -161927
2127 -161927 -80014 -232606 -107461 -75520 104254 270065 -102664 -302239 -412582 -394736
2117 -394736 -102652 -105633 -83801 -250772 -335927 -425889 -192714 -310242 -237623 -407518 -376660
$$ packed form
2191D06257j22229m33407o6871J93329q0284r4931j92925K12037J06061J75983
2181A03020j34391l5635j5422j75946J40339Q052J14311k31371j89800J36965
2171b79878J70805M7877J2595n6041k7248P2625o4355k32250n7201K14601j5143
2160b13613N2992P6963k03745j0379p5095r0390O2618J23476K2733J43492J39914
2149B8966J17441k50296l03030j69437K78101J30750P2068J34761k32168p1880
2139b64724J1109L2314K7722R4933j76680J53918m9657r9426L2427Q7478N11j1852
2127a61927Q1913j52592J25145L1941J79774J65811l72729j99575j10343J7846
2117c94736K92084k981K1832j66971q5155q9962K33175j17528P2619j69895L0858
$$ plain form
2106 -376660 -318793 -219039 -303083 -232444 -328160 -279541 -316248 -204033 -280680 -387341 -343680
2095 -343680 -330108 -119574 121099 77420 92588 -39906 -292082 -97895 -127955 -168104 -327798
$$ packed form
2106c76660N7867R9754q4044P0639r5716M8619l6707J12215p6647j06661M3661
2095c43680J3572K10534K40673m3679J5168j32494k52176J94187l0060m0149j59694
$$ [...]
##END NTUPLES=NMR SPECTRUM
##END=
