##TITLE=1H_EC-3304
 CDCl3
 8 sc, 
 2.11.2023
##JCAMPDX= 6.0         $$ Bruker NMR JCAMP-DX V2.0
##DATA TYPE= NMR SPECTRUM
##DATA CLASS= NTUPLES
##ORIGIN= UXNMR, Bruker Analytische Messtechnik GmbH
##OWNER= root
$$ XWIN-NMR		Version 3.5
$$ Thu Nov  2 13:15:38 2023 Russian Standard Time (UT+4h)  she@DPX200
##.OBSERVE FREQUENCY= 200.13135
##.OBSERVE NUCLEUS= ^1H
##.ACQUISITION MODE= SIMULTANEOUS
##.ACQUISITION SCHEME= undefined
##.AVERAGES= 8
##.DIGITISER RES= 18
##SPECTROMETER/DATA SYSTEM= spect
##.PULSE SEQUENCE= zg30
##.SOLVENT NAME= CDCl3
##.SHIFT REFERENCE= (INTERNAL, CDCl3, 0, 15.694)
##AUDIT TRAIL= $$ (NUMBER, WHEN, WHO, WHERE, WHAT)
$$ ##TITLE= Audit trail, XWIN-NMR		Version 3.5
$$ ##JCAMPDX= 5.01
$$ ##ORIGIN= Bruker BioSpin GmbH
$$ ##OWNER= she
$$ F:/spectra/data/she/nmr/H-F/1/pdata/1/auditp.txt
$$ ##AUDIT TRAIL=  $$ (NUMBER, WHEN, WHO, WHERE, WHAT)
(   1,<2023-11-02 13:14:16.37 +0400>,<she>,<DPX200>,
      <created by zg, POWCHK disabled, PULCHK disabled
       configuration hash MD5:
       00 E9 B6 7A A2 85 ED C7 34 08 36 98 17 FE 4E 26
       data hash MD5: 16K
       59 1E CF EA 5F 55 10 85 5D 1A DB 40 C1 B7 85 3A>)
(   2,<2023-11-02 13:14:19.37 +0400>,<she>,<DPX200>,
      <Start of raw data processing
       efp BC_mod = 2 LB = 0.24 FT_mod = 6 PKNL = 1 PHC0 = -23877.57 PHC1 = 10.6527 SI = 16K 
       data hash MD5: 16K
       7F 6F F7 2D 8E A4 1E 12 0F 2F 0E 6C D0 3E 0C 2F>)
(   3,<2023-11-02 13:14:41.06 +0400>,<she>,<DPX200>,
      <pk PHC0 = 3.66568 PHC1 = -2 
       data hash MD5: 16K
       54 FF E0 88 C9 19 C1 5B 5E C4 DE 40 4B C7 A5 FA>)
(   4,<2023-11-02 13:14:44.62 +0400>,<she>,<DPX200>,
      <abs ABSG = 5 
       data hash MD5: 16K
       69 ED CD 5D 2F 7C A7 FC C4 44 50 51 45 24 E2 5C>)
$$ ##END=
$$ 
$$ hash MD5
$$ F5 8D 79 02 57 BA 12 65 B4 39 C6 C9 43 10 0E 2A
##$RELAX= 
##$RELAX= 
##$RELAX= 
##$RELAX= 
##$RELAX= 
##$RELAX= 
$$ Bruker specific parameters
$$ --------------------------
##$DU= <F:/spectra>
##$EXPNO= 1
##$NAME= <H-F>
##$PROCNO= 1
##$TYPE= <nmr>
##$USER= <she>
##$AMP= (0..31)
100 100 100 100 100 100 100 100 100 100 100 100 100 100 100 100 100 100 
100 100 100 100 100 100 100 100 100 100 100 100 100 100 
##$AQSEQ= 0
##$AQ_mod= 1
##$AUNM= <au_zg>
##$AUTOPOS= <>
##$BF1= 200.13
##$BF2= 200.13
##$BF3= 200.13
##$BF4= 200.13
##$BF5= 200.13
##$BF6= 200.13
##$BF7= 200.13
##$BF8= 200.13
##$BYTORDA= 1
##$CFDGTYP= 0
##$CFRGTYP= 5
##$CHEMSTR= <none>
##$CNST= (0..31)
1 1 145 1 1 1 1 1 1 1 1 1 1 1 1 1 1 1 1 1 1 1 1 1 1 1 1 1 1 1 1 1 
##$CPDPRG= <>
##$CPDPRG1= <>
##$CPDPRG2= <>
##$CPDPRG3= <>
##$CPDPRG4= <mlev>
##$CPDPRG5= <mlev>
##$CPDPRG6= <mlev>
##$CPDPRG7= <mlev>
##$CPDPRG8= <mlev>
##$CPDPRGB= <>
##$CPDPRGT= <>
##$D= (0..31)
0 1.2 0 0 0 0 0 0 0 0.06 0 0.03 0 0 0 0 0.0002 0 0 0 0 0 0 0 0 0 0 0 0 
0 0 0 
##$DATE= 1698916455
##$DBL= (0..7)
120 120 120 120 120 120 120 120 
##$DBP= (0..7)
150 150 150 150 150 150 150 150 
##$DBP07= 0
##$DBPNAM0= <>
##$DBPNAM1= <>
##$DBPNAM2= <>
##$DBPNAM3= <>
##$DBPNAM4= <>
##$DBPNAM5= <>
$$ [...]
##$SUBNAM3= <"">
##$SUBNAM4= <"">
##$SUBNAM5= <"">
##$SUBNAM6= <"">
##$SUBNAM7= <"">
##$SUBNAM8= <"">
##$SUBNAM9= <"">
##$SW= 18.05172834244
##$SWIBOX= (0..15)
0 0 2 0 0 0 0 0 0 0 0 0 0 0 0 0 
##$SW_h= 3612.71676300578
##$TD= 16384
##$TD0= 1
##$TE= 0
##$TE2= 300
##$TE3= 300
##$TEG= 300
##$TL= (0..7)
0 120 120 120 120 120 120 120 
##$TP= (0..7)
150 150 150 150 150 150 150 150 
##$TP07= 0
##$TPNAME0= <>
##$TPNAME1= <>
##$TPNAME2= <>
##$TPNAME3= <>
##$TPNAME4= <>
##$TPNAME5= <>
##$TPNAME6= <>
##$TPNAME7= <>
##$TPOAL= (0..7)
0.5 0.5 0.5 0.5 0.5 0.5 0.5 0.5 
##$TPOFFS= (0..7)
0 0 0 0 0 0 0 0 
##$TUNHIN= 0
##$TUNHOUT= 0
##$TUNXOUT= 0
##$USERA1= <user>
##$USERA2= <user>
##$USERA3= <user>
##$USERA4= <user>
##$USERA5= <user>
##$V9= 5
##$VALIST= <valist>
##$VCLIST= <CCCCCCCCCCCCCCC>
##$VD= 0
##$VDLIST= <DDDDDDDDDDDDDDD>
##$VPLIST= <PPPPPPPPPPPPPPP>
##$VTLIST= <TTTTTTTTTTTTTTT>
##$WBST= 1024
##$WBSW= 4
##$XGAIN= (0..3)
0 0 0 0 
##$XL= 0
##$YL= 0
##$YMAX_a= 696857
##$YMIN_a= -1012504
##$ZGOPTNS= <>
##$ZL1= 120
##$ZL2= 120
##$ZL3= 120
##$ZL4= 120
##$ABSF1= 15.74799
##$ABSF2= -2.30386
##$ABSG= 5
##$ABSL= 3
##$ALPHA= 0
##$AQORDER= 0
##$ASSFAC= 0
##$ASSFACI= 0
##$ASSFACX= 0
##$ASSWID= 0
##$AUNMP= <proc_1d>
##$AZFE= 0.1
##$AZFW= 0.1
##$BCFW= 0
##$BC_mod= 2
##$BYTORDP= 0
##$COROFFS= 0
##$CY= -3
##$DATMOD= 1
##$DC= 0
##$DFILT= <>
##$DTYPP= 0
##$F1P= 0
##$F2P= 0
##$FCOR= 1
##$FTSIZE= 16384
##$FT_mod= 6
##$GAMMA= 0
##$GB= 0
##$INTBC= 1
##$INTSCL= 3.70164e-10
##$ISEN= 128
##$LB= 0.24
##$LEV0= 0
##$LPBIN= 0
##$MAXI= 10000
##$MC2= 0
##$MEAN= 0
##$ME_mod= 0
##$MI= 1.114404
##$NCOEF= 0
##$NC_proc= -6
##$NLEV= 6
##$NOISF1= 3.799351
##$NOISF2= 2.8
##$NSP= 0
##$NTH_PI= 0
##$NZP= 0
##$OFFSET= 15.694
##$PC= 1
##$PHC0= -23873.9
##$PHC1= 8.6527
##$PH_mod= 1
##$PKNL= yes
##$PPARMOD= 0
##$PSCAL= 0
##$PSIGN= 0
##$REVERSE= no
##$SF= 200.130015517225
##$SI= 16384
##$SIGF1= 3
##$SIGF2= 2
##$SINO= 5.538805
##$SIOLD= 16384
##$SREGLST= <1H.CDCl3>
##$SSB= 0
##$STSI= 16384
##$STSR= 0
##$SW_p= 3612.71676300578
##$SYMM= 0
##$S_DEV= 0
##$TDeff= 16384
##$TDoff= 0
##$TI= <>
##$TILT= no
##$TM1= 0
##$TM2= 0
##$TOPLEV= 0
##$USERP1= <user>
##$USERP2= <user>
##$USERP3= <user>
##$USERP4= <user>
##$USERP5= <user>
##$WDW= 1
##$XDIM= 16384
##$YMAX_p= 497014212
##$YMIN_p= -368048
$$ End of Bruker specific parameters
$$ ---------------------------------
##NTUPLES= NMR SPECTRUM
##VAR_NAME=  FREQUENCY,     SPECTRUM/REAL,   SPECTRUM/IMAG
##SYMBOL=    X,             R,               I
##VAR_TYPE=  INDEPENDENT,   DEPENDENT,       DEPENDENT
##VAR_FORM=  AFFN,          ASDF,            ASDF
##VAR_DIM=   16384,         16384,           16384
##UNITS=     HZ,            ARBITRARY UNITS, ARBITRARY UNITS
##FACTOR=    0.220516191357247, 1,           1
##FIRST=     3140.8405123872, 0,             0
##LAST=      -471.876250618584, 0,           0
##MIN=       -471.876250618584, -368048,     0
##MAX=       3140.8405123872, 497014212,     0
$$ Real data points
##PAGE= N=1
##DATA TABLE= (X++(R..R)), XYDATA
$$ [...]
10072 100979 136457 79270 37734 -52382 -49115 -80726 -120119 27452 35200 -130117 -99332
10061 -99332 -17168 66069 122077 139902 18359 -23870 11374 45172 125434 93834 50703
10050 50703 85794 26535 59480 52625 97339 54258 45050 68602 124837 13298 52433 80297
10038 80297 56473 44946 -13694 -31079 -40402 -5069 99823 163448 35476 12833 41534
10027 41534 23143 -1202 68671 34234 -51562 -75631 1881 479 -22710 -55686 -553 37215
10015 37215 16225 44336 110187 85996 -35429 9163 123169 89467 88032 81989 68081 -20541
10003 -20541 -59553 59844 118909 187828 111885 173404 198961 229133 74791 -50112 16267
9992 16267 14555 146084 141758 74881 74652 97819 21312 93604 174965 106610 102694 106897 9520
9979 9520 6924 44293 60164 109209 174259 111660 34468 525 110840 93575 60219 42869
9967 42869 35544 179928 138160 71550 41933 48942 28257 75740 272687 229856 188955 262129
9955 262129 215352 138450 83438 89598 130761 91953 194302 148194 108162 151886 103954 96045
9943 96045 121030 113558 82126 69470 21078 40853 29487 38704 64669 63790 150353 171860 170299
9930 170299 166576 156779 188285 119987 2389 105330 144376 140914 101331 72199 111587 157947
9918 157947 198890 191193 145561 85514 133339 198109 120339 148966 106636 98386 136028 108689
9906 108689 141114 114864 144149 80083 88191 141323 145044 27464 81886 53587 100358 75658
9894 75658 158523 204077 181376 219563 245320 231492 251214 110412 110105 173049 134239 77073
9882 77073 138334 134498 112380 34481 99285 104567 93499 105983 117093 152336 48177 -4062
9870 -4062 54600 118432 105303 134015 109076 138628 130434 96409 189809 212708 198853 182147
9858 182147 223753 159332 187656 246918 172912 145596 133011 217330 113514 152736 221930
9847 221930 359868 310927 246563 157873 268970 323935 261307 217077 229266 109185 62683
9836 62683 119043 194283 241990 200056 132401 171026 198100 242742 180688 165100 144529 217592
9824 217592 240356 240054 178753 214585 182265 197635 269654 247988 289178 190411 118896 110934
9812 110934 99452 125914 231740 222465 215702 332051 383734 276566 294650 323554 303500
9801 303500 390871 358827 192202 279171 292464 232736 216741 276417 268994 255687 253641 198128
9789 198128 264823 269769 215177 332104 286809 200402 197502 246286 265669 253207 221666 285914
9777 285914 322075 288535 261165 264072 193903 277621 317354 269524 289904 317685 455886 312073
9765 312073 200806 233153 287126 245800 269389 264262 217851 308721 266055 336240 272010 314252
9753 314252 276534 259376 258358 285951 312585 332353 306978 336246 387192 432806 305444 277774
9741 277774 407647 339897 377437 317123 304558 278614 318079 510346 405084 275277 336521
9730 336521 236218 356751 384462 297472 294963 253392 344320 369933 431873 478676 484916 356256
9718 356256 350918 454504 385470 406772 365679 291938 330520 464300 377758 407644 400461 345817
9706 345817 461624 503824 436995 380689 375329 358050 334675 375377 306180 371850 398239 452570
9694 452570 455290 492312 536254 439835 377313 405295 458157 443101 322495 334765 466324
9683 466324 491624 454910 467568 438197 400036 361777 415991 465333 418263 344328 412116 544140
9671 544140 495306 446423 444596 451712 500638 557404 548538 561796 485179 574944 520677 499666
9659 499666 528571 536701 464741 667399 709684 578490 595639 573915 577067 615092 507095
9648 507095 582057 648435 642672 685691 707701 621694 733734 732891 721406 666524 674653 795113
9636 795113 673678 762233 722852 708045 789263 833076 851842 827450 745100 781261 730677
9625 730677 747302 755537 712078 761714 752652 787011 902723 893086 926378 875091 872888 830141
9613 830141 846671 804249 796515 830554 866936 876092 891952 824448 784338 734109 820690 915591
9601 915591 911869 990786 914343 891983 920804 917845 901083 877732 1016788 888874 779760
9590 779760 865358 835179 858974 1048082 1083396 930069 1026235 1084082 1114339 1207169 1214456
9579 1214456 1131466 1104471 1127157 1050825 1019366 1111957 1138993 1147687 1242610 1289772 1287001 1351918
9567 1351918 1335999 1396924 1393107 1389080 1366759 1291399 1345325 1344444 1380642 1495689 1413481 1454412
9555 1454412 1431561 1414575 1521318 1549966 1591344 1602521 1594923 1528376 1556196 1655783 1702160
9544 1702160 1700834 1629018 1696686 1697797 1714464 1663071 1646238 1749577 1737485 1724398 1701203 1687544
9532 1687544 1749255 1738736 1748454 1706140 1734097 1760616 1882920 1932453 1858918 1894379 1863539
9521 1863539 1778069 1844174 1907668 1880830 1861733 2013094 1986400 1902336 1992573 2099823 2160344
9510 2160344 2087169 2055165 2096693 2144955 2130751 2152577 2158579 2226678 2277290 2309790 2335225 2346116
9498 2346116 2366695 2467459 2403514 2360741 2401887 2491630 2557519 2573283 2558032 2643175 2813271
9487 2813271 2863052 2803912 2763160 2679873 2739067 2745569 2806114 2891104 2899512 3007797 3005517 3004879
9475 3004879 3047148 3104747 3098144 3141100 3106049 3240287 3314271 3349158 3436444 3509441 3549201
9464 3549201 3532582 3580283 3642416 3686792 3712476 3790348 3829861 3950467 4007464 4062207 4105092
9453 4105092 4100836 4091249 4211054 4329460 4458836 4464805 4444405 4529160 4589272 4665044 4817190
9442 4817190 4923557 4931219 4925646 5060250 5129366 5152793 5133507 5284507 5431706 5446648 5458413
9431 5458413 5622072 5713732 5834081 5980173 6129241 6244531 6328217 6355893 6532838 6610318
9421 6610318 6728306 6832113 6980980 7251928 7358556 7366889 7353512 7542316 7694197 7958412
9411 7958412 7994557 8179403 8321910 8506750 8594928 8853162 9067926 9154007 9299602 9430041
9401 9430041 9614497 9899976 10147223 10270695 10448620 10679544 10864792 11003319 11226272 11449889
9391 11449889 11676558 11928831 12075929 12332759 12590135 12947565 13150692 13438842 13651632
9382 13651632 13987141 14348267 14687915 15009175 15297060 15715204 15920073 16350855 16678653
9373 16678653 17041168 17512344 17872846 18206062 18702168 19245302 19696081 20128203 20496376
9364 20496376 20988695 21457863 21909064 22480252 23014126 23710618 24339742 24830183 25438100
9355 25438100 26098176 26760951 27325719 27938264 28610167 29383884 30090943 30754297 31542762
9346 31542762 32229197 33003519 33790011 34486420 35242020 35984521 36816633 37649697 38362093
9337 38362093 39111221 39816969 40576200 41243495 41846594 42518568 43222615 43822843 44255575
9328 44255575 44634404 45206888 45511946 45727356 46008789 46183826 46201445 46136964 46184004 46133093
9318 46133093 46060812 45873470 45527352 45204254 44883652 44530264 44081608 43479251 42894039 42295535
9308 42295535 41672060 40941642 40080892 39362410 38661892 37978142 37148327 36346584 35671210
9299 35671210 34818765 34076850 33318013 32492970 31814374 31049653 30411020 29537430 28807367
9290 28807367 28097276 27432511 26839589 26179093 25539723 24910471 24291136 23693077 23150635
9281 23150635 22594497 22014901 21510135 21081147 20556502 20057174 19474659 19035737 18558841
9272 18558841 18108375 17649176 17280221 16858864 16490478 16111086 15797238 15451533 15072546
9263 15072546 14766118 14323871 14056895 13817716 13456261 13179135 12932378 12626271 12333864
9254 12333864 12101956 11801685 11526287 11321444 11154061 10999001 10816809 10485806 10346769
9245 10346769 10131918 9901397 9733131 9575057 9456021 9264530 9027492 8878359 8637712
9236 8637712 8491783 8378353 8234786 8187125 8017101 7799435 7671062 7543325 7332440 7200319
9226 7200319 7081617 6983450 6914576 6819597 6656939 6592068 6528586 6408230 6320707 6249812 6129746
9215 6129746 6087462 5910207 5785185 5625511 5495993 5528198 5498867 5469432 5364124 5184892
9205 5184892 5123647 5046233 4999084 4938257 4807622 4772464 4721061 4674483 4597122 4437053 4425536
9194 4425536 4502586 4432301 4357579 4309568 4265259 4203545 4043411 4089412 4140351 4082090 3985161
9183 3985161 3867755 3829251 3772315 3758302 3701339 3668786 3705442 3583301 3555155 3491393 3450790
9172 3450790 3409775 3385794 3384066 3347888 3314257 3249410 3202905 3171346 3229768 3200568 3267094 3182167
9160 3182167 3121560 2959755 2867942 2914367 2884146 2865545 2849407 2862231 2816183 2826148 2793555
9149 2793555 2790328 2749462 2704499 2604980 2565198 2478915 2522890 2589378 2604130 2531368 2476415 2497005
9137 2497005 2489888 2459513 2455146 2498364 2436403 2405950 2427363 2362672 2268511 2227702 2263263 2275367
9125 2275367 2268945 2252808 2207300 2236014 2199447 2176091 2262084 2214963 2134558 2138972 2069189 2108587
9113 2108587 2252338 2185421 2069557 2072825 2157843 2141601 2142889 2148382 2062965 2026841 2022159 2099884
9101 2099884 1925152 1999005 2066685 2039612 1983694 2023529 1946026 1894501 1873881 1793630 1890182
9090 1890182 1862259 1802868 1931362 1932921 1789032 1719716 1700737 1696808 1625175 1579373 1497260
9079 1497260 1544935 1655588 1649276 1637167 1643667 1662517 1533189 1507404 1636664 1549173 1489921
9068 1489921 1572839 1558953 1581548 1534668 1458569 1414318 1379447 1435907 1450806 1391259 1431487
9057 1431487 1331334 1358756 1420722 1385760 1491495 1458625 1507249 1496363 1454048 1447036 1396496
9046 1396496 1401251 1427307 1414488 1351753 1299983 1298773 1332749 1309769 1328106 1390059 1407142 1425420
9034 1425420 1445659 1471903 1416578 1435443 1407293 1407448 1261431 1379783 1445115 1482030 1428464
9023 1428464 1363773 1331543 1419466 1396985 1322888 1329632 1279345 1322571 1368159 1339429 1288134 1305654
9011 1305654 1304091 1399452 1318300 1337168 1365177 1447429 1408288 1252704 1249121 1449936 1402759
9000 1402759 1375314 1496074 1448583 1394986 1308140 1421262 1533870 1494139 1497633 1397240 1414206
8989 1414206 1458905 1509808 1474383 1523817 1523182 1613517 1565212 1587586 1618849 1481696 1531336 1449532
8977 1449532 1479229 1522535 1482963 1484463 1497546 1470673 1505796 1483325 1478502 1521148 1557511 1579598
8965 1579598 1601263 1605355 1586192 1602225 1638534 1683724 1639401 1602655 1609807 1587339 1607277 1692088
8953 1692088 1664861 1635590 1749427 1710484 1780403 1820094 1790383 1776427 1748207 1774978 1860023
8942 1860023 1829559 1929731 1905567 1938732 1930039 2004922 1980918 1958246 2057725 2002357 1952343
8931 1952343 1950403 1929830 1942978 1873803 1774686 1904942 1967951 1905497 1834040 1845633 1738322
8920 1738322 1633639 1712084 1724078 1631724 1560476 1623450 1546358 1528253 1555137 1545479 1605746
8909 1605746 1622627 1740808 1730530 1715379 1667323 1607756 1683698 1790257 1772827 1880395 1911345
8898 1911345 1848594 1761940 1791792 1895379 1882979 1870305 1808466 1947607 1954289 2006427 1973207
8887 1973207 1806637 1848099 1892375 1948858 1911865 1811063 1735076 1848946 1842804 1929331 1917577
8876 1917577 1901828 1744146 1766980 1662317 1689047 1761412 1771070 1715338 1697318 1645667 1560051
8865 1560051 1552507 1611708 1578843 1609181 1600781 1622957 1619080 1713785 1744163 1697385 1734515 1750638
8853 1750638 1681128 1550728 1588353 1693470 1696471 1707950 1752906 1709094 1720194 1716617 1716097 1667514
8841 1667514 1777960 1784923 1831162 1775086 1821550 1809091 1781129 1764841 1773407 1782431 1763927 1698834
8829 1698834 1684658 1706243 1811531 1831048 1848485 1839200 1857999 1919820 2023689 1964647 1867448
8818 1867448 1887876 1957366 1945311 2050587 2003367 2126646 2219545 2206725 2249139 2326640 2317421
8807 2317421 2357252 2374702 2331308 2256033 2109415 2121728 2124953 2096662 2131959 2195343 2196999 2236440
8795 2236440 2168694 2110436 2151644 2211449 2217400 2282740 2308436 2196929 2233246 2343407 2289656
8784 2289656 2234529 2297578 2367490 2441747 2413944 2419441 2378571 2383221 2491172 2584069 2549334 2499098
8772 2499098 2591440 2618995 2634285 2670681 2795886 2816480 2673373 2688728 2905984 2908092 2875478
8761 2875478 2901643 3081230 3139873 3195087 3268906 3310912 3315807 3238019 3298426 3272508 3374414
8750 3374414 3521036 3572050 3593608 3595253 3585762 3574206 3592248 3700143 3801615 3751601 3779655
8739 3779655 3850815 3919067 3989310 4119466 4236995 4313753 4379999 4508621 4566690 4485803 4531620
8728 4531620 4746936 4825132 5054213 5038901 5073618 5182973 5249577 5426287 5664542 5744082
8718 5744082 6007547 6169068 6318788 6551917 6807600 7111421 7447248 7731781 8114510 8599592
8708 8599592 9022953 9706707 10302279 11093203 12014164 12949445 14107705 15308849 16093149
8699 16093149 16406212 16107227 15448128 14595555 13667227 12864753 12268536 11747012 11219573
8690 11219573 10804897 10523868 10294204 10118816 9994800 10005699 9991346 9987722 9947199 9987536
8680 9987536 10107234 10159901 10280633 10394865 10491777 10673183 10959844 11083653 11234546 11443556
8670 11443556 11627730 11834219 12138092 12422597 12639464 13018890 13237460 13631384 14007491
8661 14007491 14326541 14564414 15024816 15484188 15998508 16604723 17144344 17663261 18117215
8652 18117215 18796560 19538880 20190660 20944217 21832261 22714634 23611484 24642942 25793784
8643 25793784 27052580 28521917 30070926 31757013 33455623 35416853 37607083 39952590
8635 39952590 42452167 45014927 47595092 49887928 51840903 53387555 54299366 54883878
8627 54883878 54904939 54422517 53714280 53067885 52428620 51921723 51755325 51933844 52560627 53407857
8617 53407857 54546510 56087582 57801195 59641894 61603031 63557607 65295625 66628808
8609 66628808 67548415 68043815 67960961 67564128 67035530 66557515 66369591 66334729 66596291 67301193
8599 67301193 68450589 70043978 72042387 74429636 77112001 80000362 83023207 85932236
8591 85932236 88666569 90836534 92422757 93759352 94797851 95742734 96863907 98425693
8583 98425693 100428590 102992579 106228921 109783649 113235562 116433567 119045998 120861003
8575 120861003 121996916 122772022 123687002 124495988 125294079 125890716 126064368 125465190 123545135
8566 123545135 120113403 115326158 109252398 102417021 95352877 88488866 82113890 76452477
8558 76452477 71485415 67157922 63338882 60218498 57511729 55010317 53164989 51707228
8550 51707228 50628410 49813566 49289023 49101305 49255065 49712849 50561959 51708581 53246581
8541 53246581 55315567 57720903 60512418 63886713 67256439 70579292 73649986 75958797
8533 75958797 77243310 77422614 76753869 75790831 74815088 74213974 74114373 74257885 74859361
8524 74859361 75157870 74727590 73337264 70743570 67000690 62693161 58027980 53287284
8516 53287284 48843543 44658546 41118377 37929838 35061019 32600985 30456097 28541871
8508 28541871 26903234 25479868 24046395 22858520 21738687 20777199 19871829 19074634 18412862
8499 18412862 17830836 17210677 16547016 15993477 15434888 15095933 14621971 14170187 13737955
8490 13737955 13391346 12999017 12542537 12277939 11943737 11552092 11266754 11018501 10709173
8481 10709173 10485800 10247022 9990274 9755578 9547442 9418709 9319417 9075917 8947415 8773260
8471 8773260 8667197 8511540 8352970 8281652 8021610 7940381 7861104 7811473 7685883 7528691
8461 7528691 7473300 7413974 7283644 7073479 7128825 7236650 7037067 6919221 6863497 6828126
8451 6828126 6801615 6789744 6764571 6709499 6541144 6577661 6593350 6555688 6553266 6507907 6490187
8440 6490187 6352746 6382104 6370831 6376316 6407043 6432649 6367728 6446379 6534851 6547272 6584933
8429 6584933 6641939 6630980 6635643 6752349 6625675 6548827 6551197 6688089 6911402 6957520 6916538
8418 6916538 6932846 7045126 7078030 7189754 7248889 7300053 7346172 7318353 7407922 7498045 7688538
8407 7688538 7828672 7932566 8012346 8165666 8347206 8471659 8583043 8809189 9019951 9100481
8397 9100481 9278911 9525103 9670882 9936924 10275260 10558833 10861907 11133539 11488264 11837057
8387 11837057 12310945 12823831 13215407 13686019 14329687 14926370 15455370 16165793 16993663
8378 16993663 17831524 18804177 19904230 21080820 22419539 23954842 25664143 27495418
8370 27495418 29475816 31699666 34171793 36556452 38806800 40798377 42300647 43268081
8362 43268081 43645267 43594293 43383551 43232529 43131955 43335366 43768106 44272021 44767238 44821154
8352 44821154 44352560 43592975 42423208 40930228 39396345 37953699 36494763 35209702
8344 35209702 34297826 33612454 33190468 32914816 32807622 33020385 33393955 34043103 34900642
8335 34900642 35951341 37315547 38898743 40804935 43135493 45782894 48626312 51646256
8327 51646256 54959578 58284988 61248433 64009907 66117844 67470559 68348162 68425283 68019846
8318 68019846 67481081 67066065 66674081 66344071 66073326 65748618 64969872 63699091 61940545
8309 61940545 59728118 56798844 53554835 50281965 47013221 43965934 41216901 38870114
8301 38870114 36739228 34934622 33418226 32136441 31154221 30347565 29698527 29327303 29091231
8292 29091231 29115869 29285113 29779827 30361885 31120633 32101361 33181893 34315099 35469008
8283 35469008 36435523 36999729 37127543 36975872 36290785 35477181 34702014 33913533 33473246
8274 33473246 33208648 33001764 32802737 32352938 31621947 30344242 28885175 27086357 25178381
8265 25178381 23281495 21538189 20089481 18690840 17385839 16172134 15170695 14309509
8257 14309509 13502333 12740911 12044439 11388462 10913807 10414493 10050558 9590745 9213423
8248 9213423 8895454 8534802 8219895 7923617 7661052 7522713 7325071 7082953 6880099 6704681
8238 6704681 6502207 6288675 6065892 5914732 5834445 5654709 5494217 5354495 5195277 4964284
8228 4964284 4843879 4767973 4692758 4626152 4477742 4422207 4262570 4175892 4145619 4087778 4021249
8217 4021249 3899250 3854294 3809078 3720231 3707414 3512775 3526754 3511806 3524883 3432384 3344883
8206 3344883 3299031 3284418 3245719 3194302 3124496 3066647 2959249 2896948 2848461 2777800 2750859
8195 2750859 2658740 2595520 2704459 3225396 2648397 2453660 2453268 2425548 2489311 2349943 2298068
8184 2298068 2202457 2104535 2120510 2064225 1963960 1966121 1912315 1913279 1918054 1953592 2009514 2034748
8172 2034748 2005570 2000131 1925409 1980302 1934603 1956486 2079140 2035711 1979930 1986488 1969573 1871473
8160 1871473 1985411 1995681 1978039 1948169 1768959 1726674 1676815 1677422 1631291 1598081 1658634
8149 1658634 1638619 1561831 1562789 1458166 1393017 1456623 1464193 1465309 1338229 1392208 1397894 1407880
8137 1407880 1440607 1418841 1378996 1339719 1450030 1350160 1310233 1418598 1489635 1468518 1420668
8126 1420668 1268302 1334750 1287078 1319971 1310626 1394088 1345173 1277888 1369473 1396115 1403627 1260979
8114 1260979 1285817 1300530 1275407 1328405 1438115 1345098 1187408 1115361 1159686 1126272 1066396
8103 1066396 1064839 1171598 1237859 1081750 1095549 1105973 1107101 1049997 1072325 1059671 1101005
8092 1101005 1161114 1083087 1026528 1043208 1045716 1018234 1034142 978715 1062199 1054147 1037861 1025523
8080 1025523 921434 954917 966027 818937 942422 974914 965302 927822 834775 813641 794919
8069 794919 829509 869753 871970 878253 790383 679603 712381 718788 774166 683818 625898 660859
8057 660859 693547 741731 751159 620991 596576 647038 752231 805687 634859 462371 490964
8046 490964 486939 508905 478032 544878 575119 454316 394652 514100 439751 372193 530230
8035 530230 554263 576962 448570 543091 567865 574041 604146 526949 511135 466609 458871 553497
8023 553497 463606 398087 430953 437864 403860 428913 487691 468061 503487 479901 391825 337387
8011 337387 253594 371166 397407 413105 445425 455395 435705 475634 457239 406898 417244 404850
7999 404850 498688 389292 360932 436281 519465 477129 416187 493580 529528 583899 510872
7988 510872 516323 458581 416490 462966 457913 384530 372692 375198 367394 373132 379329 356783 397900
7975 397900 438159 407016 483941 481185 494164 446315 392019 429310 409505 426832 437584 407470
7963 407470 371390 421503 470376 387162 476036 472261 419762 402037 452631 517701 487020 472772
7951 472772 453227 439309 337531 365493 495369 505267 513146 507673 407113 371058 486962
7940 486962 513865 468923 455212 359433 231965 280568 345079 259764 273296 289480 359530
7929 359530 413989 366664 249440 250902 226675 168017 169953 175195 271495 202346 171760 233672
7917 233672 265362 245285 263038 114969 181071 167704 172842 219515 244838 170540 65443
7906 65443 219600 224177 225346 211976 259585 214938 111531 80029 1840 -1720 168726 236021
7894 236021 152594 177206 273243 204689 101452 212291 63088 -20934 -22125 105578 126848
7883 126848 116818 44102 18615 143272 86949 26837 -53719 -125240 -70748 -49047 -8351
7872 -8351 -13310 -55063 -48045 27205 37372 24855 -18355 -28261 -14724 29577 29297 -52810 -108339
7859 -108339 -67258 -39332 -110386 -36533 -99164 -150679 -114805 55308 1299 -88135 -135521
7848 -135521 -75661 -105981 -86362 -125346 -113962 -37654 -26653 -91111 -143556 -189533 -138482 -56192
7836 -56192 -85394 -136621 -104822 -162776 -87472 -149236 -115056 45783 -13898 23956 -45195 -50696
7824 -50696 -93588 -132933 -98991 -13564 -36023 -139989 -163361 -151908 -193207 -299700 -145865
7813 -145865 -128221 -189012 -245160 -293691 -310712 -368048 -220282 -184149 -178059 -147786 -161943 -85622
7801 -85622 -98955 -66837 -17761 -121560 -212184 -112673 -15876 99116 134037 98900 519
7790 519 -10926 -41733 -106001 -99298 -132109 -164621 -200880 -203234 -229888 -163970 -125916 7810
7778 7810 -173255 -213022 -204788 -265471 -187403 -196799 -124741 -113146 -163528 -122580 -113691 -151968
7766 -151968 -220696 -187457 -192316 -118063 -127743 -146139 -121089 -108000 -45607 -153653 -210965 -172008
7754 -172008 -203491 -177227 -106877 -119602 -167208 -111317 -72617 -92014 -107886 -155164 -195051 -256846
7742 -256846 -244165 -228426 -265071 -124655 -105596 -196380 -194362 -150707 -152761 -183888 -102635 -45566
7730 -45566 -131209 -154223 -197324 -91268 -130434 -83554 -95182 -114165 -14338 -49347 -175157
7719 -175157 -163132 -122368 -153844 -192737 -201957 -171617 -153908 -13675 -18976 -100274 -130772 -125018
7707 -125018 -182026 -200077 -157966 -77817 -118582 -109159 -113812 -65924 -92303 -182651 -161375 -59299
7695 -59299 -31128 -55030 -224778 -258289 -177535 -187923 -229374 -113878 -104281 -130483 -212592 -155333
7683 -155333 -64096 -61668 -141618 -235344 -118360 -30632 -188524 -253875 -238205 -231157 -124616
7672 -124616 -105322 -167408 -180519 -166343 -108544 -53277 -101740 -130692 -73349 -60111 -68656 -149244
7660 -149244 -132411 -118830 -102908 -9772 25969 -44967 -230048 -161462 -144068 -33093 -12005
7649 -12005 -53380 -137352 -158341 -224356 -172755 -114383 -212643 -159065 -78755 -64468 -146069 -44120
7637 -44120 -58223 -55398 -118197 -73784 -84181 -158226 -134080 -87000 -126986 -298894 -269625 -147789
7625 -147789 -67937 -150771 -122880 -115830 -159043 -88507 -124068 -100545 -132340 -180244 -83770 -97448
7613 -97448 -299321 -337025 -209255 -192509 -243890 -290196 -150670 -51574 -12236 -123443 -132242
7602 -132242 -161455 -232314 -238271 -190478 -206354 -195806 -249413 -296930 -172040 -137659 -187405 -266172
7590 -266172 -239741 -275823 -226031 -91361 -152530 -172960 -223586 -128802 -54318 -38663 -64956
7579 -64956 -134744 -99243 -101520 -138055 -151479 -141423 -175385 -121314 -103053 -181377 -128838 -117611
7567 -117611 -71759 -23553 -98659 -139978 -108363 -132141 -128649 -175542 -193110 -152875 -104152 -160637
7555 -160637 -166960 -176071 -185982 -199326 -86428 -233678 -234094 -113279 -206187 -177290 -150767 -166243
7543 -166243 -117910 -21860 447 -84122 -120310 -188850 -206316 -148229 -215889 -285273 -256777 -221432
7531 -221432 -233110 -169995 -241752 -191398 -233345 -160661 -178200 -241403 -186133 -231747 -249952 -195686
7519 -195686 -158983 -156065 -206919 -166677 -160974 -121775 -92657 -62183 -132822 -154842 -175065 -97451
7507 -97451 -100816 -129812 -139086 -209563 -284418 -170110 -196645 -178750 -184463 -171063 -195948 -96983
7495 -96983 -92724 -121019 -191910 -235780 -151680 -136683 -147318 -165614 -132402 -136052 -149182 -129519
7483 -129519 -131105 -130109 -106551 -183555 -245612 -268052 -251846 -191776 -28524 -136621 -155119 -174495
7471 -174495 -218136 -151240 -140001 -48562 -134945 -145848 -145538 -92986 -97751 -150218 -141404 -148242 -224922
7458 -224922 -269440 -253663 -200770 -127247 -196294 -166393 -132524 -161319 -172640 -119671 -211957 -160644
7446 -160644 -158705 -144731 -171837 -215161 -202095 -117073 -65829 -105442 -72175 -98083 -299005 -238272
7434 -238272 -209485 -170199 -26967 -55427 -167948 -196260 -149826 -115006 -139901 -62665 -78955
7423 -78955 -36822 -135755 -125339 -109128 -138778 -113331 -233121 -239386 -141704 -92942 -133779 -139247
7411 -139247 -164015 -260718 -213352 -83785 -165495 -160497 -88537 -176835 -99104 -114364 -140485 -117457
7399 -117457 -108288 -143797 -101721 -183654 -180832 -188194 -168814 -205945 -196755 -193539 -186309 -305717 -313336
7386 -313336 -267990 -200645 -140504 -188128 -222267 -207437 -133341 -205986 -204709 -238289 -282596 -304133
7374 -304133 -151171 -218222 -162835 -193127 -242240 -191447 -101595 -125376 -163203 -195336 -233624
7363 -233624 -169294 -178874 -241224 -169948 -151186 -220651 -154506 -234232 -234638 -195937 -198494 -94428
7351 -94428 -165598 -222809 -226645 -143127 -171429 -136822 -139226 -242922 -349278 -220272 -206867 -85075
7339 -85075 -116162 -170973 -198836 -231168 -209083 -173109 -161608 -245396 -260605 -209133 -214794 -218221
7327 -218221 -99658 -57061 -171304 -212211 -230341 -151279 -133877 -174017 -265746 -229614 -169694
7316 -169694 -153268 -139452 -113723 -86885 -32005 -109586 -75723 32134 -17728 60860 22525
7305 22525 -47419 -127875 -111622 -70381 -80358 -152512 -207640 -199126 -216576 -196239 -170060 -225893
7293 -225893 -197531 -179573 -216440 -224661 -133021 -170761 -138332 -176388 -176824 -187137 -182805 -162235
7281 -162235 -197128 -247380 -195480 -103007 -171199 -186280 -140977 -127840 -106305 -158677 -221809 -222557
7269 -222557 -187405 -188967 -219835 -137867 -95091 -118636 -113808 -181087 -190645 -160090 -222371 -171850
7257 -171850 -144278 -155855 -105364 -169354 -196734 -236613 -205185 -128346 -160158 -199591 -171791 -227993
7245 -227993 -174161 -133821 -129873 -179696 -206506 -194448 -161386 -185383 -296433 -167926 -142452
7234 -142452 -245377 -316605 -326938 -195128 -240525 -172735 -194855 -186235 -197487 -125753 -80212
7223 -80212 -32988 -71953 -219517 -163199 -131459 -170411 -243064 -184052 -114798 -112837 -107523 -202069
7211 -202069 -191405 -203580 -214739 -216114 -287177 -245736 -199922 -124406 -161296 -151759 -109105 -133112
7199 -133112 -220217 -170535 -140617 -45455 -19309 40991 -65510 -129548 -105585 -53723 -110863
7188 -110863 -54803 -62591 -135666 -29440 -12055 -29256 -71890 -75619 -122460 -150289 -212114 -87067
7176 -87067 -79581 -105863 -218141 -313055 -235785 -205188 -264754 -281835 -196167 -170326 -180991 2922
7164 2922 107567 77685 -65701 -30745 -6304 -43303 -137329 -167165 -200352 -202991 -115076 -179256
7152 -179256 -181054 -93165 -49313 -117757 3441 44946 -33239 -48052 -49661 -49404 26597 -8445
7140 -8445 -13848 -61256 -14534 -118103 -167410 -95251 -81893 -167357 -138262 -132371 -157553 -92164
7128 -92164 -61067 5092 -694 -18034 -35531 -68739 -28794 9303 47931 58466 28709 -14172
7116 -14172 88921 41157 -59925 -72101 -101425 -91361 -100911 -125066 -91134 -109583 -173988 -188140
7104 -188140 -115877 -161594 -112595 -62634 -1538 -2042 -67538 43077 116863 42924 -12652 -37331
7092 -37331 -40451 15965 -49855 3747 -29478 -12951 -38265 -53027 -92033 -145164 -39203 -97258
7080 -97258 -134331 -98082 -247303 -178319 -141718 -190271 -89046 -12117 -48841 -12386 62022
7069 62022 -54601 -158052 -112891 -39956 -71244 -93065 -111733 -97436 -6547 36877 -18797
7058 -18797 30975 124348 104837 98807 36205 80112 76113 69477 40080 9989 156760 71818
7046 71818 75531 141502 134909 24760 -55803 50712 -76223 -1363 58140 56490 116946 140800
7034 140800 163275 225915 130265 138001 168816 62840 107154 115261 89686 76764 82572 87176
7022 87176 33742 36139 130065 206231 176737 137494 171436 198287 106168 225529 220312 221715
7010 221715 186021 150028 86394 143281 180350 223228 313527 353063 240999 214000 283725
6999 283725 324460 376761 249234 200076 159508 214783 273772 339315 251444 335988 405846
6988 405846 449806 397853 447168 474899 448554 475760 408623 469000 505748 554275 609027 614728
6976 614728 588114 531535 596531 616001 642435 697269 624959 647717 712777 757143 879275
6965 879275 902800 906576 854132 854142 843093 898445 960805 905619 846596 1038312 1053195 1084788
6953 1084788 1155242 1248595 1273627 1319812 1350278 1425039 1423973 1428801 1516248 1594527 1702707 1812654
6941 1812654 1944581 1995630 2058122 2176847 2298333 2351485 2492408 2713617 2906852 3045454
6931 3045454 3227065 3512974 3777147 3964208 4165476 4489350 4977197 5381758 5900103 6472406
6921 6472406 7319029 8190537 9164841 10423157 11728569 13361573 15399314 17710982 20160247
6912 20160247 22490292 24197554 24523389 23564974 21484258 18991999 16693019 14471198
6904 14471198 12534561 10913401 9505422 8410013 7408939 6487051 5859328 5365379 4917637
6895 4917637 4536837 4031877 3707850 3270694 3029394 2933423 2749058 2568790 2481870 2431631
6885 2431631 2357600 2300433 2198832 2106823 1951616 1824081 1740193 1714832 1593365 1443160
6875 1443160 1335889 1363597 1317853 1264743 1224391 1172549 1019865 958987 961978 976336 894899
6864 894899 925196 897806 735310 706228 696838 697222 645654 538605 562754 509329 516950 622450
6852 622450 656971 653103 443806 435364 382894 388255 327819 357626 393377 454769 503934 325513
6840 325513 298513 334584 331825 352924 420695 398955 418955 368133 285604 310305 345252 399888
6828 399888 257781 128036 175356 174534 175651 213182 217607 240234 219905 207981 116794 160875
6816 160875 162016 113919 164148 135397 168171 91409 198546 220495 118228 116420 90061 63388
6804 63388 58474 88416 132413 88595 134920 93748 85867 44943 -2251 -96179 -56783 34976
6792 34976 -17148 60773 119492 -1920 -43838 -46647 -9756 74637 113461 173465 179432 206487
6780 206487 110364 147385 99100 -9273 -41795 -67117 110622 55172 20809 71631 2784
6769 2784 -16647 47334 29716 57943 48624 19447 -14307 -38383 60728 55823 27938 97072
6757 97072 37736 8617 93374 90598 -4014 -45386 -3600 -2704 5880 7178 -56653 -44773 113456
6744 113456 105821 45818 49416 54863 -79384 -195841 -103364 -43537 -34990 32948 97975 109903
6732 109903 -734 -14975 -26449 30594 79680 65536 83554 38370 -18143 -42375 -31532
6721 -31532 46079 9481 77917 8948 -81232 -32054 8255 -22914 45424 -62827 -23966 -289
6709 -289 -70935 -43201 -57165 -57910 -60701 -39725 -40129 -88949 -53133 28099 -6374 -10076 -36899
6696 -36899 -58337 -128598 -44421 -9297 -20311 -25788 -13949 -29199 9600 102937 75174 123077
6684 123077 -26796 -13495 -13192 40466 80595 46245 45192 51627 -4916 41298 97771 42601
6672 42601 107802 79694 13057 -14065 50400 89094 29359 14299 24624 -39270 -3946 -23608
6660 -23608 51428 6310 50824 25424 34621 37103 9921 -20034 73180 5613 11979 -50355
6648 -50355 -75072 79033 50221 -37543 -89213 -56240 5388 -14051 -78973 -38595 -105777 -82162
6636 -82162 53561 -39232 26262 -63377 -90333 -7428 10096 13129 -28697 -49691 -35712 73692
6624 73692 -15358 -70585 -86470 -20021 -14768 15513 17095 -4057 55340 125014 173981 -21244
6612 -21244 -1443 31867 4442 -17787 32870 61250 109883 99528 10903 24554 28200 99548
6600 99548 172865 159156 27690 104401 86816 19437 80030 83011 54060 36727 103198 116692
6588 116692 13676 -26001 -19353 87148 93912 99540 134246 172184 102298 -2830 30787 107076
6576 107076 168779 116622 81842 46095 -405 63058 42830 150637 257799 310050 126396
6565 126396 78327 56339 70886 145054 52982 46005 180463 192718 235888 228101 209408 179119
6553 179119 177298 199422 170100 276344 166008 81234 51165 90672 181503 65094 12920
6542 12920 139390 226888 287082 307527 255747 280578 241668 288722 316897 278566 360879 371160
6530 371160 324080 306646 345539 318302 271175 320458 391329 306144 311944 294520 314513 314215
6518 314215 324789 283885 314551 414700 466812 502751 347676 299436 341198 307134 325530
6507 325530 383658 387703 421000 462267 485621 399263 452777 519944 593266 549259 600757 662520
6495 662520 689765 639805 610326 693191 585512 542112 532512 529047 541836 541952 502330 686737
6483 686737 744453 690452 655267 693796 666267 729207 737013 707021 724440 709936 765557 753154
6471 753154 652526 594637 657879 717008 673946 727871 741941 718487 819311 824269 890170
6460 890170 754761 746454 815123 724939 843901 834958 756541 714381 784209 828708 769848 795928
6448 795928 796773 723260 778252 843617 796828 818162 758535 807233 850600 760806 961182 925418
6436 925418 863715 1006269 1061041 1096971 1180716 1218591 1161130 1058373 1052889 1085501 1201684
6425 1201684 1258140 1226396 1337752 1409265 1373333 1383562 1555135 1590181 1548902 1560767 1645057
6414 1645057 1760039 1879754 1943950 2008074 2014060 2030914 2095620 2085825 2203528 2228950 2226134
6403 2226134 2319762 2241399 2197635 2152407 2098711 2037542 2076483 1982639 1941567 1944300 1885563 2001531
6391 2001531 2108665 2068705 1975002 1911521 1878641 1787740 1902646 1934498 1836107 1775828 1677631
6380 1677631 1705203 1669906 1676224 1650155 1557823 1563159 1665736 1628088 1611004 1613974 1569091 1650977
6368 1650977 1614324 1518991 1554369 1500169 1410102 1345485 1298801 1355563 1427260 1341836 1253570
6357 1253570 1152516 1030584 1010101 980598 939668 889536 933221 972938 1032902 987239 993009
6346 993009 918595 943999 1006039 952487 941709 897366 981374 905962 783067 740911 761554
6335 761554 830383 908524 926316 907839 769732 809880 777763 836532 909734 881263 995357
6324 995357 1063763 897503 839161 919415 928390 937767 860699 944161 1006941 950288 1003790 1084738
6312 1084738 1016380 949560 1002509 1215458 1160174 1104030 1094018 1282744 1285115 1228853 1245696
6301 1245696 1295150 1322942 1358538 1281057 1183593 1213805 1361280 1469306 1396312 1477546 1505968
6290 1505968 1528171 1486779 1571688 1607972 1549722 1443370 1514943 1452335 1346612 1327032 1424166
6279 1424166 1502139 1570950 1627883 1509289 1415813 1394616 1471068 1509957 1475630 1548571 1509716
6268 1509716 1416719 1448625 1418974 1381504 1341460 1366032 1501700 1567384 1563559 1558902 1615282 1641481
6256 1641481 1677628 1647682 1575755 1599625 1664806 1705236 1772039 1700691 1758757 1708127 1684042
6245 1684042 1699182 1723584 1802097 1780561 1808929 1877755 1920550 1984466 2108732 2103055 2066882
6234 2066882 2080204 2057310 2046768 2088867 2014804 2023654 2111541 2203885 2116086 2144367 2149609 2245795
6222 2245795 2202202 2281416 2362968 2429898 2533872 2593543 2505600 2533834 2629989 2711481 2698991
6211 2698991 2683015 2724702 2735354 2736499 2787353 2880766 2874522 2814653 2936728 3006309 2902079
6200 2902079 3046508 2995151 3073390 3104721 3209219 3279288 3269680 3457178 3461933 3479748 3490781
6189 3490781 3576356 3643610 3763001 3861890 3919720 4040542 4070318 4209120 4145149 4233925 4313294
6178 4313294 4425816 4627618 4601486 4645248 4662196 4762659 4932777 4930589 5096689 5144374 5273583
6167 5273583 5427129 5491221 5569186 5700323 5786605 5770949 5954953 6007072 6091465 6216707 6471036
6156 6471036 6594671 6693938 6888297 6953996 7225575 7298524 7359686 7568569 7754009 7886516
6146 7886516 8147431 8364087 8535780 8841538 8978669 9120775 9380321 9703763 10012773 10218056
6136 10218056 10390625 10718853 11073753 11289140 11596767 11983496 12429989 12824673 13250936
6127 13250936 13638408 14093344 14569599 15156565 15606300 16107703 16758189 17294738 17865028
6118 17865028 18527657 19219081 19883564 20472241 21055508 21517169 21901552 22282009 22652976
6109 22652976 22989238 23338126 23754202 24047664 24540706 25083612 25662070 26086018 26636753
6100 26636753 27484996 28334495 29167434 29975595 30998826 32102641 33292002 34542945 35840807
6091 35840807 37317409 38801777 40651831 42589205 44652097 46933768 49331474 51890071
6083 51890071 54706664 57926793 61581287 65562349 69761295 74328292 79472934 85004240
6075 85004240 90871291 96827609 102807637 108415934 113486416 117669312 120783033 122923785
6067 122923785 124421550 125473096 126327849 127277137 128643620 130552284 132920923 135759687
6059 135759687 138623106 141375200 144059857 146591670 148738326 150608269 152218551 153467568
6051 153467568 154215406 154548717 154292090 153494977 152194576 150633711 149069186 147411725 145706630
6042 145706630 143894201 141780006 139653176 137551934 135437434 133773693 132353191 131262851
6034 131262851 130633368 130079054 129240118 127807173 125434685 121825310 117216822 111686809
6026 111686809 105313156 98631934 91955877 85500307 79247355 73721319 68571765 63690416
6018 63690416 59320419 55394039 51910234 48736277 45855679 43289128 40932670 38656393
6010 38656393 36703012 34958823 33392714 31855287 30409415 29055630 27861952 26778032
6002 26778032 25853999 24867734 23959581 23080198 22245948 21507928 20853610 20162037 19617670
5993 19617670 19008691 18418683 17756607 17055596 16566853 16021899 15452600 14979130 14485247
5984 14485247 13983603 13635034 13160160 12795497 12592602 12177263 11655119 11287646 11094460
5975 11094460 10896414 10564392 10354446 10087333 9889625 9664665 9421938 9224847 9053772
5966 9053772 8830593 8671846 8664608 8478817 8212369 8092705 8065054 7854811 7621462 7456597
5956 7456597 7325377 7210079 7083661 6847656 6683549 6573665 6332803 6295591 6246590 6161502
5946 6161502 6080923 5934762 5773858 5654011 5600257 5456436 5358764 5278884 5142327 5184891
5936 5184891 5160988 4951041 4781466 4686772 4736872 4709547 4612966 4441956 4292411 4174868
5926 4174868 4216083 4116530 4022262 3987009 3907829 3925450 3936805 3892211 3817264 3829724 3724500
5915 3724500 3693377 3750218 3627130 3629150 3500692 3422913 3480182 3481188 3473768 3417849 3528108
5904 3528108 3478992 3465140 3461509 3458613 3307338 3259421 3314423 3220064 3093267 3165950 3148157
5893 3148157 3011611 3100547 3087142 2978135 3049134 3109491 3142609 3111868 3116763 3067115 3061282
5882 3061282 3021853 3009867 3032044 2979140 3019158 2991624 3044289 3070112 3021856 3046230 2989740
5871 2989740 2981540 3049536 2940383 2883105 2827336 2867156 2770417 2790639 2727007 2643910 2618446
5860 2618446 2653483 2596861 2594572 2601084 2575797 2648869 2525948 2585401 2612772 2613017 2527552 2479495
5848 2479495 2539071 2592174 2633895 2636861 2569855 2529192 2516191 2526042 2530550 2619362 2677971 2689392
5836 2689392 2749896 2735930 2802837 2831348 2818002 2840046 2725969 2785185 2785731 2838516 2844236 2726016
5824 2726016 2766027 2665836 2725295 2762725 2740055 2861097 2679559 2666082 2780748 2897092
5814 2897092 2801931 2860612 2834374 2822332 2924061 2880934 2956593 2883344 2926534 2982158 2980592
5803 2980592 2767754 2692237 2812501 2838110 2804399 2819903 2843195 2807223 2671399 2671472 2772052
5792 2772052 2735580 2696378 2763432 2676876 2593703 2636826 2591038 2584184 2651567 2639920 2638931 2607591
5780 2607591 2611348 2599942 2616928 2695261 2678121 2685648 2697912 2742471 2720286 2682317 2721327 2761511
5768 2761511 2778159 2781142 2806621 2924672 3058618 3004246 2969185 2993655 3077541 3246890 3344262
5757 3344262 3277772 3271578 3338353 3480230 3509632 3466548 3444069 3470133 3620734 3798202 3780146
5746 3780146 3748110 3687877 3637778 3816520 3951162 3980647 3927590 3956895 3946303 4068725 4031214
5735 4031214 4096228 4287279 4256425 4372570 4402340 4304932 4347650 4427839 4343390 4360049 4415529
5724 4415529 4489774 4605208 4679497 4597397 4566827 4672341 4705372 4778269 4861140 4824175 4727012
5713 4727012 4693781 4703133 4798069 4805072 4771692 4813145 4889365 4972783 4943284 4933423 4869043 4834630
5701 4834630 4874939 4892829 5055296 5100009 5087025 5243360 5254169 5287319 5325858 5445284 5528964
5690 5528964 5567518 5588940 5588124 5676031 5780251 5682103 5572877 5720616 5781630 5740564 5801686
5679 5801686 5823811 5798384 5873640 5859083 5957331 5999655 5967697 6033435 6229363 6264735 6195048
5668 6195048 6223532 6300604 6506838 6594990 6607033 6845445 6932958 7032389 7050442 7113037 7254619
5657 7254619 7441836 7589747 7663421 7772178 7903227 8134249 8280949 8442135 8515817 8516775
5647 8516775 8614924 8892197 9158753 9331543 9452303 9670313 9936402 10044066 10264595 10501182
5637 10501182 10744698 10891196 10989983 11268939 11550283 11914118 12180339 12458168 12667791 12911329
5627 12911329 13246894 13445616 13813522 14132378 14436662 14663619 14900508 15226235 15496414
5618 15496414 15804221 16099092 16456945 16768643 17086904 17471967 17871809 18432743 18964676
5609 18964676 19429492 19896696 20475766 20971161 21623252 22361773 22934579 23634214 24344793
5600 24344793 25072508 25764798 26623779 27643682 28583595 29632211 30677248 31738279 32777846
5591 32777846 33832464 35138062 36508200 37929052 39307711 40962295 42927722 44978671
5583 44978671 47110313 49398464 52028886 54821364 57667906 60686529 63820404 66939289
5575 66939289 69637493 71754339 73421621 74723575 75672459 76459599 77281079 78247825 79393683
5566 79393683 80694876 82162068 83846362 85721478 87692415 89725988 91898047 94135784
5558 94135784 96623518 99180977 101845651 104689385 107846006 110990119 114417285 118196315
5550 118196315 122446745 126955604 131762506 136376343 140265300 143079329 144168002 143820994
5542 143820994 142228107 139807164 136974309 134149566 131544075 129346193 127453210 125977096
5534 125977096 124726042 123720246 122948822 122350093 121974322 121837320 121965394 122393745 123107175
5525 123107175 124304190 125917479 128173434 130985494 134545928 138515455 143058351 148166999
5517 148166999 153643171 159274791 164640109 169761916 174441665 178539517 181937292 184358736
5509 184358736 185591843 185718196 184880062 183515325 182092575 180878458 180201609 180105615 180545135
5500 180545135 181453389 182616568 183812261 184795909 185525232 186116920 186914985 187625872 188307174
5491 188307174 188907431 189191094 188960995 188213058 186992491 185404396 183612157 181580607 179352302
5482 179352302 176666506 173863015 170869661 167735528 164800967 162218262 160058603 158437351
5474 158437351 157278138 156343256 155491575 154150457 152024439 148901671 144616086 139385213
5466 139385213 133682387 127800989 122026549 116488596 111456215 106871883 102760343 99167806
5458 99167806 96082210 93480093 91404833 89573727 88169785 87048336 86380636 86058084
5450 86058084 85968886 86128392 86483121 87188912 88100397 89420993 90996990 92953334 95318558
5441 95318558 98042731 100953180 104211796 108120739 112416853 117052553 122109085 127720881
5433 127720881 133934819 140942553 149053386 158504063 169680120 182628349 197497978 214256415
5425 214256415 233180611 254192533 277433201 302034799 326332535 347584101 362036083
5418 362036083 366346629 359080789 342151552 319137013 293572016 267799316 243277006
5411 243277006 221148398 201368171 183847559 168514927 154907750 143100004 132696372
5404 132696372 123449205 115392135 108198813 101934329 96375134 91333464 86907936 82923797
5396 82923797 79192038 75864095 72755628 69725169 66885047 64039965 61365394 58873407
5388 58873407 56453953 54211910 52063986 49790194 47817187 46040511 44311464 42604619
5380 42604619 40956482 39514947 38055584 36632007 35347831 34121327 32957597 31803787
5372 31803787 30816560 29825789 28845754 27858573 27117735 26445817 25658574 24906429 24132047
5363 24132047 23547704 22908223 22346772 21749858 21229065 20706029 20123516 19687396 19207633
5354 19207633 18707138 18218181 17876144 17578590 17212963 16841350 16608521 16249843 16036502
5345 16036502 15686513 15302712 15001745 14641424 14327967 14011048 13728606 13458741 13134278
5336 13134278 12825640 12634177 12347973 12029675 11907701 11836913 11626331 11416174 11157603 11047309
5326 11047309 10901222 10656948 10425362 10222950 10015784 9952296 9787847 9587093 9424194 9247488
5316 9247488 9121164 9030562 8778135 8648106 8583345 8439559 8318189 8131381 7947465 7776500
5306 7776500 7647461 7397391 7309500 7208146 7069823 7001456 6718721 6628183 6587410 6627531
5296 6627531 6517447 6438971 6227210 6090075 6017882 5956917 5810909 5730108 5709390 5569035
5286 5569035 5455388 5423947 5465560 5374825 5304983 5211421 5168510 5140647 5068419 4904390 4847500
5275 4847500 4702219 4693471 4790046 4857729 4732079 4684101 4657278 4602819 4634036 4674286 4672427
5264 4672427 4613310 4506829 4440572 4472586 4461502 4408792 4461840 4359219 4327073 4276802 4258700
5253 4258700 4226778 4085341 3984520 4044092 4069944 3924829 3782634 3678939 3829098 3818805
5243 3818805 3767950 3782423 3784620 3760726 3731995 3760573 3682083 3699979 3735084 3767057 3734739 3715224
5231 3715224 3717302 3755213 3733275 3717721 3826618 3853712 3749114 3751897 3777727 3816197 3948140
5220 3948140 3893753 3944149 3952744 3844672 3838089 3995268 4148598 4100360 4136334 4193564 4253380
5209 4253380 4341570 4429940 4331196 4276941 4436120 4589867 4760213 4773214 4822350 4845949 4863172
5198 4863172 4984898 5008073 5106674 5108741 5293527 5379034 5443629 5660836 5809170 6059102 6258450
5187 6258450 6331415 6426606 6505807 6532979 6333960 6139206 6017413 5769494 5644224 5386296
5177 5386296 5206199 4960214 4860456 4800208 4610815 4460754 4352685 4317864 4167253 4105359
5167 4105359 4154664 4048182 3951983 3955186 3963131 3938366 3798313 3714696 3699460 3635690 3740102
5156 3740102 3750446 3671912 3582023 3578811 3511529 3535746 3580922 3610584 3630850 3613125 3593312 3752720
5144 3752720 3683469 3666428 3683373 3709399 3719718 3725431 3718504 3736711 3740629 3741097 3843446 3876780
5132 3876780 3882329 3988768 4107098 4150240 4222401 4319329 4330588 4332276 4411718 4315268 4335271
5121 4335271 4253617 4224971 4229720 4169986 4192825 4203786 4195815 4235737 4284985 4326965 4492863 4473604
5109 4473604 4416798 4553733 4683515 4744532 4820916 4997793 5123651 5308397 5551912 5802024
5099 5802024 6052526 6376328 6632172 6811344 6877413 7114553 7182886 7048093 6820560 6527500
5089 6527500 6228743 5998683 5904602 5767163 5537170 5490362 5357931 5257683 5185809 5144449
5079 5144449 5192896 5224715 5274546 5376874 5354461 5301725 5423841 5457311 5610666 5761077 5832633
5068 5832633 6086359 6185210 6381496 6712546 7020216 7193451 7260646 7316576 7238179 7125553
5058 7125553 6877142 6562722 6322446 6147895 6013458 5839830 5690521 5540098 5526428 5417708
5048 5417708 5262674 5254202 5295059 5267129 5115599 5081292 5251574 5362269 5356207 5265554 5338731
5037 5338731 5426503 5475745 5563893 5577562 5698421 5653693 5685352 5654681 5827864 5848837 5956854
5026 5956854 5937534 5920986 6012667 6060067 6060317 6014377 6079644 6142393 6185118 6198766 6183530 6201981
5014 6201981 6230007 6211864 6182512 6295391 6442047 6512190 6578426 6640343 6670106 6628569 6805227
5003 6805227 6989098 7017426 6974524 7067681 7098370 7197349 7378945 7495747 7612288 7847284
4993 7847284 7922990 8032470 8158806 8272960 8439996 8576795 8656455 8767167 8877273 8914392
4983 8914392 9032950 9055706 9116918 9288717 9399917 9299263 9243216 9301171 9508036 9676863
4973 9676863 9856007 10081837 10242647 10411592 10661391 10889172 10967123 11231178 11624665 11843128
4963 11843128 12009294 12185939 12509672 12900954 13173842 13555704 14119870 14604651 15027710
4954 15027710 15331598 15773559 16304441 16739982 17203429 17592756 18071312 18564274 19040092
4945 19040092 19497312 19943520 20392603 20857600 21475970 21995867 22584844 23211750 23724791
4936 23724791 24338528 24997143 25642213 26139691 26736085 27437492 28141265 28721451 29362646
4927 29362646 30087808 30785396 31601527 32536242 33433617 34288937 35111469 35891352 36905027
4918 36905027 37894999 38926497 40085888 41278950 42561224 43825821 45257056 46875604
4910 46875604 48445066 50255984 52176566 54245827 56562383 58974406 61484408 64153064
4902 64153064 67102641 70085178 73456283 77085734 80864595 85023447 89598131 94666898
4894 94666898 100247632 106057823 112482209 119551453 127326959 135934325 145391700 155928362
4886 155928362 167853881 181336991 196340850 213203982 232140512 253242105 276489316
4879 276489316 302191375 330505046 361247364 393867444 427002404 457641442 482142770
4872 482142770 496278012 497014212 484019061 459899811 428543591 393799697 358602783
4865 358602783 324853277 293646449 265434819 240303104 218083496 198511237 181187627
4858 181187627 165990233 152721488 140929017 130615968 121635980 113673575 106548257
4851 106548257 100430739 94937863 89997135 85519970 81287690 77545104 74018569 70707657
4843 70707657 67680190 64802443 62066496 59497513 56986663 54704335 52509684 50558132
4835 50558132 48715796 46921173 45269839 43691340 42213216 40941605 39731693 38731276
4827 38731276 37786248 36679684 35645835 34610428 33560902 32504300 31298948 30119602
4819 30119602 29069249 28113191 27103125 26250977 25549489 24743691 23997471 23361216 22716211
4810 22716211 22114177 21569073 21090048 20663616 20190359 19795098 19434545 19029951 18670130
4801 18670130 18235519 17940555 17496888 17132659 16788168 16334908 15929853 15528798 15287699
4792 15287699 14993206 14605343 14270640 13966138 13616749 13351181 13171075 12951866 12757373
4783 12757373 12520465 12436914 12289612 12115696 11924714 11583583 11405729 11215130 11062087 10964187
4773 10964187 10702679 10514870 10445464 10337236 10257163 10045788 9899363 9805655 9638027 9450285
4763 9450285 9330411 9264372 9136112 8948374 8866303 8687849 8519157 8412767 8430294 8279507
4753 8279507 8172183 8111699 8006124 7987511 7949672 8010991 7945122 7835725 7726482 7811428 7899258
4742 7899258 7796779 7741985 7765400 7761147 7663322 7569729 7504441 7600221 7679821 7624883 7551661
4731 7551661 7572011 7615713 7692755 7690099 7729885 7745514 7681881 7789221 7798486 7889522 7992161
4720 7992161 8013793 8041291 8139385 8307228 8385555 8367740 8427197 8497136 8544119 8565215 8542656
4709 8542656 8613420 8583000 8639258 8595404 8624464 8717768 8719579 8799840 8978749 9011960 9124374
4698 9124374 9233949 9325366 9356683 9488858 9631953 9704982 9941454 10240616 10453478 10597424
4688 10597424 10643868 10964342 11275942 11544864 11749063 11968336 12288327 12556646 13032201 13431843
4678 13431843 13887360 14366214 15090367 15821605 16540699 17223315 17886024 18354581 18589061
4669 18589061 18406880 18089139 17572257 17064493 16654132 16303488 15973597 15623276 15376655
4660 15376655 15191874 15181568 15123894 15160526 15246888 15284230 15336138 15527247 15658574 15697910 15812966
4649 15812966 16076849 16443732 16680287 17010871 17297846 17560379 17914538 18199678 18632148
4640 18632148 18976304 19336316 19737581 20060017 20470312 20920570 21434091 21860770 22386138
4631 22386138 22981522 23508414 23971201 24456313 24939631 25583468 26254923 26934670 27587827
4622 27587827 28266992 28908353 29721618 30526084 31224675 32072736 32923502 33906072 34904014
4613 34904014 35814844 36886902 38118105 39298772 40458384 41783498 43214629 44643823
4605 44643823 46352606 48046307 49825520 51766569 53838112 56201077 58710902 61389905
4597 61389905 64155605 67124346 70295584 73573665 77157590 80755801 84620884 88662351
4589 88662351 92762048 96823485 100729486 104640064 108453066 112145009 115615082 118903917
4581 118903917 121915149 124625255 127213436 129642705 132099095 134522169 136934538 139532662
4573 139532662 142427727 145717608 149212563 153001313 157060812 161366853 165874129 170407313
4565 170407313 175060023 179574460 184112801 188831959 193073228 197058415 200776085 203825660
4557 203825660 206577017 208814354 210479638 211763590 212245414 212046490 211370012 210275029
4549 210275029 208943242 207562111 206033967 204504111 203074230 201838279 200701522 199671727
4541 199671727 198879504 198248150 197959096 197984279 198198994 198841617 199825642 201077263 202848022
4532 202848022 204964416 207304978 209665954 212176194 214617062 216682986 218262702 219102033
4524 219102033 219194925 218814662 217603885 215728984 213334081 210204504 206262107 201656496
4516 201656496 196676927 191521839 186155222 180683907 175382218 170210718 165225617 160485906
4508 160485906 156167135 152432621 149138425 146418706 144026943 141972539 140052566 138038219
4500 138038219 136073354 133627757 130750589 127391356 123667442 119685084 115295354 110669092
4492 110669092 105594146 100387034 95293668 90250524 85320942 80627342 76168463 72004007
4484 72004007 68163990 64413700 61079948 58003796 55146237 52425696 50088087 47943633
4476 47943633 45940263 44077444 42411047 40814372 39333187 37940623 36569576 35434718
4468 35434718 34200696 33037658 31978435 30933379 29954073 29081618 28127930 27277017 26539098
4459 26539098 25733673 24939257 24226195 23587442 22862354 22264446 21641670 20944065 20395262
4450 20395262 19927100 19381009 18726903 18289009 17793453 17398943 16929230 16384463 15938169
4441 15938169 15497246 15100892 14752454 14400365 13964059 13634064 13371570 13015804 12724868
4432 12724868 12397614 12059438 11741607 11528900 11308187 11004004 10736379 10501382 10281957
4423 10281957 10109853 9863824 9651703 9563856 9349308 9115570 8887485 8824181 8670087 8471168
4413 8471168 8241532 8129992 7973920 7863298 7623780 7448950 7477610 7381637 7273259 7168331
4403 7168331 7045277 6953253 6764657 6652163 6573074 6628079 6494151 6334034 6286049 6116292
4393 6116292 5968396 5841174 5792479 5680050 5615370 5551212 5561230 5499990 5493204 5412510 5366745
4382 5366745 5305046 5158178 5019926 4956263 4965384 4817664 4844043 4822526 4850440 4799149 4714672
4371 4714672 4771987 4624311 4598982 4519642 4491022 4415263 4391582 4322768 4334371 4324025 4298573
4360 4298573 4260207 4153135 4031820 4085006 4125217 3961821 3871785 3873503 3785461 3758666 3758703 3639315
4348 3639315 3739222 3714769 3766456 3627677 3645302 3626378 3656822 3583829 3512981 3476257 3419455
4337 3419455 3520871 3524513 3517179 3426808 3405334 3395456 3424753 3366932 3429764 3386136 3360190 3304134
4325 3304134 3243220 3318595 3328496 3311454 3215538 3311239 3347277 3318701 3280924 3132140 3164466
4314 3164466 3183636 3187789 3170547 3104542 3070536 3179431 3132500 3188886 3276545 3295061 3238462
4303 3238462 3333414 3292479 3276424 3304686 3234313 3281306 3261441 3244881 3235929 3235391 3318109 3285220
4291 3285220 3326431 3309597 3365410 3347282 3370846 3459074 3488968 3514254 3469478 3569001 3569203 3695240
4279 3695240 3607116 3688361 3732546 3750118 3732024 3805475 3794531 3836028 3916832 3892373 3900800 3927065
4267 3927065 3823326 3902998 3947198 3917900 3863907 3940004 3869424 3958332 3917848 3838323 3826215
4256 3826215 3785650 3837278 3865059 3899114 3970102 4039193 4060567 4118936 4077965 4072466 4030001 4023564
4244 4023564 4084902 4060856 4010444 4118973 4137175 4137510 4193823 4237878 4120717 4073616 3980657
4233 3980657 4026443 3963074 3926938 3893753 3906709 3823507 3761068 3794092 3887362 3853561 3824667
4222 3824667 3728764 3653492 3688425 3736041 3781814 3741258 3778212 3795788 3761433 3726390 3712143
4211 3712143 3648490 3547518 3628346 3573261 3565453 3527725 3443039 3406785 3269782 3312271 3384303
4200 3384303 3314937 3297352 3272343 3186327 3201093 3391980 3469426 3353012 3423176 3517998 3524391
4189 3524391 3546920 3674410 3695490 3807555 3954415 4046195 4261298 4441310 4598790 4794877
4179 4794877 5017885 5013347 4905512 4664236 4590680 4393364 4164641 4074188 3960567 3837219
4169 3837219 3732068 3746057 3670840 3683821 3609897 3531896 3593268 3645758 3686221 3688158 3702866
4158 3702866 3703748 3806786 3849665 3755047 3881557 3940300 3952711 3935568 3855374 3826933 3948129
4147 3948129 3921640 3877599 3958580 3990663 3984898 3995249 3948092 3950240 3984530 3933578 3942329 3906412
4135 3906412 3813244 3948192 3996027 3950324 3900686 4059222 4081819 4026057 4021379 4021405 4068446 4079156
4123 4079156 4136148 4160536 4154556 4266307 4291235 4252153 4315776 4296276 4316033 4408648 4336294
4112 4336294 4290413 4255462 4241576 4236928 4250813 4308865 4344252 4259326 4237565 4319117 4351340 4296194
4100 4296194 4163096 4174705 4128159 4118969 4099130 4230190 4193136 4241732 4427140 4333046 4283907
4089 4283907 4345051 4364360 4344882 4367287 4180070 4222066 4309861 4352114 4340161 4308509 4259741
4078 4259741 4205653 4245989 4329652 4331502 4286523 4162982 4134884 4203391 4000729 3991705 4080322
4067 4080322 4154820 4104509 4204936 4124573 4117999 4258350 4265334 4175487 4102225 4088414 4115845
4056 4115845 4109853 4205640 4335242 4307248 4318260 4319253 4405729 4456100 4486469 4463140 4484535 4550580
4044 4550580 4571857 4492218 4588705 4635838 4538491 4539008 4672091 4704647 4730425 4718275 4763802 4938761
4032 4938761 5021373 5010493 4958131 5027136 5099180 5257068 5372491 5305561 5416329 5505017 5448120
4021 5448120 5542655 5501334 5558890 5623003 5579058 5574046 5710747 5693313 5829663 5995651 5980235
4010 5980235 5992725 6158381 6171313 6204830 6180948 6313104 6412758 6393233 6482868 6644476 6753967
3999 6753967 6701381 6811477 6910977 6955391 7048803 7152366 7222297 7322362 7357554 7375899 7464014
3988 7464014 7601432 7666493 7777555 7899745 7962626 8022225 8147881 8207123 8288871 8386511 8405042
3977 8405042 8546932 8679606 8751315 8910979 8991286 9132901 9367557 9447608 9483987 9538643
3967 9538643 9678883 10005597 10184371 10320166 10544687 10612396 10797072 10971813 10967881 11191395
3957 11191395 11435489 11608447 11777269 11980887 12222435 12440189 12676689 12825506 12990016
3948 12990016 13182787 13322458 13560645 13894229 14131958 14306003 14480007 14803071 15165354
3939 15165354 15501680 15763511 16033277 16356898 16604557 16952173 17369414 17752252 18281335
3930 18281335 18613466 18895164 19305901 19775294 20205455 20631300 21211839 21702190 22239130
3921 22239130 22723100 23278209 23942551 24652817 25427916 26124938 26915490 27872956 28730783
3912 28730783 29671586 30721728 31732782 32801287 33971485 35156754 36561391 37817387
3904 37817387 39156072 40446770 41753618 43028703 44340695 45656581 47012313 48263647
3896 48263647 49567008 51003768 52328839 53653585 55155395 56795365 58384734 60083392
3888 60083392 61816966 63614897 65405936 67140607 68890949 70577578 72244600 73994647
3880 73994647 75739786 77633369 79577480 81567393 83632520 85635918 87915567 90172931
3872 90172931 92580801 95150125 97866189 100865758 103913955 107121786 110551160 114186246
3864 114186246 118068551 122350436 126840327 131755278 136903699 142271204 147811886 153248606
3856 153248606 158739275 164340603 170052941 175840229 181824395 187935524 194388180 201291515
3848 201291515 208575883 216041359 223708828 231410216 238741490 245948939 253029383 260078477
3840 260078477 267611834 275618819 283872867 292089148 300060910 307284662 313719967 319331989
3832 319331989 324252132 328544095 332139893 335343821 338331404 341254117 343966287 346742169
3824 346742169 349570699 352348852 354938943 357774430 360927442 364300112 367580521 370451330
3816 370451330 371903200 371449900 368658455 363702015 357092559 349597759 341646700 333464842
3808 333464842 325336047 317025833 308357720 299380411 290444192 281598966 273046852 264888315
3800 264888315 256891213 249260607 241810656 234339684 226923228 219816204 212988070 206713548
3792 206713548 200914350 195551513 190807671 186501313 182396985 178236584 173531736 168478781
3784 168478781 162615524 156097368 149284593 142326453 135756193 129433519 123626565 118351506
3776 118351506 113265283 108479147 103738241 99230067 95089544 91135071 87720313 84507760
3768 84507760 81512074 78829481 76401377 74258881 72340099 70612334 69039016 67556403
3760 67556403 66174775 64660024 63278787 61782228 60194221 58579310 56773478 54982772
3752 54982772 53183106 51447170 49725733 48072778 46521545 45042404 43826580 42572384
3744 42572384 41266503 40092609 38928137 37903975 36842547 35757151 34642471 33636977
3736 33636977 32709445 31796248 30790188 29839029 28942258 28088590 27288898 26535544 25693565
3727 25693565 24991866 24391541 23761477 23209806 22638147 22125097 21446422 21027809 20572526
3718 20572526 20199435 19864923 19392205 18963583 18718360 18454647 18250482 17806819 17564723
3709 17564723 17336929 17001847 16734276 16381410 16052104 15870947 15693618 15399244 15204775
3700 15204775 14994383 14761312 14697108 14379182 14209203 14070168 14051979 13858999 13656238 13397504
3690 13397504 13301194 13193143 13012245 12956990 12865078 12651283 12579963 12440657 12298995 12245737
3680 12245737 12154255 12057799 11930215 11818343 11690184 11674613 11549300 11385524 11218357 11108247
3670 11108247 11057496 11018095 10980198 10849537 10725483 10678785 10656114 10651935 10586082 10544148 10435939
3659 10435939 10349996 10263036 10260432 10194679 10167625 10083354 10020593 9934880 9821841 9805285 9742132
3648 9742132 9644883 9641401 9510744 9487348 9430024 9361349 9293288 9291359 9182781 9141444 9114166
3637 9114166 8993662 8964281 8986449 8879078 8779865 8738053 8779605 8770919 8754780 8685713 8595671
3626 8595671 8556004 8544736 8530449 8524729 8463607 8448714 8430774 8390430 8362996 8269255 8305698 8264932
3614 8264932 8128983 8063932 8069861 8131207 8099655 8041469 8058352 8080640 8011250 8025118 7935272
3603 7935272 8073780 8051391 8036065 8108452 8055181 7948623 7934006 7951111 7982905 8023693 8087297
3592 8087297 7993323 7992298 7998501 8075359 8127292 8136965 8149010 8214550 8161140 8200308 8241046 8243272
3580 8243272 8355842 8294295 8340828 8388944 8393648 8317586 8335000 8384576 8382346 8433196 8531162 8512307
3568 8512307 8572698 8509072 8432404 8481779 8513534 8521796 8590885 8508648 8553870 8520746 8677757
3557 8677757 8833880 8778673 8792581 8955645 8959471 8896591 8951939 8936529 8954622 9055371 9083797
3546 9083797 9174862 9225427 9205990 9255860 9294559 9281619 9215974 9198875 9189806 9178533 9125625 9086739
3534 9086739 9025243 8854526 8826138 8873470 9003508 8936509 8978907 8907309 8901034 8945667 8972985
3523 8972985 8993572 9099468 9128307 9157567 9220768 9150335 9165115 9145035 9233523 9220677 9198506
3512 9198506 9184212 9204859 9184247 9126022 9098172 9007029 8955311 8968192 9011418 8919478 8837043
3501 8837043 8772425 8786871 8778511 8693810 8676178 8671963 8550286 8545283 8620225 8618340 8626353 8528531
3489 8528531 8501746 8609913 8750036 8775714 8818699 8798142 8672247 8743834 8832501 8862169 8805519
3478 8805519 8846770 8890086 8692878 8595941 8637272 8652303 8721999 8737916 8716845 8711321 8664932
3467 8664932 8716837 8662876 8659687 8681518 8661987 8592179 8591651 8639384 8624717 8720094 8776577 8815203
3455 8815203 8917421 9044361 9001211 8919422 8975590 9077354 9085148 9051152 9043651 9096378 9161804
3444 9161804 9170786 9324895 9316789 9344666 9449930 9525379 9534827 9565264 9631317 9821414 9784238
3433 9784238 9839720 10120436 10233081 10361167 10451743 10604677 10706944 10840664 10795314 10865493
3423 10865493 10939997 10978302 10961758 10992574 11078188 11049972 11140347 11124314 11193004 11320068 11366652
3412 11366652 11404587 11455241 11513212 11679503 11678783 11734826 11918822 12048934 12244504 12402707 12452226
3401 12452226 12687950 12948388 13031269 13270258 13553812 13750421 13946775 14088881 14156324 14268054
3391 14268054 14247979 14163521 14228086 14170269 14243105 14314868 14274975 14251921 14400754 14492070 14642207
3380 14642207 14764436 14890730 14994424 15158717 15355752 15483412 15614053 15790192 15915697
3371 15915697 16126741 16334079 16531385 16750297 17011665 17354281 17679745 17915567 18199358
3362 18199358 18486140 18799073 19002029 19201507 19473650 19651192 19846514 20035904 20270596
3353 20270596 20504910 20849461 21116343 21464354 21737074 21981747 22299673 22625745 22917777
3344 22917777 23237397 23634246 24034644 24382062 24709249 25109611 25631953 26114179 26607085
3335 26607085 27045098 27534605 28017049 28499055 29032801 29587108 30048896 30611783 31124342
3326 31124342 31771165 32358837 32820374 33384149 33863619 34441230 35165908 35661440 36269585
3317 36269585 37113200 37751915 38429145 39030377 39837224 40720304 41520559 42302888 43168108
3308 43168108 44083599 45170811 46382193 47550963 48830451 50009210 51265379 52829018
3300 52829018 54402600 56007950 57695792 59611976 61662224 63671623 66009255 68576932
3292 68576932 71257374 74165670 77235463 80415382 83808176 87292327 90964846 94569883
3284 94569883 98119070 101555513 104710389 107325160 109468970 110798664 111148491 110645676
3276 110645676 109112169 106863880 104128023 100916077 97603244 94203205 90863166 87667778
3268 87667778 84681403 81741085 79079642 76705019 74457863 72396166 70366186 68615002
3260 68615002 67021274 65520376 64212763 62921366 61705118 60619486 59570661 58564538
3252 58564538 57609345 56749252 55864696 55004377 54307035 53533980 52771622 52068724 51231900
3243 51231900 50406549 49423063 48241760 47155130 46043614 44937512 43804764 42650772
3235 42650772 41586865 40646266 39668354 38761624 37939794 37202669 36502321 35758996 35144415
3226 35144415 34689027 34196723 33662940 33392365 33087931 32780719 32553289 32414174 32231900
3217 32231900 32086285 32115688 32258824 32400560 32463899 32580068 32536811 32120658 31709583 31084306
3207 31084306 30204052 29305048 28486905 27737049 27091830 26336486 25728294 25173137 24727702
3198 24727702 24315761 23910089 23541854 23204502 22941401 22768762 22492019 22369002 22238765
3189 22238765 22067607 21968469 21896791 21840780 21685092 21653173 21673649 21681018 21618742 21542212 21551117
3178 21551117 21465820 21149068 20736961 20433507 19934630 19529267 19166159 18697230 18474820 18137450
3168 18137450 17784912 17361171 17082152 16870018 16659583 16445634 16251945 16123905 15998825
3159 15998825 15729858 15559473 15459517 15355420 15230473 15115829 14925065 14862117 14761817 14663721
3149 14663721 14568031 14512853 14379544 14187754 14084725 13919452 13924992 13736888 13724605 13654110
3139 13654110 13495734 13387950 13357660 13271740 13201379 13068373 13031845 12934286 12832639 12736350
3129 12736350 12683963 12599980 12615451 12569937 12527787 12547352 12535525 12483584 12377245 12407873 12302599
3118 12302599 12216349 12132076 12064261 12014485 11981801 11970003 11846819 11634283 11568864 11606365 11527386
3107 11527386 11454564 11461506 11360285 11297208 11153227 10996718 11007904 10983326 10844631 10741304
3097 10741304 10712549 10701954 10613002 10484236 10439256 10333675 10398761 10388942 10295455 10264429 10145277
3086 10145277 10180485 10167279 10077811 9887306 9871222 9762192 9833734 9741544 9608567 9587291 9553954
3075 9553954 9480905 9473662 9339370 9208629 9132566 9150858 9156932 8981793 8931080 8886787 8843807
3064 8843807 8911757 8819868 8737070 8749712 8664999 8773174 8899683 8825780 8821455 8834318 8848203
3053 8848203 8928765 8949088 8807609 8772818 8863601 8848104 8833027 8826635 8834128 8742036 8794507 8844364
3041 8844364 8833316 8874355 8815590 8917381 9075836 9191456 9217843 9312043 9449780 9439122 9507976
3030 9507976 9737798 9814459 9898918 9875443 9899285 9977577 10070731 10223866 10300366 10290841 10444194
3019 10444194 10570377 10651972 10965933 11106745 11238031 11287840 11457959 11739047 11878207 12008585
3009 12008585 12105559 12160113 12338601 12432939 12612431 12687883 12771019 12882662 12987976 13256149
2999 13256149 13538968 13647621 13772289 13947207 14071182 14175690 14371555 14663371 14926354
2990 14926354 15093055 15241513 15516729 15947365 16359603 16675569 16993766 17458862 17894817
2981 17894817 18231493 18695327 19160791 19632684 20293571 20727895 21028503 21425193 21928518
2972 21928518 22500891 23014415 23367951 23913027 24433033 24754802 25110709 25528463 25878697
2963 25878697 26216834 26511186 26861264 27228284 27590340 27997504 28381612 28765464 29136424
2954 29136424 29615091 30290010 30916760 31624344 32444787 33297247 34264284 35326500 36260072
2945 36260072 37290172 38371039 39569843 40537321 41388058 42134572 42769773 43179297 43273180
2936 43273180 43143139 42908212 42425376 41796185 41238072 40745654 40512401 40190874 39887958
2927 39887958 39754516 39936394 40155332 40361413 40605368 40952474 41451502 42016585 42578726
2918 42578726 43272901 43860538 44352458 44710452 45196733 45519282 45641241 45451243 45116918
2909 45116918 44670699 44145487 43316039 42424326 41569127 40574505 39468510 38565915 37671370
2900 37671370 36855013 36190749 35556837 35018262 34616035 34247447 33986187 33752399 33427455
2891 33427455 33221829 32912922 32539751 32088100 31592866 31080684 30339109 29578595 28801026
2882 28801026 27933908 27004846 26062634 25211085 24291744 23326169 22490377 21637838 20874408
2873 20874408 20188014 19560614 18892277 18283283 17768627 17255499 16724360 16260272 15964142
2864 15964142 15630473 15213777 14872988 14504694 14154996 13781665 13430242 13126631 12807391
2855 12807391 12560525 12161983 11840529 11490484 11181398 10893207 10679741 10378932 10139176
2846 10139176 9881076 9745460 9489471 9300973 9053823 8754730 8579765 8452406 8150432
2837 8150432 7994360 7833805 7662905 7612044 7403389 7246069 7190909 7049716 6903321 6716998
2827 6716998 6625253 6679723 6595590 6490118 6469838 6345560 6195104 6105400 6025591 5950963 5772538
2816 5772538 5639274 5512147 5452156 5315242 5238350 5026665 4973872 4864422 4774028 4699775
2806 4699775 4665705 4576617 4499306 4366172 4315392 4267307 4130188 4068704 3987244 4063592 3943911
2795 3943911 3857973 3796867 3835204 3705602 3698040 3550523 3542393 3585081 3412857 3366658 3300800
2784 3300800 3095652 2999296 3013551 2892594 2891606 2820105 2756904 2706764 2762977 2687719 2629873
2773 2629873 2698409 2631430 2552294 2440485 2342266 2412230 2325446 2250276 2157172 2151143 2180901
2762 2180901 2201653 2188616 2199888 2079597 2039925 1959042 1938154 2022734 1908996 1938483 1922955
2751 1922955 1938765 1843536 1795841 1806713 1793978 1831756 1824509 1776100 1702191 1701216 1679645 1689976
2739 1689976 1675881 1710946 1629032 1601370 1603543 1583262 1561602 1456195 1502049 1549089 1582852
2728 1582852 1481545 1421414 1477425 1527937 1475974 1429243 1370498 1357983 1356692 1313439 1360479
2717 1360479 1360981 1413487 1360509 1286903 1336576 1312307 1282207 1261621 1202535 1245453 1308158 1377133
2705 1377133 1386027 1249236 1313696 1290446 1166937 1100625 1124154 1094913 1103038 1183602 1212459
2694 1212459 1133227 1134121 1116022 1122799 1130558 1073360 1075357 1037679 1028942 1063769 990213 1031415 1005052
2681 1005052 1067825 1133637 1099405 1082727 1072421 1211166 1139052 1033737 1021410 937558 842175
2670 842175 881392 1035829 1002212 1020860 1053125 909836 884293 886509 769664 850980 878115
2659 878115 926888 1022895 958174 901472 910437 853776 846019 930668 970901 900022 908244 947514
2647 947514 984808 947281 841783 830951 853400 947069 892461 848501 925125 923318 901761 875065
2635 875065 812378 855430 881899 783840 795500 876989 865047 845777 799848 779383 856375 854634
2623 854634 861566 888165 765542 713311 543329 664441 668392 669319 717838 683005 634376 652864
2611 652864 619830 638477 660370 620976 697666 629818 648771 720685 754942 692753 654627 686553
2599 686553 677802 699718 717105 685140 568189 534844 582044 621608 616661 604449 551688 582689
2587 582689 511606 433001 394905 504135 590772 562824 453214 373848 443427 452402 370697
2576 370697 415256 348102 312824 333174 438428 416289 313820 360692 436575 406725 375186
2565 375186 333374 296838 341435 378693 397805 353569 414157 328394 334730 368893 336348 331968
2553 331968 246649 182746 217413 239418 284007 309233 322584 305564 174766 229904 220201 218193
2541 218193 362603 376406 202947 238043 308611 325534 257710 192273 269943 202192 297560
2530 297560 153000 265990 260984 210534 194709 124837 29534 107569 83981 181712 239993
2519 239993 243135 216823 221061 195469 120779 139189 150159 141946 155477 18268 67761 214345
2507 214345 152430 105523 78948 182210 166520 98813 206496 164203 32579 93369 50437
2496 50437 48597 4555 -45571 47819 147706 73014 41486 13263 107276 101861 131687 149819
2484 149819 116501 66447 88575 30106 135166 188693 76439 71621 97836 100082 44665 93382
2472 93382 10910 -38998 50185 76106 61629 6703 -49292 47410 783 -14319 -3856 111027
2460 111027 70031 50288 132712 6261 -40465 79288 114218 62018 -75384 -140369 -5814
2449 -5814 16000 86156 114431 115814 115463 113337 144382 9086 -23266 50139 51213 38482 48697
2436 48697 45269 98756 40925 -17385 -22335 -6476 47565 80292 50022 -32845 3628 -22595
2424 -22595 -106080 -100677 -144391 -218248 -182746 -161780 -66505 -5319 -41290 -42276 10756 -20038
2412 -20038 16858 11519 -48587 50750 94680 200312 171384 210364 116076 34474 -966 -106905
2400 -106905 121875 -56644 -68492 -4604 -1097 -36720 -84338 -53701 -108949 -93200 -33424
2389 -33424 22860 -34541 -92003 -17173 24217 -46159 -162379 -164295 -153645 -130282 -118124 -46211
2377 -46211 -84246 -67719 -159499 -149777 -31922 -43105 -53922 -85326 -177707 -130926 -158376 -141631
2365 -141631 -138679 -56389 -41375 -88781 -107432 -137696 -105351 -67747 -45658 -94113 -163546 -98882
2353 -98882 -16000 -226054 -183290 -150163 -89026 -114921 -206066 -136128 -14173 -23225 -131292
2342 -131292 -201518 -232724 -233668 -135076 -77726 -91248 -125086 -181429 -202848 -108676 -50472 -119904
2330 -119904 -93561 -32842 -120217 -66447 -53053 -3615 -118466 -103360 -50020 -171550 -69368
2319 -69368 -37888 -150694 -51782 -108086 -110154 -17393 -28496 -81096 -113416 -87770 -46403 -34035
2307 -34035 -46243 -18497 -50711 -99150 -121911 32066 45804 -6147 -71251 3604 30292 -82721
2295 -82721 -130898 -125732 -28622 16125 -51260 -212271 -114174 -44009 -91308 -26101 32856 39537
2283 39537 151924 121136 -20303 -79616 -80134 -84933 -30984 -16234 -46570 -134277 -103363 -62631
2271 -62631 -35129 -52125 -59639 2765 103999 40894 -25830 -25312 -67227 9122 10088 -1097 -82061
2258 -82061 -21401 91601 122009 55733 71738 70060 3563 61192 152412 180613 220459 172060
2246 172060 152184 142341 51117 42675 116623 160976 197045 166627 167960 66110 77227 183130
2234 183130 260709 262370 231635 243809 305878 259728 345125 378321 308482 313890 352261 389954
2222 389954 405627 446620 472719 519311 480118 380992 472525 480555 422299 470391 457639 516216
2210 516216 503111 547309 581710 639660 625179 607992 687176 644478 691013 788919 858388 890896
2198 890896 943741 1004191 1000751 1064434 1048578 983857 880875 978207 1040155 1150894 1086195
2187 1086195 1154992 1288845 1339937 1429846 1484708 1543863 1679914 1690942 1648532 1681024 1709151
2176 1709151 1692175 1737432 1864216 1968565 2119680 2205130 2271341 2469129 2610386 2732007
2166 2732007 2965090 3079662 3245742 3411984 3697990 3749712 3949600 4400893 4791657 5243923
2156 5243923 5762008 6123947 6545505 7030316 7601617 8399981 9201065 10265666 11499986
2147 11499986 12979227 14745342 16792389 19251178 21880270 24629203 26817061 27702343
2139 27702343 27126803 25283059 22666626 20083123 17391694 15239729 13391490 11632391
2131 11632391 10326602 9267204 8336283 7598159 6980756 6326505 5872341 5423420 4931312
2122 4931312 4545219 4270854 4064277 3763100 3490693 3289673 3110342 2833036 2687163 2652815
2112 2652815 2511130 2457015 2290523 2075376 2004061 1942639 1837123 1706409 1676721 1557631
2102 1557631 1511108 1478399 1313303 1357378 1325401 1254579 1110201 1074695 1110068 924286 897362
2091 897362 902086 870241 882537 827113 788456 723537 686761 704183 607378 620460 673957 594692
2079 594692 637256 586654 543199 507684 510810 517167 501392 447934 398439 308450 396655 499144
2067 499144 508886 487112 406910 422032 369104 350152 338734 381419 302869 257989 281034 180704
2055 180704 239818 241696 243792 265240 241998 234229 279499 268866 216337 278614 251760 138499
2043 138499 107524 79598 71219 -2473 5730 -21643 8783 54533 112783 153899 209854 44290
2031 44290 -59499 -10152 -20483 -43709 2771 -16231 68489 19973 -4828 10320 -13304 -110239
2019 -110239 -77765 26777 25597 26093 -78 32552 43755 79887 -28039 -132639 -50762 -97847
2007 -97847 30102 -40990 -114574 -77881 11036 64026 -49987 -48781 -106733 -36461 -13025 -17595
1995 -17595 -43718 -7068 -97131 -76358 -84854 -48055 -8088 69651 -5001 35734 171733 54299
1983 54299 -19510 -95452 -122421 -16116 -81545 -97529 -35913 -108567 -92452 -16654 6449 -69392
1971 -69392 -171137 -179599 -245674 -195048 -185060 -137853 -79591 -64859 -56065 -47074 -145356 -112049
1959 -112049 12137 -61645 -44880 -54868 -77302 -30116 -119847 -90444 -108766 -36245 31932 -15224
1947 -15224 -61133 -113672 -65453 -68346 -150375 -87426 -158411 -98656 -107038 -128467 -172135 -108711
1935 -108711 -183750 -188243 -129254 -95999 -82558 -51983 -9909 -33007 -17297 -132534 -146622 -61247
1923 -61247 -28867 1906 -30289 -55275 -11528 44998 15276 -48657 -14046 -80892 -63655 -142840
1911 -142840 -88658 -90954 -156677 -94684 41962 86883 -6459 -115992 -189169 -128413 -64821
1900 -64821 11496 35673 -51846 -96336 -150765 -119658 -155450 -164037 -226201 -172032 -170887 -100560
1888 -100560 -75277 -33163 -17073 -56660 -42770 21055 -31660 -150364 -151428 -125813 -34581 -24861
1876 -24861 -16403 33664 8432 113425 128727 114924 37309 21977 114676 23218 21411 28849
1864 28849 -6471 62786 33518 45163 -9467 -66651 -88900 -48508 -63856 -41860 -145059 -138695
1852 -138695 -88990 -27362 65514 38089 -40174 -51829 -121408 -80622 -78804 -157393 -55651 -121258
1840 -121258 -163813 -145809 -80883 -77158 -188835 -151550 -61960 -102711 -88157 -149840 -62761 -100594
1828 -100594 -241720 -230410 -87427 -99437 -85798 -50459 -111242 -114797 -101529 -121287 -142742
1817 -142742 -156514 -148493 -163474 -183815 -181365 -166205 -166794 -118517 -57291 -84938 -82829 -119793 -170108
1804 -170108 -106952 -110083 -82574 -185189 -160777 -142045 -120224 -117481 -169789 -129970 -33442 -102814
1792 -102814 -113154 -93780 -160063 -135778 -142533 -197549 -213261 -95625 -75397 -142248 -75045 -151125
1780 -151125 -211158 -142471 -117873 -40788 -93800 -74658 -14520 -3952 -117738 -149708 -102526
1769 -102526 -56375 -100491 -121670 -139281 -67220 -135829 -184083 -251045 -244698 -124213 -112809 -210162
1757 -210162 -130217 -113431 -68437 -55204 -61600 525 -78594 27070 -36076 -33743 -127720 -103569
1745 -103569 -111316 -223328 -120586 -45633 -114533 -135822 -153507 -225696 -161442 -180692 -233441
1734 -233441 -138298 -145234 -186661 -216602 -213497 -208330 -243033 -221007 -173843 -141938 -44440 -99599
1722 -99599 -118402 -210639 -213342 -109291 14316 -33955 -29569 -35781 -162815 -108815 25673 67409
1710 67409 20928 7963 -64794 -145293 -57830 -7964 -126285 -165852 -170848 -101768 -161395 -93208
1698 -93208 -113662 -176732 -259318 -98178 -39392 -88899 -201389 -293938 -151079 -147772 -167078
1687 -167078 -195779 -121908 -55456 -119076 -202892 -223933 -176926 -20035 -29954 -7283 41941 5676
1675 5676 55019 -3587 -76632 -95907 -145739 -167464 -157753 -228636 -193359 -121808 -103524 -99647
1663 -99647 -81581 -48676 5768 6606 -97483 -127443 -230780 -291238 -141983 -86081 -104085 -113697
1651 -113697 -163767 -116584 -25615 -68125 -111423 -173701 -199215 -125883 -193428 -267107 -196123 -152165
1639 -152165 -145350 -70552 -56862 -91182 -77695 -52453 -61983 -97139 -145683 -207728 -250933 -201140
1627 -201140 -225498 -201979 -168421 -76290 -118506 -72017 -35190 -113849 -56503 1530 -46006 -32868
1615 -32868 -37867 -82235 -49111 17973 -68540 -124332 -75158 -87749 -50402 -29014 -63842 -155455
1603 -155455 -148823 -172156 -146281 -144448 -125019 -48501 -111795 -64069 -53179 -110363 -120442 -150307
1591 -150307 -51209 -96816 11160 10248 -48341 -33535 -74033 -199445 -152844 -144144 -170044 -290234
1579 -290234 -177085 -124021 -185615 -194420 -102202 -10881 8714 -22606 -144342 -130052 -49006
1568 -49006 -3531 -155010 -23531 9496 -64594 -144816 -147357 -132294 -57729 10110 66212 1298
1556 1298 -48956 18314 138930 138921 20577 -17748 -61989 -97438 -55557 10174 12365 -33534 -121209
1543 -121209 -122895 -99923 -109079 -143300 -160750 -32938 -53934 -130182 -90997 -135409 -88485 -13405
1531 -13405 -54920 -135531 -70979 -160036 -167104 -98238 -76200 -185667 -107958 -65276 -117711 -121265
1519 -121265 -187971 -126431 -30919 -47580 -70854 26937 30350 -13239 -57729 -151917 -81278 -30974
1507 -30974 -41586 -16404 -34414 19574 66174 10357 -30503 5318 12258 46531 -58603 -46267
1495 -46267 -8682 11444 -11307 -24150 -88192 28205 -15704 -32834 -82115 -113759 -135849 -67883
1483 -67883 -33842 -101705 -83446 -138073 -107984 -199597 -178426 -179444 -138078 -32061 -14988 -55541
1471 -55541 21836 1144 30666 -24292 -11502 -31623 -132393 -120245 -226068 -161856 -21429
1460 -21429 -61102 -130575 -69427 -88319 -150674 -124822 -57476 -139627 -114723 -37214 -79923 -190746
1448 -190746 -102631 -92221 -126515 -118936 -117774 -120670 -53995 -119051 -124836 -92857 -137576 -96704
1436 -96704 -97996 -103559 -53130 -31243 -71337 -136720 -75234 28083 -56662 -83594 -53588 -13988
1424 -13988 -22038 -39638 -73013 -122188 -102536 -40549 -36452 30326 52321 -36690 -52088 -41300
1412 -41300 -58655 -9872 -38644 -150140 -54104 28966 -56514 -170167 -123258 -23145 -75792
1401 -75792 -126237 -170185 -63208 -7945 -72478 -87546 -132436 -213323 -55622 -101 -34362
1390 -34362 595 -38978 5095 14257 -49111 -31122 9142 14060 -85292 -51387 -74552 -151693
1378 -151693 -35624 65919 9153 -121247 -138854 -206630 -162326 -87208 -35701 -8904 -10177
1367 -10177 -39457 -44951 47315 97065 25637 -21992 -65341 -119685 -82169 -86516 -53906 14635
1355 14635 -37558 -3242 46842 13859 -49654 -163222 -42294 -27720 -17493 -141353 -90442
1344 -90442 -220348 -171762 -219291 -198168 -141719 -129194 -93652 -79985 -25439 -21002 -42396 -83076
1332 -83076 -18795 29630 -21323 -11139 31483 10163 -1705 -94866 -78018 -95598 -179930 -69024
1320 -69024 -83223 -158779 -11844 -7444 -11633 14090 -36530 -90975 -85162 -37086 -110202 -144911
1308 -144911 -150034 -94613 62609 63068 -32273 -137633 -101577 -35847 -63379 -40727 18608 66681
1296 66681 30022 -56352 -63963 -17859 -15480 -89645 -45166 -98272 -62811 -75082 -46271 -79280
1284 -79280 -35963 -35503 -17023 -59978 -56309 -62444 -62287 -6951 38522 -16741 -96116 -61263 -1465
1271 -1465 10567 44459 85802 140384 7583 -103660 -153419 -78311 -2730 101136 15440
1260 15440 -86843 -123747 4726 42062 -40042 -74700 79446 88909 35704 13018 -39044
1249 -39044 15940 88838 53893 -10465 31649 80973 46870 -49734 26077 -55167 -77914 -73206
1237 -73206 -107995 9285 11498 -4534 -11831 -59993 -60052 -32933 -12252 34349 85440 -55948
1225 -55948 -68515 -20875 -12933 -9204 125209 86184 -37439 42243 23989 56006 123309 145027
1213 145027 140796 78797 68735 25864 52379 28027 80162 64107 41550 -16924 -9013 -26047
1201 -26047 -41714 99942 109466 45292 -7738 3618 9951 27842 195 26697 23234 -94975
1189 -94975 -30129 -55269 -72061 -149210 -31493 -21359 19870 73190 51378 16608 14249 -33230
1177 -33230 -20955 -50157 -110167 -56877 64540 -31133 44579 48252 17531 59425 37491 -39832
1165 -39832 -77942 -56748 -98425 -119390 -123954 -42592 13807 14974 -20510 57764 -26633 -67488
1153 -67488 47077 30062 39022 -20364 -55642 -83801 -49225 -125791 -100558 6963 -17693 -1888
1141 -1888 -26229 -22536 -80020 -31856 -148079 -86149 -114776 -100259 -67465 -31465 35650 -14320
1129 -14320 -38660 -73166 -108586 -41073 -7722 745 156552 31447 -4124 19025 1133 40687
1117 40687 25136 9091 -25463 -50743 28850 137570 60078 -11779 41217 21811 44114 3205
1105 3205 41169 87411 22420 45238 22546 -1313 19362 11620 65185 92598 58119 43320
1093 43320 7869 100609 58082 113431 -3165 17137 -15120 -92577 -147308 -140092 -31884 -7146
1081 -7146 29665 18873 -19898 -49906 -70441 -25978 -82600 -61026 -74302 -95942 1620 -12180
1069 -12180 -77675 -96785 -84386 -22646 -24996 -6435 -107788 -78956 -47331 -33461 13122 -52875
1057 -52875 -14494 -2593 -50700 -34658 74707 91090 16108 -46120 -88412 -72277 -38305 -42044
1045 -42044 -73091 -25160 -63228 16693 44457 -9528 -55878 -108074 -57844 -19261 -44143 -38600
1033 -38600 -66165 13486 65196 121289 113222 32022 23684 -32740 89685 93874 73158 14857
1021 14857 12253 -59294 -2021 -63246 44779 144403 72556 54340 28265 -35055 20466 36986
1009 36986 -47650 -161328 -163170 -125607 -27170 -9381 -15890 -6004 3620 -31949 -113761 -12474
997 -12474 74544 162192 147776 30855 -29630 20515 57397 -25639 -97553 -79973 -45117 1981
985 1981 36126 59551 90714 44645 -11664 39245 51513 39236 -12552 -67650 -57212 -18505
973 -18505 -25915 -5067 45147 -47611 -126573 -37381 100625 38513 -58390 47793 97071 36067
961 36067 74480 97857 101830 82178 143422 178487 138474 113661 154113 32670 -15045 -26043
949 -26043 22272 64923 593 -13581 -33877 41936 75619 48681 36920 108920 6955 35813
937 35813 23428 -97016 -19588 -130515 -62719 41596 44074 85204 4175 -43956 -43132 11316
925 11316 55141 -37007 15918 45891 -2205 23598 81339 71536 40592 12493 -78329 -78827 -20819
912 -20819 12843 58126 -29823 -92134 -60752 -42622 50304 11630 86229 7646 -77123 -72993
900 -72993 -54802 32511 139655 62291 26453 -93509 -64990 -31360 -28360 16724 3180 42157
888 42157 -47575 -20059 23437 29358 -70509 6261 67369 -70190 -153807 -159933 22011 -35114
876 -35114 30459 -5900 -83790 -83812 -5993 37816 4546 59238 46142 35684 36976 -67479 -1045
863 -1045 40855 16250 17646 -63969 -27572 -25863 -9425 18162 100706 42358 1283 -18428 32181
850 32181 104016 119712 62843 20205 -117905 -62238 13561 77092 21215 -2745 -15458 -88562
838 -88562 -146536 -79245 -94139 -130421 -72026 -70617 -68263 15011 108108 83258 142250 96339
826 96339 120369 30395 47857 98771 36574 101699 137172 102416 97510 123595 114128 129305
814 129305 123214 100055 97580 16261 14456 -57973 -64892 -45759 4259 -3019 -15587 14538 10821
801 10821 53908 151058 142460 -30847 -148996 -186411 -44286 -145709 -94787 12275 121428
790 121428 123070 133233 131546 40234 34117 69868 31419 17821 -21340 34075 23068 -56320
778 -56320 72982 -35225 -58919 28432 36472 -28045 55544 51215 69899 79652 105371 71842
766 71842 159889 149158 -40023 -35921 9001 10826 39266 35757 73649 69632 106759 147280 151021
753 151021 126222 27518 8396 107808 8271 -13333 -56284 101722 48702 -46221 2454 -18172
741 -18172 16885 73988 97888 -16354 -12426 23730 -23811 52208 98911 121922 108788 -21605
729 -21605 -13464 -86925 -124619 -90657 26191 66475 109289 124320 35400 -37561 83605 124280
717 124280 135008 22842 17727 60754 200630 27707 -21984 -9196 55126 50448 -6133 -17836
705 -17836 24522 -28334 50350 56746 -38162 -25011 2492 -5721 -46840 25647 121623 126500 102467
692 102467 123063 -13195 103662 71114 35265 73302 37419 101622 116250 86055 90081 11593
680 11593 31758 -16342 20732 71973 -19480 137382 171030 84038 76646 139228 217956 124283
668 124283 71338 80037 -33625 -20080 25815 27293 79650 116062 139202 46271 52332 167416
656 167416 156868 226989 213208 53100 144640 6377 42738 96015 -7276 41800 -23991
645 -23991 17427 106507 99062 20472 42066 48897 16983 -5096 -69553 -3120 91815 149690
633 149690 147139 67845 49507 79300 51132 49556 80613 37099 -3614 64558 111062 212800
621 212800 38473 -25012 5852 -18797 21251 119004 51382 200112 185837 91463 26198
610 26198 60772 138100 5343 -113347 -86013 -79797 -58738 -27705 -52400 80842 -20615
599 -20615 28502 20115 33536 12828 47766 -23875 -13958 19161 53945 105806 7256 -18452
587 -18452 -5810 97513 16482 17833 63757 -11186 10667 36957 94095 38466 81323 52572
575 52572 19801 71752 71219 37893 4100 38200 55974 116880 3232 145892 180015 73937
563 73937 50185 46561 156492 145872 155022 194586 148623 79676 92242 155632 174378 155570
551 155570 85967 34609 -1831 15966 136440 217530 91348 118599 65737 -5381 59038
540 59038 64254 98106 79359 98251 179548 193040 63258 46794 121089 73774 77861 175845
528 175845 172767 39503 8044 46907 2894 10033 -27133 100264 88021 -26035 -73450 16053
516 16053 106255 149743 165225 123218 60530 77084 101441 77587 65204 145788 108752 114177
504 114177 130488 168670 141218 121578 182664 85497 73931 44415 38850 42523 75015 121634
492 121634 -16747 78199 125271 94818 -3337 -30803 112498 175169 191669 185870 83585
481 83585 -80590 -4363 99234 118756 71821 -19743 -15250 -51908 -53265 4162 -46576 45130
469 45130 75391 123615 143546 18122 47263 -26045 62328 200674 97301 131517 127568 124653
457 124653 36688 121805 65967 103887 49153 21342 101263 133167 153025 160261 181832 171265
445 171265 63488 -58561 -20370 -50019 56271 116444 88652 115426 153021 157187 165161 189764
433 189764 223975 121797 -20862 28088 103677 77736 58781 60803 115930 146344 144236 131068
421 131068 105813 76273 147503 122348 69455 78178 111737 53342 63443 31739 45415 49040
409 49040 -40615 -9436 47207 -24602 -45543 -18935 111451 124131 11582 96231 58274 84317
397 84317 21414 26737 86538 22166 55027 112289 39879 36499 -32960 -47480 -106492 -9050
385 -9050 67349 138353 99536 83684 72297 6656 113545 134368 118754 -16128 -273 50129
373 50129 129030 128283 121646 174687 188083 124165 -51790 -35388 -58221 -96539 19425 65701
361 65701 29467 15322 -11100 94013 157636 31991 -3342 -81595 -74958 -81426 8932 88567
349 88567 48281 -7138 31709 57741 74878 47541 -28725 36913 48556 11190 6695 71482
337 71482 73279 22331 44278 85441 -6757 46177 21887 -76965 6626 84566 58323 53330
325 53330 40239 126322 239943 91950 -28477 14118 25576 83485 52648 65988 40222
314 40222 -42294 39571 -27929 15236 69579 78132 41417 47494 162758 116952 -41358 -101140
302 -101140 -22864 -131214 -13025 81598 26022 91216 162826 156011 47599 103814 59455
291 59455 63585 70167 38058 -45599 74541 77510 54678 1615 -3358 26910 55963 -11636 24838
278 24838 55946 -56093 -8956 -14995 61392 179363 192187 64074 2967 -4880 40792 6155
266 6155 14419 24082 66125 96897 132981 67892 108965 85698 -23867 39247 89520 123609
254 123609 103191 95101 82530 56376 67123 90535 114481 58647 51517 61309 55176 81342 187858
241 187858 107597 101639 72334 4256 -2953 43455 33942 -8215 31705 -27820 -12137 -9369 45725
228 45725 57676 9763 32716 58877 62701 85232 90002 150337 133933 102131 30999 37573 64949
215 64949 47084 -8104 50213 8914 -21843 -38171 -107650 -6726 60170 89083 4724 48068
203 48068 114709 26684 22913 4354 34623 70374 -1188 -22387 20151 98147 49203 35348
191 35348 53330 -6515 41275 42712 112519 28044 -24756 48849 110382 131155 44928 2946
179 2946 136805 121462 112713 54876 128459 181180 37927 90762 81006 8555 -71482 -71683 -24402
166 -24402 29722 124110 164010 18266 -20494 161688 94183 126105 128291 103635 81566 49728
154 49728 99767 56279 82493 26696 45127 76201 97308 31617 78107 21154 39477 12576
142 12576 39078 11526 14357 -32210 -71779 -56310 -75087 -33032 50932 6799 6625 16090 523
129 523 80843 123592 24815 65657 177238 134857 18164 55191 41706 56674 94185 57262
117 57262 58945 40296 66134 52558 32028 29426 37387 10532 33293 38502 37779 39388 30507 16391
103 16391 97031 90061 78462 83495 92601 42029 119591 152113 135495 66620 76398 122140 127347
90 127347 43057 101609 131653 100021 129998 133940 60435 46690 81256 83532 34996 26839 10727
77 10727 3819 128647 42982 78960 91380 93278 37510 75335 71637 82189 136502 118361 164807
64 164807 95474 131364 71042 70260 85508 54258 69152 8299 88259 30097 126 51013
52 51013 83408 89044 776 -18169 19031 61879 96215 124111 81669 103756 77544 2724
40 2724 -835 -16333 -21985 16872 -27056 3711 -1326 19866 78233 35139 24014 96119 163312
27 163312 148575 122972 16429 -15573 5173 55483 61390 -44872 -13977 -39048 -45601 -29200
15 -29200 29048 99871 100361 142572 197050 102769 120648 129386 113207 55614 62040 102129 114449
2 114449 87518 101689
0 101689
$$ Imaginary data points
##PAGE= N=2
##DATA TABLE= (X++(I..I)), XYDATA
16383 -2657007 -2614446 -2556592 -2549874 -2578094 -2515506 -2437131 -2330885 -2266073 -2219456 -2242968 -2174524
16372 -2174524 -2205996 -2181087 -2109562 -2034067 -1978648 -1956422 -1842465 -1831184 -1768734 -1711996 -1616958
16361 -1616958 -1580036 -1598401 -1594625 -1480414 -1372728 -1270297 -1318993 -1282775 -1212399 -1199839 -1187027
16350 -1187027 -1128168 -1073541 -1071880 -976732 -969726 -942249 -873995 -822768 -773542 -712925 -651387 -635044
16338 -635044 -559869 -498495 -422292 -386735 -339033 -239354 -182532 -213145 -212128 -182223 -150578 -105333
16326 -105333 -1036 -55164 -16829 147646 209683 205570 227912 330810 332397 310190 365191
16315 365191 410618 424564 481190 537699 566798 585854 730669 805069 779924 869970 879305
16304 879305 834694 824804 876815 961146 1043302 1059693 1081246 1180959 1188038 1260188 1263145 1284460
16292 1284460 1358751 1432010 1470184 1483900 1470138 1514275 1555505 1540125 1609968 1720943 1762958
16281 1762958 1823946 1757842 1755815 1859901 1961555 1937966 1911106 1930618 1960129 2017232 2095517
16270 2095517 2110502 2143139 2171277 2166728 2268898 2262033 2359673 2388866 2360684 2370714 2449161
16259 2449161 2477587 2502574 2539729 2477311 2587290 2657215 2588204 2639532 2634446 2667397 2783309
16248 2783309 2730083 2693292 2775398 2826700 2850952 2905320 2870391 2892488 2928409 2982828 3143952
16237 3143952 3130682 3104847 3075354 3086535 3149336 3171909 3234649 3177051 3203601 3275759 3315915
16226 3315915 3306401 3309505 3369037 3312577 3335623 3466939 3490345 3483461 3544303 3522951 3536850 3529338
16214 3529338 3548162 3561903 3543121 3624937 3710708 3675123 3660847 3695311 3798534 3766768 3794494
16203 3794494 3821102 3764634 3758810 3836345 3812125 3872577 3967385 3918921 3951315 3949142 3922039 3975470
16191 3975470 3979615 4025479 4086785 4053220 4043763 4162709 4190472 4189913 4139846 4148769 4192480 4145937
16179 4145937 4191794 4165037 4181428 4257686 4206908 4202113 4279000 4327565 4275612 4223087 4283095
16168 4283095 4375306 4294653 4231051 4332444 4370500 4337654 4352593 4299414 4286469 4379242 4406935
16157 4406935 4421540 4365630 4416513 4460524 4471388 4421661 4452480 4464678 4485135 4477393 4477804 4581382
16145 4581382 4654393 4597572 4641400 4620210 4565700 4482221 4490805 4511766 4569407 4564953 4584120 4632170
16133 4632170 4623089 4573349 4610300 4661236 4674928 4749582 4672264 4659689 4668112 4671706 4680391 4683414
16121 4683414 4672316 4692212 4715549 4673457 4640356 4712917 4814367 4819738 4766001 4751856 4722501
16110 4722501 4733083 4702315 4755790 4750936 4736949 4795544 4784131 4729433 4830687 4763679 4814110
16099 4814110 4889376 4989062 4836568 4747210 4838535 4796603 4763042 4809352 4847169 4784947 4883739
16088 4883739 4774340 4853918 4898160 4918682 4841699 4850897 4917105 4983905 4992128 4962099 4981532
16077 4981532 4925201 4915082 4869091 4847085 4897421 4815545 4806518 4864531 4855901 4894367 4888435 4926672
16065 4926672 4940077 4832184 4842305 4917922 4945992 4929517 4950145 4838209 4809246 4872912 4838895
16054 4838895 4909627 4963210 4911347 4908678 4916657 4802449 4763355 4890059 4873199 4891926 4866801
16043 4866801 4975129 4938626 4951640 4906796 4931146 4914717 4893613 4936004 4875815 4850245 4893504
16032 4893504 5025116 5036588 4955551 4900198 4911036 4892723 5003310 4939873 5000046 4973233 4960062
16021 4960062 4999780 4995814 4921620 4865639 4804547 4814555 4901437 4932047 4920628 4992809 4999923 4924005
16009 4924005 4794818 4920928 4945863 4959929 4966594 4997792 4951468 4961776 4945523 4939848 4968604
$$ [...]
##END NTUPLES=NMR SPECTRUM
##END=
