##TITLE=1H_EC-3304(1)
CDCl3
 8 sc, 
 3.11.2023
##JCAMPDX= 6.0         $$ Bruker NMR JCAMP-DX V2.0
##DATA TYPE= NMR SPECTRUM
##DATA CLASS= NTUPLES
##ORIGIN= UXNMR, Bruker Analytische Messtechnik GmbH
##OWNER= root
$$ XWIN-NMR		Version 3.5
$$ Fri Nov  3 14:14:55 2023 Russian Standard Time (UT+4h)  she@DPX200
##.OBSERVE FREQUENCY= 200.1313
##.OBSERVE NUCLEUS= ^1H
##.ACQUISITION MODE= SIMULTANEOUS
##.ACQUISITION SCHEME= undefined
##.AVERAGES= 8
##.DIGITISER RES= 18
##SPECTROMETER/DATA SYSTEM= spect
##.PULSE SEQUENCE= zg30
##.SOLVENT NAME= CDCl3
##.SHIFT REFERENCE= (INTERNAL, CDCl3, 0, 15.4527)
##AUDIT TRAIL= $$ (NUMBER, WHEN, WHO, WHERE, WHAT)
$$ ##TITLE= Audit trail, XWIN-NMR		Version 3.5
$$ ##JCAMPDX= 5.01
$$ ##ORIGIN= Bruker BioSpin GmbH
$$ ##OWNER= she
$$ F:/spectra/data/she/nmr/H-F/1/pdata/1/auditp.txt
$$ ##AUDIT TRAIL=  $$ (NUMBER, WHEN, WHO, WHERE, WHAT)
(   1,<2023-11-03 14:13:33.21 +0400>,<she>,<DPX200>,
      <created by zg, POWCHK disabled, PULCHK disabled
       configuration hash MD5:
       00 E9 B6 7A A2 85 ED C7 34 08 36 98 17 FE 4E 26
       data hash MD5: 16K
       65 4A B8 39 3B 2C 47 AE F3 51 81 85 9E 5E 05 8F>)
(   2,<2023-11-03 14:13:35.78 +0400>,<she>,<DPX200>,
      <Start of raw data processing
       efp BC_mod = 2 LB = 0.24 FT_mod = 6 PKNL = 1 PHC0 = -23874.8 PHC1 = 13.05269 SI = 16K 
       data hash MD5: 16K
       C6 86 71 25 CF 70 EB F7 68 56 E8 1C 9F E7 B0 30>)
(   3,<2023-11-03 14:14:01.65 +0400>,<she>,<DPX200>,
      <pk PHC0 = -0.4624426 PHC1 = 0.1999999 
       data hash MD5: 16K
       D7 E9 2E D1 DE 28 49 27 48 BF 8C D8 D6 00 0B B8>)
(   4,<2023-11-03 14:14:06.03 +0400>,<she>,<DPX200>,
      <abs ABSG = 5 
       data hash MD5: 16K
       AB 12 B0 57 F6 04 9F 66 A1 DC F5 FE 2F CB 90 DA>)
$$ ##END=
$$ 
$$ hash MD5
$$ 26 B1 31 B1 66 F5 F1 C0 26 4C 8E EB F0 AE E0 B5
##$RELAX= 
##$RELAX= 
##$RELAX= 
##$RELAX= 
##$RELAX= 
##$RELAX= 
$$ Bruker specific parameters
$$ --------------------------
##$DU= <F:/spectra>
##$EXPNO= 1
##$NAME= <H-F>
##$PROCNO= 1
##$TYPE= <nmr>
##$USER= <she>
##$AMP= (0..31)
100 100 100 100 100 100 100 100 100 100 100 100 100 100 100 100 100 100 
100 100 100 100 100 100 100 100 100 100 100 100 100 100 
##$AQSEQ= 0
##$AQ_mod= 1
##$AUNM= <au_zg>
##$AUTOPOS= <>
##$BF1= 200.13
##$BF2= 200.13
##$BF3= 200.13
##$BF4= 200.13
##$BF5= 200.13
##$BF6= 200.13
##$BF7= 200.13
##$BF8= 200.13
##$BYTORDA= 1
##$CFDGTYP= 0
##$CFRGTYP= 5
##$CHEMSTR= <none>
##$CNST= (0..31)
1 1 145 1 1 1 1 1 1 1 1 1 1 1 1 1 1 1 1 1 1 1 1 1 1 1 1 1 1 1 1 1 
##$CPDPRG= <>
##$CPDPRG1= <>
##$CPDPRG2= <>
##$CPDPRG3= <>
##$CPDPRG4= <mlev>
##$CPDPRG5= <mlev>
##$CPDPRG6= <mlev>
##$CPDPRG7= <mlev>
##$CPDPRG8= <mlev>
##$CPDPRGB= <>
##$CPDPRGT= <>
##$D= (0..31)
0 1.2 0 0 0 0 0 0 0 0.06 0 0.03 0 0 0 0 0.0002 0 0 0 0 0 0 0 0 0 0 0 0 
0 0 0 
##$DATE= 1699006412
##$DBL= (0..7)
120 120 120 120 120 120 120 120 
##$DBP= (0..7)
150 150 150 150 150 150 150 150 
##$DBP07= 0
##$DBPNAM0= <>
##$DBPNAM1= <>
##$DBPNAM2= <>
##$DBPNAM3= <>
##$DBPNAM4= <>
$$ [...]
##$SUBNAM3= <"">
##$SUBNAM4= <"">
##$SUBNAM5= <"">
##$SUBNAM6= <"">
##$SUBNAM7= <"">
##$SUBNAM8= <"">
##$SUBNAM9= <"">
##$SW= 18.0517328524113
##$SWIBOX= (0..15)
0 0 2 0 0 0 0 0 0 0 0 0 0 0 0 0 
##$SW_h= 3612.71676300578
##$TD= 16384
##$TD0= 1
##$TE= 0
##$TE2= 300
##$TE3= 300
##$TEG= 300
##$TL= (0..7)
0 120 120 120 120 120 120 120 
##$TP= (0..7)
150 150 150 150 150 150 150 150 
##$TP07= 0
##$TPNAME0= <>
##$TPNAME1= <>
##$TPNAME2= <>
##$TPNAME3= <>
##$TPNAME4= <>
##$TPNAME5= <>
##$TPNAME6= <>
##$TPNAME7= <>
##$TPOAL= (0..7)
0.5 0.5 0.5 0.5 0.5 0.5 0.5 0.5 
##$TPOFFS= (0..7)
0 0 0 0 0 0 0 0 
##$TUNHIN= 0
##$TUNHOUT= 0
##$TUNXOUT= 0
##$USERA1= <user>
##$USERA2= <user>
##$USERA3= <user>
##$USERA4= <user>
##$USERA5= <user>
##$V9= 5
##$VALIST= <valist>
##$VCLIST= <CCCCCCCCCCCCCCC>
##$VD= 0
##$VDLIST= <DDDDDDDDDDDDDDD>
##$VPLIST= <PPPPPPPPPPPPPPP>
##$VTLIST= <TTTTTTTTTTTTTTT>
##$WBST= 1024
##$WBSW= 4
##$XGAIN= (0..3)
0 0 0 0 
##$XL= 0
##$YL= 0
##$YMAX_a= 402394
##$YMIN_a= -553159
##$ZGOPTNS= <>
##$ZL1= 120
##$ZL2= 120
##$ZL3= 120
##$ZL4= 120
##$ABSF1= 20.15866
##$ABSF2= 2.106728
##$ABSG= 5
##$ABSL= 3
##$ALPHA= 0
##$AQORDER= 0
##$ASSFAC= 0
##$ASSFACI= 0
##$ASSFACX= 0
##$ASSWID= 0
##$AUNMP= <proc_1d>
##$AZFE= 0.1
##$AZFW= 0.1
##$BCFW= 0
##$BC_mod= 2
##$BYTORDP= 0
##$COROFFS= 0
##$CY= -3
##$DATMOD= 1
##$DC= 0
##$DFILT= <>
##$DTYPP= 0
##$F1P= 0
##$F2P= 0
##$FCOR= 1
##$FTSIZE= 16384
##$FT_mod= 6
##$GAMMA= 0
##$GB= 0
##$INTBC= 1
##$INTSCL= 3.70164e-10
##$ISEN= 128
##$LB= 0.24
##$LEV0= 0
##$LPBIN= 0
##$MAXI= 10000
##$MC2= 0
##$MEAN= 0
##$ME_mod= 0
##$MI= 1.114404
##$NCOEF= 0
##$NC_proc= -7
##$NLEV= 6
##$NOISF1= 3.799351
##$NOISF2= 2.8
##$NSP= 0
##$NTH_PI= 0
##$NZP= 0
##$OFFSET= 15.45271
##$PC= 1
##$PHC0= -23875.26
##$PHC1= 13.25269
##$PH_mod= 1
##$PKNL= yes
##$PPARMOD= 0
##$PSCAL= 0
##$PSIGN= 0
##$REVERSE= no
##$SF= 200.130013807414
##$SI= 16384
##$SIGF1= 3
##$SIGF2= 2
##$SINO= 5.538805
##$SIOLD= 16384
##$SREGLST= <1H.CDCl3>
##$SSB= 0
##$STSI= 16384
##$STSR= 0
##$SW_p= 3612.71676300578
##$SYMM= 0
##$S_DEV= 0
##$TDeff= 16384
##$TDoff= 0
##$TI= <>
##$TILT= no
##$TM1= 0
##$TM2= 0
##$TOPLEV= 0
##$USERP1= <user>
##$USERP2= <user>
##$USERP3= <user>
##$USERP4= <user>
##$USERP5= <user>
##$WDW= 1
##$XDIM= 16384
##$YMAX_p= 349187661
##$YMIN_p= -902294
$$ End of Bruker specific parameters
$$ ---------------------------------
##NTUPLES= NMR SPECTRUM
##VAR_NAME=  FREQUENCY,     SPECTRUM/REAL,   SPECTRUM/IMAG
##SYMBOL=    X,             R,               I
##VAR_TYPE=  INDEPENDENT,   DEPENDENT,       DEPENDENT
##VAR_FORM=  AFFN,          ASDF,            ASDF
##VAR_DIM=   16384,         16384,           16384
##UNITS=     HZ,            ARBITRARY UNITS, ARBITRARY UNITS
##FACTOR=    0.220516191357247, 1,           1
##FIRST=     3092.55109601616, 0,            0
##LAST=      -520.165666989624, 0,           0
##MIN=       -520.165666989624, -902294,     0
##MAX=       3092.55109601616, 349187661,    0
$$ Real data points
##PAGE= N=1
##DATA TABLE= (X++(R..R)), XYDATA
$$ [...]
6831B30787N5778L7133j01162J9597m5039K12088n958L3010Q0612p4972P00k63560
6819A79014o1898p5350J69059R6154M0735L1666R4954q0561k50878K05740J42302
6808D90937J19081L8322J2326j32015M262M1885l800j21553j86452j85225J51862
6797B29630J26071m5384j26411j20553K71693P3097p0001N6380p1278J08762k13788
6786B18218N7896P168j51387N2248l7179K39430J5887M0079j21869n4914Q3335
6775C48912R1686k2774J3329J88993j87098j55750K2864O9889Q6274N9118j63507
6764C51936k7673J70413O5780j42113J07946N9152o1961Q2821k7852j28157q0128
6753C70164M657Q4535P2125j13294K36888o6436l0532j95475N2129Q1014J12757
$$ plain form
6831 230787 286565 323698 222536 242133 197094 409182 403224 436234 516846 441874 442574 179014
6819 179014 117116 41766 210825 306979 347714 379380 474334 393773 142895 348635 490937
6808 490937 610018 648340 660666 528651 532913 574798 570998 449445 262993 77768 229630
6797 229630 355701 310317 183906 63353 335046 408143 338142 394522 323244 432006 218218
6786 218218 276114 283282 131895 184143 146964 386394 402281 442360 320491 265577 348912
6775 348912 440598 417824 431153 620146 433048 277298 300162 370051 456325 515443 351936
6764 351936 324263 494676 560456 418343 526289 585441 523480 606301 578449 450292 370164
6753 370164 374821 459356 531481 418187 655075 588639 558107 362632 414761 495775 608532
6742F08532K12447j97344j97554J71521j7953P4675K5061K0370m1618j49268J75050
6731F83919r730k34512P3620J2161k30738q341O4480o6729R7452n1271j20889
6720B09422Q9287j47578L91136J08048q2466K0101K6999m8744n1094Q16q6196
6709D29731J06127j8175m7391J98195J17704k7192l1312j58920M3332J08664R5286
6698H16049j47257j22408J54824r2787n2844K58731q5799R5363p5963J94248k36807
6687G05350Q84K54388j20993p3190o4037L31141j72743K9652R7945m3120j31361
6676H13916N7947m0242K1317o921M8197r9420J41062L1380j22881J5241l9664
6665H19932J91253J9189j2182l5342N1167k228J21362M0390j36110L20282r6591
$$ plain form
6742 608532 820979 623635 426081 597602 579649 654324 679385 699755 658137 508869 683919
6731 683919 674189 439677 513297 525458 294720 286379 350859 284130 381582 330311 209422
6720 209422 298709 151131 542267 650315 567849 587950 614949 566205 515111 515927 429731
6709 429731 535858 517683 470292 668487 786191 758999 727687 568767 612099 720763 816049
6698 816049 668792 546384 701208 608421 555577 814308 728509 823872 747909 942157 705350
6687 705350 706234 960622 839629 766439 702402 1033543 860800 890452 988397 945277 813916
6676 813916 871863 831621 852938 846017 894214 794794 935856 967236 844355 859596 819932
6665 819932 1011185 1030374 1018192 982850 1034017 1031789 1153151 1193541 1057431 1377713 1281122
6654A281122k63868Q4502L66225k70787r8868r070m0080q2997M7627L69327n7994
6643A325139K10203J00900j25307o6440m3958J10895j31460J40201K70375k04569
6633A585979k25452J02972L04286K94758j77028M3229J56780J26861J77849o3385
6623B326849K03888m5340K4096j83625k5364k12644j44476j44069j56687j28139
6613A514489l4125j13714j473N6253K142k01672k89504p1971K51824n2493K4170
6602A083926J63656l38499N3630J26717R5315K9575J09051j28670M3506L7311
6592A275518j8448R0296p4008j3588j30319j02016K27171p7327r914j26716k93826
6581G46823J58645O5753P1359K1550J64671j587j59460J3004J28368n4905l5188
$$ plain form
6654 1281122 1017254 1101756 1467981 1197194 1098326 1089256 1049176 966179 1013806 1383133 1325139
6643 1325139 1535342 1636242 1510935 1444495 1400537 1511432 1379972 1520173 1790548 1585979
6633 1585979 1360527 1463499 1767785 2062543 1885515 1928744 2085524 2212385 2390234 2326849
6623 2326849 2530737 2485397 2509493 2325868 2300504 2087860 1943384 1799315 1642628 1514489
6613 1514489 1480364 1366650 1365177 1421430 1423572 1221900 932396 860425 1112249 1059756 1083926
6602 1083926 1247582 909083 962713 1089430 1184745 1214320 1323371 1194701 1238207 1275518
6592 1275518 1257070 1347366 1273358 1259770 1129451 1027435 1254606 1177279 1167365 1040649 746823
6581 746823 905468 971221 1042580 1064130 1228801 1227214 1067754 1080758 1209126 1154221 1119033
6570A119033M8888k21644J25934J13640k17792j683K5852j45417k55286J43208
6560G34733K45727R276j50120m2716R4417J45P4591o650q526N9342j35264K0868
6548H95823m5731J7882J3327P9272K6339k67824j31035J28521j78456J07946L56330
6537A002394J5445k08473R3663N5798j224J16014k07624j12007k4046m8785q9864
6526E91291J61864l4976j01857Q6561K00708K85808J89456k48282o5213j65924
6516H99436k7425J96340O4845q7252l5801J8349l5144K02850p5686j69286K10419
6505A161645j2097j58548j36675j6706N3822r387J18626j07481K53302q655p8504
6494A059342N7786J13815j5061O1563p0133k65931n8253K9521J2739r0537Q6982
$$ plain form
6570 1119033 1167921 946277 1072211 1185851 968059 966376 992228 846811 591525 734733
6560 734733 980460 989736 839616 796900 891317 891462 966053 959403 950877 1010219 874955 895823
6548 895823 850092 867974 881301 960573 986912 719088 588053 716574 538118 646064 1002394
6537 1002394 1017839 809366 903029 958827 957603 1073617 865993 753986 729940 681155 591291
6526 591291 753155 718179 616322 702883 903591 1189399 1378855 1130573 1065360 899436
6516 899436 872011 1068351 1133196 1045944 1010143 1028492 993348 1196198 1120512 951226 1161645
6505 1161645 1149548 991000 854325 837619 891441 882054 1000680 893199 1146501 1137846 1059342
6494 1059342 1117128 1230943 1215882 1277445 1207312 941381 883128 912649 925388 834851 921833
6483I21833l3921j6202l4018K94656k16059P1277j85151J39548K93890j60773
6473A075080j72744q8515J28070k77545K6789K03248j08555J43705J39630k31059
6463H38104J02154J02592j88639j35673O8309N7825j82642J14102j74476R5684
6453F97340J99856R9688j06954R2499J05919q0426j47791R043J88143L5445j38441
6442I54321n5128J84799l10654K38443J08474P0559j8536k22585l9525m0535K44232
6431A113865J38740r8420l75611j20246N9857K78221Q6230p6947n4468O171J57420
6420A114812r8159j07637p4059J00657O4597M5181J75342k0424r1898j18337n6955
6409I33120J35583J4190J00815j37713J10563j24652Q0579J01725K2289O5189
$$ plain form
6483 921833 887912 871710 837692 1132348 916289 987566 802415 941963 1235853 1075080
6473 1075080 902336 813821 941891 664346 691135 894383 785828 929533 1069163 838104
6463 838104 940258 1042850 854211 718538 786847 844672 662030 776132 601656 697340
6453 697340 897196 996884 889930 982429 1088348 1007922 860131 869174 1057317 1092762 954321
6442 954321 899193 1083992 773338 1011781 1120255 1190814 1172278 949693 910168 869633 1113865
6431 1113865 1252605 1154185 778574 658328 718185 996406 1082636 1005689 951221 957392 1114812
6420 1114812 1016653 909016 834957 935614 1000211 1045392 1220734 1200310 1108412 990075 933120
6409 933120 1068703 1082893 1183708 1045995 1156558 1031906 1112485 1214210 1236499 1301688
6399A301688J90756j13886q3893P8388j01172o272K31116p5128J9191N3475J9719
6388A513982p1269j87289L01709K05831l93607O4298J42981l0433j20849J92985
6378A618339J01920l5877n9900k0775N5421j2740R5834r2359Q6540J53906n706
6367A884603j00829k21944J2155J39288N4558j10247k80419m098j5269N1456J73729
6356A582983L1864j43784J47947M1014q6160m5854j6265p6402R3126J69479l7063
6345A660885k0860J45444J08302k43675o4661N5894k7299k500M0951j04713j50103
6334A397665J68773n8149j35545K36829M626j90998j7861p9478j8021l8273K10770
6323A480338J12836M8918j84953J00864J34241J08883j75783L0992r1011l1585
$$ plain form
6399 1301688 1492444 1378558 1294665 1373053 1271881 1265609 1496725 1421597 1440788 1494263 1513982
6388 1513982 1442713 1255424 1557133 1762964 1369357 1433655 1576636 1546203 1425354 1618339
6378 1618339 1720259 1684382 1624482 1603707 1659128 1646388 1742222 1649863 1736403 1890309 1884603
6367 1884603 1783774 1561830 1573985 1713273 1767831 1657584 1377165 1373067 1357798 1409254 1582983
6356 1582983 1614847 1471063 1619010 1660024 1573864 1528010 1511745 1435343 1528469 1697948 1660885
6345 1660885 1640025 1785469 1893771 1650096 1585435 1641329 1614030 1611530 1652481 1547768 1397665
6334 1397665 1566438 1508289 1372744 1609573 1614199 1423201 1405340 1325862 1307841 1269568 1480338
6323 1480338 1593174 1642092 1457139 1558003 1692244 1801127 1625344 1656336 1565325 1533740
6313A533740j84K6683r0197K44625K22166j55472j31058l0731j16901j01819R9112
6302A499964R0800K86625K66230j35414k64728j02154J04726O3709R0199j26226
6292A773731j56180J27756J00872J66177J3983j21697P3162J57229m8790q0608
6282B005635o9667J053k1415P3477J71189j59636j7304j45391J21221L53189L1839
6271B344190p7374j20089J76111l6808K50068q7720K1366r7852j50042R1529R7252
6260B410631j10819J97678n8778n9338r8575l5196J47863J31070j31057O6656
6250B460135k5291L1483K92021j67753J81514q824J23318J93948j23205J28418
6240C085764m5389j88158P8275J67410O0387k71008J77559j7736P5260n5359P9331
$$ plain form
6313 1533740 1533556 1560239 1470042 1714667 1936833 1781361 1650303 1619572 1502671 1400852 1499964
6302 1499964 1590764 1877389 2143619 2008205 1743477 1641323 1746049 1809758 1899957 1773731
6292 1773731 1617551 1745307 1846179 2012356 2026339 1904642 1977804 2135033 2086243 2005635
6282 2005635 1935968 1937021 1915606 1989083 2160272 2000636 1983332 1837941 1959162 2312351 2344190
6271 2344190 2266816 2146727 2322838 2286030 2536098 2448378 2469744 2371892 2221850 2313379 2410631
6260 2410631 2299812 2497490 2438712 2379374 2280799 2245603 2393466 2524536 2393479 2460135
6250 2460135 2434844 2466327 2758348 2590595 2772109 2763285 2886603 3080551 2957346 3085764
6240 3085764 3040375 2852217 2930492 3097902 3158289 2887281 3064840 3047104 3122364 3067005 3146336
6229C146336P5766q9935j67750O9534J74196J15401J70906J01138J02303n7008
6219C640887J46356j0429q949n0744L50640J24404N8859k8520q1685J35769K9998
6208D306586J60171r1816j560J34990O7441P2052K50574J80265O4624n7261Q3209
6197E169275K9079R5599K28744p0423K47227J64048Q1237P3349Q2452K71244J29264
6186F501095l434M35238L34618K68889L37909J99080M12854N26147K08467L35134
6176I555997M79328M18608N8655L6149n461K54591J99402K69461J03373L32333
6166A1702436N96043K91161K71768L37208N81582N16196K79069P08021O17133
6157A5900617O03012M39804Q2121K75896L52486L83616J69987K40286K73794J81729
$$ plain form
6229 3146336 3222102 3132167 2964417 3033951 3208147 3323548 3494454 3595592 3697895 3640887
6219 3640887 3787243 3776814 3767865 3717121 4067761 4192165 4251024 4222504 4140819 4276588 4306586
6208 4306586 4466757 4374941 4373381 4508371 4575812 4647864 4898438 5078703 5143327 5086066 5169275
6197 5169275 5198354 5293953 5522697 5452274 5699501 5863549 5944786 6018135 6100587 6371831 6501095
6186 6501095 6497661 6932899 7267517 7536406 7874315 8073395 8486249 9012396 9220863 9555997
6176 9555997 10035325 10453933 10512588 10548737 10543276 10797867 10997269 11266730 11370103 11702436
6166 11702436 12298479 12589640 12861408 13198616 13780198 14296394 14575463 15283484 15900617
6157 15900617 16503629 16943433 17025554 17301450 17653936 18037552 18207539 18447825 18721619 18903348
6147A8903348J70896L10007K47560M30459L77622M89136O02859M71434L16162
6138B2319483N64268O07726P63801R00913P53664P76444Q03072J036849J164431
6129B9690651O14578M56808J38554k19358j59696r5331j51051j99559N0962q0370
6119C0046188Q6589M81720L71221M02879L63986P42866O19086N36529Q63362J214828
6109C5729254R97646J005641J485818J567780J737239K011375K346919K649950
6101D9531622K551620K626450K750592L090065L255827L956458M391499M943034
6093G7097167M849238L883500K909816Q90086j048758k352362l245482l672644
6085G9310561l211181k967881k354414j694302j045094o33492K23561Q77905J454726
$$ plain form
6147 18903348 19074244 19384251 19631811 20062270 20439892 20929028 21531887 22003321 22319483
6138 22319483 22883751 23491477 24255278 25156191 25909855 26686299 27489371 28526220 29690651
6129 29690651 30305229 30762037 30900591 30681233 30521537 30426206 30275155 30075596 30126558 30046188
6119 30046188 30132777 30614497 30985718 31388597 31752583 32495449 33114535 33651064 34514426 35729254
6109 35729254 36726900 37732541 39218359 40786139 42523378 44534753 46881672 49531622
6101 49531622 52083242 54709692 57460284 60550349 63806176 67762634 72154133 77097167
6093 77097167 81946405 85829905 88739721 89629807 88581049 86228687 82983205 79310561
6085 79310561 76099380 73131499 70777085 69082783 68037689 67404197 67627758 68505663 69960389
6076F9960389K246352K960016L775414M625816N985482O765734P568868Q997558
6068A12885629J0268624J1011016J0850270Q875428N195130K51830m746937r178597
6060A45412393j1299163j1666613j0925171r076437p881814o462171n046704m169160
6052G8885160l432472k664003j772015r86939k79337L40088Q30239J676141K588407
6043G5185269L128407L962002M250558M632891M373851K638980O91189j747337
6035I7115810m461942o193763o375583o598287o410414n467651m821856m295023
6027E2491291l651149l089701k658763k559796k081186j760894j609517j557264
6019C3523021j615888j484357j245505j258230j279075j005232j014989j007176
$$ plain form
6076 69960389 72206741 75166757 78942171 83567987 89553469 96319203 103888071 112885629
6068 112885629 123154253 134165269 145015539 153890967 159086097 159337927 154590990 145412393
6060 145412393 134113230 122446617 111521446 102445009 94563195 88101024 83054320 78885160
6052 78885160 75452688 72788685 71016670 70029731 69750394 70090482 70920721 72596862 75185269
6043 75185269 78313676 82275678 86526236 91159127 95532978 98171958 98863147 97115810
6035 97115810 92653868 86460105 80084522 73486235 67075821 61608170 56786314 52491291
6027 52491291 48840142 45750441 43091678 40531882 38450696 36689802 35080285 33523021
6019 33523021 31907133 30422776 29177271 27919041 26639966 25634734 24619745 23612569
6011B3612569j011359q25951o43420n56955o51254l95013l00581o67997m12630
6002A8147409r0662j43260j54405l71606k22268m11277m80032j59116k57936m21650
5992A5435197n80562l81775m14878n61601l49949n07957l50116n45111j38266
5983A1604982p0191k89857k40624l71786r9955j04163j46046l43766j67932Q400
5973I779062p8800j06302R1567M837k27928l07210j23795j89847K1162k06793
5963H655953n70j72018P4902l4323L3456L2930j42421j6727j21803k32202q0186
5952G996991k56928j95284N9118J1976k91584j99316Q4934k19161P981p5525p1887
5941F851315J19287j80546J14795j9395r7619k2515J42096j60217Q0315K27562
$$ plain form
6011 23612569 22601210 21775259 21131839 20574884 19923630 19528617 19228036 18560039 18147409
6002 18147409 18056747 17913487 17759082 17387476 17165208 16753931 16273899 16114783 15856847 15435197
5992 15435197 14854635 14472860 14057982 13496381 13146432 12638475 12288359 11743248 11604982
5983 11604982 11534791 11244934 11004310 10632524 10532569 10428406 10282360 9938594 9770662 9779062
5973 9779062 9700262 9593960 9685527 9690364 9462436 9155226 9031431 8841584 8862746 8655953
5963 8655953 8655383 8483365 8558267 8523944 8557400 8590330 8447909 8431182 8309379 8077177 7996991
5952 7996991 7740063 7544779 7603897 7615873 7324289 7124973 7209907 6990746 6998727 6923202 6851315
5941 6851315 6970602 6790056 6904851 6885456 6787837 6765322 6907418 6747201 6827516 7055078
5931G055078K7883R6545Q7117J7632j89117P6195m8102k47937k25523J08506J24302
5920F882579j96137l13282q2702n3274J08472K0373J8452j94455q6656j63978
5910E939392j3309P1514J83192p997N5081K44528j68869l2597n2946J60509J42284
5899F520782j54656l025j49466N7263J19608R094Q0503J76643r6956Q835j69251
5888F399374J75302J13797j0817j53028L9058J34635j01010q6888N7974P5541
5878F643938m0810K80521J81694J9701q2604K46231K99831p1948Q916k9974J76209
5867G631705J11214J09180J71884m5328M6885O3450K45211O5027j53790L55475
5857H600913M8085J61381J34279J20569J26193K83759n4923K6325L73192J08412
$$ plain form
5931 7055078 7082961 7179506 7266623 7284255 7095138 7171333 7123231 6875294 6649771 6758277 6882579
5920 6882579 6686442 6373160 6290458 6237184 6345656 6366029 6384481 6190026 6103370 5939392
5910 5939392 5926083 5997597 6180789 6172792 6227873 6472401 6303532 6270935 6217989 6378498 6520782
5899 6520782 6366126 6363101 6213635 6270898 6390506 6399600 6480103 6656746 6559790 6568625 6399374
5888 6399374 6574676 6688473 6677656 6524628 6563686 6698321 6597311 6510423 6568397 6643938
5878 6643938 6603128 6883649 7065343 7085044 7002440 7248671 7548502 7476554 7485470 7455496 7631705
5867 7631705 7742919 7852099 8023983 7978655 8025540 8088990 8334201 8399228 8245438 8600913
5857 8600913 8648998 8810379 8944658 9065227 9191420 9475179 9420256 9446581 9819773 9928185
5847I928185K49818J80567L60629J74984L89541J33224J29542J9545K68220L69896
5837A2204151J51596J57750n074K84028K94545K16512L99071J77458J91118K93446
5827A4364601M09317L65398J25023J0994L04245L67546O05696N13756N77387N26250
5817A8170213M82200O99187M01563O36962P59217O13369O74673O62096Q78375
5808B3977855R98013Q37659J160918Q38292Q99081J037690J174526J287379J177885
5799C3389298J214051J673212K337431K096136K301472K588911K774881L245632
5791E1621024L589989M306124M990552M981224M429507L124903J234495J02876
5783G8380694j32635l24682m92002n83430Q5672R34385J400569K047446K083551
$$ plain form
5847 9928185 10178003 10358570 10719199 10894183 11283724 11416948 11546490 11566035 11834255 12204151
5837 12204151 12355747 12513497 12508423 12792451 13086996 13303508 13702579 13880037 14071155 14364601
5827 14364601 14773918 15139316 15264339 15275333 15579578 15947124 16552820 17066576 17643963 18170213
5817 18170213 18652413 19351600 19753163 20390125 21149342 21762711 22437384 23099480 23977855
5808 23977855 24975868 25813527 26974445 27812737 28711818 29749508 30924034 32211413 33389298
5799 33389298 34603349 36276561 38613992 40710128 43011600 45600511 48375392 51621024
5791 51621024 55211013 59517137 64507689 69488913 73918420 77043323 78277818 78380694
5783 78380694 78248059 77923377 77431375 76847945 76933617 77868002 79268571 81316017 83399568
5774H3399568J385545J459027K189299K563636K942163K972484K994905K789379
5766A02696006K597833K836445L503935M866645N606957O562947P471230Q358278
5758A44500276P769144N891672K290881k797681o117017p200906o971564o251718
5750A31113087n631780m575019l326255k682163k752919k591379l311565l299704
5742A02942303l301120k550326k145704j769856j734995j622034j379754j127632
5734H7310882n22431J82807Q40398J365808J688101J021107P45000j0910j488096
5725I1132666l407816m817940m986604m390043l878837k891931k638594k256384
5717F1864517k255882k230947k115189j952049j660282j475462j035982j077191
$$ plain form
5774 83399568 84785113 86244140 88433439 90997075 93939238 96911722 99906627 102696006
5766 102696006 105293839 108130284 111634219 116500864 122107821 128670768 136141998 144500276
5758 144500276 152269420 158161092 160451973 157654292 151537275 144336369 137364805 131113087
5750 131113087 125481307 120906288 117580033 114897870 112144951 109553572 106242007 102942303
5742 102942303 99641183 97090857 94945153 93175297 91440302 89818268 88438514 87310882
5734 87310882 86788451 86971258 87811656 89177464 90865565 91886672 92631672 92620762 91132666
5725 91132666 87724850 82906910 77920306 73530263 69651426 66759495 64120901 61864517
5717 61864517 59608635 57377688 55262499 53310450 51650168 50174706 49138724 48061533
5709D8061533j048255p97839o36425o76936q85668m93442l17838k98780l45736
5700D2560614k63689j47622k3330k34629k245r7584M272j7874L02030K72226K1900
5689D2374069q7745n53912k83722k78168l20429n05605n62502j4779j95808j12956
5679C9458443q1666p8653J19874p6360K83705M06206M42985M93404L47871O84649
5669D2000458N82618M10634O49388Q69703Q37896R77393L79726O56695O75590
5660D8040101L18269K49890N36455M74757O61258R22211J094176J360821J795983
5651E5453921K260142K408358K965678L408733M183906M857075N489029O254418
5643H7281260P096020P439502P358612O266646M411783J394171j455604l621199
$$ plain form
5709 48061533 47013278 46215439 45579014 44902078 44016410 43522968 43205130 42906350 42560614
5700 42560614 42296925 42149303 42125973 41891344 41889099 41791515 41795787 41777913 42079943 42352169 42374069
5689 42374069 42286324 41732412 41448690 41170522 40850093 40344488 39781986 39767207 39571399 39458443
5679 39458443 39376777 39298124 39417998 39341638 39625343 40031549 40474534 40967938 41315809 42000458
5669 42000458 42583076 42993710 43643098 44512801 45350697 46328090 46707816 47364511 48040101
5660 48040101 48358370 48608260 49144715 49619472 50280730 51202941 52297117 53657938 55453921
5651 55453921 57714063 60122421 63088099 66496832 70680738 75537813 81026842 87281260
5643 87281260 94377280 101816782 109175394 115442040 119853823 121247994 119792390 116171191
5635A16171191n095124n430527n162789m195365l497149k646606k048556j354418
5627H6740657n30071J84509J115970J743369K786818L592704M696660N571311
5619A05901927O805889Q660939J0537168J1883615J2955232J2004749Q853889
5612A77603408L446154k602978p435640j0968550j2120848j1615297j0638543
5605A25667706r058210p471862o118933n028096m017104l215698k484419j789419
5597H6483965r32234r7841L21935J112685J740826K340424L047615L471224M123951
5588A01612550M290315L887770K503001P30638j289122l097314m266337m775724
5580I9595777m513342m103347l185735k548371j899658j253665o36214o7915K01256
$$ plain form
5635 116171191 111076067 105645540 100482751 96287386 92790237 90143631 88095075 86740657
5627 86740657 86210586 86395095 87511065 89254434 92041252 95633956 100330616 105901927
5619 105901927 112707816 121368755 131905923 143789538 156744770 168749519 177603408
5612 177603408 181049562 178446584 171010944 160042394 147921546 136306249 125667706
5605 125667706 116609496 109137634 103018701 97990605 93973501 90757803 88273384 86483965
5597 86483965 85551731 85453890 85775825 86888510 88629336 90969760 94017375 97488599 101612550
5588 101612550 105902865 109790635 112293636 113024274 111735152 108637838 104371501 99595777
5580 99595777 95082435 90979088 87793353 85244982 83345324 82091659 81455445 81387530 81588786
5571H1588786R486n54413j086207j681933k575935k711031k738476k702098j806184
5562F5741995j799344j327533j199248r93725p68733n10156k92310k55898l89776
5553E8205272k93486n39475o00300m88921r04159o34084m77578k81699p45327
5544E3240243p83566o67954o96805q71478q42716q13110o25610q13046n11955
5535D6614003k69801k61301k15040l58491k98456k96679n21703n93782n82326
5526D3216424p51509o81358n87995m52865r35046r98089o81794r52434q60686
5517C6314648n81509n48669p20941n92005n17150k88897p12088m54428l83527
5508C1515434n45764k01151l44013n76614l19938j49943m66148l97423l0744q7701
$$ plain form
5571 81588786 81598272 81043859 79957652 78275719 75699784 72988753 70250277 67548179 65741995
5562 65741995 63942651 62615118 61415870 60422145 59653412 59143256 58850946 58595048 58205272
5553 58205272 57911786 57372311 56772011 56283090 55378931 54744847 54267269 53985570 53240243
5544 53240243 52456677 51788723 51091918 50220440 49377724 48564614 47939004 47125958 46614003
5535 46614003 46344202 46082901 45867861 45509370 45210914 44914235 44392532 43798750 43216424
5526 43216424 42464915 41783557 41195562 40742697 39807651 38809562 38127768 37175334 36314648
5517 36314648 35733139 35184470 34463529 33871524 33354374 33065477 32353389 31898961 31515434
5508 31515434 30969670 30768519 30424506 29847892 29527954 29378011 28911863 28514440 28483696 28395995
5498B8395995k45035l93530l23624j59254l40892k00700o6779R424L8175j95586
5488B6518194o7038J39921k05585p1438j37265R0667p0741L40406K95018K021
5478B6834160J05516K33745M23960J38900J76088L60757K09931J91609M63938
5469B9138604N85182M05831K56207O20505N53557L78063N80211P15562O09769
5460C3843491Q71210J095772R54950J219213J142739J276834J419754J698269
5452D3522232J406836J581540J925425J988040K194531K310500K467261K664922
5444F0061287L333737L772440M528035N086336O135768P363839Q660562J0437256
5436A09379260J2475782J4643437J7479020K1307627K5350662K9206806L0926359
$$ plain form
5498 28395995 28150960 27757430 27433806 27274552 26933660 26732960 26666181 26675605 26713780 26518194
5488 26518194 26451156 26591077 26385492 26314054 26176789 26267456 26196715 26537121 26832139 26834160
5478 26834160 26939676 27173421 27597381 27736281 27912369 28273126 28483057 28674666 29138604
5469 29138604 29723786 30129617 30385824 31006329 31559886 31937949 32518160 33233722 33843491
5460 33843491 34714701 35810473 36765423 37984636 39127375 40404209 41823963 43522232
5452 43522232 44929068 46510608 48436033 50424073 52618604 54929104 57396365 60061287
5444 60061287 63395024 67167464 71695499 76781835 82917603 90281442 98942004 109379260
5436 109379260 121855042 136498479 153977499 175285126 200635788 229842594 260768953
5429B60768953K7694435J8831937L700560j3221935k5596369l0209969k9368060
5422B12599552k6692916k2603515j8904982j5468764j2963976j1019220r277618
5415I5668561p832640o885501o242605n236655m799352m006841l513157l164374
5407E3987436k849267k312480k336882j950783j629108j697085j753882j517085
5399C7940864j471105j033973j018943j182465q75689q69779q20387p73478q73528
5390B9021517j124544p96555r37297p78118o22160n46023n87642n49928n49510
5381B2529740m66357l37481l74865Q4344j29926l87722k75239j60342o1046j60081
5371B0261025J0894p6742j40222o8298l47841k75251l12852m29225q14933n46003
$$ plain form
5429 260768953 288463388 307295325 310995885 297773950 272177581 241967612 212599552
5422 212599552 185906636 163303121 144398139 128929375 115965399 104946179 95668561
5415 95668561 87835921 80950420 74707815 69471160 64671808 60664967 57151810 53987436
5407 53987436 51138169 48825689 46488807 44538024 42908916 41211831 39457949 37940864
5399 37940864 36469759 35435786 34416843 33234378 32358689 31488910 30668523 29895045 29021517
5390 29021517 27896973 27100418 26163121 25385003 24762843 24216820 23629178 23079250 22529740
5381 22529740 22063383 21725902 21351037 21435381 21305455 20917733 20642494 20482152 20421106 20261025
5371 20261025 20271919 20195177 20054955 19986657 19638816 19363565 19050713 18621488 17806555 17260552
5361A7260552j18861m58563j82515l13998m12755l21020m9535r7803j09842o5781
5351A5129879j7269n0054O3669K42321N9805r6853J3703J63549k4863j07060K05933
5340A5582760j28140l6516j35644m53511o33881p17735l63939l11766o06065m44116
5330A1751447k75291k81044l93046j21381j04796k81327j94372j03089l57502
5321I639599M0115J23504m7742L6386j14551K75521J83397l7299L8004K20126
5311A0357060J69795L01502L05661R6052j00093j10523l12531k88795m10929l91859
5301I615340l73876k18954j48567k67179k14362R9142j5354k16721k65075K1788
5291H016182j13559q1501N8529J20601N0729j79756L1538k85726j62577k394m7522
$$ plain form
5361 17260552 17141691 16683128 16500613 16186615 15773860 15452840 15403305 15305502 15195660 15129879
5351 15129879 15112610 15062556 15126225 15368546 15428351 15331498 15345201 15508750 15483887 15376827 15582760
5340 15582760 15454620 15418104 15282460 14828949 14195068 13477333 13113394 12801628 12195563 11751447
5330 11751447 11476156 11195112 10802066 10680685 10575889 10294562 10100190 9997101 9639599
5321 9639599 9679714 9803218 9755476 9791862 9677311 9952832 10136229 10098930 10136934 10357060
5311 10357060 10526855 10828357 11134018 11230070 11129977 11019454 10706923 10418128 10007199 9615340
5301 9615340 9241464 9022510 8873943 8606764 8392402 8491544 8476190 8259469 7994394 8016182
5291 8016182 7902623 7821122 7879651 8000252 8050981 7871225 7902763 7617037 7454460 7452066 7404544
5280G404544m0122O5628n1772J12843k0675k7657J26875P0117N5613l6486l47084
5269G311824l84881M4418K82564K74252j0837k4436n7915J02542K12875J74188
5259G924594J0225j4844K16197K9622j91774k8683k57173k51108K94967o570q9763
5248G635690J13060m9005j99763j0504N3345m8289j41823J9245K33971r2409K6061
5237G539579K57597K09076J69914Q6779J68068k36925k12892R694k356Q2020j78498
5226G892056j74020O8229j94236m15112k10699j86052j33370r0551j71962j39026
5216F245257l0859k68683j16936j25179Q7587n7927k10074J69889n8350j6587
5206E618138M395k01900q1441q4290k10473p360L9300j97648k28684j33735N0992
$$ plain form
5280 7404544 7364422 7430050 7378278 7491121 7470446 7442789 7569664 7639781 7695394 7658908 7311824
5269 7311824 6926943 6971361 7253925 7528177 7517340 7492904 7434989 7537531 7750406 7924594
5259 7924594 7934819 7919975 8136172 8165794 7974020 7945337 7688164 7437056 7732023 7725453 7635690
5248 7635690 7748750 7699745 7499982 7489478 7542823 7494534 7352711 7371956 7605927 7513518 7539579
5237 7539579 7797176 8006252 8176166 8262945 8431013 8194088 7981196 7990890 7988534 8070554 7892056
5226 7892056 7718036 7786265 7592029 7176917 6966218 6780166 6646796 6556245 6384283 6245257
5216 6245257 6214398 5945715 5828779 5703600 5791187 5733260 5523186 5693075 5634725 5618138
5206 5618138 5622533 5420633 5339192 5254902 5044429 5037069 5076369 4878721 4650037 4516302 4567294
5195D567294J09778l1256l08546J38776l6063p7602p1629l2597P4969m8560r4282
5184D190282l1103r4088k70705R5938n2465k45353J47561K46494j34377M3963
5174C896147k03027k98350K23657R1633q9481n1429J12151m8999p5111r7464l812
5163C455915r5595Q1581L9070o9024m6611j45153L4730R3841J893R4146k02483
5152C242310k20066N6496L3337O8043j40052j31180O009K49094r7415r6228N8635
5141C028983J15661k00818r6333q1990m2114K78009K0298M4239J49587j54072
5131C061450J63851K51592k61269J211K36204j8643o9544m4166K65659k7775O6161
5120C624731j06853j37850p2878L0434j9357j5555k1531r8640J68610J848j31505
$$ plain form
5195 4567294 4677072 4645816 4337270 4476046 4439983 4362381 4290752 4258155 4333124 4284564 4190282
5184 4190282 4159179 4065091 3794386 3890324 3837859 3592506 3740067 3986561 3852184 3896147
5174 3896147 3693120 3394770 3618427 3710060 3620579 3569150 3681301 3632302 3557191 3459727 3455915
5163 3455915 3360320 3441901 3480971 3411947 3365336 3220183 3254913 3348754 3350647 3444793 3242310
5152 3242310 3022244 3078740 3112077 3180120 3040068 2908888 2914897 3163991 3066576 2970348 3028983
5141 3028983 3144644 2943826 2847493 2765503 2723389 3001398 3021696 3065935 3215522 3061450
5131 3061450 3225301 3476893 3215624 3216835 3453039 3434396 3364852 3320686 3586345 3558570 3624731
5120 3624731 3517878 3380028 3307150 3337584 3318227 3302672 3281141 3182501 3351111 3352959 3221454
5109C221454l2198K61839K03427j33750j2407j81355J17009K33953r1261j06490
5099C480221k24860R6929j1248J20017J21789J18102K8144K6471q874j48896m2980
5088C554815O6796K51978J09717p3501l4364O2385j97211K7435N4272Q2070m497
5077C899895j02436l5933J02153J35534j68486j28187j30061J74018J59629k6381
5067C879745K77150j36290R6142j38881q344L27728P8432J31691j59141l3076
5057D315156p0986K0984J17236p3185M5851m2372k50492K11548J13039J6105r0548
5046D312336J15133K05003K05323K1862l4127P4327Q0684q8125N5805j34442J02239
5035D916018o6344j9692L8437J37106r1365P8695o250k59894q4904K09719L27276
$$ plain form
5109 3221454 3189256 3451095 3654522 3520772 3508365 3327010 3444019 3677972 3586711 3480221
5099 3480221 3255361 3352290 3341042 3461059 3582848 3700950 3729094 3755565 3746691 3597795 3554815
5088 3554815 3621611 3873589 3983306 3909805 3875441 3937826 3740615 3768050 3822322 3904392 3899895
5077 3899895 3797459 3761526 3863679 3999213 3830727 3702540 3572479 3746497 3906126 3879745
5067 3879745 4156895 4020605 4116747 3977866 3969522 4297250 4375682 4507373 4348232 4315156
5057 4315156 4244170 4265154 4382390 4309205 4355056 4312684 4062192 4273740 4386779 4402884 4312336
5046 4312336 4427469 4632472 4837795 4859657 4825530 4899857 4980541 4892416 4948221 4813779 4916018
5035 4916018 4849674 4829982 4868419 5005525 4914160 4992855 4986605 4726711 4641807 4851526 5178802
5024E178802j10397n1315j31138O6734J83307L08864N6059n5211j1497O393K7674
5013E468275k4449O536N8913j4220N2540j24364j0252J09104J09419r5531O793
5002E542764L9722J8304M9304K00174J88759j30904n448n4679j09559k20055K0952
4991E539334J5843K2028O4041J63181L00745q895R5500J28745k22175N8838L74917
4980F532102J07101j79728m9834J38606J25679P4298R1648j45227r6401K7875
4970F626119O2746R1830O757j1762J51463K42765l801j32982L9083K29721L0429
4959G332368j10548j03093J68890o9646K62410j41437M5236K71192P2541J1908
4949G739821K04251L3140j60394J74026K86401j35125R4469L25629R0251P0065
$$ plain form
5024 5178802 5068405 5017090 4885952 4952686 5135993 5444857 5500916 5445705 5434208 5440601 5468275
5013 5468275 5443826 5450362 5509275 5495055 5547595 5423231 5412979 5522083 5631502 5535971 5542764
5002 5542764 5582486 5600790 5650094 5850268 6039027 5908123 5902675 5847996 5738437 5518382 5539334
4991 5539334 5555177 5577205 5641246 5804427 6105172 6096277 6191777 6320522 6098347 6157185 6532102
4980 6532102 6639203 6459475 6409641 6548247 6673926 6748224 6839872 6694645 6598244 6626119
4970 6626119 6688865 6780695 6787452 6775690 6927153 7169918 7166117 7033135 7072218 7301939 7332368
4959 7332368 7221820 7118727 7287617 7217971 7480381 7338944 7384180 7655372 7727913 7739821
4949 7739821 7944072 7977212 7816818 7990844 8277245 8142120 8236589 8562218 8652469 8722534
4939H722534j6984J37519L4910R1002J5802q3245K21043L65650N8991r239J63716
4928I701699K86684m527j9108K49005K26624M86434N8497J34515M82981J85869
4918A1788673L95466L91790L58453P11501R97724J108461J307091R91927P51280
4909A8802366L6145l93813r78593j220294r53764o57381n34525l93159m06036
4900A3300946k25552j97326o6047l0220n137r7542P1252L5046O0164O5536M35693
4889A3346813M23658R7219Q8051n1360J15043J01284N01701L27620R437K05589
4879A5165055M34131M35734R7838J50563K70365L56116L36050L82256L21431L53234
4869A8302773K79497K99492N74164K07275K80957M33013M72550M44497O95889
$$ plain form
4939 8722534 8705550 8843069 8877979 8968981 8984783 8901538 9122581 9488231 9547222 9537983 9701699
4928 9701699 9988383 9983856 9964748 10213753 10440377 10926811 10985308 11119823 11602804 11788673
4918 11788673 12184139 12575929 12934382 13645883 14643607 15752068 17059159 18051086 18802366
4909 18802366 18838511 18444698 17466105 16245811 15292047 14634666 14100141 13706982 13300946
4900 13300946 13075394 12878068 12812021 12781801 12776664 12679122 12750374 12785420 12845584 12911120 13346813
4889 13346813 13770471 13867690 13955741 13904381 14019424 14120708 14622409 14950029 14959466 15165055
4879 15165055 15599186 16034920 16132758 16283321 16553686 16909802 17245852 17628108 17949539 18302773
4869 18302773 18582270 18881762 19455926 19663201 19944158 20377171 20849721 21294218 21990107
4860B1990107O47615N05482M13754L62375N44503R43864N31035N75517O29421
4851B7143673N92742Q13819Q72628O74071P18982O61827P52457R08406R45275
4842C4083880P63146R60442J062119Q90454J151058J043370J221199J280100J423616
4833D3879384J376279J411849J531147J694542J764271J942844K268484K127352
4825E7996152K059284J897658K351188K344976K317473K302897K308524K530947
4817G6109099K604576K644742K942067K974528L095122L304348L609581L867461
4809A01151524L773227M082856M231511M238086M035673L840310L550847L209023
4801A32113057K988630K841833K340997K308465K182128K171553K422021K319373
$$ plain form
4860 21990107 22637722 23143204 23556958 23919333 24463836 25407700 25938735 26514252 27143673
4851 27143673 27736415 28550234 29422862 30096933 30815915 31477742 32230199 33138605 34083880
4842 34083880 34847026 35807468 36869587 37760041 38911099 39954469 41175668 42455768 43879384
4833 43879384 45255663 46667512 48198659 49893201 51657472 53600316 55868800 57996152
4825 57996152 60055436 61953094 64304282 66649258 68966731 71269628 73578152 76109099
4817 76109099 78713675 81358417 84300484 87275012 90370134 93674482 97284063 101151524
4809 101151524 104924751 109007607 113239118 117477204 121512877 125353187 128904034 132113057
4801 132113057 135101687 137943520 140284517 142592982 144775110 146946663 149368684 151688057
4793A51688057K833440L498547L408991L986805M406713M935367N780880O390619
4785A86929419O911086P395698Q179685Q179413P982487P136810N958481L970688
4777B42643767J911463m00000k135606l220088m294524m570527m975724n011841
4769B19946920m269638l606641k843432j924039j000520K67115J313830K483530
4761B10367125L181717L894404M730498N293725N261443N455036N037273M084056
4753B47305277L518415J718157k89797k504919m930092o931330q524090r211709
4745B20149912r092860q871623q626328p626385p088339o193965n287011m735715
4737A62627686m085989l293903l003155k664981k400712k448984k613625k253016
$$ plain form
4793 151688057 154521497 158020044 161429035 165415840 169822553 174757920 180538800 186929419
4785 186929419 193840505 201236203 209415888 217595301 225577788 232714598 238673079 242643767
4777 242643767 244555230 244155230 242019624 238799536 234505012 229934485 224958761 219946920
4769 219946920 215677282 212070641 209227209 207303170 206302650 206569765 207883595 210367125
4761 210367125 213548842 217443246 222173744 227467469 232728912 238183948 243221221 247305277
4753 247305277 250823692 252541849 252252052 249747133 244817041 237885711 229361621 220149912
4745 220149912 211057052 202185429 193559101 185932716 178844377 172650412 167363401 162627686
4737 162627686 158541697 155247794 152244639 149579658 147178946 144729962 142116337 139863321
4729A39863321k796802k789584l157813m049919m081361m402557m762604m980920
4721A08841761n238412m979621m862406m912782m522519m212220l951851l738560
4713G2423390l607707l413454l045580k825897k587851k335815k356259j800855
4705E0449972j596338j656373j411361j221301j469936j459091j175844j082453
4697C9377275p06773q92171q09354o68078o06892r38720p16753p06190o97365
4688C2634979p16020r10228o11564q98547r46653p52708n79887o66866p53508
4679B5798998o18571o88474m02442l85733p21161o15161m60289l92960m98427
4670B1015780n90290k73695n44187l41364k47075k99399m55122j59711k11884
$$ plain form
4729 139863321 137066519 134276935 131119122 127069203 122987842 118585285 113822681 108841761
4721 108841761 103603349 98623728 93761322 88848540 84326021 80113801 76161950 72423390
4713 72423390 68815683 65402229 62356649 59530752 56942901 54607086 52250827 50449972
4705 50449972 48853634 47197261 45785900 44564599 43094663 41635572 40459728 39377275
4697 39377275 38670502 37778331 36968977 36300899 35694007 34755287 34038534 33332344 32634979
4688 32634979 31918959 31008731 30397167 29498620 28551967 27799259 27219372 26552506 25798998
4679 25798998 25180427 24491953 24089511 23703778 22982617 22367456 21907167 21514207 21015780
4670 21015780 20425490 20151795 19607608 19266244 19019169 18719770 18264648 18104937 17893053
4661A7893053l31045n11133l60393k74437m21215k78623k95169n19084l72759
4652A4529195l7731k42216l84503l10117l14766j50544k89569k01630j86522o7137
4642A2344460l58934l30787k80954j01058k53002l21103k25431m8368o4688J34823
4632A0494958j36442l89004j57616n0806j50685k30085j22950j81684O8170k90252
4622H853604j03174j77593q7296j50491j77084J7550o9795J06766n7683k08901
4612G945903r2018j03144o0311k64457k23732p9804J16883k895j32998l91832
4602F711595R0325P7012j75975j58893j02823K24371k10618j10320P6311p1689
4592F349296J73372r0298l0377n9208J31756j06714j89525P4278r6869k35613
$$ plain form
4661 17893053 17562008 17050875 16690482 16416045 15994830 15716207 15421038 14901954 14529195
4652 14529195 14491464 14249248 13864745 13554628 13239862 13089318 12799749 12598119 12411597 12344460
4642 12344460 11985526 11654739 11373785 11272727 11019725 10698622 10473191 10424823 10360135 10494958
4632 10494958 10358516 9969512 9811896 9761090 9610405 9380320 9257370 9075686 9143856 8853604
4622 8853604 8750430 8572837 8485541 8335050 8157966 8175516 8105721 8212487 8154804 7945903
4612 7945903 7853885 7750741 7690430 7425973 7202241 7122437 7239320 7236425 7103427 6711595
4602 6711595 6801920 6878932 6702957 6544064 6441241 6665612 6454994 6344674 6420985 6349296
4592 6349296 6522668 6432370 6401993 6342785 6474541 6367827 6178302 6252580 6155711 5920098
4582E920098J917j20684k93394m1723J5290j52568j70282J41517L0008q9822m8778
4571E191579J12845j9039k40553k06461J07038R4342r4544n8811N6068J50133
4561E092597N6999J7821j27437p443p0109K59628K19476j13839O4263j23799K5931
4550E294088L4821j1499k26666j73655J45014K956k3106n5757j85791k4718K66212
4539E041899k44048o9074K03163O5323j93248M1672J37220Q0718k43861J04189
4529D923953M8238L5560Q2514J3792L39734j11655J41890K63866p5502m9788l7907
4518E574695j43517L4161Q593j4930j46501n6475p0173q8488K2571o5496J70709
4507E225149l1608J62921q6752k12762K81822l6016n4090R2233K10668J73866
$$ plain form
4582 5920098 5922015 5801331 5507937 5466214 5481504 5328936 5158654 5300171 5330179 5240357 5191579
4571 5191579 5304424 5285385 5044832 4838371 4945409 5039751 4945207 4886396 4942464 5092597
4561 5092597 5149596 5167417 5039980 5032537 4962428 5222056 5441532 5327693 5391956 5268157 5294088
4550 5294088 5328909 5317410 5090744 4917089 5062103 5065059 5041953 4986196 4800405 4775687 5041899
4539 5041899 4797851 4728777 4931940 4997263 4804015 4845687 4982907 5063625 4819764 4923953
4529 4923953 4972191 5007751 5090265 5104057 5443791 5332136 5474026 5737892 5662390 5612602 5574695
4518 5574695 5431178 5465339 5473932 5459002 5312501 5256026 5185853 5097365 5119936 5054440 5225149
4507 5225149 5193541 5356462 5269710 5056948 5338770 5302754 5248664 5340897 5551565 5725431
4497E725431j8537L7573J30874O8601J95054J34030L37602L39696j25275j12535
4487F712514l215o7472N5430j52171L0027p2753P1941J50601J9774k09228j78273
4476F357175N119j88271j22414J71778K78221R6569J10600R2132j27800J44442
4466F817551K54569O469p3767p1099R9040j20085O1286Q6211j2107J28742j69774
4455G007036n6549p3137o4076J3933q0413l43162m8363p5335j51487j67195m6118
4444E915134n908J5553R516R0020n8852k01805j46536J39131J12472l7991J1029
4433E841763j41507M6546K4829j89912q065l3391J48936O4405L9404J84418k62813
4422E714613M22850m828m2247K27693J13978j93232K12815L17555J01095M01214
$$ plain form
4497 5725431 5706894 5744467 5875341 5943942 6138996 6273026 6610628 6950324 6825049 6712514
4487 6712514 6709299 6641827 6697257 6545086 6575113 6502360 6574301 6724902 6744676 6535448 6357175
4476 6357175 6362294 6174023 6051609 6223387 6501608 6598177 6708777 6800909 6673109 6817551
4466 6817551 7072120 7078589 7004822 6933723 7032763 6912678 6973964 7060175 7048068 7176810 7007036
4455 7007036 6950487 6877350 6813274 6827207 6746794 6403632 6355269 6279934 6128447 5961252 5915134
4444 5915134 5909226 5924779 5934295 6024315 5965463 5763658 5617122 5756253 5868725 5830734 5841763
4433 5841763 5700256 5746802 5771631 5581719 5573654 5540263 5689199 5753604 5793008 5977426 5714613
4422 5714613 6137463 6132635 6090388 6318081 6432059 6238827 6451642 6769197 6870292 7271506
4412G271506J59447K35985N51904P58458K19373K84741J04892l62943n11733m01305
4402H310325k34301k33053o8817j46068j18164k0794j98020j68774R9024j9471
4392G201887j25900j21782j82182O6002q4497k25617q1367J82715n953R453l387
4381F629372l70915K7847L34837j13029k9250j17442M8717P877N1117j1038j95562
4370F262531K11657P7852k9897k00626L16879p6013j37942O4608K74724l4184
4360F729589j9259N6443r6947k7380R3033n7092q8219j61202N5378J30956L4541
4349F649841K0076L2940o7891M0501J44339n4451j35188k9974K87556K38759O207
4338G132715k4117r53J06119N6230J7712r672p6965k0922o126O364l6720J4645
$$ plain form
4412 7271506 7430953 7666938 8218842 8977300 9196673 9481414 9586306 9223363 8711630 8310325
4402 8310325 8076024 7842971 7774154 7628086 7509922 7489128 7291108 7122334 7221358 7201887
4392 7201887 7075987 6954205 6772023 6838025 6753528 6527911 6446544 6629259 6623306 6632759 6629372
4381 6629372 6258457 6286304 6621141 6508112 6478862 6361420 6410137 6418014 6469131 6458093 6262531
4370 6262531 6474188 6552040 6522143 6321517 6638396 6562383 6424441 6489049 6763773 6729589
4360 6729589 6710330 6766773 6669826 6642446 6735479 6678387 6590168 6428966 6484344 6615300 6649841
4349 6649841 6669917 6702857 6634966 6675467 6819806 6765355 6630167 6600193 6887749 7126508 7132715
4338 7132715 7108598 7107645 7213764 7269994 7287706 7278034 7201069 7180147 7174021 7180385 7143665 7158310
4326G158310k23755K20838J67133j43218J1571O5213M0647o6348q5759N3717J35091
4315G333440L7456K6134k62071k07988L12981j09012P4782K55646j15479M5114
4305G391003J04252J06127n5725R760L6872j56128n5508l7106J60345j76068j01010
4294G226814L8245j12252p2550J82414K33724J15292j49183K5420J21148k00208
4284G408864m8688l3706J23605K2554j94347O5303K01728J44663p1967j23159
4274G494850j74552Q243L99499j75271R8511J03877q5193P798P177l460Q5207
4263G766686P1406k03063M0706r271P2880J00691r9295R7938J42459o5670r6581
4252G818886J15756M1747K62948L1274J130Q9370J21473K779p6848K44039L06131
$$ plain form
4326 7158310 6934555 7155393 7322526 7179308 7190879 7256092 7296739 7230391 7144632 7198349 7333440
4315 7333440 7370896 7397030 7134959 6926971 7239952 7130940 7205722 7461368 7345889 7391003
4305 7391003 7495255 7601382 7545657 7555417 7592289 7436161 7380653 7343547 7503892 7327824 7226814
4294 7226814 7265059 7152807 7080257 7262671 7496395 7611687 7462504 7487924 7609072 7408864
4284 7408864 7360176 7326470 7450075 7472629 7278282 7343585 7545313 7689976 7618009 7494850
4274 7494850 7320298 7328541 7728040 7552769 7651280 7755157 7669964 7677762 7684939 7681479 7766686
4263 7766686 7838092 7635029 7675735 7666464 7739344 7840035 7740740 7838678 7981137 7915467 7818886
4252 7818886 7934642 7976389 8239337 8270611 8271741 8361111 8482584 8485363 8408515 8652554 8958685
4241H958685M4098Q342J22651L5692K39329N9040J40570J48616K93338L3011j18033
4230I965339J16517L798L8269L3089q0590q4212p9015j582J43387J94283j01620
4219A0147663K1384J88460K36579K18607R3057K553J76015O3113K70703O6091
4209A1484225J42489K99055L37528j83217K4148M24407p251J37365K3835p35r2953
4198A2588896n538L4248K3175J48102J36041M7649J15713R7194Q5136K18499Q8516
4187A3577631K63832J39935K06931L08745K18469M15575J42595K23592K89370
4178A5786675J48017J56818N45117K96300K22575L50857J64156L50096K2459J70689
4168A8213759K84390K78796L64621L63239N05113K71403L84216K88335N74991
$$ plain form
4241 8958685 9002783 9011125 9133776 9169468 9408797 9467837 9608407 9757023 10050361 10083372 9965339
4230 9965339 10081856 10085654 10123923 10157012 10076422 9992210 9913195 9911613 10055000 10249283 10147663
4219 10147663 10169047 10357507 10594086 10812693 10905750 10908303 11084318 11147431 11418134 11484225
4209 11484225 11626714 11925769 12263297 12080080 12104228 12528635 12521384 12658749 12682584 12681849 12588896
4198 12588896 12583358 12617606 12640781 12788883 12924924 12972573 13088286 13185480 13270616 13489115 13577631
4187 13577631 13841463 13981398 14188329 14497074 14715543 15131118 15273713 15497305 15786675
4178 15786675 15934692 16091510 16636627 16932927 17155502 17506359 17670515 18020611 18043070 18213759
4168 18213759 18498149 18776945 19141566 19504805 20009918 20281321 20665537 20953872 21528863
4159B1528863N48100M26649M62821M23045Q62530O50235N50341O59171Q15434
4150B6927189Q25156P55612P74430R49810P17495R37052R02443J208501J500591
4141C5498279J049997J350350J161169J041818J364395J251211J170666J149132
4133D5037017J135799J293854J258050J222053J195036J605522J491597J422234
4125E5661162J725994J910665J816395K001294J757025J854972J684136J675701
4117G0087344J515968J391316J424034J593949J683402J379940J464993J774981
4109H2315927J787399J926708J817029J917903J990592K145038K162736K174083
4101I8237415K423852K681745K784609K827989L270479L340019L277219L175459
$$ plain form
4159 21528863 22076963 22503612 22966433 23389478 24252008 24902243 25452584 26111755 26927189
4150 26927189 27752345 28507957 29282387 30232197 30949692 31886744 32789187 33997688 35498279
4141 35498279 36548276 37898626 39059795 40101613 41466008 42717219 43887885 45037017
4133 45037017 46172816 47466670 48724720 49946773 51141809 52747331 54238928 55661162
4125 55661162 57387156 59297821 61114216 63115510 64872535 66727507 68411643 70087344
4117 70087344 71603312 72994628 74418662 76012611 77696013 79075953 80540946 82315927
4109 82315927 84103326 86030034 87847063 89764966 91755558 93900596 96063332 98237415
4101 98237415 100661267 103343012 106127621 108955610 112226089 115566108 118843327 122018786
4093A22018786K897256K436215K291852J867289J699647J830625J930916K173679
4085A39146265K028702K400000K571063K796422L185043K896314L294747L475828
4077A61794384L853797M112380M431494N032942N165467N825437O141117O733793
4069B03090811P647135Q687121R463878R360036Q213373N747970L571157K205654
4061B57987135J467517J468055J486384K337329L522913M369742N113089N342609
4053B83094773M525775L743212K429746J269674K09081p73416q56355q32003k62542
4044B92547945L69088J336367K131570L694725N672897Q293552J0207760J0735017
4036C34988921R170007N028733k148905q480490j1728578j1998196j0614176q468988
$$ plain form
4093 122018786 124916042 127352257 129644109 131511398 133211045 135041670 136972586 139146265
4085 139146265 141174967 143574967 146146030 148942452 152127495 155023809 158318556 161794384
4077 161794384 165648181 169760561 174192055 179224997 184390464 190215901 196357018 203090811
4069 203090811 210737946 219425067 228888945 238248981 246462354 252210324 255781481 257987135
4061 257987135 259454652 260922707 262409091 264746420 268269333 272639075 277752164 283094773
4053 283094773 287620548 291363760 293793506 295063180 295272261 294498845 293642490 292810487 292547945
4044 292547945 292917033 294253400 296384970 300079695 305752592 314046144 324253904 334988921
4036 334988921 344158928 349187661 347038756 338558266 326829688 314831492 304217316 295748328
4028B95748328o880443n631468m732050m625040m624889m496516m199040m787979
4020B55770903n635437o376507p394176p868616p840995p522027o685355n551565
4012B00896225l979474k478077j302353k85614j18178k13219j207307k505755
4004A88806248m451981o301921o852365o601604n884507n063052m607801m287249
3996A44755768l986924m090170l957264m169865m272373m180856l790165l814207
3988A12493944l469539k967604k770877k477386k441572k212487k206960k153864
3980I1793655j826288j687613j814431j644540j422195j545069j621119j369398
3972G8863002j849962k058527j689202j794327j851379j738562j820975j872691
$$ plain form
4028 295748328 288867885 283236417 278504367 273879327 269254438 264757922 260558882 255770903
4020 255770903 250135466 243758959 236364783 228496167 220655172 213133145 206447790 200896225
4012 200896225 196916751 194438674 193136321 192850707 192732529 192519310 191312003 188806248
4004 188806248 184354267 178052346 171199981 164598377 158713870 153650818 149043017 144755768
3996 144755768 140768844 136678674 132721410 128551545 124279172 120098316 116308151 112493944
3988 112493944 109024405 106056801 103285924 100808538 98366966 96154479 93947519 91793655
3980 91793655 89967367 88279754 86465323 84820783 83398588 81853519 80232400 78863002
3972 78863002 77013040 74954513 73265311 71470984 69619605 67881043 66060068 64187377
3964F4187377j656772j636523j567356j449202j361076j436360j053771j192030
3956E2834287j180620j108006j210317r85757r36965j173073j158307j266978
3948D3814264j019935j016096j242855j085183q99376r87015p75813q97496o52985
3939C5237510j000957m49974n91480o21590l61328n37721n33762m82044m10462
3930C0248192m57868k99789n27950l26719j57716O8554m19544m46163j0210j21641
3920B7549146l19439k10508j59994j17997k33823j46055k96859k05709k83344
3911B5575418j30078k1271j70605k54283j94364k24965j24288N8330j46394k18513
3901B4148987k29303j16818p1360j84672m58168l44000j20803j39580K1744k37195
$$ plain form
3964 64187377 62530605 60894082 59326726 57877524 56516448 55080088 54026317 52834287
3956 52834287 51653667 50545661 49335344 48349587 47412622 46239549 45081242 43814264
3948 43814264 42794329 41778233 40535378 39450195 38550819 37563804 36787991 35890495 35237510
3939 35237510 34236553 33786579 33195099 32573509 32212181 31674460 31140698 30658654 30248192
3930 30248192 29790324 29490535 28962585 28635866 28478150 28546704 28127160 27680997 27670787 27549146
3920 27549146 27229707 27019199 26859205 26741208 26507385 26361330 26064471 25858762 25575418
3911 25575418 25445340 25424069 25253464 24999181 24804817 24579852 24455564 24513894 24367500 24148987
3901 24148987 23919684 23802866 23731506 23546834 23088666 22744666 22623863 22484283 22506027 22268832
3891B2268832j46002K2931k6634K2927j68801J07265l43421j26035j65236k92384
3881B1153442P5091k17016m43072p188J6687k17389j84885o9384m3361o4146j73676
3870A9825103j10901j43320j61523j57128j19762j42312n0480k12912k40221O8016
3860A8554560q9269j42607r0879Q3417L6174k81228l21775m2082J43300p8509
3850A7771102k9431J29349k64017j13710l31421j09242K11856m8609o7557J44218
3840A7292538l51465J7166J78228l08266j02193n4778l0487J82948J45816k6806
3830A6942701j1653j56007K070k7105j60430J5581J53611L0496k79149j56886
3820A6353229n8342J83007J03576r0037L1894J21131r4499k52541J42398M23414
$$ plain form
3891 22268832 22122830 22145761 22119127 22142054 21973253 22080518 21737097 21611062 21445826 21153442
3881 21153442 21228533 21011517 20568445 20561257 20577944 20360555 20175670 20106286 20062925 19998779 19825103
3870 19825103 19714202 19570882 19409359 19252231 19132469 18990157 18939677 18726765 18486544 18554560
3860 18554560 18465291 18322684 18231805 18315222 18351396 18070168 17748393 17706311 17849611 17771102
3850 17771102 17741671 17871020 17607003 17493293 17161872 17052630 17264486 17215877 17148320 17292538
3840 17292538 16941073 16958239 17136467 16828201 16726008 16671230 16640743 16823691 16969507 16942701
3830 16942701 16931048 16775041 16777111 16750006 16589576 16605157 16758768 16789264 16510115 16353229
3820 16353229 16294887 16477894 16581470 16491433 16523327 16644458 16549959 16297418 16439816 16863230
3810A6863230j45960j42470Q8771p4760j2556r1883l8176K45375m8138K01157
3800A6844590M822M4343J35128M1863K4163m7030l33562N5828J80877k37466K09564
3789A6923120j0934Q103K16641o3780L9860j57834P2024K29447q3892n6822r0228
3778A7025705J05207J74791J01106j38671k919K25966J35280J38898n6279Q7287
3768A7796371J74165j85701K02127J32026k08296r9030P0637k9633l8929L3236
3758A7846973o8117P3485j23212J11277M5973K36788N4856j02535j6225m6252
3748A8013011J72855N0001k6828J16027Q079j13906J40162n7033J59150O9667
3738A8531185j6841Q5113L81367m4496m5922O9427j3395k58266J91751R9403j2923
$$ plain form
3810 16863230 16717270 16574800 16663571 16588811 16576255 16484372 16446196 16691571 16643433 16844590
3800 16844590 16849412 16893755 17028883 17070746 17094909 17047879 16714317 16770145 16951022 16713556 16923120
3789 16923120 16912186 16920289 17136930 17073150 17113010 16955176 17027200 17256647 17172755 17115933 17025705
3778 17025705 17130912 17305703 17406809 17268138 17265219 17491185 17626465 17765363 17709084 17796371
3768 17796371 17970536 17784835 17986962 18118988 17910692 17811662 17882299 17852666 17813737 17846973
3758 17846973 17778856 17852341 17729129 17840406 17886379 18123167 18178023 18075488 18059263 18013011
3748 18013011 18185866 18235867 18209039 18325066 18333145 18219239 18359401 18302368 18461518 18531185
3738 18531185 18514344 18599457 18980824 18936328 18890406 18959833 18946438 18688172 18879923 18979326 18966403
3727A8966403j14985r164J14369p7607j53364O2294o5375j94510r7601K03140
3717A8633600J46933j84009j02401r689J43655J27131O1274K04431K89473O4589
3707A9374987k5497J329R2570Q4395j9676p5718k29121K39816J24713r0899q443
3696A9468456k6714m1945r6018J76355N7167k75507j40085R7158R8741J22676
3686A9440284K92916K19722j05656J37305R904O1188l7880J7329K2016J05640
3676B0162768O9501J3296J79280J99369o0062J7874J40376M1526R7175q7434K06351
3665B0980020O4345M753K37577n1087K11949n6051n3984K19098K29843r4790j8368
3654B1673305J40396K44159K81319K49960J23531K92544K87778K57543K76221
$$ plain form
3727 18966403 18851418 18842254 18956623 18879016 18725652 18787946 18722571 18528061 18430460 18633600
3717 18633600 18780533 18596524 18494123 18484434 18628089 18755220 18816494 19020925 19310398 19374987
3707 19374987 19349490 19350819 19443389 19527784 19508108 19432390 19203269 19443085 19567798 19476899 19468456
3696 19468456 19441742 19399797 19303779 19480134 19537301 19261794 19121709 19218867 19317608 19440284
3686 19440284 19733200 19952922 19847266 19984571 19994475 20055663 20017783 20035112 20057128 20162768
3676 20162768 20232269 20245565 20424845 20624214 20564152 20582026 20722402 20763928 20861103 20773669 20980020
3665 20980020 21044365 21049118 21286695 21235608 21447557 21391506 21337522 21556620 21786463 21691673 21673305
3654 21673305 21813701 22057860 22339179 22589139 22712670 23005214 23292992 23550535 23826756
3645B3826756J1010J82993L13178J00765m5642j2222J04130J98176K77209J09513
3635B5065866M5537Q1384J91961M39797Q2281K22341K11242K42324K32424K11984
3625B7027141J67392J03600J82623J98134J85286L15736K16737K71227L19812
3616B8987688L55815L61698K71188J58197J12336K48401M04216K90059L19250
3607C1508848L82204K18973L00331L35821M33154M32179M26428L43587K17776
3598C4599301M80294N62634M06701K95360M93071N87339M02734M27986N13576
3589C8768996P04838N21119O48585N13595O42922L01663M46679L67093O25836
3580D3541326Q03694P62086N38627N72625N96273N32848P93253R15389Q83394
$$ plain form
3645 23826756 23837766 24020759 24333937 24434702 24389060 24376838 24480968 24679144 24956353 25065866
3635 25065866 25111403 25192787 25384748 25824545 25906826 26129167 26340409 26582733 26815157 27027141
3625 27027141 27194533 27298133 27480756 27678890 27864176 28179912 28396649 28667876 28987688
3616 28987688 29343503 29705201 29976389 30134586 30246922 30495323 30899539 31189598 31508848
3607 31508848 31891052 32110025 32410356 32746177 33179331 33611510 34037938 34381525 34599301
3598 34599301 35079595 35642229 36048930 36344290 36837361 37424700 37827434 38255420 38768996
3589 38768996 39473834 39994953 40643538 41157133 41800055 42101718 42548397 42915490 43541326
3580 43541326 44345020 45107106 45645733 46218358 46814631 47347479 48140732 49056121 49939515
3571D9939515Q20983P98278Q19754R65688R81947Q51357Q43857R26528O53828
3562E7601735R28675J195008J076189J098692Q45030J188274R45258J212112J449742
3553F7540715J293988J234729J057449J461267J173681J520861J462730J293360
3545G8038780J467467J490894J233718J318233J785447J883392J695028J403653
3537I0316612J775996K219569K206798K075833J980940K080389J852651K535289
3529A07044077K358444K429001K469779K903091K962488L134696L329574L715611
3521A30346761L903310M140925M594726M985766N148685N659551O404565O930471
3513A72114760P723409Q200739Q951723R806278J0672643J1187406J1883024J2343759
$$ plain form
3571 49939515 50760498 51558776 52378530 53344218 54326165 55177522 56021379 56947907 57601735
3562 57601735 58530410 59725418 60801607 61900299 62745329 63933603 64878861 66090973 67540715
3553 67540715 68834703 70069432 71126881 72588148 73761829 75282690 76745420 78038780
3545 78038780 79506247 80997141 82230859 83549092 85334539 87217931 88912959 90316612
3537 90316612 92092608 94312177 96518975 98594808 100575748 102656137 104508788 107044077
3529 107044077 109402521 111831522 114301301 117204392 120166880 123301576 126631150 130346761
3521 130346761 134250071 138390996 142985722 147971488 153120173 158779724 165184289 172114760
3513 172114760 179838169 188038908 196990631 206796909 217469552 228656958 240539982 252883741
3505B52883741J2145434J2088530J1479957R982364P723561M536372J153872k784205
3497C09209626o099647q448262j0559896j1163044j1310713j0795824j0111291
3490B40720949r406937q434126p525208o970146o314939n895495n105312m799125
3482A86269661m859618m423430m251484m068342l753497l225738l153625k997881
3474A55536046k894770k654276k677199k459905k682894k239875j993982k572956
3466A35360189k498077k238454k233133k495014k307806k407157k469293k176997
3458A16534258k398178j833158j784651j609381j431653j485780j362634j501001
3450A03127822j830421k207368k233735k309869k341389j960630k116656j955413
$$ plain form
3505 252883741 265029175 277117705 288597662 298580026 306303587 310839959 311993831 309209626
3497 309209626 303109979 294661717 284101821 272938777 261628064 250832240 240720949
3490 240720949 231314012 222879886 215354678 208384532 202069593 196174098 191068786 186269661
3482 186269661 181410043 176986613 172735129 168666787 164913290 161687552 158533927 155536046
3474 155536046 152641276 149987000 147309801 144849896 142167002 139927127 137933145 135360189
3466 135360189 132862112 130623658 128390525 125895511 123587705 121180548 118711255 116534258
3458 116534258 114136080 112302922 110518271 108908890 107477237 105991457 104628823 103127822
3450 103127822 101297401 99090033 96856298 94546429 92205040 90244410 88127754 86172341
3442H6172341j862650j818632j632110j517298j354004j526867j391670j118702
3434G3950408j153182j134677r54820q46584r69659o97886q02932o46687o64788
3425F6079193n00326o30526p34981m52276m07347k35967m86420p43625r60825
3416F0926900j013802q99335j174424j049038o95978q33161r12250o87666p46893
3407E2914353p47887n84975l55564l78728n78588m91874n93344n04877o18727
3398D8059789j19179k64872p45780m69916l57279k64761m47021m22543j58589
3389D4809849k76639m04958j71094k00814n20244l40482k70516m88243m64876
3380D1671983n88716k91742j65422l35849l63941l19035j99617k50287k58204
$$ plain form
3442 86172341 84309691 82491059 80858949 79341651 77987647 76460780 75069110 73950408
3434 73950408 72797226 71662549 70707729 69861145 68891486 68193600 67390668 66743981 66079193
3425 66079193 65578867 64948341 64213360 63761084 63353737 63117770 62631350 61887725 60926900
3416 60926900 59913098 59013763 57839339 56790301 56094323 55261162 54348912 53661246 52914353
3407 52914353 52166466 51581491 51225927 50847199 50268611 49776737 49183393 48678516 48059789
3398 48059789 47940610 47675738 46929958 46460042 46102763 45838002 45390981 44968438 44809849
3389 44809849 44533210 44128252 43957158 43756344 43236100 42895618 42625102 42136859 41671983
3380 41671983 41083267 40791525 40626103 40290254 39926313 39607278 39407661 39157374 38899170
3371C8899170k66985k80674k50460K53190j67015m82844j78857p8686k76140l23199
3361C6847500j81966l90832n02186l03205k10766J6156m33452k40757p2561j74267
3351C4353664k45026j73020j27021j26674R901p9666k67850j45314j3686j54819
3341C3030489l79334j20492j31075l3539j48548l59700o9640j60375j10179k49823
3331C1267784q502j7979j53809k67235j95174m78564j42752l68949k85704o0022
3321B9289094l47044k08071l82841j27743j11843r6527p5709O4505m1973k70958
3311B7690890j30756J06960k99105j12109r5836j64205m61637r9615J2348m61983
3301B5984952l44486j67677o8922k78672k72380j13381j78284k84716m5697l57751
$$ plain form
3371 38899170 38632185 38351511 38101051 38354241 38187226 37704382 37525525 37446839 37170699 36847500
3361 36847500 36665534 36274702 35772516 35469311 35258545 35274701 34841249 34600492 34527931 34353664
3351 34353664 34108638 33935618 33808597 33681923 33691824 33612158 33344308 33198994 33185308 33030489
3341 33030489 32651155 32530663 32399588 32366049 32217501 31857801 31788161 31627786 31517607 31267784
3331 31267784 31259282 31241303 31087494 30820259 30625085 30146521 30003769 29634820 29349116 29289094
3321 29289094 28942050 28733979 28351138 28223395 28111552 28015025 27939316 28003821 27961848 27690890
3311 27690890 27560134 27667094 27367989 27255880 27160044 26995839 26534202 26434587 26446935 25984952
3301 25984952 25640466 25472789 25403867 25125195 24852815 24739434 24561150 24276434 24230737 23872986
3291B3872986m02747j65277o9162k11965j70039k34570o4102k81843K05099M2850
3281B2521230k15509k1481j43503M8678j24523o5380J2610R6739r7628M2769J56519
3270B2210521j3376J05640k29346J04177O7658j6178K78018Q652j66808j38837
3260B2210121P0315J96398K90340r8774O7124J93828R2799Q9525j6466J91772
3250B3286982L49450K40780J30938L30861K49427N8022K40224K82722J32337J55804
3240B5457547K84361L43207L61326K71624K79939M50060K61983L08639M11906
3231B8430592L71515J25720K52547K32409J52344K47635J84635L16887J97584
3222C0511868L68447L43872J24330M59461M26592J82026L92095L46180O61860
$$ plain form
3291 23872986 23470239 23304962 23235800 23023835 22853796 22619226 22555124 22273281 22478380 22521230
3281 22521230 22305721 22284240 22140737 22189415 22064892 21999512 22012122 22108861 22011233 22054002 22210521
3270 22210521 22197145 22302785 22073439 22177616 22245274 22229096 22507114 22515766 22348958 22210121
3260 22210121 22280436 22476834 22767174 22668400 22735524 22929352 23022151 23111676 23095210 23286982
3250 23286982 23636432 23877212 24008150 24339011 24588438 24646460 24886684 25169406 25301743 25457547
3240 25457547 25741908 26085115 26446441 26718065 26998004 27448064 27710047 28018686 28430592
3231 28430592 28802107 28927827 29180374 29412783 29565127 29812762 29997397 30314284 30511868
3222 30511868 30880315 31224187 31348517 31807978 32234570 32416596 32808691 33154871 33816731
3213C3816731N07893O80557P83884M85773Q22476O03460Q58503Q07625N03262
3204C9870164Q05197J170981O35589J005493J302368R10708J310256J018732J258485
3195D9287973J470374J389992J429100J339653J649352J300341J200736J162169
3187F0229690J004438Q26337P92530Q52729R34734Q01693O83609Q17093P89963
3178F7732816Q78554J020755J086742J172916J225232J527429J774522J960102
3170G8379068K331933K540306K710710K895247L163994L295007L690811L675645
3162A02682721L383595L322351K753833J994526R80798p2509r92713j953814k459591
3153A09639197k546342k343068k202783j527430j304637l12979p1J52350O85734
$$ plain form
3213 33816731 34324624 35005181 35789065 36274838 37097314 37700774 38559277 39366902 39870164
3204 39870164 40675361 41846342 42481931 43487424 44789792 45700500 47010756 48029488 49287973
3195 49287973 50758347 52148339 53577439 54917092 56566444 57866785 59067521 60229690
3187 60229690 61234128 62060465 62852995 63705724 64640458 65442151 66125760 66942853 67732816
3178 67732816 68611370 69632125 70718867 71891783 73117015 74644444 76418966 78379068
3170 78379068 80711001 83251307 85962017 88857264 92021258 95316265 99007076 102682721
3162 102682721 106066316 109388667 112142500 114137026 115117824 115045315 114052602 112098788 109639197
3153 109639197 107092855 104749787 102547004 101019574 99714937 99401958 99401887 99554237 100239971
3144A00239971J065776J484006J805319K034714K064899K330673K383855K355656
3136A15764869K392052J986861J876616J343092N73541j29601o28400j357036
3128A21821994j981057k604588l106889l492769l379920l170262l177227k936188
3120I7973094k318133j745065j838362j264323q22607n08434j69861j64062q4783
3111H9057464j18681l82293m78569p15833q83517j347902j663157j970671k029325
3102G9467516k578815k974151k875406k746824k669723k791548k359064k079935
3094E8392050k276083k122345j910868j503543j439215j404709j456705j173221
3086D5105361j154037r40014r94216r98561q56279q56139r05074n93782p66847
$$ plain form
3144 100239971 101305747 102789753 104595072 106629786 108694685 111025358 113409213 115764869
3136 115764869 118156921 120143782 122020398 123363490 123937031 123807430 123179030 121821994
3128 121821994 119840937 117236349 114129460 110636691 107256771 104086509 100909282 97973094
3120 97973094 95654961 93909896 92071534 90807211 89984604 89476170 89306309 89142247 89057464
3111 89057464 88938783 88556490 88077921 87362088 86478571 85130669 83467512 81496841 79467516
3102 79467516 76888701 73914550 71039144 68292320 65622597 62831049 60471985 58392050
3094 58392050 56115967 53993622 52082754 50579211 49139996 47735287 46278582 45105361
3086 45105361 43951324 43011310 42017094 41018533 40162254 39306115 38401041 37807259 37040412
3077C7040412j140453r59621q50370q59082j080828q73950r38806p82989n37916
3068B9016397q35865p72996n38473o35736o25916m60882l97654n67036o26969
3059B3554870m95351m07204m09228o02114m42188l62793m37977k54469j87332
3050A9956214m65386l07258j55740l60974j08208m28198j89222l52290k36963
3041A7351975k01406l56496j19291k92714j78437l24606n88354k79609k88555
3032A4722507k05044j59592l36007j85355k02981m56005k59167K8037l64057o6711
3022A2515625k5805l55340j04771k75028l20913j37405j61848k67954k5638J46143
3012A0987066k91285j32728K6881l10812k20738k89539q2400j91328k22250m3987
$$ plain form
3077 37040412 35899959 34940338 34089968 33230886 32150058 31276108 30337302 29554313 29016397
3068 29016397 28180532 27407536 26869063 26233327 25607411 25146529 24748875 24181839 23554870
3059 23554870 23059519 22652315 22243087 21640973 21198785 20835992 20398015 20143546 19956214
3050 19956214 19490828 19183570 19027830 18666856 18558648 18130450 17941228 17588938 17351975
3041 17351975 17150569 16794073 16674782 16382068 16203631 15879025 15290671 15011062 14722507
3032 14722507 14517463 14357871 14021864 13836509 13633528 13177523 12918356 12946393 12582336 12515625
3022 12515625 12489820 12134480 12029709 11754681 11433768 11296363 11134515 10866561 10840923 10987066
3012 10987066 10695781 10563053 10589934 10279122 10058384 9768845 9686445 9495117 9272867 9228880
3002I228880m53974l41028o8227Q953j3259K2306k45933k73839q5596j64431p6802
2991G537050r7388r0099k17294o7509m4346k20554L0051p2414l53722j56982O5773
2980F312566J5511J27390j17100k90413j69321m2224O421R0633j19426k65140
2970E548897r1137k14737N8449Q14k50480m172L0803n0344J00138K2462k20596
2959D930097K72291j50268j20192O2938k63657n9457j17065J34992p6335k19333
2949D394011k4874J46825l4075r7348J19343j48027k32176j9746n666j9488O4
2938D078843j30264n5574p7459J66576J68257k79823l745K7578r0930O2092R3445
2927C958996j87233q6827p7164K31511Q3964m7950J14385k89605j62284n835N6648
$$ plain form
3002 9228880 8774906 8433878 8365651 8374604 8361345 8383651 8137718 7863879 7778283 7613852 7537050
2991 7537050 7439662 7349563 7132269 7064760 7020414 6799860 6829911 6757497 6403775 6246793 6312566
2980 6312566 6328077 6455467 6338367 6047954 5878633 5836409 5842830 5933463 5814037 5548897
2970 5548897 5457760 5243023 5301472 5302286 5051806 5047634 5078437 5028093 5128231 5150693 4930097
2959 4930097 5202388 5052120 4931928 4994866 4731209 4671752 4554687 4689679 4613344 4394011
2949 4394011 4369137 4515962 4481887 4384539 4503882 4355855 4123679 4103933 4098267 4078779 4078843
2938 4078843 3948579 3893005 3815546 3982122 4150379 3870556 3866811 3894389 3803459 3865551 3958996
2927 3958996 3771763 3684936 3607772 3839283 3923247 3875297 3989682 3700077 3537793 3531958 3588606
2916C588606P1981J43006m3453j44123R0539j02485k21730j14267J20161P7760
2906C465995k6137k70699L0075K06782j50071m2703R6882k31030q033R5357l7439
2895C128979m172P5215P4476j78181K8961j02363q0992J50986l4216j53694N1314
2884B956313m1741p5741K661J33529J20502J01766K3368k42456j09077J41401
2874C010525p0768L0344J7829O0583p7987K4693P012j22062M7140J13504j24729
2863B916084L685l083k2302k584j11939K9309j3255O3083j52019j22232J22721
2852B707468K3442m8180J7922J04748n5238O8618j06341j03647J59683p862j02436
2841B658177J69794J8118l18806p9653J07423J43788r8194n0541J21540k10290
$$ plain form
2916 3588606 3660587 3803593 3760140 3616017 3706556 3604071 3382341 3268074 3388235 3465995
2906 3465995 3439858 3169159 3199234 3406016 3255945 3213242 3310124 3079094 3071061 3166418 3128979
2895 3128979 3124807 3200022 3274498 3096317 3125278 3022915 2941923 3092909 3058693 2904999 2956313
2884 2956313 2914572 2838831 2841492 2975021 3095523 3197289 3220657 2978201 2869124 3010525
2874 3010525 2939757 2970101 2987930 3048513 2970526 2995219 3002231 2880169 2927309 3040813 2916084
2863 2916084 2919769 2916686 2894384 2891800 2779861 2809170 2795915 2858998 2706979 2584747 2707468
2852 2707468 2730910 2682730 2700652 2805400 2750162 2818780 2712439 2608792 2768475 2760613 2658177
2841 2658177 2827971 2846089 2527283 2447630 2555053 2698841 2600647 2550106 2671646 2461356
2831B461356k96380L2762J66208N4081j37308l0456K06884j06423P0064N0223
2821B471011j35016j04655j7746J37672j61034n9315j01096m7605J11185j73012
2811A920389l383K57986j66050o3189j4705r5321K02251o3359o4332j26951j71904
2800A611432O4238O7425Q0309o5254J63169j37693r6461k8055P3015k7293O4566
2789A769398k49378m6132N6416Q1847Q6616n8799L4079j12674k17701N7326J79976
2778A580974J10018l4359j67058J41042R1788j04570r2363L1368J38258M4882
2768A739980j55068M134l1732j38645r8921k3062R7860J45872n9264k2169N4944
2757A513929k03796l1166J29900J42047N0077l06304n6862k901J3655J13197r9914
$$ plain form
2831 2461356 2164976 2197738 2363946 2418027 2280719 2250263 2457147 2350724 2420788 2471011
2821 2471011 2335995 2231340 2213594 2351266 2190232 2130917 2029821 1982216 2093401 1920389
2811 1920389 1917006 2174992 2008942 1945753 1931048 1835727 2037978 1974619 1910287 1783336 1611432
2800 1611432 1675670 1743095 1823404 1758150 1921319 1783626 1687165 1659110 1732125 1704832 1769398
2789 1769398 1520020 1473888 1530304 1612151 1698767 1639968 1674047 1561373 1343672 1400998 1580974
2778 1580974 1690992 1656633 1489575 1630617 1722405 1617835 1525472 1556840 1695098 1739980
2768 1739980 1584912 1589046 1557314 1418669 1319748 1296686 1394546 1540418 1481154 1458985 1513929
2757 1513929 1310133 1278967 1408867 1550914 1600991 1294687 1237825 1234924 1248579 1361776 1261862
2746A261862M8389k8596K7475P2185M2418k71803J20762K26981l62282K76211
2736A413602l1372o9877j29721k1665n011J62465o0320j29816J03215J48445j59387
2725A220558o0074J47483m5784j00102Q3499n5050k11166J48634P853O1120k69637
2714I27334N9303J77406j51931J60979K5466j12012l0472j2710o9680M5352n36
2703A018499O4314j20009q8349j6454j01823K6971J54594q5776j45863O9993K1615
2692G97712J70322n4278l3117K2633k63827O5472J97834l5499j67361q2051P3427
2681F91267J90375K0586l38006J54561k1252J06639p3585M10P3409n4396M5711
2670G95719k6625J07235k34780R9931l8667J1227K8874l2597q0806K03366j57152
$$ plain form
2746 1261862 1310251 1281655 1309130 1381315 1423733 1151930 1272692 1499673 1137391 1413602
2736 1413602 1382230 1312353 1182632 1160967 1155956 1318421 1258101 1128285 1231500 1379945 1220558
2725 1220558 1160484 1307967 1262183 1162081 1245580 1190530 979364 1127998 1135851 1196971 927334
2714 927334 986637 1164043 1012112 1173091 1198557 1086545 1056073 1043363 973683 1019035 1018499
2703 1018499 1082813 962804 874455 858001 756178 783149 937743 851967 706104 776097 797712
2692 797712 968034 913756 880639 903272 639445 704917 902751 867252 699891 617840 691267
2681 691267 881642 902228 564222 718783 697531 804170 730585 730995 804404 750008 795719
2670 795719 769094 876329 641549 741480 702813 714040 742914 710317 629511 832877 675725
2659F75725l466K47518k90250O4920j40147j44775j73370K93333l2727l5581P3425
2648E34605K5817o2783m0382N8830p3370n6566J08835K7803J83902j01117k59690
2637C45884n354K19853J2590l1616J02069N185L0236r4806K76903r2275m2466
2626G26203J1738P9002O5365o715o3489N1653j05011j90042Q5345o8228q8248
2615D97573p9511J81884Q0130p1907j12777r436j23298r4529J37314L8577j62378
2604B81642M3189J06159P8820k42435k6997J40429J45433J83470k23006J42476
2594F29180j68293L8011r0325P7638J8175j70410J5059J2102m0923J83542J34451
2583F38207j04395K9987L7939J5171l3449L4215k02917L0229j42742R3646j17855
$$ plain form
2659 675725 672259 919777 629527 694447 554300 409525 236155 529488 496761 461180 534605
2648 534605 560422 497639 457257 516087 442717 386151 494986 522789 706691 605574 345884
2637 345884 340530 560383 572973 541357 643426 648611 678847 584041 860944 768669 726203
2626 726203 737941 816943 882308 875593 812104 863757 758746 568704 654049 585821 497573
2615 497573 418062 599946 680076 608169 495392 485956 362658 268129 405443 444020 281642
2604 281642 324831 430990 509810 267375 240378 380807 526240 709710 486704 629180
2594 629180 460887 498898 408573 486211 504386 333976 349035 361137 320214 503756 638207
2583 638207 533812 563799 601738 616909 583460 617675 414758 444987 302245 395891 278036
2572B78036k0531K2848N5883j0501n8633m742R8899P8971k03445l5570J05808
2561C07023J78178P3389J5467j59317k0631n3323j34905j11872J48110l0776K04077
2550D15420k02039k749M5022K3222o2336l8561J62107n5939q0260L35049l927
2539E35009j35818M5967j1434j6699L906M9423j86513J05101N7704j34945L5821
2528C47522j16247O3728R3083J33066o2732K3145j52366k50472J73105J80847
2518D32679J9955m7001J44902n8965j3448j2090J55771l16475j51363n5526J25817
2507B24256J64999k0209j32165K20730J34426r1038K8592m0388q4530R6026P2549
2496E73248j2647j3292l7767p8104O0043j69068j09212J48042K00466O9440K731
$$ plain form
2572 278036 257505 280353 336236 325735 267102 262360 361259 440230 236785 201215 307023
2561 307023 485201 558590 574057 414740 394109 340786 205881 94009 242119 211343 415420
2550 415420 213381 210632 255654 278876 216540 177979 340086 284147 203887 538936 535009
2539 535009 399191 445158 433724 417025 420931 470354 283841 388942 446646 311701 347522
2528 347522 231275 295003 388086 521152 458420 481565 329199 78727 251832 432679
2518 432679 452634 405633 550535 491570 478122 466032 621803 305328 153965 98439 224256
2507 224256 389255 369046 236881 457611 592037 500999 529591 489203 404673 500699 573248
2496 573248 560601 547309 509542 431438 491481 322413 213201 361243 561709 631149 633880
2485F33880Q6518j28579j10731j24140K4526L8084J20774J39957m4261l9197q3637
2474E13194p4631l2173J91491L8939n5996k9345K87329K0279k23566r7798j06865
2463D30858K7268J18900P2885J13085J36064l11687P3905J68418K42995n5647
2453A017044l73720J11700J09870m2731J34780N0694j08243L4778l1340J03738
2443A006570Q869o3193J2470N0105J70413Q3646O6610R1089k1089J39910P4920
2432A620320k14365R9351j2880j69070K2639L19546P0665j30337j46430K61213
2422A720652L730R7107O6991J0923J26180j61719n5509K38308J53260J82018J17688
2411B499629j31945K42171J21244p5740J48932J4806K3783J15176Q454J23906
$$ plain form
2485 633880 720398 591819 481088 356948 381474 419558 540332 680289 636028 596831 513194
2474 513194 438563 406390 597881 636820 580824 551479 838808 859087 635521 537723 430858
2463 430858 458126 577026 649911 762996 899060 587373 661278 829696 1072691 1017044
2453 1017044 643324 755024 864894 822163 956943 1007637 899394 934172 902832 1006570
2443 1006570 1015439 952246 964716 1014821 1185234 1268880 1335490 1426579 1405490 1545400 1620320
2432 1620320 1405955 1505306 1492426 1323356 1345995 1665541 1736206 1605869 1459439 1720652
2422 1720652 1724382 1821489 1888480 1899403 2025583 1863864 1808355 2046663 2199923 2381941 2499629
2411 2499629 2367684 2609855 2731099 2655359 2804291 2819097 2842880 2958056 2966510 3090416
2401C090416M0462J67431J31962r4748L8478K45013L04075J17886K04480J73659
2391D419114K25883L18703J75823K42294K72237M12609L59910K30731L95613M89739
2381G542656M61626P15722O62020M24759N32633J037051R78083P25880R66896
2372A4047326R04207J109343J630564K116121K413733L205203L873793M921951
2364C4222241P013057Q545602J0093923R966684P849542J314050o974796j0651287
2356F1379016r931686q298772o911180n179143l895196l125253k442469j957946
2348A9637371j723250j357995j095504r84475q03733r72084j179441q96179o61919
2339I962791p32562p72359l20041m21566n88881k63652l02521l51732k85521k21426
$$ plain form
2401 3090416 3130878 3298309 3430271 3335523 3374001 3619014 3923089 4040975 4245455 4419114
2391 4419114 4644997 4963700 5139523 5381817 5654054 6066663 6426573 6657304 7052917 7542656
2381 7542656 8004282 8720004 9382024 9806783 10339416 11376467 12354550 13080430 14047326
2372 14047326 14951533 16060876 17691440 19807561 22221294 25426497 29300290 34222241
2364 34222241 41235298 49780900 59874823 69841507 77691049 79005099 72030303 61379016
2356 61379016 51447330 43148558 36237378 31058235 27163039 24037786 21595317 19637371
2348 19637371 17914121 16556126 15460622 14476147 13672414 12700330 11520889 10624710 9962791
2339 9962791 9230229 8457870 8137829 7716263 7127382 6863730 6561209 6209477 5923956 5702530
2329E702530l59257j72554j57651j58632k65554j10032j11209l79551j1658k77423
2319C699009j98990j59736J8036k37193p1892N2926j11053m076O936k43642k95197
2308B455128O5024n7631j46707o8165j35941J4251j21102n8603R2925j04048m8700
2297A886431L0799P3772K1228j48624l14203J24644l4818l41155K2041K89624
2287A609739k6032j29075j55351o8126L3300J08703N7875k16077l1752l3680j39503
2276A010021k34899j179K13793J72629j02116k2209J10657m3257n5062k62595
2266G85783l2518J45896q974j33376r9714O0311j27592Q8486J6092j39235L4877
2255E90036J37736l0652O505K9357n162k13211k8580P1652n473o175j8324K0163
$$ plain form
2329 5702530 5343273 5170719 5013068 4854436 4588882 4478850 4367641 3988090 3976432 3699009
2319 3699009 3500019 3340283 3358319 3121126 3049234 3102160 2991107 2987031 2993967 2750325 2455128
2308 2455128 2520152 2462521 2315814 2247649 2111708 2125959 2004857 1946254 2039179 1935131 1886431
2297 1886431 1917230 1991002 2012230 1863606 1549403 1674047 1639229 1298074 1320115 1609739
2287 1609739 1583707 1454632 1299281 1231155 1264455 1373158 1431033 1214956 1183204 1149524 1010021
2276 1010021 775122 773943 987736 1160365 1058249 1036040 1146697 1103440 1048378 785783
2266 785783 753265 899161 890187 756811 657097 717408 589816 678302 694394 555159 590036
2255 590036 727772 697120 703625 732982 727820 514609 486029 557681 552208 546033 527709 547872
2243E47872N6353k14503j39887J29026o7406M6588j23040J98642k3878J76983
2233E86750K916Q0775k18780q6953j04267Q3389K15917J81131q1967l38948q4080
2222B35883J6789J41885r3547K3294J89175r5255j28095P1859M3457J8203J94144
2211F17792l2376j75328K1391j26613j16697K00989J06743l6452r1245q9945J62383
2200D40642Q7196J00291k56047j0854p6686K25601j49155j38719J50236J0039
2190C82544j93873n8989J62767J3213k95933J02940J22613j1037j00681n1412
2180G2152L0508N0709L604j19752P6419q8671J14524J02274K063r7037P5924J35851
2168C58568k88076p8276P8700l0229P6120K4703K09488q7118j25273k07964J638
$$ plain form
2243 547872 604225 389722 249835 378861 311455 358043 235003 433645 409767 586750
2233 586750 589666 670441 451661 364708 260441 343830 559747 740878 658911 319963 235883
2222 235883 252672 394557 301010 324304 513479 418224 290129 361988 405445 423648 617792
2211 617792 585416 410088 431479 304866 188169 389158 495901 459449 368204 278259 440642
2200 440642 527838 628129 372082 361228 284542 510143 360988 222269 372505 382544
2190 382544 188671 129682 292449 305662 9729 112669 235282 224245 123564 72152
2180 72152 102660 153369 156973 37221 113640 24969 139493 241767 243830 146793 222717 358568
2168 358568 70492 -7784 70916 40687 116807 141510 350998 263880 138607 -69357 -67719
2157f7719J39895K0301Q8550n1424K7163o361q4223J5336l356l7026J76843L8488
2145B56467k34699l1603P3837J28536j07447P0457j25663q8054J94426k18392
2135h2135O7797l6246K6006J36234o4057J52792j38760n1401J47619n0631j68701
2124f1483j86595L553J45610O6171J01488K4341n5397K55922J63792k3416r2906
2113C41080j01641n7027m9740k2667J29012J34917n5477p1609J58502j36136r9206
2102A70008K2387J00535k0048j28478N3323k248n6419J03785j7975l0505P5222
2091B69587K6937M8962j15347j1885P7483j52035l9548J86716N1658j57149k4551
2080A60828m141j62783K19389p2342j32366K268j19710J86871M5562J7518M890
$$ plain form
2157 -67719 72176 92477 181027 129603 156766 150405 66182 81518 78162 41136 217979 256467
2145 256467 21768 -9835 64002 192538 85091 155548 29885 -58169 136257 -82135
2135 -82135 -14338 -50584 -24578 111656 47599 200391 61631 10230 157849 107218 -61483
2124 -61483 -248078 -244525 -98915 -32744 68744 93085 37688 293610 457402 433986 341080
2113 341080 239439 182412 132672 110005 239017 373934 318457 246848 405350 269214 170008
2102 170008 192395 292930 272882 144404 197727 195479 139060 242845 224870 194365 269587
2091 269587 296524 345486 230139 218254 295737 143702 104154 290870 342528 185379 160828
2080 160828 156687 -6096 213293 140951 8585 10853 -108857 78014 123576 141094 145984
2069A45984k1619R8875j5256K7310o6758J9723j60056K02528O2285l10473K623
2058a4834r371J26755J18151j52663L6729Q9806j885j22182j37269j1910k8090
2047a06763O7833K27283k9644Q8141m254L3470P504p5591Q8076k76968j56619
2036a37532j7028J34363l6513J5524J75665l2683j8069L5258k1853k2209j45676
2025g0753K6569J95594J36505r9257k09177J5792n047l1411K55734l3371j09232
2014G1946Q0682j85119j55287K03743L2230J91548J42235k65902j60201J26130
2004H2005Q7836k22773N0724n9178r5326l836O7702J73868m9136K4192L3447K30801
1992C20326n8808j10512J00893q2255K2408q2244O1602l0133m9688R239m892k20429
$$ plain form
2069 145984 124365 223240 207984 235294 168536 188259 28203 230731 293016 -17457 -14834
2058 -14834 -24205 102550 220701 68038 104767 194573 192688 70506 -66763 -78673 -106763
2047 -106763 -38930 188353 158709 246850 242596 276066 283570 207979 296055 19087 -137532
2036 -137532 -154560 -20197 -56710 -41186 134479 101796 83727 118985 97132 74923 -70753
2025 -70753 -44184 151410 287915 188658 -20519 -4727 -9774 -41185 214549 181178 71946
2014 71946 152628 -32491 -187778 15965 48195 239743 381978 116076 -44125 82005
2004 82005 169841 -52932 -2208 -61386 -156712 -160548 -92846 81022 31886 56078 89525 320326
1992 320326 261518 151006 251899 169644 192052 109808 171410 141277 91589 100828 95936 -124493
1980a24493k8128N7627J08009j50385J41220R4920j2240J23466p8626q5570j4754
1969C1046P9738k81409p5406J16651R1212L415K55685O3298r9161j02475j589
1958H1005n0721n1690K30409j60661J05789O1521r0927k8781l12926J05392P7249
1947c4341o2076J62472J59550j15949J3875j21343P3144P2212P9927k1701Q3260
1936B89030m1653k81602l7463j34396J43169M8190k25530J63316K38279j10294
1926E1046R1336M2829J7978k46516l0728K9773N9784N4788K02187j68732m1379
1915F2366K19731k31537j3287k11759k7800q1198R0429L28390R3449k9247L0166
1904B29703j60522L1976K8019j69980Q429j06176n6922R0220j57973o131J76524
$$ plain form
1980 -124493 -152621 -94994 13015 -137370 3850 98770 86530 209996 131370 45800 31046
1969 31046 110784 -170625 -246031 -129380 -38168 -34753 220932 284230 185069 82594 81005
1958 81005 30284 -21406 209003 48342 154131 215652 124725 95944 -216982 -111590 -34341
1947 -34341 -96417 66055 225605 109656 123531 2188 75332 147544 227471 205770 289030
1936 289030 247377 -34225 -71688 -206084 -62915 -14725 -240255 -76939 161340 51046
1926 51046 142382 185211 203189 -43327 -74055 -44282 15502 70290 272477 103745 62366
1915 62366 282097 50560 37273 -174486 -202286 -283484 -193055 135335 228784 199537 229703
1904 229703 69181 101157 129176 -40804 -32375 -138551 -195473 -105253 -263226 -269357 -92833
1893i2833K2340o8671j9695O4596J2292J16403m1553K59321J8304k50295k2713
1882b504q4330m9481P1917J22386J7611j3032j58475Q3605J61901j19808o1034
1871c1244j4205m7471j54403J05311O8359P1475R1967P0190j2508j40846l1980
1860b5355J43843K0509k3740J41729j65583k01250J58230P9075j49415O2834j51758
1849a10881J1099J15908N1480j48748j86490K14985O0482j05721Q7933J11701
1839A01748K13986k27614j45354J01153o672q4956J18274j09726l3498O9478k31421
1828b34602K01889L9738p5213J21311n5396j23450K4418K45313l0499R1538j36182
1817F8865j19697J425L8687J42075j57968r9924j01261J33256P48l1381R7374
$$ plain form
1893 -92833 -70493 -139164 -158859 -94263 -81971 34432 -7121 252200 270504 20209 -2504
1882 -2504 -86834 -136315 -64398 57988 75599 62567 -95908 -12303 149598 29790 -31244
1871 -31244 -45449 -92920 -247323 -142012 -73653 -2178 89789 159979 147471 6625 -25355
1860 -25355 118488 138997 115257 256986 91403 -109847 48383 127458 -21957 40877 -110881
1849 -110881 -99782 16126 67606 -81142 -267632 -52647 7835 -97886 -9953 101748
1839 101748 315734 88120 -57234 43919 37247 -47709 70565 -39161 -72659 -3181 -234602
1828 -234602 -32713 7025 -68188 53123 -2273 -125723 -101305 144008 113509 205047 68865
1817 68865 -50832 -49407 -10720 131355 -26613 -126537 -227798 -94542 -93794 -125175 -27801
1806b7801J47844m1768j59803m7646N4973J02329J1374k8976Q4618j76469j1520
1795i2845J36940o655j6984l3542j88551O1951L6174Q8514L8408J00445j71713
1784d7858k09602J51862K11073j60669j01229N9192L5525q0936r2589J74738J11826
1773E1333q853j69074Q4629J08628p7288P8964j72715k5756J20250l7719j72873
1762b20474P4887R2496l6675L5799J49o2452J03519K48287L1968j36386j287l6006
1750I3825J38646q532k93265n7009J88930Q6818J5288K8012j04142r7590O3105
1739E4086K60193k23126M1191l3362j8278M9838l8678J0631M303m4385Q481K0676
1727I1570j2777M2729j40434J16611J88999p5106M7314j24238J9075Q152o5016
$$ plain form
1806 -27801 120043 78275 -81528 -129174 -74201 28128 39502 10526 95144 -81325 -92845
1795 -92845 44095 37440 20456 -13086 -201637 -139686 -103512 -14998 23410 123855 -47858
1784 -47858 -257460 -105598 105475 -55194 -156423 -97231 -61706 -142642 -235231 -60493 51333
1773 51333 42480 -126594 -41965 66663 -10625 68339 -104376 -130132 -9882 -47601 -220474
1762 -220474 -145587 -53091 -89766 -53967 -53818 -116270 -12751 235536 267504 131118 129831 93825
1750 93825 232471 223939 -69326 -126335 62595 149413 164701 192713 88571 -9019 54086
1739 54086 314279 91153 132344 98982 80704 130542 91864 102495 106798 62413 70894 91570
1727 91570 78793 121522 -18912 97699 286698 211592 258906 134668 153743 161895 96879
1716I6879j79809J53306N6350R1041j82082q1032J48875n8190l139j69051Q8378
1705c8474J10277J76470O5282j30379K2016l3709p9524k873R9468n1901j34429
1694B224O7541j48419K09791L7454k51128J42762j43156j47046J30822n6823j06192
1683b62170L1488Q5308P9386M9673L1604J6158j22449N2368P7257J36722P0404
1672B45749j50047J42291j45135m3283q0246O9163J10494J94136j82764L9289
1662A99647J42335l13753J44577j20160Q2565L2091j50668K0558L9480k6548r2897
1651d2773j10638O3508j31317K5746K77361j22183Q7886R2945l6703J11278J12554
1640C27664j23581K09097j83170k20658R1744k4137J24594r2893j65071p8008
$$ plain form
1716 96879 -82930 70376 126726 217767 35685 -45347 103528 45338 42199 -126852 -38474
1705 -38474 71803 248273 313555 183176 205192 171483 91959 89086 188554 136653 2224
1694 2224 69765 -78654 131137 168591 -82537 60225 -82931 -229977 -99155 -155978 -262170
1683 -262170 -230682 -145374 -65988 -16315 15289 31447 -91002 -38634 38623 175345 245749
1672 245749 95702 237993 92858 49575 -30671 38492 148986 343122 160358 199647
1662 199647 341982 28229 172806 52646 135211 167302 16634 37192 76672 50124 -42773
1651 -42773 -153411 -89903 -221220 -195474 81887 -40296 47590 140535 103832 215110 327664
1640 327664 204083 413180 230010 9352 101096 76959 201553 108660 -56411 -134419
1630a34419r3600K05059J12062N8622J1652k59091K17476j94104o857K27788n7159
1619H7429j2233N3716J5723J72075j29802o1583J34301J05942j41513k55694J18020
1608H6381j64718L2198J38841r6955P0183M3639k23950J917K41697k299k11039
1597h4105j1688j7103q2635k9486J20827Q3311N6665l7630N8783J48246j35931
1586F9254r1009k3647j16858j35975L07774m8055J9943j15160k2513J73044M9186
1575F5984q5967K5487K5683M4954K0598j65391J05719k2478j03484K26558r2531
1564D5132r9951j04343L6069J50436O8372k64698J19295L4545k6970J59655J9087
1553A36629o29k50052j85040R9930R6741O70J11069j04786j76056K41065P8787
$$ plain form
1630 -134419 -228019 -22960 89102 147724 159376 -99715 117761 -76343 -83200 144588 87429
1619 87429 75196 128912 144635 316710 186908 125325 259626 365568 224055 -31639 86381
1608 86381 -78337 -46139 92702 -4253 65930 109569 -114381 -112464 129233 126934 -84105
1597 -84105 -95793 -112896 -195531 -225017 -104190 -20879 35786 -1844 56939 205185 69254
1586 69254 -21755 -45402 -162260 -298235 9539 -38516 -18573 -133733 -156246 16798 65984
1575 65984 -19983 5504 31187 76141 96739 -68652 37067 14589 -88895 137663 45132
1564 45132 -54819 -159162 -123093 27343 95715 -168983 -49688 -15143 -42113 117542 136629
1553 136629 136000 -114052 -299092 -199162 -102421 -101751 9318 -95468 -271524 -30459 48328
1542D8328j9679j50016l2129m3030K716J32468j17195p151J22255J10504k71957
1531b24886O3485R2928J68499n979j66398P9813r78j9123R5414k73768J50573
1520d0420q2657q0550J18172n7508K8134m845j12305J77137K9814J02227l8899
1509C8300j67507R3083r4211k20803K0575M9124J63805P4343R9434j59507J704
1498a01660J0629q2581J39957P2223L8844L24637j787m01965j13586L8035J6286
1487f0968J7373J49364r7440n0250o0871L5203l09908R8076K11988o9204J63398
1476B6761k33468J29452j75789L7806Q2646J47457j169j04657J65787p4636O9003
1465F9193J59906j59862Q7686O4820j90236J58076j17532j01287J01369j63202
$$ plain form
1542 48328 28649 -121367 -153496 -196526 -193810 -61342 -178537 -185688 -63433 47071 -224886
1531 -224886 -161401 -68473 100026 94047 -72351 7462 6484 -12639 82775 -190993 -40420
1520 -40420 -123077 -203627 -85455 -142963 -114829 -119674 -231979 -54842 -25028 77199 38300
1509 38300 -129207 -36124 -130335 -351138 -330563 -281439 -117634 -43291 56143 -103364 -101660
1498 -101660 -91031 -173612 -33655 38568 77412 402049 400262 -1703 -115289 -77254 -60968
1487 -60968 -43595 105769 8329 -41921 -102792 -67589 -377497 -279421 -67433 -136637 26761
1476 26761 -206707 -77255 -253044 -215238 -132592 14865 13696 -90961 74826 190 69193
1465 69193 229099 69237 156923 221743 31507 189583 72051 -29236 72133 -91069
1455i1069L0016K81531j80349j68027Q9083J82238O6022p5045l90957k9924J82349
1444a04132J39315R6279L7876m2485j0052k90434n9432Q2349l6613J81302J83504
1433A77477O8556k57870R0854o4851j59071J29751j06123j4496j04513J77887
1423f2399K63694q7016r8707M7014J1059q6654O4779j16057p0526J06975p810
1412c5648j17477K6119K7101j28004l1474O4222J20522p1675J41770n2577J38058
1401H0937p6971N5508p9932K3591j7182J18977J03603n3555J12366j61467K97339
1390D03214k65430l4933K24515k19717J1416j12277p1261n171L1290J33539j34058
1379c8873M6362K2702j34R4766M8870Q8513k63418J56J15661J40078j88131m8126
$$ plain form
1455 -91069 -61053 220478 40129 -127898 -38815 143423 209445 134400 -256557 -286481 -104132
1444 -104132 35183 131462 169338 126853 116801 -173633 -233065 -150716 -187329 -6027 177477
1433 177477 246033 -11837 79017 14166 -144905 -15154 -121277 -135773 -240286 -62399
1423 -62399 201295 114279 15572 62586 73645 -13009 51770 -64287 -134813 -27838 -35648
1412 -35648 -153125 -127006 -99905 -227909 -259383 -195161 -74639 -146314 -4544 -57121 80937
1401 80937 3966 59474 -20458 3133 -14049 104928 208531 154976 267342 105875 403214
1390 403214 137784 102851 327366 107649 119065 6788 -64473 -69644 -38354 95185 -38873
1379 -38873 7489 30191 30057 124823 173693 262206 -1212 -1056 114605 254683 66552 18426
1367A8426J03099R3213K00965l09256j2466l0716L6458K88003j90357n3186K7768
1356A71951j96919J38882m1595Q8185q7922j62543k53347K07625R8690N326J32192
1345A00525j19609Q5569k38517O7140J25701N6914O5166j3032l4254n45J10593
1334B05651J94540k20516k65436L8491Q9064L5067n7445j31534j55062j00876
1324c68056J11090K25785R9943Q8430j38322r0722k1416n0396L9583L9404K1264
1313d3413q1357m8684n4380R5761K7461o0324J68688J68431M4012J17029r0439
1302B42785j31812Q7838j36480k2822j08719J26030Q5159n2864m7950o9207J90186
1291A62144m2281O1565k6392j74149q4895k7872n0939L519P9729l6055J86922
$$ plain form
1367 18426 121525 214738 415703 106447 93981 63265 99723 387726 197369 144183 171951
1356 171951 -24968 113914 72319 160504 72582 -89961 -343308 -135683 -36993 -31667 100525
1345 100525 -19084 66485 -172032 -104892 20809 77723 142889 129857 95603 95058 205651
1334 205651 400191 179675 -85761 -47270 41794 76861 19416 -112118 -267180 -368056
1324 -368056 -256966 -31181 68762 157192 18870 -71852 -93268 -143664 -104081 -64677 -43413
1313 -43413 -124770 -173454 -227834 -132073 -104612 -164936 3752 172183 216195 333224 242785
1302 242785 110973 198811 62331 39509 -69210 56820 141979 89115 41165 -28042 162144
1291 162144 119863 181428 155036 -19113 -104008 -131880 -182819 -179300 -99571 -135626 51296
1280E1296j01948J37745L2831k39437J37509K1272j34393K0360r4019k6312M9389
1269a45707l5879j16854J06693l0074Q6158K18995J7169j27387j61623p1796l1711
1258b92016K01602J49577n9098k2359J4016J28182q9626r2196j9190j788j18196
1247b01092L6337k3496N1271j809j3137R3075k5631J71309R4642j48863j70379
1236a37773j07885P5577m6962J1560J34627R4144n8897o6929j19467K2835J4831
1225a84339R1209N6485o545j6999p2976N8380K17253j2009N4062j6556j51996
1214A5969J6279j30753O7309L2166K959j50859K585J2744J05494l5655M3863j69312
1202a87211j7798r4189L39188R705k23595j40877L98180p07o5271Q2235r1139
$$ plain form
1280 51296 -50652 87093 119924 -119513 17996 39268 -95125 -74765 -168784 -195096 -145707
1269 -145707 -181586 -298440 -191747 -221821 -135663 83332 100501 -26886 -188509 -260305 -292016
1258 -292016 -90414 59163 65 -22294 -8278 119904 30278 -61918 -81108 -82896 -201092
1247 -201092 -164755 -188251 -136980 -138789 -151926 -58851 -84482 86827 181469 32606 -137773
1236 -137773 -245658 -170081 -217043 -205483 -70856 23288 -35609 -102538 -222005 -199170 -184339
1225 -184339 -93130 -36645 -43190 -60189 -133165 -74785 142468 130459 184521 167965 15969
1214 15969 32248 -98505 -31196 970 3929 -146930 -144345 -131601 -26107 -61762 -17899 -187211
1202 -187211 -205009 -299198 39990 49695 -173900 -314777 83403 82696 17425 99660 8521
1191H521M0273n6212j09192J25587k10738j04018K50375K520j20866M8205J30064
1180D519o4617j75808K41544J88475j60858P7753J1568m6357M0372p1897O4587
1169A09281O3395k93300L2114Q1049J45596j22527P9671j88862k4132K02890j14769
1158b9594m0870M1611J41902l9099N2309R0844K7344p6366k45641k1232N7581
1147d1211R8609l1283j3122K5483j35795O901J82764J6907P9524O9953K377j05230
1135A55877j53698R3300n2688M6887k2038q5715J2742q0190J55970Q319p4092
1124D674M1200O5878M2171j23821q0210P1178J9739J8639l5687P309N6544k2182
$$ plain form
1191 8521 48794 -7418 -116610 8977 -201761 -305779 -55404 -52884 -173750 -125545 4519
1180 4519 -60098 -235906 5638 194113 33255 111008 122576 76219 116591 44694 109281
1169 109281 172676 -120624 -88510 -7461 138135 15608 95279 -93583 -117715 85175 -29594
1158 -29594 -70464 -28853 113049 73950 126259 217103 244447 168081 -77560 -98792 -41211
1147 -41211 57398 26115 12993 38476 -97319 -90418 92346 109253 188777 258730 261107 155877
1135 155877 2179 95479 42791 89678 67640 -18075 -5333 -85523 70447 78766 4674
1124 4674 45874 111752 153923 30102 -50108 21070 40809 59448 23761 31070 87614 65432
$$ [...]
##END NTUPLES=NMR SPECTRUM
##END=
