##TITLE=1H_EC-3303
 CDCl3
 8 sc, 
 1.11.2023
##JCAMPDX= 6.0         $$ Bruker NMR JCAMP-DX V2.0
##DATA TYPE= NMR SPECTRUM
##DATA CLASS= NTUPLES
##ORIGIN= UXNMR, Bruker Analytische Messtechnik GmbH
##OWNER= root
$$ XWIN-NMR		Version 3.5
$$ Wed Nov  1 14:42:48 2023 Russian Standard Time (UT+4h)  she@DPX200
##.OBSERVE FREQUENCY= 200.13135
##.OBSERVE NUCLEUS= ^1H
##.ACQUISITION MODE= SIMULTANEOUS
##.ACQUISITION SCHEME= undefined
##.AVERAGES= 8
##.DIGITISER RES= 18
##SPECTROMETER/DATA SYSTEM= spect
##.PULSE SEQUENCE= zg30
##.SOLVENT NAME= DMSO
##.SHIFT REFERENCE= (INTERNAL, DMSO, 0, 15.7766)
##AUDIT TRAIL= $$ (NUMBER, WHEN, WHO, WHERE, WHAT)
$$ ##TITLE= Audit trail, XWIN-NMR		Version 3.5
$$ ##JCAMPDX= 5.01
$$ ##ORIGIN= Bruker BioSpin GmbH
$$ ##OWNER= she
$$ F:/spectra/data/she/nmr/H-F/1/pdata/1/auditp.txt
$$ ##AUDIT TRAIL=  $$ (NUMBER, WHEN, WHO, WHERE, WHAT)
(   1,<2023-11-01 14:40:46.45 +0400>,<she>,<DPX200>,
      <created by zg, POWCHK disabled, PULCHK disabled
       configuration hash MD5:
       00 E9 B6 7A A2 85 ED C7 34 08 36 98 17 FE 4E 26
       data hash MD5: 16K
       14 13 E4 2F C7 A0 5B DC 7E B3 F8 4C 7B DA B9 1B>)
(   2,<2023-11-01 14:40:48.95 +0400>,<she>,<DPX200>,
      <Start of raw data processing
       efp BC_mod = 2 LB = 0.24 FT_mod = 6 PKNL = 1 PHC0 = -23871.6 PHC1 = 5.052709 SI = 16K 
       data hash MD5: 16K
       8C DE C4 8A 53 0E 89 A4 2E 87 81 BF C2 18 7A 38>)
(   3,<2023-11-01 14:41:51.81 +0400>,<she>,<DPX200>,
      <pk PHC0 = -0.1688738 PHC1 = 1.8 
       data hash MD5: 16K
       C1 3E 03 B1 B1 40 DD 03 D6 71 C2 1A 0C 8E EF A8>)
(   4,<2023-11-01 14:41:55.20 +0400>,<she>,<DPX200>,
      <abs ABSG = 5 
       data hash MD5: 16K
       CD EB E1 0A 81 60 F0 47 8B 4C F1 93 4C B3 0F 7C>)
$$ ##END=
$$ 
$$ hash MD5
$$ F7 2B 1A 59 03 C3 B1 DA FE 87 2D 01 11 9A 37 FD
##$RELAX= 
##$RELAX= 
##$RELAX= 
##$RELAX= 
##$RELAX= 
##$RELAX= 
$$ Bruker specific parameters
$$ --------------------------
##$DU= <F:/spectra>
##$EXPNO= 1
##$NAME= <H-F>
##$PROCNO= 1
##$TYPE= <nmr>
##$USER= <she>
##$AMP= (0..31)
100 100 100 100 100 100 100 100 100 100 100 100 100 100 100 100 100 100 
100 100 100 100 100 100 100 100 100 100 100 100 100 100 
##$AQSEQ= 0
##$AQ_mod= 1
##$AUNM= <au_zg>
##$AUTOPOS= <>
##$BF1= 200.13
##$BF2= 200.13
##$BF3= 200.13
##$BF4= 200.13
##$BF5= 200.13
##$BF6= 200.13
##$BF7= 200.13
##$BF8= 200.13
##$BYTORDA= 1
##$CFDGTYP= 0
##$CFRGTYP= 5
##$CHEMSTR= <none>
##$CNST= (0..31)
1 1 145 1 1 1 1 1 1 1 1 1 1 1 1 1 1 1 1 1 1 1 1 1 1 1 1 1 1 1 1 1 
##$CPDPRG= <>
##$CPDPRG1= <>
##$CPDPRG2= <>
##$CPDPRG3= <>
##$CPDPRG4= <mlev>
##$CPDPRG5= <mlev>
##$CPDPRG6= <mlev>
##$CPDPRG7= <mlev>
##$CPDPRG8= <mlev>
##$CPDPRGB= <>
##$CPDPRGT= <>
##$D= (0..31)
0 1.2 0 0 0 0 0 0 0 0.06 0 0.03 0 0 0 0 0.0002 0 0 0 0 0 0 0 0 0 0 0 0 
0 0 0 
##$DATE= 1698835245
##$DBL= (0..7)
120 120 120 120 120 120 120 120 
##$DBP= (0..7)
150 150 150 150 150 150 150 150 
##$DBP07= 0
##$DBPNAM0= <>
##$DBPNAM1= <>
##$DBPNAM2= <>
##$DBPNAM3= <>
##$DBPNAM4= <>
##$DBPNAM5= <>
$$ [...]
##$SUBNAM3= <"">
##$SUBNAM4= <"">
##$SUBNAM5= <"">
##$SUBNAM6= <"">
##$SUBNAM7= <"">
##$SUBNAM8= <"">
##$SUBNAM9= <"">
##$SW= 18.05172834244
##$SWIBOX= (0..15)
0 0 2 0 0 0 0 0 0 0 0 0 0 0 0 0 
##$SW_h= 3612.71676300578
##$TD= 16384
##$TD0= 1
##$TE= 0
##$TE2= 300
##$TE3= 300
##$TEG= 300
##$TL= (0..7)
0 120 120 120 120 120 120 120 
##$TP= (0..7)
150 150 150 150 150 150 150 150 
##$TP07= 0
##$TPNAME0= <>
##$TPNAME1= <>
##$TPNAME2= <>
##$TPNAME3= <>
##$TPNAME4= <>
##$TPNAME5= <>
##$TPNAME6= <>
##$TPNAME7= <>
##$TPOAL= (0..7)
0.5 0.5 0.5 0.5 0.5 0.5 0.5 0.5 
##$TPOFFS= (0..7)
0 0 0 0 0 0 0 0 
##$TUNHIN= 0
##$TUNHOUT= 0
##$TUNXOUT= 0
##$USERA1= <user>
##$USERA2= <user>
##$USERA3= <user>
##$USERA4= <user>
##$USERA5= <user>
##$V9= 5
##$VALIST= <valist>
##$VCLIST= <CCCCCCCCCCCCCCC>
##$VD= 0
##$VDLIST= <DDDDDDDDDDDDDDD>
##$VPLIST= <PPPPPPPPPPPPPPP>
##$VTLIST= <TTTTTTTTTTTTTTT>
##$WBST= 1024
##$WBSW= 4
##$XGAIN= (0..3)
0 0 0 0 
##$XL= 0
##$YL= 0
##$YMAX_a= 503337
##$YMIN_a= -653545
##$ZGOPTNS= <>
##$ZL1= 120
##$ZL2= 120
##$ZL3= 120
##$ZL4= 120
##$ABSF1= 15.91546
##$ABSF2= -2.136394
##$ABSG= 5
##$ABSL= 3
##$ALPHA= 0
##$AQORDER= 0
##$ASSFAC= 0
##$ASSFACI= 0
##$ASSFACX= 0
##$ASSWID= 0
##$AUNMP= <proc_1d>
##$AZFE= 0.1
##$AZFW= 0.1
##$BCFW= 0
##$BC_mod= 2
##$BYTORDP= 0
##$COROFFS= 0
##$CY= -3
##$DATMOD= 1
##$DC= 0
##$DFILT= <>
##$DTYPP= 0
##$F1P= 0
##$F2P= 0
##$FCOR= 1
##$FTSIZE= 16384
##$FT_mod= 6
##$GAMMA= 0
##$GB= 0
##$INTBC= 1
##$INTSCL= 3.70164e-10
##$ISEN= 128
##$LB= 0.24
##$LEV0= 0
##$LPBIN= 0
##$MAXI= 10000
##$MC2= 0
##$MEAN= 0
##$ME_mod= 0
##$MI= 1.114404
##$NCOEF= 0
##$NC_proc= -4
##$NLEV= 6
##$NOISF1= 3.799351
##$NOISF2= 2.8
##$NSP= 0
##$NTH_PI= 0
##$NZP= 0
##$OFFSET= 15.77664
##$PC= 1
##$PHC0= -23871.77
##$PHC1= 6.852709
##$PH_mod= 1
##$PKNL= yes
##$PPARMOD= 0
##$PSCAL= 0
##$PSIGN= 0
##$REVERSE= no
##$SF= 200.129998978984
##$SI= 16384
##$SIGF1= 3
##$SIGF2= 2
##$SINO= 5.538805
##$SIOLD= 16384
##$SREGLST= <1H.CDCl3>
##$SSB= 0
##$STSI= 16384
##$STSR= 0
##$SW_p= 3612.71676300578
##$SYMM= 0
##$S_DEV= 0
##$TDeff= 16384
##$TDoff= 0
##$TI= <>
##$TILT= no
##$TM1= 0
##$TM2= 0
##$TOPLEV= 0
##$USERP1= <user>
##$USERP2= <user>
##$USERP3= <user>
##$USERP4= <user>
##$USERP5= <user>
##$WDW= 1
##$XDIM= 16384
##$YMAX_p= 318363478
##$YMIN_p= -81179
$$ End of Bruker specific parameters
$$ ---------------------------------
##NTUPLES= NMR SPECTRUM
##VAR_NAME=  FREQUENCY,     SPECTRUM/REAL,   SPECTRUM/IMAG
##SYMBOL=    X,             R,               I
##VAR_TYPE=  INDEPENDENT,   DEPENDENT,       DEPENDENT
##VAR_FORM=  AFFN,          ASDF,            ASDF
##VAR_DIM=   16384,         16384,           16384
##UNITS=     HZ,            ARBITRARY UNITS, ARBITRARY UNITS
##FACTOR=    0.220516191357247, 1,           1
##FIRST=     3157.37893475468, 0,            0
##LAST=      -455.337828251098, 0,           0
##MIN=       -455.337828251098, -81179,      0
##MAX=       3157.37893475468, 318363478,    0
$$ Real data points
##PAGE= N=1
##DATA TABLE= (X++(R..R)), XYDATA
$$ [...]
$$ plain form
8218 20755 11182 13509 9257 -31042 -33704 -22472 -15948 -21433 -2033 19882 8461 -21111 -598
8205 -598 -9730 -10272 -7736 -5086 5 6834 241 -1934 2405 -6306 14840 -18866 -5293 45977
8191 45977 11038 7887 1244 4734 14519 8301 -6896 -11389 -16880 -2672 -4957 -7098 -14455 -20604
8177 -20604 -21423 -19849 -29389 -19875 -6462 -10588 -17885 -49749 -56188 -22783 -21856 -14706 -36629 -28110
8163 -28110 -11168 6939 1531 -3590 -14448 -31061 -17229 -17190 2091 -2128 -28644 -33222 -17664
8150 -17664 -4911 18498 6777 7485 -15969 -28314 -44054 -39920 -10432 -26726 -50593 -15311
8138 -15311 -16390 -52647 -37230 -8495 -22674 -13255 -23137 -11621 -8139 -14827 -12237 -26406 -27796
8125 -27796 -10846 -23236 -27191 -17426 -24934 -22589 -15896 1355 -2246 7484 -18127 -36247 -34319
$$ packed form
8218B0755r573K327m252m0299k662J1232O524n485J9400K1915j1421k9572K0513
8205e98r132n42K536K650N091O829o593k175M339q711K1146l3706J3573N1270
8191D5977l4939l151o643L490R785o218j5197m493n491J4208k285k141p357o149
8177b0604q19J574r540R514J3413m126p297l1864o439L3405R27P150k1923Q519
8163b8110J6942J8107n408n121j0858j6613J3832L9J9281m219k6516m578J5558
8150a7664J2753K3409j1721P08k3454j2345j5740M134K9488j6294k3867L5282
8138a5311j079l6257J5417K8735j4179R419r882J1516L482o688K590j4169j390
8125b7796J6950j2390l955R765p508K345O693J7251l601R730k5611j8120J928
$$ plain form
8112 -34319 -30931 -34932 -5661 -23892 -40557 -10808 -7787 5341 25716 17515 -1954 -25741 -21563
8099 -21563 -5458 -16605 -10003 -4467 -10720 -15877 -32615 -29372 -1011 -10469 -12752 -25666 -18516
8086 -18516 12911 -27450 -46528 -30413 -40687 -32758 -17206 19373 30978 11493 -19884 -7983
8074 -7983 -7429 -22061 -36039 -1348 9608 -2184 -6642 10172 581 -12826 -2758 -9623 3822
8061 3822 -8835 -19321 -28494 -16047 -1084 1472 -29440 -35941 -26242 -12767 -20071 -26874 -36619
8048 -36619 -32782 -18919 1836 -7609 -8992 -6912 -11826 -14924 -36511 -39607 -18559 995 -11533
8035 -11533 -26087 -29248 -15231 -7910 -87 -13198 -18271 -30210 -11919 -2469 -6706 3052 -14461
8022 -14461 -34466 -44202 -18214 -29563 -39271 -51569 -40449 -45018 -32642 484 -9351 -2883 -22837
$$ packed form
8112c4319L388m001K9271j8231j6665K9749L021J3128K0375q201j9469k3787M178
8099b1563J6105j1147O602N536o253n157j6738L243K8361r458k283j2914P150
8086a8516L1427m0361j9078J6115j0274P929J5552L6579J1605j9485l1377J1901
8074g983N54j4632j3978L4691J0956j1792m458J6814r591j3407J0068o865J3445
8061C822j2657j0486r173J2447J4963K556l0912o501R699J3475p304o803r745
8048c6619L837J3863K0755r445j383K080m914l098k1587l096K1048J9554j2528
8035a1533j4554l161J4017P321P823j3111n073j1939J8291R450m237R758j7513
8022a4461k0005r736K5988j1349r708j2298J1120m569J2376L3126r835O468j9954
$$ plain form
8009 -22837 -19735 -33099 -31062 -8610 -9026 -4927 -7702 -17213 693 -20080 -25396 -29452 -33119 -44971
7995 -44971 -30358 -57754 -46862 -4500 -13779 -24726 -25501 1885 10010 -10043 -16296 -26668 -81179
7982 -81179 -42431 -38470 -53074 -65111 -58276 -23343 -827 1454 -724 -24554 -32128 -34224 -18487
7969 -18487 -10018 -34295 -34531 -33309 -19807 -11628 -28722 -32736 -49975 -54281 -55196 -37520 -24288 -24425
7955 -24425 -24192 -32270 -29276 -16832 -2321 -15510 -65 20909 -9721 -30223 -20303 -2376 -18779
7942 -18779 -23129 -10803 -9727 -13423 -21942 -5085 -14873 -17534 -4604 -25295 -39057 -55965 -41935
7929 -41935 -12070 -15255 -23961 1796 14556 -5474 -3225 -6174 -11646 -2504 -6373 -24308 -38883
7916 -38883 -31885 -36580 -31235 -34178 -56863 -5028 -104 -14615 -30111 -30593 -10501 -3524 -12114 -8788
$$ packed form
8009b2837L102j3364K037K2452m16M099k775r511J7906k0773n316m056l667j1852
7995d4971J4613k7396J0892M2362r279j0947p75K7386Q125k0053o253j0372n4511
7982h1179L8748L961j4604j2037O835L4933K2516K281k178k3830p574k096J5737
7969a8487Q469k4277k36J222J3502Q179j7094m014j7239m306r15J7676J3232j37
7955b4425K33q078K994J2444J4511j3189J5445K0974l0630k0502R920J7927j6403
7942a8779m350J2326J076l696q519J6857r788k661J2930k0691j3762j6908J4030
7929d1935K9865l185q706K5757J2760k0030K249k949n472R142l869j7935j4575
7916c8883O998m695N345k943k2685N1835M924j4511j5496m82K0092O977q590L326
$$ plain form
7902 -8788 -32272 -41760 -45602 -49891 -24947 -23868 -21946 -7533 14665 -1862 -28125 -13025 23712
7889 23712 31428 1850 -21473 -28394 2529 -9622 -11580 -19528 -16251 -20726 -16374 -6222 -3643
7876 -3643 11414 14968 37561 -20147 -20574 -8379 -2066 -4778 -26262 -42268 -18374 6499 -25989
7863 -25989 -28224 -46541 -52977 -38737 -26752 -18505 -31036 -2506 5386 -13342 -49341 -42769 -28323
7850 -28323 -12729 -381 12878 10833 -771 -7719 -11090 -15790 -17770 -11336 -45499 -44273 -17509
7837 -17509 -23548 -10594 20847 -1416 -18204 -25178 -42785 -37026 -39776 -33575 -29952 -35233 -41769
7824 -41769 -37741 -38198 -61272 -46057 -37918 -34778 -25660 -8227 -10735 -5064 -28191 -17499 -14073 17877
7810 17877 46339 50867 18725 -38873 -45924 -41879 -13514 -9535 -36768 -39843 -23455 -35906 -41409
$$ packed form
7902h788k3484r488l842m289K4944J079J922J4413K2198j6527k6263J5100L6737
7889B3712P716k9578k3323o921L0923j2151j958p948L277m475M352J0152K579
7876c643J5057L554K2593n7708m27J2195O313k712k1484j6006K3894K4873l2488
7863b5989k235j8317o436J4240J1985Q247j2531K8530P892j8728l5999O572J4446
7850b8323J5594J2348J3259k045j1604o948l371m700j980O434l4163J226K6764
7837a7509o039J2954L1441k2263j6788o974j7607N759k750O201L623n281o536
7824d1769M028m57k3074J5215Q139L140R118J7433k508N671k3127J0692L426L1950
7810A7877K8462M528l2142n7598p051M045K8365L979k7233l075J6388j2451n503
$$ plain form
7797 -41409 -14398 -10437 -18440 -45370 -16317 -19132 -23370 11529 20978 2460 -13028 -4949 -6780
7784 -6780 -28305 -45966 -5568 14339 5364 6355 10330 13992 4559 -20104 -29490 -34286 -38120 -25878
7770 -25878 -14436 -7158 -29707 -34517 11718 466 -25345 -25677 -7104 -2612 -21173 -36778 -34005
7757 -34005 -18397 -17813 -13970 -20846 -30373 -37333 -30040 -22785 -23756 -26559 -24752 -18614 -23789 -3713 -6147
7742 -6147 -3556 -22426 -4656 9923 -15807 -17643 -6128 -21223 -16617 -19677 -10032 -21551 -37159
7729 -37159 -3123 -267 -4289 1009 -8144 -1474 -29546 -21440 -7758 -2391 -7660 -12876 -43101 -40949
7715 -40949 -22960 -34019 -10801 5297 -18805 -20566 -32536 -15971 33 -36204 -22922 2541
7703 2541 -19337 -25113 -23290 -21556 -14007 -31676 -43165 -10845 12766 -29487 -15642 -5068 -18598
$$ packed form
7797d1409K7011L961q003k6930K9053k815m238L4899R449j8518j5488Q079j831
7784f780k1525j7661M0398J9907q975R91L975L662r433k4663r386m796l834J2242
7770b5878J1442P278k2549m810M6235j1252k5811l32J8573M492j8561j5605K773
7757c4005J5608N84L843o876r527o960P293P255r71k803J807O138n175K0076k434
7742f147K591j8870J7770J4579k5730j836J1515j5095M606l060R645j1519j5608
7729c7159L4036K856m022N298r153O670k8072Q106J3682N367n269n216l0225K152
7715d0949J7989j1059K3218J6098k4102j761j1970J6565J6004l6237J3282K5463
7703B541k1878n776J823J734P549j7669j1489L2320K3611m2253J3845J0574j3530
$$ plain form
7690 -18598 -24595 -21758 -13315 -3718 -9802 -6986 -433 1313 27686 30413 -4213 -8316 -4797 -21207
7676 -21207 -14111 -32173 -45025 -18995 -4975 -21701 -10078 -8488 -25482 -35098 -31383 7975 -13392
7663 -13392 -10946 -25685 -13498 -6332 -16184 -13709 -8490 -29610 -44797 -43871 -26947 -6437 -1866
7650 -1866 5823 13003 -16032 -19039 -34909 -16814 -7358 -12165 2610 3164 -10613 -12404 -6765 -17393
7636 -17393 -13186 -10110 14172 14028 1900 1572 5703 -7293 -10530 8131 -4922 8554 -2401
7623 -2401 3002 2791 -15332 -3109 -4067 -41468 -22931 -16372 -33293 -39391 -26066 -23115 -20525 -39185
7609 -39185 -32107 -11282 -22319 -31981 -40561 -41795 -44155 -19234 -16162 -21760 -15466 568 -32956
7596 -32956 -11472 -5802 2910 -17632 -44441 -42142 -22129 -23747 -33750 -1006 -7099 -16447 -22115
$$ packed form
7690a8598n997K837Q443R597o084K816O553J746K6373K727l4626m103L519j6410
7676b1207P096j8062j2852K6030J4020j6726J1623J590j6994r616L715L9358k1367
7663a3392K446j4739J2187P166r852K475N219k1120j5187R26J6924K0510M571
7650a866P689P180k9035l007j5870J8095R456m807J4775N54j3777j791N639j0628
7636a7393M207L076K4282j44j2128l28M131j2996l237J8661j3053J3476j0955
7623b401N403k11j8123J2223r58l7401J8537O559j6921o098J3325K951K590j8660
7609c9185P078K0825j1037r662q580j234k360K4921L072n598O294J6034l3524
7596c2956K1484N670Q712k0542k6809K299K0013j618j0003L2744o093r348n668
$$ plain form
7583 -22115 -32735 -31142 -36313 -17810 -37722 -42145 -46080 -33948 -35060 -49448 -52332 -19836 -13217
7570 -13217 -9073 -15244 -27983 -9385 -17300 -28450 -28946 -29092 -22992 -14537 -5526 -27473 -9683 -8364
7556 -8364 -22695 7768 26349 -2671 -12597 -34159 -24199 -22339 -23332 -17521 -37800 -23798 -36244
7543 -36244 -27526 -17357 -14738 -10424 -40224 -32727 2181 7844 12851 -1768 -107 -9636 -9419 -11464
7529 -11464 -45624 -24380 -12131 -18740 -12266 -9770 -2288 -66 18097 11208 -5539 -34851 -44336
7516 -44336 -35168 -68088 -64034 -49692 -40004 -8372 -30165 -14673 -1494 -3889 -10975 -32775 -22350
7503 -22350 -38431 -49703 -31066 -7942 -15739 -11620 -32889 -60083 -24304 -18667 -15659 7619 3454
7490 3454 -35787 -30796 -23890 -28499 -34552 -14041 12470 -10054 -23793 -33968 -58910 -50989 -38330
$$ packed form
7583b2115j0620J593n171J8503j9912m423l935J2132j112j4388k884L2496O619
7570a3217M144o171j2739J8598p915j1150m96j46O100Q455R011k1947J7790J319
7556h364j4331L0463J8581k9020r926k1562R960J860r93N811k0279J4002j2446
7543c6244Q718J0169K619M314k9800P497L4908N663N007j4619J661r529K17k045
7529a1464l4160K1244J2249o609O474K496P482K222J8163o889j6747k9312r485
7516d4336R168l2920M054J4342R688L1632k1793J5492J3179k395p086k1800J0425
7503b2350j6081j1272J8637K3124p797M119k1269k7194L5779N637L008K3278m165
7490C454l9241M991O906m609o053K0511K6511k2524j3739j0175k4942P921J2659
$$ plain form
7477 -38330 -17142 -16672 -5478 -16686 -6586 -2993 -4613 -8507 -5457 -18996 -33977 -37501 -11822
7464 -11822 -33156 -34423 -10839 -27383 -31686 -32366 -14588 432 8405 14243 -7436 -32248 -35592
7451 -35592 -13120 -3627 5412 4403 -5713 3175 -3961 -4281 -9005 -15367 -4764 -4407 -15097 -42926
7437 -42926 -44618 -39116 -42721 -21304 -54146 -35791 -16819 -3295 -15266 -37094 -39950 -23309 -7481
7424 -7481 -16846 -14135 -1033 -1872 -20427 -24770 -29098 -38683 -13019 -18447 -2730 -15657 -11642 6492
7410 6492 -19490 -20374 -5620 -10779 -8090 -5344 4406 -6544 12536 -387 -28896 -15378 -14760 -20019
7396 -20019 -34178 -40987 -39074 -24395 -18924 -12793 -23109 -41496 -36318 -26145 -47873 -39101 -17547
7383 -17547 -20621 -11920 -5703 1668 11965 -26114 -17768 -31832 -53780 -18867 -27767 -14090 -22479
$$ packed form
7477c8330K1188M70J1194j1208J0100L593j620l894L050j3539j4981l524K5679
7464a1822k1334j267K3584j6544m303o80J7778J5020P973N838k1679k4812l344
7451c5592K2472R493R039j009j0116Q888p136l20m724o362J0603L57j0690k7829
7437d2926j692N502l605K1417l2842J8355J8972J3524j1971k1828k856J6641J5828
7424g481r365K711J3102q39j8555m343m328r585K5664n428J5717j2927M015J8134
7410F492k5982q84J4754n159K689K746R750j0950J9080j2923k8509J3518O18n259
7396b0019j4159o809J913J4679N471O131j0316j8387N178J0173k1728Q772K1554
7383a7547l074Q701O217P371J0297l8079Q346j4064k1948L4913q900J3677q389
$$ plain form
7370 -22479 -40136 -43193 -32627 -22169 -34034 -29907 -36709 -14840 -6218 -9079 -18298 -28176 -43804
7357 -43804 -67726 -35335 -22560 -16929 -21597 -24854 -20496 -15262 -2297 2295 -9557 -17953 -12614
7344 -12614 -14223 -33311 -21755 -18507 -48396 -11989 -12807 -42837 -37414 -25958 -14357 -4640 -14499
7331 -14499 -40451 -7186 -305 -6688 -9602 -17657 -16202 -3958 5878 -32247 -28338 -15581 -18255
7318 -18255 -31705 -16280 -22321 -38661 -21233 -8950 -436 -21631 -21739 -18258 1441 7805 -17345
7305 -17345 -32520 62 -4362 -7399 1012 7615 19316 34889 63662 37598 29071 41765 28279
7292 28279 12026 35355 14391 4543 -335 6638 -17964 -26388 -9435 -5185 -18106 -13079 -7401
7279 -7401 -12368 -15991 -9592 -15128 -29920 -16951 -12293 -22395 -32945 -17094 -381 -11245 19725
$$ packed form
7370b2479j7657l057J0566J0458j1865M127o802K1869Q622k861r219r878j5628
7357d3804k3922L2391J2775N631m668l257M358N234J2965M592j1852q396N339
7344a2614j609j9088J1556L248k9889L6407q18l0030N423J1456J1601R717r859
7331a4499k5952L3265O881o383k914q055J455J2244R836l8125L909J2757k674
7318a8255j3450J5425o041j6340J7428J2283Q514k1195j08L481J9699O364k5150
7305a7345j5175L2582m424l037Q411O603J1701J5573K8773k6064q527J2694j3486
7292B8279j6253K3329k0964r848m878O973k4602q424J6953M250j2921N027N678
7279g401m967l623O399n536j4792J2969M658j0102j0550J5851J6713j0864L0970
$$ plain form
7266 19725 14275 5306 25105 4600 -19226 -1699 6412 -1378 -5968 -16799 -32259 -35912 -33396
7253 -33396 -25808 -32939 -33091 -15807 -20541 -29182 -7187 6219 3695 -20809 -37691 -30698 -29215 -22695
7239 -22695 -41289 -34070 -21587 15100 8812 16630 -1240 -33723 -39562 -15422 -11862 -10018 8123
7226 8123 -2395 -10615 -19103 -22180 -3897 -3325 8973 3160 -12923 -7424 2583 -15723 -17086 -13656
7212 -13656 -35315 -42001 -26245 -25880 -37808 -23063 -34505 -12156 -28887 -4553 4325 -2279 -2486
7199 -2486 -12283 -12515 -22355 -36522 -11280 1561 -21548 -24033 -22638 -7508 -17631 -44426 -42204
7186 -42204 -47889 -20351 -11289 -11842 -9251 -5119 12383 -8000 -24657 -27085 -11126 -42530 -26938
7173 -26938 -38082 -7451 4024 -16796 -33293 -45353 -39847 -19646 -13885 708 -19271 2317
$$ packed form
7266A9725n450q969J9799k0505k3826J7527Q111p790m590j0831j5460l653K516
7253c3396P588p131j52J7284m734q641K1995J3406k524k4504j6882O993J483O520
7239b2695j8594P219J2483L6687o288P818j7870l2483n839K4140L560J844J8141
7226H123j0518q220q488l077J8283N72J2298n813j6083N499J0007j8306j363L430
7212a3656k1659o686J5756L65j1928J4745j1442K2349j6731K4334Q878o604k07
7199b486r797k32r840j4167K5242J2841k3109k485J395J5130j0123k6795K222
7186d2204n685K7538R062n53K591M132J7502k0383j6657k428J5959l1404J5592
7173b6938j1144L0631J1475k0820j6497j2060N506K0201N761J4593j9979K1588
$$ plain form
7161 2317 -5848 -5459 -14762 -31214 8903 17774 37477 -7743 -20053 2707 2864 19141 1906
7148 1906 28126 4724 6686 -9481 -33144 -36041 -14796 -2850 -10916 -17112 -30689 -14170 -18126
7135 -18126 -9003 -15903 -6048 1969 10311 -12621 -31358 -22702 12695 -1092 -35091 -35474 -21769
7122 -21769 -31888 -20984 -3669 -7648 -3387 6538 -11677 -7948 10194 9227 -15852 -1910 -4442
7109 -4442 -5918 1728 -5081 -13528 -13272 14797 16398 -9133 -19004 -4110 -15440 -784 -88 8801
7095 8801 41063 11457 22853 6036 23442 12199 -2856 -8132 12272 5810 7307 1250 12793
7082 12793 11865 25298 14039 16537 -18381 -12768 -8380 -13329 -4732 12261 1222 -19585 -3766
7069 -3766 985 4954 -5209 17452 17124 6424 -6913 -10234 -11187 21013 12676 8726 10950 16769
$$ packed form
7161B317q165L89r303j6452M0117Q871J9703m5220j2310K2760J57J6277j7235
7148A906K6220k3402J962j6167k3663k897K1245J1946q066o196j3577J6519l956
7135a8126R123o900R855Q017Q342k2932j8737Q656L5397j3787l3999l83J3705
7122b1769j0119J0904J7315l979M261R925j8215L729J8142r67k5079J3942k532
7109d442j476P646o809q447K56K8069J601k5531r871J4894j1330J4656O96Q889
7095H801L2262k9606J1396j6817J7406j1243j5055n276K0404o462J497o057J1543
7082A2793r28J3433j1259K498l4918N613M388m949Q597J6993j1039k0807J5819
7069c766M751L969j0163K2661l28j0700j3337l321r53L2200q337l950K224N819
$$ plain form
7055 16769 3215 -2733 -4658 27675 17444 19845 16854 22310 10997 1539 11153 28428 25203
7042 25203 11173 27245 28745 39512 40779 27539 36501 56927 35665 39716 32292 30801 37310
7029 37310 23725 13136 8850 40601 40268 49339 45134 24681 35008 56255 59450 32161 19048
7016 19048 41855 51390 68122 58529 55297 45625 51913 71502 84166 70220 51161 27372 44551
7003 44551 73314 56209 70522 100474 102660 98668 91647 82229 75417 69166 82426 84753 79322
6990 79322 97684 105735 101404 103860 98783 108044 118444 108629 104823 109359 130833 138290 155677 148799
6976 148799 169439 171491 172257 179279 190356 209757 184655 164011 206248 232236 212089 190414
6964 190414 216157 208365 208033 243065 253526 234283 244691 255349 261561 259873 254762 268900 273773
$$ packed form
7055A6769j3554n948j925L2333j0231K401k991N456j1313r458R614J7275l225
7042B5203j4030J6072J500J0767J267j3240Q962K0426k1262M051p424j491O509
7029C7310j3585j0589m286L1751l33R071m205k0453J0327K1247L195k7289j3113
7016A9048K2807R535J6732r593l232r672O288J9589J2664j3946j9059k3789J7179
7003D4551K8763j7105J4313K9952K186l992p021r418o812o251J3260K327n431
6990G9322J8362Q051m331K456n077R261J0400r815l806M536K1474P457J7387o878
6976A48799K0640K052P66P022J1077J9401k5102k0644M2237K5988k0147k1675
6964A90414K5743p792l32L5032J0461j9243J0408J0658O212j688n111J4138M873
$$ plain form
6951 273773 282453 297068 306316 338386 350858 352721 359653 372689 386599 387613 362925 391026 427766
6938 427766 429963 468918 467223 469807 492966 524277 548807 568560 570312 627508 659993 686161
6926 686161 730080 766450 796718 840033 876373 920141 961830 993524 1032684 1108632 1180527 1250010
6914 1250010 1307511 1377853 1483457 1619466 1791461 2003874 2235354 2552834 2911945 3370367
6904 3370367 3862700 4415675 5101849 6043667 7448188 9358977 11660882 13507023 13178292
6895 13178292 11609791 9668166 7702500 6243503 5095059 4192095 3535917 3070653 2691910
6886 2691910 2416988 2193831 2003700 1837890 1710576 1579159 1474534 1364143 1292615 1191870
6876 1191870 1125525 1062261 1034427 1004168 949676 880638 823192 804092 803652 763836 732704 700578
$$ packed form
6951B73773Q680J4615R248L2070J2472J863O932J3036J3910J014k4688K8101L6740
6938D27766K197L8955j695K584K3159L1311K4530J9753J752N7196L2485K6168
6926F86161M3919L6370L0268M3315L6340M3768M1689L1694L9160P5948P1895O9483
6914A250010N7501P0342J05604J36009J71995K12413K31480L17480L59111M58422
6904C370367M92333N52975O86174R41818J404521J910789K301905J846141l28731
6895A3178292j568501j941625j965666j458997j148444r02964o56178m65264l78743
6886B691910k74922k23157j90131j65810j27314j31417j04625j10391p1528j00745
6876A191870o6345o3264k7834l0259n4492o9038n7446j9100m40l9816l1132l2126
$$ plain form
6864 700578 665282 618827 613474 561987 517338 480465 457755 406214 394404 393327 411796 389149
6852 389149 376300 365294 364040 353959 343574 347723 343343 337677 305132 292251 292276 300809 277593
6839 277593 256632 248804 252491 254874 245652 234395 208348 202922 227584 228776 204798 198769 204752
6826 204752 191014 188164 157654 167069 183623 171425 149459 149370 154757 130574 141749 148786 142337
6813 142337 127437 118098 127039 117569 115872 121158 118422 122667 101917 96828 87558 92135 92890 79013
6799 79013 74275 91993 99023 90455 78155 67122 91858 91420 88929 79399 59204 67183 52834
6786 52834 38335 44082 48825 57278 59596 53439 54436 54455 50947 36850 52149 71371 82141 60542
6772 60542 75574 66637 44956 66076 47333 48793 60378 57409 66240 69830 62147 40609 30736
$$ packed form
6864G00578l5296m6455n353n1487m4649l6873k2710n1541j1810j077J8469k2647
6852C89149j2849j1006j254j0081j0385M149m380n666l2545j2881K5Q533k3216
6839B77593k0961p828L687K383r222j1257k6047n426K4662J192k3978o029N983
6826B04752j3738k850l0510R415J6554j2198k1966q9N387k4183J1175P037o449
6813A42337j4900r339Q941r470j697N286k736M245k0750n089r270M577P55j3877
6799G9013m738J7718P030q568j2300j1033K4736m38k491r530k0195P979j4349
6786E2834j4499N747M743Q453K318o157R97J9l508j4097J5299J9222J0770k1599
6772F0542J5032q937k1681K1120j8743J460J1585k969Q831L590p683k1538r873
$$ plain form
6759 30736 30115 34438 56671 46346 23541 21931 42345 63183 50987 40391 50553 36380 42401
6746 42401 35785 54252 43605 10421 15033 3458 9627 21466 25767 18348 18843 7817 38935
6733 38935 51531 50871 38377 22249 43715 71349 35602 10603 34858 16451 35915 54102
6721 54102 36671 16911 -4599 4141 23890 29241 10639 14965 20374 31863 29736 -15669 -19769
6708 -19769 -34105 5611 9488 19965 18635 3874 14314 24787 21896 21147 5513 2859 1336
6695 1336 4082 -19277 -9516 14815 42294 26837 1225 8580 13625 28129 22234 29353 54207
6682 54207 23430 18379 15755 9753 15802 4044 -10710 -4894 26932 17622 30731 44685 34462
6669 34462 33283 7794 30437 28219 5040 24390 46043 25601 3906 20657 25365 12535
$$ packed form
6759C0736o21M323K2233j0325k2805j610K0414K0838j2196j0596J0162j4173O021
6746D2401o616J8467j0647l3184M612j1575O169J1839M301p419M95j1026L1118
6733C8935J2596o60j2494j6128K1466K7634l5747k4999K4255j8407J9464J8187
6721E4102j7431j9760k1510Q740J9749N351j8602M326N409J1489k127m5405m100
6708a9769j4336L9716L877J0477j330j4761J0440J0473k891p49j5634k654j523
6695A336K746k3359R761K4331K7479j5457k5612P355N045J4504n895P119K4854
6682E4207l0777n051k624o002O049j1758j4754N816L1826r310J3109J3954j0223
6669C4462j179k5489K2643k218k3179J9350K1653k0442k1695J6751M708j2830
$$ plain form
6657 12535 23025 10310 4548 16994 6665 11614 -3340 27082 31716 37089 40804 10299 16003
6644 16003 14264 -14664 3318 46376 5481 -6076 -10769 8596 23591 27761 6618 -11072
6632 -11072 2048 -11776 -3931 -6259 2857 8921 15123 -6098 7023 22205 18586 12004 -2491
6619 -2491 -21101 -11180 -20306 -2955 -14444 8598 4571 2747 -2248 -30950 -36160 -15897 -5282
6606 -5282 14564 12885 6784 6353 15967 20746 8436 -1279 41928 23275 14045 -13350 -32068 -28258
6592 -28258 -854 3904 -12453 10078 20957 20299 14922 26306 27752 29097 -2259 15449 7885
6579 7885 13210 5379 -5601 11868 2691 3944 6713 -8621 -12718 23219 11326 -13507 15694
6566 15694 12859 7084 15268 10287 10240 -6939 4466 28735 24427 36266 35769 27853 3703 16549
$$ packed form
6657A2535J0490j2715n762J2446j0329M949j4954L0422M634N373L715l0505N704
6644A6003j739k8928J7982M3058m0895j1557m693J9365J4995M170k1143j7690
6632a1072J3120j3824P845k328R116O064O202k1221J3121J5182l619o582j4495
6619b491j8610R921r126J7351j1489K3042m027j824m995k8702n210K0263J0615
6606e282J9846j679o101m31R614M779j2310r715M3207j8653r230k7395j8718L810
6592b8258K7404M758j6357K2531J0879o58n377J1384J446J345l1356J7708p564
6579G885N325p831j0980J7469r177J253K769j5334m097L5937j1893k4833K9201
6566A5694k835n775Q184m981m7j7179J1405K4269m308J1839m97p916k4150J2846
$$ plain form
6552 16549 9418 21224 20949 49668 40871 43245 31275 15644 41117 36263 18776 11756 13640
6539 13640 12644 19739 -1381 -3117 -4927 -438 -136 12662 20159 34074 22170 18908 22922 23931
6525 23931 26021 24062 6733 17956 50183 61411 47783 41422 38968 10848 18234 42599 41301
6512 41301 22919 31589 24691 45584 45863 52415 33055 35600 18810 13535 46436 61121 76609
6499 76609 84976 98924 98747 96695 118745 115796 110508 120106 123760 104422 109154 117647 135634 123622
6485 123622 105425 109206 111768 115102 117033 100374 73518 101439 132948 116898 123619 95497 120324
6472 120324 144101 132842 113957 74147 85210 94467 108376 93460 95958 109645 131216 142170
6460 142170 144748 133667 125231 151655 174904 141417 162388 172506 167251 177807 170585 154528
$$ packed form
6552A6549p131J1806k75K8719q797K374j1970j5631K5473m854j7487p020J884
6539A3640r96P095k1120j736j810M489L02J2798P497J3915j1904l262M014J009
6525B3931K090j959j7329J1223L2227J1228j3628o361k454k8120P386K4365j298
6512D1301j8382Q670o898K0893K79O552j9360K545j6790n275L2901J4685J5488
6499G6609Q367J3948j77k052K2050k949n288R598L654j9338M732Q493J7987j2012
6485A23622j8197L781K562L334J931j6659k6856K7921L1509j6050O721k8122K4827
6472A20324K3777j1259j8885l9810J1063R257J3909j4916K498J3687K1571J0954
6460A42170K578j1081q436K6424K3249l3487K0971J0118n255J0556p222j6057
$$ plain form
6448 154528 164278 157157 157893 158197 154342 148483 146827 158042 178911 172787 178241 190185 202633 214096
6434 214096 216916 213296 233637 231796 235528 252346 241052 249666 279527 307922 317683 319475 314058
6421 314058 301541 269691 223496 230997 228622 227993 257033 231063 268008 288156 285899 298833 316772
6408 316772 345471 364862 373090 382697 384748 390799 398631 434634 476018 497424 501556 494955 492471
6395 492471 536046 574572 574964 579154 545478 543689 541238 513925 530559 555937 564483 557461 620980
6382 620980 651256 694995 733300 755185 782407 786994 822224 873479 938564 968024 1012647 1028165
6370 1028165 1047800 1084823 1142163 1241504 1345946 1449735 1480384 1411759 1296298 1187658 1075556
6359 1075556 972830 902037 868431 858734 826090 818747 821647 816106 782147 757403 694631 638864
$$ packed form
6448A54528R750p121P36L04l855n859j656J1215K0869o124N454J1944J2448J1463
6434B14096K820l620K0341j841L732J6818j1294Q614K9861K8395R761J792n417
6421C14058j2517l1850m6195P501k375o29K9040k5970L6945K0148k257J2934J7939
6408C16772K8699J9391Q228R607K051O051P832L6003M1384K1406M132o601k484
6395D92471M3575L8526L92M190l3676j789k451k7313J6634K5378Q546p022O3519
6382F20980L0276M3739L8305K1885K7222M587L5230N1255O5085K9460M4623J5518
6370A028165J9635L7023N7340R9341J04442J03789L0649o8625j15461j08640j12102
6359A075556j02726p0793l3606r697l2644p343K900n541l3959k4744o2772n5767
$$ plain form
6347 638864 587458 528089 470663 410991 402118 399272 391755 378127 327286 327658 332746 331583 350971
6334 350971 337824 347349 351791 316343 300248 305601 313664 311189 318040 297687 264754 276014 276120
6321 276120 273449 245572 238557 253753 273524 248917 254295 260549 245130 231642 215275 214750 218325
6308 218325 225854 230043 244287 200003 231186 250622 228496 220224 226868 233194 242247 251046 228475
6295 228475 235295 249194 255763 228879 227616 241780 245271 243194 237238 197405 221230 271133 245364
6282 245364 224911 230334 228600 228366 232515 242974 249381 263065 251834 262982 272841 269727 257793
6269 257793 282552 288245 273850 296522 309903 316641 300410 317866 340080 340610 372722 363991 380720
6256 380720 379026 384389 386955 386779 405431 417312 414351 424510 450439 456954 476321 473177 472782 466738
$$ packed form
6347F38864n1406n9369n7426n9672q873k846p517j3628n0841L72N088j163J9388
6334C50971j3147R525M442l5448j6095N353Q063k475O851k0353l2933J1260J06
6321B76120k671k7877p015J5196J9771k4607N378O254j5419j3488j6367n25L575
6308B18325P529M189J4244m4284L1183J9436k2126q272O644O326R053Q799k2571
6295B28475O820J3899O569k6884j263J4164L491k077n956l9833K3825M9903k5769
6282B45364k0453N423j734k34M149J0459O407J3684j1231J1148R859l114j1934
6269B57793K4759N693j4395K2672J3381O738j6231J7456K2214N30L2112q731J6729
6256C80720j694N363K566j76J8652J1881k961J0159K5929O515J9367l144l95o044
$$ plain form
6242 466738 472410 446950 438702 446421 452585 427223 455227 471728 470365 467636 467023 478996 472056
6229 472056 487002 502762 475620 506352 496887 521942 528209 532919 566762 559139 560948 556694 550008
6216 550008 542016 550491 542858 581957 581383 582821 582897 624119 650434 644106 695606 701174 700836 706594
6202 706594 718439 714247 723735 733403 723756 736750 755499 757728 786794 799396 799588 806976 798912
6189 798912 826804 887789 899878 923157 908371 906781 938033 957787 979675 989524 1037262 1064099
6177 1064099 1087660 1066092 1102664 1121098 1146085 1156510 1166989 1191787 1228563 1240633 1270974
6166 1270974 1301112 1334198 1383527 1424818 1436610 1466249 1523884 1573355 1633358 1672953 1687859
6155 1687859 1767123 1855374 1891940 1979091 2061797 2169016 2278549 2406076 2591630 2768536
$$ packed form
6242D66738N672k5460q248P719O164k5362K8004J6501j363k729o13J1973o940
6229D72056J4946J5760k7142L0732r465K5055O267M710L3843p623J809m254o686
6216E50008p992Q475p633L9099n74J438P6M1222K6315o328N1500N568l38N758
6202G06594J1845m192R488R668r647J2994J8749K229K9066J2602J92P388q064
6189G98912K7892O0985J2089K3279j4786j590L1252J9754K1888R849M7738K6837
6177A064099K3561k1568L6572J8434K4987J0425J0479K4798L6776J2070L0341
6166A270974L0138L3086M9329M1291J1792K9639N7635M9471O0003L9595J4906
6155A687859P9264Q8251L6566Q7151Q2706J07219J09533J27527J85554J76906
$$ plain form
6145 2768536 2978069 3236962 3553146 3977630 4495546 5140416 5748362 5857809 5549558 5119693
6135 5119693 4583929 4132580 3822686 3597267 3437673 3304839 3249549 3208580 3180340 3160569
6125 3160569 3173466 3204087 3226473 3249267 3305197 3382302 3422512 3490788 3549791 3618157 3705485
6114 3705485 3763453 3828316 3906476 3975864 4087577 4205420 4313033 4389540 4487720 4564507 4671136
6103 4671136 4760347 4870439 5013539 5112744 5236004 5386762 5528934 5678178 5818076 5951983
6093 5951983 6119587 6285513 6478367 6680299 6876456 7094529 7357991 7632165 7889711 8166400
6083 8166400 8480011 8789189 9122818 9453260 9803359 10205058 10650766 11134471 11690542 12307431
6073 12307431 12928196 13678699 14527284 15515286 16637384 17932854 19458700 21221017 23294160
$$ packed form
6145B768536K09533K58893L16184M24484N17916O44870O07946J09447l08251m29865
6135E119693n35764m51349l09894k25419j59594j32834n5290m0969k8240j9771
6125C160569J2897L0621K2386K2794N5930P7105M0210O8276N9003O8366Q7328
6114C705485N7968O4863P8160O9388J11713J17843J07613P6507R8180P6787J06629
6103D671136Q9211J10092J43100R9205J23260J50758J42172J49244J39898J33907
6093E951983J67604J65926J92854K01932J96157K18073K63462K74174K57546K76689
6083H166400L13611L09178L33629L30442L50099M01699M45708M83705N56071O16889
6073A2307431O20765P50503Q48585R88002J122098J295470J525846J762317K073143
$$ plain form
6064 23294160 25611872 28106131 30728759 33678883 37332936 42047400 47958333 54426405
6056 54426405 59582279 60989889 59020574 55466776 51686292 48719065 46695447 45690733
6048 45690733 45896968 47485055 50457474 54585009 58972009 61864445 62656628 62561564 62822173
6039 62822173 64435148 67683039 71622404 74463479 74469451 71621670 67263114 62927371 59674104
6030 59674104 58152484 58319961 59636032 60454903 59389628 57018828 54353673 52025760
6022 52025760 50539308 49928003 50365000 52317610 55932315 60784423 65456684 66917934
6014 66917934 63649428 57539836 50327894 43466868 37683193 32850014 28943211 25885614
6006 25885614 23458387 21522797 19867524 18443496 17226062 16179081 15266406 14453218
$$ packed form
6064B3294160K317712K494259K622628K950124L654053M714464N910933O468072
6056E4426405N155874J407610j969315l553798l780484k967227k023618j004714
6048D5690733K06235J588087K972419M127535M387000K892436P92183r5064K60609
6039F2822173J612975L247891L939365K841075N972k847781m358556m335743l253267
6030E9674104j521620J67477J316071Q18871j065275k370800k665155k327913
6022E2025760j486452o11305M36997J952610L614705M852108M672261J461250
6014F6917934l268506o109592p211942o861026n783675m833179l906803l057597
6006B5885614k427227j935590j655273j424028j217434j046981r12675q13188
$$ plain form
5998 14453218 13752688 13127702 12574022 12072593 11650638 11282074 10947887 10617168 10228751
5989 10228751 9846613 9453510 9089482 8752383 8465074 8175868 7877306 7574637 7323443
5980 7323443 7047611 6813446 6548310 6313541 6102580 5923127 5737300 5588846 5449071 5346791
5970 5346791 5235251 5157453 5092473 5029113 4966538 4902863 4817796 4727006 4647624 4542861 4475412
5959 4475412 4356632 4188850 4015677 3859385 3711458 3556072 3419358 3308454 3195086 3103082
5949 3103082 3032446 2970371 2891889 2819755 2749687 2704425 2636102 2564400 2497059 2467011 2442654
5938 2442654 2388897 2339926 2323296 2251397 2210883 2201046 2186224 2180886 2189726 2165420 2145965 2119454
5926 2119454 2059845 1972825 1912438 1857291 1806913 1731941 1684525 1669349 1643160 1612072 1596365
$$ packed form
5998A4453218p00530o24986n53680n01429m21955l68564l34187l30719l88417
5989A0228751l82138l93103l64028l37099k87309k89206k98562l02669k51194
5980G323443k75832k34165k65136k34769k10961j79453j85827j48454j39775j02280
5970E346791j11540p7798o4980o3360o2575o3675q5067r0790p9382j04763o7449
5959D475412j18780j67782j73173j56292j47927j55386j36714j10904j13368r2004
5949C103082p0636o2075p8482p2134p0068m5262o8323p1702o7341l0048k4357
5938B442654n3757m8971j6630p1899m0514r837j4822n338Q840k4306j9455k6511
5926B119454n9609q7020o0387n5147n0378p4972m7416j5176k6189l1088j5707
$$ plain form
5915 1596365 1560430 1577509 1576376 1550929 1539153 1528524 1482941 1445108 1429106 1400177 1397708 1352020
5903 1352020 1321598 1334030 1317695 1289945 1290094 1264771 1229860 1222511 1213550 1206681 1193335 1188879 1182900
5890 1182900 1184936 1195123 1227881 1180787 1144738 1156119 1114894 1095256 1119502 1118819 1103433 1068567
5878 1068567 1028106 1021063 1021054 1012577 987015 976922 965658 959705 932690 906341 904622 884770 870058
5865 870058 857017 858258 817299 821385 820951 825485 814533 799920 795750 802310 776635 780878 775109
5852 775109 753585 700358 678848 693468 702457 679593 680687 697175 683349 719185 714565 700960
5840 700960 725316 730464 721609 720783 722315 727910 752683 787913 795037 808900 829098 872368 887901
5827 887901 902320 900906 893658 874674 875753 825407 809491 815326 834458 827543 817697 815435 836874
$$ packed form
5915A596365l5935J7079j133k5447j1776j0629m5583l7833j6002k8929k469m5688
5903A352020l0422J2432j6335k7750J49k5323l4911p349q961o869j3346m456n979
5890A182900K036J0187L2758m7094l6049J1381m1225j9638K4246o83j5386l4866
5878A068567m0461p043rq477k5562j0093j1264n953k7015k6349j719j9852j4712
5865H70058j3041J241m0959M086m34M534j0952j4613m170O560k5675M243n769
5852G75109k1524n3227k1510J4620Q989k2864J094J6488j3826L5836m620j3605
5840G00960K4356N148q855q26J532N595K4773L5230P124J3863K0198M3270J5533
5827H87901J4419j414p248j8984J079n0346j5916N835J9132o915r846k262K1439
$$ plain form
5814 836874 830204 836380 808114 816289 827428 827998 845542 883025 881772 886450 885223 840894 847287
5801 847287 850954 822810 816645 767425 779923 756530 701951 693840 689348 717134 733918 741292 733635
5788 733635 744776 770292 766393 761423 739307 704099 695711 674063 629304 622940 600314 566135
5776 566135 564036 541924 541316 558969 576925 576037 590288 573702 538281 524107 523597 545515 552086
5763 552086 578105 567270 565874 578153 578964 591866 593840 631187 606741 619343 639015 653213
5751 653213 650082 676215 700684 695684 715974 765523 820313 824355 829101 818145 812749 802911 777306
5738 777306 770242 785957 767243 772972 791025 792302 845546 882534 905113 911532 940282 986773
5726 986773 988465 1013150 1030457 1038779 1054116 1049405 1048330 1054875 1065554 1108571 1115764 1124291 1134318
$$ packed form
5814H36874o670O176k8266Q175J1139N70J7544L7483j253M678j227m4329O393
5801H47287L667k8144o165m9220J2498k3393n4579q111m492K7786J6784P374p657
5788G33635J1141K5516l899m970k2116l5208q388k1648m4759o364k2626l4179
5776E66135k099k2112o08J7653J7956q88J4251j6586l5421j4174n10K1918O571
5763E52086K6019j0835j396J2279Q11J2902J974L7347k4446J2602J9672J4198
5751F53213l131K6133K4469n000K0290M9549N4790M042M746j0956n396r838k5605
5738G77306p064J5715j8714N729J8053J277N3244L6988K2579O419K8750M6491
5726I86773J692K4685J7307Q322J5337m711j075O545J0679M3017P193Q527J0027
$$ plain form
5713 1134318 1145027 1141531 1124554 1092061 1088827 1097549 1106957 1143460 1190463 1254473 1296487 1336718
5701 1336718 1324065 1297425 1254125 1245064 1217207 1233528 1250743 1227777 1222412 1186080 1154167 1156602
5689 1156602 1142830 1118149 1126311 1155337 1181774 1181425 1178943 1174699 1149020 1167160 1176058 1203109 1212679
5676 1212679 1247305 1283525 1310703 1314679 1305529 1270536 1235532 1193254 1150442 1139143 1124190 1115649
5664 1115649 1126931 1113574 1088900 1080875 1080116 1096047 1118577 1119656 1115975 1116896 1129561 1110601 1114162
5651 1114162 1121503 1144387 1159717 1156961 1161484 1180539 1170556 1183277 1196403 1195424 1186710 1180373 1189063
5638 1189063 1238905 1238130 1247591 1267464 1288555 1319401 1351051 1405040 1395796 1405845 1402578 1440199
5626 1440199 1469191 1494526 1537388 1562300 1565569 1594111 1622791 1618052 1647645 1676483 1697096 1741034
$$ packed form
5713A134318J0709l496j6977l2493l234Q722R408L6503M7003O4010M2014M0231
5701A336718j2653k6640m3300r061k7857J6321J7215k2966n365l6332l1913K435
5689A156602j3772k4681Q162K9026K6437l49k482m244k5679J8140Q898K7051R570
5676A212679L4626L6220K7178L976r150l4993l5004m2278m2812j1299j4953q541
5664A115649J1282j3357k4674q025p59J5931K2530J079l681R21J2665j8960L561
5651A114162P341K2884J5330k756M523J9055r983J2721J3126r79q714o337Q690
5638A189063M9842p75R461J9873K1091L0846L1650N3989r244J0049l267L7621
5626A440199K8992K5335M2862K4912L269K8542K8680m739K9593K8838K0613M3938
$$ plain form
5614 1741034 1774801 1799962 1819923 1871311 1888663 1899909 1923277 1992517 2039505 2060951 2085430
5603 2085430 2123549 2158274 2229556 2272408 2318081 2365568 2446190 2515355 2594246 2674424 2783977
5592 2783977 2875904 2958617 2970307 2976586 2988351 3016107 3032662 3066408 3084798 3143096 3212142 3229102
5580 3229102 3270225 3335908 3409244 3482464 3569886 3650351 3733737 3844587 3977768 4078927 4201614
5569 4201614 4301977 4402641 4484293 4566195 4648632 4734901 4815832 4921551 5013001 5117542 5221711
5558 5221711 5306270 5447812 5590436 5752641 5893738 6057192 6226916 6385225 6529523 6683286
5548 6683286 6895663 7118011 7344133 7567676 7808429 8056374 8288843 8541851 8885256 9231646
5538 9231646 9561699 9971057 10464813 11030728 11621520 12095521 12462395 12718526 12966805 13298703
$$ packed form
5614A741034L3767K5161J9961N1388J7352J1246K3368O9240M6988K1446K4479
5603B085430L8119L4725P1282M2852M5673M7487Q0622O9165P8891Q0178J09553
5592B783977R1927Q2713J1690O279J1765K7756J6555L3746J8390N8298O9046J6960
5580C229102M1123O5683P3336P3220Q7422Q0465Q3386J10850J33181J01159J22687
5569D201614J00363J00664Q1652Q1902Q2437Q6269Q0931J05719R1450J04541J04169
5558E221711Q4559J41542J42624J62205J41097J63454J69724J58309J44298J53763
5548F683286K12377K22348K26122K23543K40753K47945K32469K53008L43405L46390
5538I231646L30053M09358M93756N65915N90792M74001L66874K56131K48279L31898
$$ plain form
5528 13298703 13680805 14115403 14618251 15254149 16008470 16882208 17792031 18732504 19758546
5519 19758546 20931613 22262029 23949515 25950491 28322213 31050877 34079677 37526953
5511 37526953 41665791 46927748 53546262 61213613 68228630 71562813 70161611 66071356
5503 66071356 61112658 56753786 53626169 51753626 51280095 52469769 55141386 58920341
5495 58920341 62590389 64329906 64112162 63191966 62611152 63376519 65908735 70036485 74765714
5486 74765714 78063180 78261604 75608981 71684178 68116271 65856215 65122103 65111589 64173117
5477 64173117 61581963 58178993 54810781 52205456 50611279 49948396 50333248 51981308
5469 51981308 55027565 59255021 63767540 66442833 65135508 60572467 54568581 48416143
$$ packed form
5528A3298703L82102M34598N02848O35898P54321Q73738R09823R40473J026042
5519A9758546J173067J330416J687486K000976K371722K728664L028800L447276
5511C7526953M138838N261957O618514P667351P015017L334183j401202m090255
5503F6071356m958698m358872l127617j872543m73531J189674K671617L778955
5495E8920341L670048J739517k17744r20196n80814P65367K532216M127750M729229
5486G4765714L297466J98424k652623l924803l567907k260056p34112j0514r38472
5477F4173117k591154l402970l368212k605325j594177o62883L84852J648060
5469E1981308L046257M227456M512519K675293j307325m563041o003886o152438
$$ plain form
5461 48416143 43072319 38638146 35022114 32214086 30063002 28381106 27026812 25908212
5453 25908212 25039955 24299260 23659756 23141426 22721897 22329518 21999370 21741636 21547516
5444 21547516 21381799 21242376 21183832 21163999 21176665 21297500 21449953 21681142 22010391 22386650
5434 22386650 22814212 23353482 23881426 24481160 25101472 25713856 26386987 27103695 27832684
5425 27832684 28677144 29604725 30727259 32025264 33639488 35557705 37857906 40569489
5417 40569489 43947525 48108323 53165589 59158089 66346929 74547698 83617588 94128927
5409 94128927 107627213 125742755 149379056 176664624 200591032 206330455 192947753
5402 192947753 171079782 146206361 124317940 106373699 91689695 80284729 71772357
$$ packed form
5461D8416143n343824m434173l616032k808028k151084j681896j354294j118600
5453B5908212q68257p40695o39504n18330m19529l92379l30148k57734j94120
5444B1547516j65717j39423n8544j9833J2666J20835J52453K31189L29249L76259
5434B2386650M27562N39270N27944N99734O20312O12384O73131P16708P28989
5425B7832684Q44460R27581J122534J298005J614224J918217K300201K711583
5417D0569489L378036M160798N057266N992500P188840Q200769R069890J0511339
5409I4128927J3498286J8115542K3636301K7285568K3926408N739423j3382702
5402A92947753k1867971k4873421k1888421j7944241j4684004j1404966q512372
$$ plain form
5395 71772357 65140115 59892396 55646586 52227906 49346758 46881838 44700747 42716363
5387 42716363 40822709 39029216 37278549 35625901 34032490 32523336 31050123 29626670
5379 29626670 28258287 26989084 25814442 24756525 23748025 22772651 21847348 20920256 19990328
5370 19990328 19138935 18336056 17594534 16962885 16405064 15961657 15622699 15383679 15161668
5361 15161668 14865189 14445194 13966215 13433341 12907413 12441666 12011961 11638865 11369916
5352 11369916 11081127 10829147 10581381 10311370 10060397 9822902 9527647 9226990 8924757
5343 8924757 8632289 8357925 8103632 7898927 7650058 7445151 7259350 7030491 6852446 6695309
5333 6695309 6539346 6398257 6210940 6015510 5829194 5650705 5506177 5321914 5139153 5002899
$$ packed form
5395G1772357o632242n247719m245810l418680k881148k464920k181091j984384
5387D2716363j893654j793493j750667j652648j593411j509154j473213j423453
5379B9626670j368383j269203j174642j057917j008500r75374r25303r27092r29928
5370A9990328q51393q02879p41522o31649n57821m43407l38958k39020k22011
5361A5161668k96479m19995m78979n32874n25928m65747m29705l73096k68949
5352A1369916k88789k51980k47766k70011k50973k37495k95255l00657l02233
5343H924757k92468k74364k54293k04705k48869k04907j85801k28859j78045j57137
5333F695309j55963j41089j87317j95430j86316j78489j44528j84263j82761j36254
$$ plain form
5323 5002899 4900894 4787950 4682468 4579331 4508919 4438774 4390318 4361768 4283665 4168474
5313 4168474 4107449 4008267 3910318 3812520 3737562 3629057 3562473 3506893 3453333 3405726 3347404
5302 3347404 3303634 3302663 3297095 3278510 3257600 3246003 3186541 3119617 3025154 2966509 2896215 2839427
5290 2839427 2781535 2705547 2662925 2605663 2552315 2521239 2487641 2493885 2487921 2467232 2455094 2423497
5278 2423497 2416713 2421313 2390988 2388632 2407516 2398492 2369730 2347190 2331320 2276946 2241560 2179835
5266 2179835 2127112 2092918 2078928 2036291 1988353 1957138 1932068 1885158 1819856 1754687 1721288
5255 1721288 1688699 1665776 1640241 1633627 1619413 1579989 1555540 1549362 1544544 1485884 1420497 1380896
5243 1380896 1341416 1366316 1344884 1318364 1308513 1270150 1259455 1250444 1256501 1253836 1273025 1301885
$$ packed form
5323E002899j02005j12944j05482j03137p0412p0145m8456k8550p8103j15191
5313D168474o1025r9182r7949r7798p4958j08505o6584n5580n3560m7607n8322
5302C347404m3770r71n568j8585k0910j1597n9462o6924r4463n8645p0294n6788
5290B839427n7892p5988m2622n7262n3348l1076l3598O244n964k0689j2138l1597
5278B423497o784M600l0325k356J8884r024k8762k2540j5870n4374l5386o1725
5266B179835n2723l4194j3990m2637m7938l1215k5070m6910o5302o5169l3399
5255A721288l2589k2923k5535o614j4214l9424k4449o178m818n8660o5387l9601
5243A380896l9480K4900k1432k6520r851l8363j0695r011O057k665J9189K8860
$$ plain form
5231 1301885 1314519 1306406 1271449 1272741 1237295 1202714 1165618 1123737 1114201 1096766 1079833 1083420
5219 1083420 1081687 1101371 1092461 1070888 1090220 1089264 1061074 1059072 1056919 1058539 1066125 1054437 1053940
5206 1053940 1079038 1085791 1080615 1077773 1075763 1077680 1080034 1097173 1135364 1115956 1123749 1125117 1144021
5193 1144021 1182150 1228187 1269010 1296579 1340113 1386117 1447443 1500504 1573870 1679558 1778584
5182 1778584 1885335 2011114 2157145 2338984 2539652 2737125 2816270 2722008 2520728 2290647
5172 2290647 2119646 1971943 1859834 1768284 1687525 1622464 1571511 1538364 1535291 1536215 1589254
5161 1589254 1629271 1641486 1688376 1693676 1625584 1541472 1487519 1422005 1369112 1331176 1288793 1254628
5149 1254628 1237904 1212615 1215691 1255659 1237706 1242083 1279519 1296426 1310358 1283886 1272456 1249168
$$ packed form
5231A301885J2634q113l4957J292l5446l4581l7096m1881r536j7435j6933L587
5219A083420j733J9684q910k1573J9332r56k8190k002k153J620P586j1688m97
5206A053940K5098O753n176k842k010J917K354J7139L8191j9408P793J368J8904
5193A144021L8129M6037M0823K7569M3534M6004O1326N3061P3366J05688R9026
5182A778584J06751J25779J46031J81839K00668J97473P9145r4262k01280k30081
5172B290647j71001j47703j12109r1550q0759o5061n0953l3147l073R24N3039
5161A589254M0017J2215M6890N300o8092q4112n3953o5514n2893l7936m2383l4165
5149A254628j6724k5289L076L9968j7953M377L7436J6907J3932k6472j1430k3288
$$ plain form
5137 1249168 1231036 1218427 1233630 1218555 1217885 1253849 1256335 1251791 1198991 1162480 1130516 1080160
5125 1080160 1057158 1045412 1044198 1036782 1001801 1022110 1022528 1011719 994239 1026669 1027783 1016977
5113 1016977 1035838 1049587 1080377 1101444 1101418 1143288 1179595 1207630 1241597 1240309 1283112 1306153
5101 1306153 1318231 1299084 1303033 1273030 1265258 1274344 1297959 1332626 1386471 1458568 1501548 1578625
5089 1578625 1616652 1639491 1666342 1624790 1593936 1560644 1571337 1567156 1570830 1556444 1553444 1548648
5077 1548648 1513427 1474706 1506663 1500574 1516605 1548012 1542203 1536322 1586410 1615824 1656085 1698207
5065 1698207 1761842 1832234 1926384 1998966 2139275 2291637 2458338 2626955 2792371 2888454
5055 2888454 2881164 2803758 2656570 2488959 2337643 2240413 2133919 2034497 1948593 1834694 1778857
$$ packed form
5137A249168j8132j2609J5203j5075o70L5964K486m544n2800l6511l1964n0356
5125A080160k3002j1746j214p416l4981K0309M18j0809j7480L2430J114j0806
5113A016977J8861J3749L0790K1067k6M1870L6307K8035L3967j288M2803K3041
5101A306153J2078j9147L949l0003p772R086K3615L4667N3845P2097M2980P7077
5089A578625L8027K2839K6851m1552l0854l3292J0693m181L674j4386l000m796
5077A548648l5221l8721L1957o089J6031L1407n809n881N0088K9414M0261M2122
5065A698207O3635P0392R4150P2582J40309J52362J66701J68617J65416R6083
5055B888454p290p7406j47188j67611j51316r7230j06494r9422q5904j13899n5837
$$ plain form
5044 1778857 1748410 1694535 1667799 1655841 1647904 1640219 1622074 1620626 1646263 1703123 1760190 1844993
5032 1844993 1927620 2047094 2195797 2308103 2424944 2608262 2818882 3017216 3136398 3140419
5022 3140419 3063669 2911298 2743432 2569569 2427253 2291349 2167143 2091949 2072392 2020770
5012 2020770 1998910 1981370 1961791 1926092 1907153 1931525 1943545 1924625 1940718 1970613 1990193
5001 1990193 2002921 2020193 2067472 2109071 2144227 2209725 2279510 2383828 2504469 2589435 2670834
4990 2670834 2704393 2703770 2706451 2695510 2719920 2719614 2746381 2750052 2770094 2779467 2802176 2806873 2833966
4977 2833966 2829747 2883840 2889478 2921307 2936516 2989997 2990548 3009606 3022815 3076188 3107846 3149751
4965 3149751 3182646 3290021 3306513 3362797 3453932 3570415 3657584 3756138 3839500 3920349 4021495
$$ packed form
5044A778857l0447n3875k6736j1958p937p685j8145j448K5637N6860N7067Q4803
5032A844993Q2627J19474J48703J12306J16841J83318K10620J98334J19182M021
5022C140419p6750j52371j67866j73863j42316j35904j24206p5194j9557n1622
5012B020770k1860j7540j9579l5699j8939K4372J2020j8920J6093K9895J9580
5001A990193J2728J7272M7279M1599L5156O5498O9785J04318J20641Q4966Q1399
4990B670834L3559o23K681j0941K4410l06K6767L671K0042R373K2709M697K7093
4977B833966m219N4093N638L1829J5209N3481N51J9058J3209N3373L1658M1905
4965C149751L2895J07375J6492N6284R1135J16483Q7169R8554Q3362Q0849J01146
$$ plain form
4954 4021495 4114684 4208284 4377615 4553974 4731682 4917809 5105606 5246468 5379136 5515129
4944 5515129 5644107 5726938 5822329 5917563 6003723 6125784 6254177 6353916 6459254 6559143 6678849
4933 6678849 6824236 6956908 7119782 7324603 7519625 7733566 7966333 8234573 8500534 8755199
4923 8755199 9028408 9290802 9539132 9777144 10039605 10319359 10615271 10861046 11098628 11316858
4913 11316858 11502550 11668217 11878559 12089996 12375536 12659763 12940527 13248672 13661548
4904 13661548 14122909 14632814 15104647 15565282 16053308 16593794 17164050 17868024 18645732
4895 18645732 19539159 20437823 21444375 22546324 23844570 25180705 26610447 28088246
4887 28088246 29809723 31785588 34101035 36539611 38673764 40076159 41416995 42856362
$$ packed form
4954D021495R3189R3600J69331J76359J77708J86127J87797J40862J32668J35993
4944E515129J28978Q2831R5391R5234Q6160J22061J28393R9739J05338R9889J19706
4933F678849J45387J32672J62874K04821J95022K13941K32767K68240K65961K54665
4923H755199K73209K62394K48330K38012K62461K79754K95912K45775K37582K18230
4913A1316858J85692J65667K10342K11437K85540K84227K80764L08145M12876
4904A3661548M61361N09905M71833M60635M88026N40486N70256P03974P77708
4895A8645732Q93427Q98664J006552J101949J298246J336135J429742J477799
4887B8088246J721477J975865K315447K438576K134153J402395J340836J439367
$$ plain form
4879 42856362 44817416 47389229 50706697 54776059 60194629 66980096 75326119 84818616
4871 84818616 95795904 107999457 121648769 137332430 157701218 185620002 223378980
4864 223378980 268369072 310211226 318363478 292365978 254735321 212489667 177282063
4857 177282063 148541594 124164052 105035338 90825954 79755219 71057988 63961945
4850 63961945 58166376 53213052 49036729 45313004 42111780 39236240 36731793 34470400
4842 34470400 32539163 30753500 29189641 27734978 26382216 25084769 23939911 22869212
4834 22869212 21956519 21128300 20336504 19509710 18618349 17656467 16794204 15945858 15225304
4825 15225304 14494451 13837612 13231943 12760981 12371944 12043022 11713307 11433626 11160847
$$ packed form
4879D2856362J961054K571813L317468M069362N418570O785467Q346023R492497
4871H4818616J0977288J2203553J3649312J5683661K0368788K7918784L7758978
4864B23378980M4990092M1842154Q152252k5997500l7630657m2245654l5207604
4857A77282063k8740469k4377542j9128714j4209384j1070735q697231p096043
4850F3961945n795569m953324m176323l723725l201224k875540k504447k261393
4842C4470400j931237j785663j563859j454663j352762j297447j144858j070699
4834B2869212r12693q28219p91796q26794q91361r61882q62263q48346p20554
4825A5225304p30853o56839o05669m70962l89037l28922l29715k79681k72779
$$ plain form
4816 11160847 10919661 10708429 10516826 10371460 10207069 10066293 9985687 9959987 10017444 10119145
4806 10119145 10176270 9917912 9446277 8964251 8486085 8052703 7707473 7393044 7113018 6894957
4796 6894957 6711413 6543660 6338799 6192269 6020572 5848044 5725951 5602077 5452270 5324767
4786 5324767 5151594 4995039 4809294 4641327 4459407 4344381 4207614 4072311 3943246 3855504
4776 3855504 3776157 3723271 3677924 3617279 3517444 3433124 3295569 3204441 3070487 3001539 2923293
4765 2923293 2885765 2855814 2784022 2726442 2690730 2642278 2606875 2575632 2568931 2502311 2468956 2402717
4753 2402717 2373146 2328164 2293558 2221582 2197031 2179160 2160568 2133443 2077922 2038895 2006240
4742 2006240 1957506 1939643 1904306 1874579 1869247 1840756 1814482 1796758 1785115 1774617 1775027 1800227
$$ packed form
4816A1160847k41186k11232j91603j45366j64391j40776q0606k5700N7457J01701
4806A0119145N7125k58358m71635m82026m78166m33382l45230l14429k80026k18061
4796F894957j83544j67753k04861j46530j71697j72528j22093j23874j49807j27503
4786E324767j73173j56555j85745j67967j81920j15026j36767j35303j29065q7742
4776C855504p9347n2886m5347o0645r9835q4320j37555r1128j33954o8948p8246
4765B923293l7528k9951p1792n7580l5712m8452l5403l1243o701o6620l3355o6239
4753B402717k9571m4982l4606p1976k4551j7871j8592k7125n5521l9027l2655
4742B006240m8734j7863l5337k9727n332k8491k6274j7724j1643j0498M10K5200
$$ plain form
4730 1800227 1806109 1828337 1824063 1788786 1762523 1735014 1730260 1704624 1677179 1666447 1639551 1632264
4718 1632264 1609774 1607240 1561215 1553746 1522088 1484683 1495020 1500608 1481692 1469436 1464385 1427623
4706 1427623 1372521 1320894 1287747 1261994 1243555 1203153 1148441 1147716 1123468 1107596 1105972 1096519
4694 1096519 1125824 1128102 1144916 1195080 1220945 1261935 1258269 1238468 1222897 1205594 1157377 1119361
4682 1119361 1092235 1093396 1085780 1081228 1074041 1068293 1056249 1030779 1047840 1036262 1060638 1059625 1047716
4669 1047716 1049778 1057398 1078554 1092207 1094035 1152192 1169581 1187521 1228240 1244378 1242240 1299622
4657 1299622 1331098 1329485 1317822 1327982 1375203 1393764 1461206 1562950 1689413 1812287 1927698
4646 1927698 2046139 2168861 2346417 2535059 2797537 3201846 3725551 4305544 4790811 4842968
$$ packed form
4730A800227N882K2228m274l5277k6263k7509m754k5636k7445j0732k6896p287
4718A632264k2490k534m6025p469l1658l7405J0337N588j8916j2256n051l6762
4706A427623n5102n1627l3147k5753j8439m0402n4712p25k4248j5872j624r453
4694A096519K9305K278J6814N0164K5865M0990l666j9801j5571j7303m8217l8016
4682A119361k7126J161p616m552p187n748j2044k5470J7061j1578K4376j013j1909
4669A047716K062P620K1156J3653J828N8157J7389J7940M0719J6138k138N7382
4657A299622L1476j613j1663J0160M7221J8561O7442J01744J26463J22874J15411
4646A927698J18441J22722J77556J88642K62478M04309N23705N79993M85267N2157
$$ plain form
4636 4842968 4650263 4326552 3921419 3491584 3057107 2678151 2328559 2057554 1877893 1702999
4626 1702999 1580202 1461622 1372211 1269094 1209226 1146530 1105916 1051827 1017631 992985 955570
4615 955570 920598 916816 911458 863696 856015 858686 858309 864130 849357 831478 824991 806782 797846
4602 797846 802526 791874 823847 849325 867091 872592 905740 952063 977947 1007781 1092986 1212237
4590 1212237 1324055 1441100 1512067 1452266 1348362 1214437 1066706 964456 868091 818912
4580 818912 803072 761057 709097 701617 684486 694578 715907 685643 643903 638175 672867 652494
4568 652494 655522 654812 650656 669633 669485 653580 642953 661041 693070 714876 714778 746587 749700 804207
4554 804207 873725 950059 991776 1024985 1150776 1294860 1474493 1686025 1908081 2032128
$$ packed form
4636D842968j92705l23711m05133m29835m34477l78956l49592k71005j79661j74894
4626A702999j22797j18580q9411j03117n9868o2696m0614n4089l4196k4646l7415
4615I55570l4972l782n358m7762p681K671l77N821j4773j7879o487j8209q936
4602G97846M680j0652L1973K5478J7766N501L3148M6323K5884K9834Q5205J19251
4590A212237J11818J17045P0967n9801j03904j33925j47731j02250r6365m9179
4580H18912j5840m2015n1960p480j7131J0092K1329l0264m1740n728L4692k0373
4568F52494L028p10m156J8977j48j5905j0627J8088L2029K1806r8L1809L113N4507
4554H04207O9518P6334M1717L3209J25791J44084J79633K11532K22056J24047
$$ plain form
4544 2032128 1930150 1763824 1525733 1305339 1144815 1007619 895543 796037 731753 680794
4534 680794 636863 608147 586246 561000 505043 501279 494596 473753 462812 487875 474368 459657
4522 459657 452094 422544 374382 389504 419726 398527 370441 367008 355434 345415 334303 327272
4510 327272 291608 312808 348035 324257 319870 332786 336114 331398 313376 309368 310110 326665 302317
4497 302317 288650 306571 287643 285490 282220 292655 309927 295513 292284 322840 330341 320380 304420
4484 304420 313491 304755 259766 243078 243915 250512 234187 230573 223403 212679 204459 211609 228555
4471 228555 222424 215990 190095 196127 210208 202215 207356 193890 185924 217853 231338 213623 205257
4458 205257 214355 215167 196886 192819 186643 191860 194164 171384 166733 168435 150169 156855 157474 146760
$$ packed form
4544B032128j01978j66326k38091k20394j60524j37196j12076r9506o4284n0959
4534F80794m3931k8716k1901k5246n5957l764o683k0843j0941K5063j3507j4711
4522D59657p563k9550m8162J5122L0222k1199k8086l433j1574j0019j1112p031
4510C27272l5664K1200L5227k3778m387J2916L328m716j8022m008P42J6555k4348
4497C02317j3667J7921j8928k153l270J0435J7272j4414l229L0556P501r961j5960
4484C04420R071q736m4989j6688Q37O597j6325l614p170j0724q220P150J6946
4471B28555o131o434k5895O032J4081p993N141j3466p966L1929J3485j7715q366
4458B05257R098Q12j8281m067o176N217K304k2780m651J702j8266O686O19j0714
$$ plain form
4444 146760 162025 161546 168539 178971 181078 177372 182591 165845 136962 142187 168425 175476 195673
4431 195673 172270 166699 156517 162108 167557 147388 134033 128674 138886 148357 155381 135429 147305
4418 147305 143729 150788 141390 156693 130676 129510 155696 116816 120626 139712 143500 142219 119327
4405 119327 95283 132390 136290 132668 128657 129748 133841 169528 180151 153776 126598 135082 100081
4392 100081 97816 123230 129520 127261 113279 99704 92381 84510 106928 121372 129220 139457 139045
4379 139045 112726 123056 113206 118624 107181 125294 135715 145899 147352 111602 108645 85519
4367 85519 84559 79072 80052 74912 79418 67511 58639 56676 55958 75231 98009 79120 47272 88352
4353 88352 104593 82547 80567 78371 101427 81929 95588 79418 90091 99954 93206 101454 103958
$$ packed form
4444A46760J5265m79O993J0432K107l706N219j6746k8883N225K6238P051K0197
4431A95673k3403n571j0182N591N449k0169j3355n359J0212R471P024j9952J1876
4418A47305l576P059r398J5303k6017j166K6186l8880L810J9086L788j281k2892
4405A19327k4044L7107L900l622m011J091M093L5687J0623k6375k7178Q484l5001
4392A00081k265K5414O290k259j3982j3575p323p871K2418J4444P848J0237m12
4379A39045k6319J0330r850N418j1443J8113J0421J0184J453l5750k957k3126
4367H5519r60n487R80n140M506j1907q872j963p18J9273K2778j8889l1848M1080
4353H8352J6241k2046j980k196K3056j9498J3659j6170J0673R863o748Q248K504
$$ plain form
4340 103958 106728 117296 132319 122968 111553 123614 99301 80568 82728 88832 99386 78461
4328 78461 79485 101022 85354 68769 115338 132933 108978 79627 109266 131167 137406 97629
4316 97629 59912 59767 57121 57804 78543 102735 90826 91816 92366 95430 100736 103159 114621 100947
4302 100947 72193 94663 90216 70740 86049 92957 95849 91531 68234 76384 88992 83112 79172
4289 79172 74388 82508 100484 104191 83352 89562 86005 92444 86489 68952 82712 85771 103319
4276 103319 94299 93948 122826 102223 91981 104328 99811 97289 89119 87811 64770 78541 77948
4263 77948 75741 94466 83209 71800 78340 103011 94624 89818 117209 97434 119231 125566 112645
4250 112645 100753 117272 94745 95146 85025 100352 134013 115034 100138 111258 124002 118242
$$ packed form
4340A03958K770J0568J5023r351j1415J2061k4313j8733K160O104J0554k0925
4328G8461J024K1537j5668j6585M6569J7595k3955k9351K9639K1901O239l9777
4316I7629l7717j45k646O83K0739K4192j1909R90N50L064N306K423J1462j3674
4302A00947k8754K2470m447j9476J5309O908K892m318k3297Q150J2608n880l940
4289G9172m784Q120J7976L707k0839O210l557O439n955j7537J3760L059J7548
4276A03319r020l51K8878k0603j0242J2347m517k522q170j308k3041J3771n93
4263G7948k207J8725j1257j1409O540K4671q387m806K7391j9775K1797O335j2921
4250A12645j1892J6519k2527M01j0121J5327L3661j8979j4896J1120J2744n760
$$ plain form
4238 118242 131039 124554 140511 144583 132768 147205 115345 112239 78984 76246 93431 95487 104856
4225 104856 97339 107713 104393 118469 115971 118858 115325 119607 121153 109093 116332 101140 95475
4212 95475 103741 91064 104938 130622 102608 79591 103601 108557 111127 104858 135535 122952 104338
4199 104338 106777 119833 138830 123001 106884 100378 92854 83380 104014 107596 117323 112793 104221
4186 104221 99844 94045 104845 76208 78372 104391 99639 88387 76580 64862 78847 84859 101019
4173 101019 93255 77425 64048 63354 61747 81749 72963 82329 83265 99560 74665 66107 80590
4160 80590 95381 78478 97475 109695 93898 86287 89737 90229 87105 120561 110423 94262 103408
4147 103408 100458 100639 104337 100432 111934 86839 76317 76763 69265 62396 79563 91119 89505 94858
$$ packed form
4238A18242J2797o485J5957M072j1815J4437l1860l106l3255k738J7185K056R369
4225A04856p517J0374l320J4076k498K887l533M282J546j2060P239j5192n665
4212I5475Q266j2677J3874K5684k8014k3017K4010M956K570o269L0677j2583j8614
4199A04338K439J3056J8997j5829j6117o506p524r474K0634L582R727m530q572
4186A04221m377n799J0800k8637K164K6019m752j1252j1807j1718J3985O012J6160
4173A01019p764j5830j3377o94j607K0002q786R366R36J6295k4895q558J4483
4160H0590J4791j6903J8997J2220j5797p611L450M92l124L3456j0138j6161R146
4147A03408k950J81L698l905J1502k5095j0522M46p498o869J7167J1556j614N353
$$ plain form
4133 94858 92706 90447 71242 84839 136403 122321 128519 162191 150647 143965 165079 197917 219101
4120 219101 227451 219350 194437 150666 127497 118471 109892 103240 105425 104320 100075 119399 114069
4107 114069 109779 80383 77487 62852 68980 90818 92027 62260 86218 93205 95339 109154 94532
4094 94532 81820 63665 68593 72033 67562 59432 66689 65462 78033 79293 82990 80631 101975 78164
4080 78164 76444 71046 78026 83868 78946 94487 58532 69694 83015 89419 84748 78129 88823
4067 88823 87229 96252 85365 82350 87186 70976 85001 106839 102900 86192 80135 71390 90874
4054 90874 100389 111866 132936 122368 113875 120437 147190 181771 193426 201852 221483 253159 288652
4041 288652 337325 402108 401769 365095 343562 286441 235328 210261 193352 161458 147139 142509
$$ packed form
4133I4858k152k259j9205J3597N1564j4082O198L3672j1544o682K1114L2838K1184
4120B19101Q350q101k4913m3771k3169r026q579o652K185j105m245J9324n330
4107A14069m290k9396k896j4635O128K1838J209k9767K3958O987K134J3815j4622
4094I4532j2712j8155M928L440m471q130P257j227J2571J260L697k359K1344k3811
4080G8164j720n398O980N842m922J5541l5955J1162J3321O404m671o619J0694
4067H8823j594R023j0887l015M836j6210J4025K1838l939j6708o057q745J9484
4054I0874R515J1477K1070j0568q493O562K6753L4581J1655Q426J9631L1676L5493
4041B88652M8673O4783l39l6674k1533n7121n1113k5067j6909l1894j4319m630
$$ plain form
4029 142509 137146 129143 97095 91029 73251 80634 103466 106843 129511 127814 142094 125408 144878
4016 144878 133810 109172 89744 89888 109986 121384 107526 88742 98253 96845 79454 75972 92390
4003 92390 103440 117742 123234 121123 114166 82385 92728 109384 131417 112315 116880 110380 95662
3990 95662 110810 103413 105505 97102 113134 128427 97563 125482 143700 132672 132444 143325 180910
3977 180910 174779 147426 139781 152616 154112 166621 159079 164580 187918 225694 233097 250376 277815
3964 277815 298558 329969 360351 400851 483353 536299 573352 596675 595303 558474 534639 486154
3952 486154 468613 423708 391298 361291 309865 302972 330488 310576 293348 264579 245630 237025
3940 237025 217479 199598 204755 205503 215061 205114 202399 214032 204152 212548 219894 229619 239040 224958
$$ packed form
4029A42509n363q003l2048o066j7778P383K2832L377K2668j697J4280j6686J9470
4016A44878j1068k4638j9428J44K0098J1398j3858j8784R511j408j7391l482J6418
4003I2390J1050J4302N492k111o957l1781J0343J6656K2033j9102M565o500j4718
3990I5662J5148p397K092q403J6032J5293l0864K7919J8218j1028k28J0881L7585
3977A80910o131k7353p645J2835J496J2509p542N501K3338L7776P403J7279K7439
3964B77815K0743L1411L0382M0500Q2502N2946L7053K3323j372l6829k3835m8485
3952D86154j7541m4905l2410l0007n1426o893K7516j9912j7228k8769j8949q605
3940B37025j9546j7881N157P48R558r947k715J1633r880Q396P346R725R421j4082
$$ plain form
3926 224958 210880 218851 219894 222330 216401 229672 234552 218280 226525 228907 192529 190354 180975
3913 180975 201248 216153 231856 244112 244421 265198 263426 275586 272717 248146 254099 264041 294462
3900 294462 278309 276021 296201 289576 295737 289104 293808 294708 292754 294826 304222 303334 307495 314689
3886 314689 327792 341897 334651 336939 362751 400469 391392 398990 425577 416936 422937 433488 460418
3873 460418 463705 475257 476273 487552 526112 555306 576433 571944 568135 610216 654900 670440
3861 670440 681900 705270 731189 748241 767598 784935 833453 880482 930086 988591 1058994 1092850
3849 1092850 1112389 1139630 1185706 1234963 1276871 1364979 1416870 1453015 1516007 1596761 1665999
3838 1665999 1733363 1782371 1833071 1898577 1985720 2029091 2047892 2090005 2080971 2098896 2109472 2107821
$$ packed form
3926B24958j4078P971J043K436n929J3271M880j6272Q245K382l6378k175r379
3913A80975K0273J4905J5703J2256L09K0777j772J2160k869k4571N953R942L0421
3900B94462j6153k288K0180o625O161o633M704R00j954K072R396q88M161P194
3886C14689J3103J4105p246K288K5812L7718r077P598K6587q641O001J0551K6930
3873D60418L287J1552J016J1279L8560K9194K1127m489l809M2081M4684J5540
3861F70440J1460K3370K5919J7052J9357J7337M8518M7029M9604N8505P0403L3856
3849A092850J9539K7241M6076M9257M1908Q8108N1891L6145O2992Q0754O9238
3838A665999O7364M9008N0700O5506Q7143M3371J8801M2113r034J7925J0576j651
$$ plain form
3826 2107821 2079493 2057075 2015593 1961292 1925412 1863184 1761970 1728546 1696293 1650895 1586602
3815 1586602 1492595 1414801 1342479 1273085 1236570 1180854 1120990 1070176 1050116 1003306 976179
3804 976179 928646 866896 844369 808596 760132 745167 714096 699649 655764 624046 647166 625444
3792 625444 589459 549313 509465 494675 529811 528021 517811 490760 444646 445971 445950 413537 409018
3779 409018 402396 388549 376290 348221 349416 341454 353562 329075 315229 312205 295211 291522 316527
3766 316527 291629 281523 263401 257671 268922 253263 248510 227931 231929 221243 257319 234531
3754 234531 215203 226472 206230 199398 204457 189201 200415 195471 196198 185881 197037 204030 200322
3741 200322 169353 172685 154581 156821 148077 139764 151391 170448 167028 127836 116087 125044 114725
$$ packed form
3826B107821k8328k2418m1482n4301l5880o2228j01214l3424l2253m5398o4293
3815A586602r4007p7794p2322o9394l6515n5716n9864n0814k0060m6810k7127
3804I76179m7533o1750k2527l5773m8464j4965l1071j4447m3885l1718K3120k1722
3792F25444l5985m0146l9848j4790L5136j790j0210k7051m6114J325k1l2413m519
3779D09018o622j3847j2259k8069J195p962J2108k4487j3846l024j6994l689K5005
3766C16527k4898j0106j8122n730J1251j5659m753k0579L998j0686L6076k2788
3754B34531j9328J1269k0242o832N059j5256J1214m944P27j0317J1156O993l708
3741B00322l0969L332j8104K240q744q313J1627J9057l420l9192j1749Q957j0319
$$ plain form
3728 114725 132947 134624 124851 109810 127670 116757 118763 112064 96249 99112 103571 113562 106311
3715 106311 114444 104512 81175 96172 122105 120421 137534 135648 109046 90936 95710 108835 111451
3702 111451 126807 117003 109606 105938 109810 112789 119385 108964 107841 145536 112866 106807 132498
3689 132498 146112 116416 92271 95103 86739 84927 85253 93166 105406 103464 104986 99172 92529 72660
3675 72660 78052 96419 91883 93412 104908 105966 84104 82582 91406 126159 145762 105528 104432
3662 104432 102837 94541 110673 122892 104822 106456 93960 117888 110062 113062 118971 121442 85324
3649 85324 77567 96586 121612 104013 77405 71732 70701 73657 93707 94395 79059 106472 110993
3636 110993 103517 88525 99916 97346 111209 121504 133507 103149 89907 95679 71342 99957
$$ packed form
3728A14725J8222J677r773j5041J7860j0913K006o699j5815K863M459R991p251
3715A06311Q133r932k3337J4997K5933j684J7113j886k6602j8110M774J3125K616
3702A11451J5356r804p397l668L872K979O596j0421j123L7695l2670o059K5691
3689A32498J3614k9696k4145K832q364j812L26P913J2240j942J522n814o643j9869
3675G2660N392J8367m536J529J1496J058k1862j522Q824L4753J9603m0234j096
3662A04432j595q296J6132J2219j8070J634j2496K3928p826L000N909K471l6118
3649H5324p757J9019K5026j7599k6608n673j031K956K0050O88j5336K7413M521
3636A10993p476j4992J1391k570J3863J0295J2003l0358j3242N772k4337K8615
$$ plain form
3624 99957 114036 111123 131255 122871 119789 136754 134416 129022 119282 130548 137524 126318 114922
3611 114922 97638 98017 85615 97679 128438 130321 102290 72114 95947 119639 131321 134026
3599 134026 136398 149036 131338 140139 129789 124911 146275 136483 116838 138011 144455 127421 161883
3586 161883 182283 159341 146325 149843 139571 127868 123566 134458 145149 127757 118770 109728
3574 109728 134870 125156 122820 144569 169425 191365 180238 160172 170876 203034 154012 152695
3562 152695 176757 181332 183566 172854 168356 188323 197126 165096 165444 150834 163729 186205 171346
3549 171346 184662 187244 189929 195705 196609 189129 211873 196863 189896 201988 233151 248084 233422
3536 233422 231350 233269 253200 257653 238614 250196 262444 242749 263826 252573 245025 244376 252706
$$ packed form
3624I9957J4079k913K0132q384l082J6965k338n394r740J1266O976j1206j1396
3611A14922j7284L79j2402J2064L0759J883k8031l0176K3833K3692J1682K705
3599A34026K372J2638j7698Q801j0350m878K1364r792j9645K1173O444j7034L4462
3586A61883K0400k2942j3016L518j0272j1703m302J0892J0691j7392q987r042
3574A09728K5142r714k336K1749K4856K1940j1127k0066J0704L2158m9022j317
3562A52695K4062M575K234j0712m498J9967Q803l2030L48j4610J2895K2476j4859
3549A71346J3316K582K685N776R04p480K2744j5010o967J2092L1163J4933j4662
3536B33422k072J919J9931M453j9039J1582J2248j9695K1077j1253p548o49Q330
$$ plain form
3523 252706 261060 238539 259078 257402 253845 245073 243542 254452 245482 246016 251299 267163 249581
3510 249581 238835 226114 241109 257534 266624 274280 291148 278356 278830 295046 293612 288511 286113
3497 286113 307147 301169 297723 300695 304810 301240 297645 277213 262279 281474 271323 240925 252962
3484 252962 269071 281669 282958 277749 282982 285741 279491 255426 263485 290053 296469 262157 261003
3471 261003 267826 286478 292043 286312 281298 290228 291934 319606 283496 272862 268320 276797 302788
3458 302788 290592 318162 318157 307145 325895 313167 299851 313884 295462 288653 310787 301600 298647
3445 298647 280630 277013 284627 277888 275562 268803 275707 258022 280758 322842 338201 317540 301819
3432 301819 318701 291383 310178 329309 328718 309468 314764 325769 302926 328811 301543 303185
$$ packed form
3523B52706Q354k2521K0539j676l557q772j531J0910q970N34N283J5864j7582
3510B49581j0746j2721J4995J6425R090P656J6868j2792M74J6216j434n101k398
3497B86113K1034n978l446K972M115l570l595k0432j4934J9195j0151l0398J2037
3484B52962J6109J2598J289n209N233K759o250k4065Q059K6568O416l4312j154
3471B61003O823J8652N565n731n014Q930J706K7672l6110j0634m542Q477K5991
3458C02788j2196K7570nj1012J8750j2728j3316J4033j8422o809K2134r187k953
3445B98647j8017l617P614o739k326o759O904j7685K2736M2084J5359k0661j5721
3432C01819J6882k7318J8795J9131n91j9250N296J1005k2843K5885k7268J642
$$ plain form
3420 303185 317023 329980 333602 341768 351475 353424 351281 364524 370273 368563 370439 391326 380289
3407 380289 379711 390144 409772 409020 406419 411643 454979 494376 499551 523420 543811 565418 609854
3394 609854 656749 729996 824818 918497 964386 959672 895898 837382 812927 793158 758998 752495
3382 752495 736840 729383 746488 776110 780123 790183 797045 862624 926330 998510 1075747 1135124
3370 1135124 1209539 1339908 1468732 1627648 1846169 2098240 2341958 2526067 2654508 2713373
3360 2713373 2690311 2657808 2587535 2381831 2160388 1932505 1752843 1609400 1501984 1392773
3350 1392773 1361039 1312832 1278103 1269434 1267423 1271325 1298108 1345253 1363813 1435025 1526134 1598436
3338 1598436 1723721 1880985 2062593 2241854 2490219 2806657 3212936 3625138 4001414 4187261
$$ packed form
3420C03185J3838J2957L622Q166R707J949k143J3243N749j710J876K0887j1037
3407C80289n78J0433J9628p52k601N224M3336L9397N175K3869K0391K1607M4436
3394F09854M6895P3247R4822R3679M5889m714o3774n8516k4455j9769l4160o503
3382G52495j5655p457J7105K9622M013J0060O862O5579O3706P2180P7237N9377
3370A135124P4415J30369J28824J58916K18521K52071K43718J84109J28441N8865
3360B713373k3062l2503p0273k05704k21443k27883j79662j43443j07416j09211
3350A392773l1734m8207l4729q669k011L902K6783M7145J8560P1212R1109P2302
3338A598436J25285J57264J81608J79261K48365L16438M06279M12202L76276J85847
$$ plain form
3328 4187261 4094121 3853594 3535248 3125328 2736398 2394438 2126193 1901556 1732453 1597503
3318 1597503 1494507 1451136 1395385 1350850 1297369 1260199 1233698 1247195 1247429 1264424 1309660 1325871
3306 1325871 1343237 1374024 1426129 1471923 1571419 1675166 1786072 1915681 2083562 2243771
3296 2243771 2334321 2315964 2176095 1977815 1823905 1687246 1533441 1432294 1380982 1327391
3286 1327391 1286782 1276193 1295256 1321667 1336500 1405256 1482019 1547922 1589339 1570199 1500652
3275 1500652 1419411 1344473 1280789 1202995 1152894 1117517 1071889 1066051 1059148 1060549 1002854 1011820
3263 1011820 1054719 1051771 1076253 1100336 1129660 1173306 1238771 1277410 1334804 1375185 1375401 1334783
3251 1334783 1277892 1194026 1113502 1073219 1025694 989936 957132 932056 922990 882118 889597 904333
$$ packed form
3328D187261r3140k40527l18346m09920l88930l41960k68245k24637j69103j34950
3318A597503j02996m3371n5751m4535n3481l7170k6501J3497K34J6995M5236J6211
3306A325871J7366L0787N2105M5794R9496J03747J10906J29609J67881J60209
3296B243771R0550j8357j39869j98280j53910j36659j53805j01147n1312n3591
3286A327391m0609j0589J9063K6411J4833O8756P6763O5903M1417j9140o9547
3275A500652q1241p4938o3684p7794n0101l5377m5628n838o903J401n7695Q966
3263A011820M2899k948K4482K4083K9324M3646O5465L8639N7394M0381K16m0618
3251A334783n6891q3866q0524m0283m7525l5758l2804k5076r066m0872P479J4736
$$ plain form
3239 904333 941103 930751 944432 925250 950444 963431 952834 956265 938190 910665 926049 936709
3227 936709 920344 935212 939598 960062 960975 977414 997595 1030951 1053326 1112624 1124301 1119733
3215 1119733 1177316 1245311 1333001 1394441 1463075 1569014 1664699 1782783 1942756 2077409 2234929
3204 2234929 2424873 2622016 2800815 2991678 3089424 3081028 2991981 2827049 2648843 2478625
3194 2478625 2284537 2082022 1922085 1783255 1675172 1544197 1474498 1458756 1443444 1429729
3184 1429729 1386381 1390760 1389897 1390551 1405900 1455703 1550018 1645913 1752658 1846132 1999915 2134326
3172 2134326 2358007 2618511 2962259 3385663 3756745 3935883 3862672 3675118 3403682 3109156
3162 3109156 2837063 2529987 2244716 2002447 1813426 1665209 1509853 1412262 1355691 1297665
$$ packed form
3239I04333L6770j0352J3681j9182K5194J2987j0597L431j8075k7525J5384J0660
3227I36709j6365J4868M386K0464R13J6439K0181L3356K2375N9298J1677m568
3215A119733N7583O7995Q7690O1440O8634J05939R5685J18084J59973J34653J57520
3204B234929J89944J97143J78799J90863R7746q396q9047j64932j78206j70218
3194B478625j94088k02515j59937j38830j08083j30975o9699j5742j5312j3715
3184A429729m3348M379q63O54J5349M9803R4315R5895J06745R3474J53783J34411
3172B134326K23681K60504L43748M23404L71082J79138p3211j87554k71436k94526
3162C109156k72093l07076k85271k42269j89021j48217j55356r7591n6571n8026
$$ plain form
3152 1297665 1218407 1192855 1186991 1172073 1154008 1132991 1143835 1163423 1185967 1224365 1270374 1325728
3140 1325728 1404361 1493466 1648928 1827446 1987824 2091200 2086956 1991370 1863075 1712729
3130 1712729 1571770 1427886 1292348 1162637 1043991 951403 868161 808356 746520 733710
3120 733710 705584 669656 648272 623395 598455 575835 556777 555857 562311 560746 544467 531824
3108 531824 514162 529492 526692 498277 481037 457661 474209 457363 472094 469912 441353 452194
3096 452194 435426 405229 406267 405719 393819 367761 353557 334199 318788 342812 365847 343894
3084 343894 327249 330425 333381 301933 321131 344796 354108 372703 348794 336152 325581 313203
3072 313203 310332 310145 297082 285655 268727 287016 281871 287346 282598 263926 251229 252220 241888
$$ packed form
3152A297665p9258k5552n864j4918j8065k1017J0844J9588K2544L8398M6009N5354
3140A325728P8633Q9105J55462J78518J60378J03376m244r5586j28295j50346
3130A712729j40959j43884j35538j29711j18646r2588q3242n9805o1836j2810
3120G33710k8126l5928k1384k4877k4940k2620j9058r20O454j565j6279j2643
3108E31824j7662J5330k800k8415j7240k3376J6548j6846J4731k182k8559J0841
3096D52194j6768l0197J038n48j1900k6058j4204j9358j5411K4024K3035k1953
3084C43894j6645L176K956l1448J9198K3665R312J8595k3909j2642j0571j2378
3072C13203k871j87j3063j1427j6928J8289n145N475m748j8672j2697R91j0332
$$ plain form
3059 241888 232842 233668 217819 231965 218569 204427 214691 223894 228636 229070 244204 214475 212991
3046 212991 218802 220891 219971 221536 203405 196681 179268 207599 220933 220746 177064 168078 166399 136303
3032 136303 162306 164688 179639 175049 184995 180293 171547 163233 162366 132367 165965 148184 140778
3019 140778 130608 127562 128015 127762 118573 112765 120536 119612 159650 174211 171917 154266 155601 161400
3005 161400 154051 153645 146085 131028 136333 150267 167290 158090 143345 132939 165601 165286 162936
2992 162936 157529 166980 165547 164416 186629 160857 183611 202140 189546 193033 207718 200350 187532
2979 187532 167388 132063 149113 162167 164906 173793 188704 201056 199786 199107 189623 243371 268533
2966 268533 252206 250517 288945 310810 304421 317432 318107 333003 370135 379545 402261 448431 495994
$$ packed form
3059B41888r046Q26j5849J4146j3396j4142J0264R203M742M34J5134k9729j484
3046B12991N811K089r20J565j8131o724j7413K8331J3334j87m3682q986j679l0096
3032A36303K6003K382J4951m590R946m702q746q314q67k9999L3598j7781p406
3019A40778j0170l046M53k53r189n808P771r24M0038J4561k294j7651J335N799
3005A61400p349m06p560j5057N305J3934J7023r200j4745j0406L2662l15k350
2992A62936n407R451j433j131K2213k5772K2754J8529j2594L487J4685p368j2818
2979A87532k0144l5325J7050J3054K739Q887J4911J2352j270o79r484N3748K5162
2966B68533j6327j689L8428K1865o389J3011O75J4896L7132R410K2716M6170M7563
$$ plain form
2953 495994 551288 542622 523494 522580 510966 505497 504214 492154 487349 487261 515041 529872 512280
2940 512280 513180 498578 485140 462738 461403 476398 458604 468670 467221 472883 464899 491229 492424
2927 492424 494870 511083 524198 555820 592860 653235 700520 754623 776553 790896 774693 746939
2915 746939 679252 678844 659743 654506 697543 701589 668110 632838 606361 595058 568723 519149
2903 519149 513493 506315 481504 497072 497484 489894 474658 460808 477864 466365 473161 474553 482467
2890 482467 481140 496443 495452 507639 528101 533481 517462 484826 478269 455370 444292 447199 432174
2877 432174 455881 441685 423735 429774 419627 417032 400865 389704 372887 378598 363057 337506
2865 337506 354720 365357 365266 370896 368319 330818 316168 283339 277291 268507 264773 278433 259988
$$ packed form
2953D95994N5294q666j9128r14j1614n469j283j2060m805q8K7780J4831j7592
2940E12280R00j4602j3438k2402j335J4995j7794J0066j449N662p984K6330J195
2927D92424K446J6213J3115L1622L7040O0375M7285N4103K1930J4343j6203k7754
2915G46939o7687m08j9101n237M3037M046l3479l5272k6477j1303k6335m9574
2903E19149n656p178k4811J5568M12p590j5236j3850J7056j1499O796J392P914
2890D82467j327J5303r91J2187K0462N380j6019l2636o557k2899j1078K907j5025
2877D32174K3707j4196j7950O039j0147k595j6167j1161j6817N711j5541k5551
2865C37506J7214J0637r1N630k577l7501j4650l2829o048q784l734J3660j8445
$$ plain form
2852 259988 247058 249550 228654 215723 246945 284560 293372 282016 268398 262780 273695 248809
2840 248809 266880 260378 244910 239612 242305 242014 240544 221936 223266 222197 233009 250245 232975
2827 232975 210241 182899 189100 156459 146633 152384 170348 184127 167514 171465 163966 155003 165870
2814 165870 156364 159105 143751 156275 134605 121194 125592 140301 131471 123896 130646 133216 116928
2801 116928 94609 89958 104781 120621 93912 79161 69937 60844 62266 89652 88642 99461 108645
2788 108645 112102 87590 58547 66771 72141 77508 92234 46881 45444 39025 38868 40432 50057 37409
2774 37409 45723 40212 52953 61662 40976 43262 43431 73199 58335 32976 30318 25187 31899 32887
2760 32887 35016 43721 31148 19604 39730 27077 32754 24439 23305 45231 33458 48960 30760
$$ packed form
2852B59988j2930K492k0896j2931L1222L7615Q812j1356j3618n618J0915k4886
2840B48809J8071o502j5468n298K693k91j470j8608J330j069J0812J7236j7270
2827B32975k2734k7342O201l2641r826N751J7964J3779j6613L951p499q963J0867
2814A65870r506K741j5354J2524k1670j3411M398J4709q830p575O750K570j6288
2801A16928k2319m651J4823J5840k6709j4751r224r093J422K7386j010J0819R184
2788A08645L457k4512k9043Q224N370N367J4726m5353j437o419j57J564R625j2648
2774C7409Q314n511J2741Q709k0686K286J69K9768j4864k5359k658n131O712R88
2760C2887K129Q705j2573j1544K0126j2653N677q315j134K1926j1773J5502j8200
$$ plain form
2747 30760 22221 55546 65076 35273 35848 34814 38636 31730 42829 31214 23138 7322 8137 578
2733 578 5322 33467 16347 10049 -7554 -9502 20549 13241 34124 49720 46626 39029 30703 37902
2719 37902 15510 -275 13524 -1091 -18749 -606 -5175 -5508 -4345 -15501 -1648 -18842 3727
2706 3727 1919 -31626 -10539 9557 7082 2101 4447 2172 -542 -5462 12486 11893 10334 11145
2692 11145 12652 5601 5867 -9733 26166 32914 37054 31942 6576 5461 6133 2066 8016 19310
2678 19310 22437 4515 6188 -11364 -10109 -446 -6195 3807 3691 1012 -6507 -6094 -18043 1677
2664 1677 -16446 -8875 -17515 -32579 -35976 -21288 -11036 -6189 -214 -1319 -16742 -25562 -21073 1588
2650 1588 26071 8330 -4954 -12567 -4682 20162 13855 9692 -11264 9022 4678 -4878 2650
$$ packed form
2747C0760q539L3325R530k9803N75j034L822o906J1099j1615q076j5816Q15p559
2733E78M744K8145j7120o298j7603j948L0051p308K0883J5596l094p597q326P199
2719C7902k2392j5785J3799j4615j7658J8143m569l33J163j1156J3853j7194K2569
2706C727j808l3545K1087K0096k475m981K346k275k714m920J7948n93j559Q11
2692A1145J507p051K66j5600L5899O748M140n112k5366j115O72m067N950J1294
2678A9310L127j7922J673j7552J255R663n749J0002j16k679p519M13j1949J9720
2664A677j8123P571q640j5064l397J4688J0252M847N975j105j5423q820M489K2661
2650A588K4483j7741j3284p613P885K4844o307m163k0956K0286m344r556P528
$$ plain form
2637 2650 6576 6538 -23428 -17913 3001 -1542 -8887 -2075 -11140 -5344 -21728 8814 7848 -12559
2623 -12559 -933 -17453 -8224 -8496 -5895 -19160 -15173 -23512 -20183 -15355 -31769 13412 34461
2610 34461 13629 -14736 -5998 7007 -4502 -2153 -11215 -26236 -24111 5144 16982 -7209 -8490
2597 -8490 -6721 5032 -8919 272 -6514 -2477 6097 -6675 -15028 -16360 8016 8448 -11518 -11981
2583 -11981 -15675 -28986 -7269 -14874 -1163 19136 6070 3970 -2386 2973 1624 -27812 -18189
2570 -18189 -2968 3457 -22509 -56638 -33284 -30252 -9409 4772 9576 15363 12304 8856 20603
2557 20603 3272 -20226 -34018 -23711 1500 -4918 -22843 -35237 -16237 -4883 -8826 2100
2545 2100 5867 -32128 -23806 -5587 -23207 -28499 -20744 -11781 -12676 23832 25046 5509 -11838 -13656
$$ packed form
2637B650L926l8k9966N515K0914m543p345O812r065N796j6384L0542r66k0407
2623a2559J1626j6520R229k72K601j3265L987q339L329M828j6414M5181K1049
2610C4461k0832k8365Q738J3005j1509K349r062j5021K125K9255J1838k4191j281
2597h490J769J1753j3951R191o786M037Q574j2772q353j332K4376M32j9966m63
2583a1981l694j3311K1717p605J3711K0299j3066k100o356N359j349k9436R623
2570a8189J5221O425k5966l4129K3354L032K0843J4181M804N787l059l448J1747
2557B0603j7331k3498j3792J0307K5211o418j7925j2394J9000J1354l943J0926
2545B100L767l7995Q322J8219j7620n292P755Q963q95L6508J214j9537j7347j818
$$ plain form
2531 -13656 -5905 17144 -12909 -35968 -40393 -36117 -1101 12956 4032 -14812 -19240 -10538 5285
2518 5285 -6979 -2585 -33676 -38538 -10841 725 -6942 -10806 -10856 -28357 -28148 -36360 -18121 -22534
2504 -22534 -27275 12086 21525 -9499 -30690 -21624 -18690 -12332 -9806 -20963 -10073 15890 12799
2491 12799 4180 -5848 12560 -12534 -28758 -28307 -48286 -43473 -16155 -5482 -5875 -12288 -41341
2478 -41341 -36589 -27295 -29537 -13791 -24450 -26974 -14425 3456 -10507 -11433 -10900 -20831 -24869 1365
2464 1365 -14149 -11840 -2455 -31139 -26318 -28080 -20346 -23246 -19611 7708 4518 -18562 9400 -2211
2450 -2211 -14661 -2061 19178 9352 -7006 9672 3905 3782 3297 -29569 -49704 -27452 -27770 -20042
2436 -20042 -14148 -10779 -6398 -10800 -10099 -17125 -32949 -10981 11107 -7842 -24874 -15634 2594
$$ packed form
2531a3656P751K3049l0053k3059m425M276L5016J4057q924j8844m428Q702J5823
2518E285j2264M394l1091m862K7697J1566p667l864n0j7501K09q212J8239m413
2504b2534m741L9361R439l1024k1191R066K934O358K526j1157J0890K5963l091
2491A2799q619j0028J8408k5094j6224M51j9979M813K7318J0673l93o413k9053
2478d1341M752R294k242J5746j0659k524J2549J7881j3963r26N33r931m038K6234
2464A365j5514K309R385k8684M821j762P734k900L635K7319l190k3080K7962j1611
2450b211j2450J2600K1239r826j6358J6678n767j23m85l2866k0135K2252l18P728
2436b0042N894L369M381m402P01p026j5824K1968K2088j8949j7032R240J8228
$$ plain form
2423 2594 -16156 -33250 -25954 -29711 -31601 -29680 -22182 -25896 -37676 -23007 -8579 -502 -11327
2410 -11327 8236 -3637 -5363 4784 -32934 -29541 -17078 -13022 -10059 -16240 -12458 1815 -10073
2397 -10073 -4359 11106 14126 -1464 9483 7198 -18600 -13516 -17267 -4666 -22936 -28151 -41719
2384 -41719 -38546 -26136 -26199 -36349 -25047 -34138 -52662 -6582 -416 -8718 -18298 5813 2913 -5470
2370 -5470 14823 9142 14737 1142 15032 6124 11981 11539 269 40491 15367 -18906 -11058
2357 -11058 -16727 -24679 -33632 -27353 -9761 -10769 -15432 -7387 -16998 -24881 -6593 9902 5323 -18136
2343 -18136 -14776 -1555 22081 22157 -8368 2167 3905 -3296 -318 1829 -17526 -1650 12728
2330 12728 42769 52855 20748 9080 14952 -10288 -9961 -6834 -28809 -10728 -2406 -7730 -25847
$$ packed form
2423B594j8750j7094P296l757j890J921P498l714j1780J4669J4428Q077j0825
2410a1327J9563j1873j726J0147l7718L393J2463M056K963o181L782J4273j1888
2397a0073N714J5465L020j5590J0947k285k5798N084l751J2601j8270n215j3568
2384d1719L173J2410o3j0150J1302r091j8524M6080O166q302r580K4111k900q383
2370e470K0293n681N595j3595J3890q908N857m42j1270M0222k5124l4273P848
2357a1058n669p952q953O279J7592j008m663Q045r611p883J8288J6495m579k3459
2343a8136L360J3221K3636P6l0525J0535J738p201K978K147j9355J5876J4378
2330A2728L0041J0086l2107j1668N872k5240L27L127k1975J8081Q322n324j8117
$$ plain form
2317 -25847 -42228 -19133 -7147 -158 -11300 -17214 4753 5015 -32781 -46786 -12699 -24820 -23333
2304 -23333 -23684 -42143 -23845 8576 -2194 -10873 -22534 -17149 -7222 -28169 -27126 -35076 -15873
2291 -15873 -15959 -32394 -17623 -6638 4679 -577 -2287 13868 11887 7861 2589 -9586 -4957 13301
2277 13301 10118 18549 3265 -8015 598 -8291 3992 18341 14569 10439 10874 -4920 -20574
2264 -20574 -21334 -3504 -11145 -24336 -32275 -339 10367 1896 4466 -18855 -15019 -18683 -38578
2251 -38578 -26621 -28076 -33208 -61348 -44344 -33257 -36255 -22682 1685 -13665 -12585 -28272 -33425
2238 -33425 -32594 -6442 1261 2284 13860 14130 -97 -835 -2166 4456 19591 33964 37081 41279
2224 41279 13021 9530 433 -2585 4059 -3472 9731 -4565 7330 2 8681 37832 40974
$$ packed form
2317b5847j6381K3095J1986O989j1142n914K1967K62l7796j4005L4087j2121J487
2304b3333l51j8459J8298L2421j0770q679j1661N385R927k0947J043p950J9203
2291a5873q6j6435J4771J0985J1317n256j710J6155j981m026n272j2175M629J8258
2277A3301l183Q431j5284j1280Q613q889J2283J4349l772m130M35j5794j5654
2264b0574p60J7830p641j3191p939L1936J0706q471K570k3321L836l664j9895
2251c8578J1957j455n132k8140J7004J1087k998J3573K4367j5350J080j5687n153
2238c3425Q31K6152P703J023J1576K70j4227p38j331O622J5135J4373L117M198
2224D1279k8258l491r097l018O644p531J3203j4296J1895p328Q679K9151L142
$$ plain form
2211 40974 46811 42161 19161 8316 20207 39927 13800 17368 45532 50314 27041 30647 27520
2198 27520 12466 7181 9832 26599 37711 42138 41414 44375 40942 55043 71548 64537 61321 21590
2184 21590 42549 38894 40820 33880 45029 48457 39495 50259 74237 79379 69879 26724 42835
2171 42835 58637 56717 42450 36560 35986 53193 66594 72858 62151 33916 61135 85199 77407
2158 77407 83102 83883 93012 114090 107449 125275 105586 107722 109610 89023 129423 161079 156788
2145 156788 153432 160398 132896 131092 145267 153910 180791 185949 181083 154397 168202 160267 161752
2132 161752 182117 193070 184345 199270 185282 191408 200958 207139 227658 213698 223822 206453
2120 206453 222357 278869 246696 229061 249371 280900 283689 296814 319858 307732 325899 326766
$$ packed form
2211D0974N837m650k3000j0845J1891J9720k6127L568K8164M782k3273L606l127
2198B7520j5054n285K651J6767J1112M427p24K961l433J4101J6505p011l216l9731
2184B1590K0959l655J926o940J1149L428q962J0764K3978N142r500m3155J6111
2171D2835J5802j920j4267n890n74J7207J3401O264j0707k8235K7219K4064p792
2158G7407N695P81R129K1078o641J7826j9689K136J888k0587M0400L1656m291
2145A56788l356O966k7502j804J4175Q643K6881N158m866k6686J3805p935J485
2132A61752K0365J0953q725J4925j3988O126R550O181K0519j3960J0124j7369
2120B06453J5904N6512l2173j7635K0310L1529K789J3125K3044j2126J8167Q67
$$ plain form
2108 326766 343753 357149 380068 421150 422371 427112 457246 449648 453563 480260 539680 558949
2096 558949 576523 597904 614572 636172 654950 684642 740231 796209 840948 883199 947506 986796
2084 986796 1060365 1160815 1232011 1341435 1500467 1596478 1679388 1801132 1986942 2207736
2074 2207736 2479211 2853666 3255336 3675770 4203093 4957367 6061533 7539759 9255735
2065 9255735 10459535 10016397 8791927 7299607 5861916 4832451 3973009 3278796 2783204
2056 2783204 2465445 2197132 1982188 1829509 1711853 1606007 1543444 1442798 1316759 1211692
2046 1211692 1099311 1020670 949302 889246 833181 787758 735988 678425 639901 629721 616841
2035 616841 571066 544201 562302 528326 484432 459623 435562 390851 394127 404041 382880 355364
$$ packed form
2108C26766J6987J3396K2919M1082J221M741L0134p598L915K6697N9420J9269
2096E58949J7574K1381J6668K1600J8778K9692N5589N5978M4739M2251O4307L9290
2084I86796P3569J00450P1196J09424J59032R6011Q2910J21744J85810K20794
2074B207736K71475L74455M01670M20434N27323P54274J104166J478226J715976
2065I255735J203800m43138j224470j492320j437691j029465q59442o94213m95592
2056B783204l17759k68313k14944j52679j17656j05846o2563j00646j26039j05067
2046A211692j12381p8641p1368o0056n6065m5423n1770n7563l8524j0180j2880
2035F16841m5775k6865J8101l3976m3894k4809k4061m4711L276R914k1161k7516
$$ plain form
2023 355364 330300 315506 305964 296814 287628 277685 266666 250541 250042 248900 247239 242078 221076
2010 221076 228113 225617 233986 214576 183835 181276 178352 165270 152901 143733 161501 153535 140068
1997 140068 138599 150146 118422 162613 151620 121100 126763 131165 116501 103581 115408 80940
1985 80940 62257 57723 56600 70241 67454 70421 66585 64578 65974 78677 59064 74276 73019
1972 73019 67148 80733 84940 78735 35314 26979 15106 34718 50411 24210 20095 33284 42081
1959 42081 14726 10643 -10642 17384 8709 20538 46644 55635 59110 36272 29837 8825 -3697
1946 -3697 613 13239 8523 16342 21048 20676 20254 26899 44479 50478 20575 15054 14516 19465 54300
1931 54300 14326 17163 27183 29001 43613 3366 3780 24618 28591 41524 41041 20924 6278
$$ packed form
2023C55364k5064j4794r542r150r186r943j1019j6125m99j142j661n161k1002
2010B21076P037k496Q369j9410l0741k559k924j3082j2369r168J7768p966j3467
1997A40068j469J1547l1724M4191j0993l0520N663M402j4664j2920J1827l4468
1985H0940j8683m534j123J3641k787K967l836k007J396J2703j9613J5212j257
1972G3019n871J3585M207o205m3421q335j1873J9612J5693k6201m115J3189Q797
1959D2081k7355m083k1285K8026q675J1829K6106Q991L475k2838o435k1012j2522
1946c697M310J2626m716P819M706l72m22O645J7580N999k9903n521n38M949L4835
1931E4300l9974K837J0020J818J4612m0247M14K0838L973J2933m83k0117j4646
$$ plain form
1918 6278 -8411 -105 22300 8264 -701 10493 5245 17825 -5312 -442 17611 28591 11791
1905 11791 866 6890 12167 -5593 -3173 -5751 -810 -1457 10997 8354 3165 22289 24304 44835
1891 44835 27758 17576 12223 -3394 -25114 -19175 4883 -4936 -5147 -3416 -44056 -22433 -18522
1878 -18522 -45246 -18066 -8458 -15095 -10919 -10917 -3938 20634 -3478 -18585 -4693 17592 -2759
1865 -2759 -22018 -12180 -12897 -15920 -6787 -3908 -18382 -9747 9490 -4268 -22769 -41147 -36890 -35455
1851 -35455 -24458 -34446 -33329 -22316 -21062 -15022 3572 321 11947 13354 -13128 -5614 664
1838 664 -7164 -21101 -14835 -56436 -53246 -16932 -13857 -10154 -7707 -1925 -2383 9727 -15363 -21108
1824 -21108 -18656 9493 15941 21735 41479 33086 12464 12402 13382 6142 -7849 -1972 -10981 -18118
$$ packed form
1918F278j4689Q306K2405j4036q965J1194n248J2580k3137M870J8053J0980j6800
1905A1791j0925O024N277j7760K420k578M941o47J2454k643n189J9124K015K0531
1891D4835j7077j0182n353j5617k1720N939K4058r819k11J731m0640K1623L911
1878a8522k6724K7180R608o637M176KO979K4572k4112j5107J3892K2285k0351
1865b759j9259R838p17l023R133K879j4474Q635J9237j3758j8501j8378M257J435
1851c5455J0997r988J117J1013J254O040J8594l251J1626J407k6482P514O278
1838F64p828j3937O266m1601L190L6314L075L703K447N782m58J2110k5090n745
1824b1108K452K8149O448N794J9744q393k0622o2R80p240j3991N877r009p137
$$ plain form
1810 -18118 -43745 -46352 -20426 -8776 13683 14700 1233 11359 15239 841 6197 22355 26101
1797 26101 36184 48722 44005 49150 18204 31246 13852 20530 -3907 -709 -2732 -19940 7616
1784 7616 20078 6999 4860 2548 1125 -33458 -22521 -3794 -14737 -22400 -30596 -28662 -20066
1771 -20066 -21442 -506 -9060 -2478 -17387 2347 19225 -15623 -29299 -334 31875 16511
1759 16511 19883 27718 35003 7197 -566 -2145 -1198 592 -5505 2600 -10354 -9070 -3919 -8187
1745 -8187 -15711 -35315 -33738 -14891 -24153 2332 9308 2349 -5355 -31660 -19099 -6377 -13969
1732 -13969 -51115 -43401 -9143 -13812 -17774 1752 -10231 -9249 11429 -1267 -25362 -28433 -40451
1719 -40451 -29253 -24500 -5132 -10978 -4810 -13563 -6107 4452 -18329 -26060 -30764 -30173 -42908 -24785
$$ packed form
1810a8118k5627k607K5926J1650K2459J017j3467J0126L880j4398N356J6158L746
1797B6101J0083J2538m717N145l0946J3042j7394O678k4437L198k023j7208K7556
1784G616J2462j3079k139k312j423l4583J0937J8727j0943p663q196J934Q596
1771b0066j376K0936q554O582j4909J9734J6878l4848j3676K8965L2209j5364
1759A6511L372P835P285k7806p763j579R47J790o097Q105j2954J284N151m268
1745h187p524j9604J577J8847r262K6485O976o959p704k6305J2561J2722p592
1732a3969l7146P714L4258m669l962J9526j1983R82K0678j2696k4095l071j2018
1719d0451J1198M753J9368n846O168q753P456J0559k2781p731m704N91j2735J8123
$$ plain form
1705 -24785 -2518 7658 18172 269 -21071 -39178 -33653 -21684 -36550 -51206 -23371 -33477
1693 -33477 -43239 -38721 -39382 -14159 -23498 -39123 -26257 -5070 -4622 -20278 -9856 8559 5423
1680 5423 -15894 -37066 -14682 -3549 -21925 -2208 17215 8213 2505 11891 -1732 -16865 5729
1667 5729 -27649 -33962 -16782 1449 4551 -18394 -35050 -30087 -17712 -32821 -33887 -28597 -11285
1654 -11285 -19722 -28084 -7088 -12221 -31347 -24849 -27841 -39884 -56278 -48428 -29481 -30169 -29879 -16611
1640 -16611 -20648 -2635 -23920 -41636 -16459 -29971 -11009 4780 -6744 -23381 -9030 -15999
1628 -15999 -16986 -18803 -3777 -6813 -19395 -13945 -20824 -25954 -17546 -6841 -15540 -23235 -45331 -28587
1614 -28587 -38377 -15466 4812 -17317 -35155 -12163 15017 -19723 -17313 -22324 -25268 -1145 -13353
$$ packed form
1705b4785K2267J0176J0514j7903k1340j8107N525J1969j4866j4656K7835j0106
1693c3477r762M518o61K5223r339j5625J2866K1187M48j5656J0422J8415l136
1680E423k1317k1172K2384J1133j8376J9717J9423r002n708R386j3623j5133K2594
1667E729l3378o313J7180J8231L102k2945j6656M963J2375j5109j066N290J7312
1654a1285q437q362K0996n133j9126O498k992j2043j6394P850J8947o88K90J3268
1640a6611m037J8013k1285j7716K5177j3512J8962J5789j1524j6637J4351o969
1628a5999r87j817J5026l036j2582N450o879n130Q408J0705q699p695k2096J6744
1614b8587r790K2911K0278k2129j7838K2992K7180l4740K410n011k944K4123j2208
$$ plain form
1601 -13353 -30465 -31329 -22161 -24995 -24848 -23901 -24232 -30364 -35161 -32427 -21346 -24013 -50057 -33511 12267
1586 12267 10849 5566 3163 3687 -4953 -26427 -35400 -34247 -48322 -39415 -52756 -33890 14028 -6701
1572 -6701 -32107 -22252 -13549 -4562 -8650 -24344 -21569 -32933 -26407 -40766 -26084 11102 3583
1559 3583 -28369 -19758 -21079 2022 8295 -3745 -15898 -13470 -29403 -20588 -23356 -21911 -28226 -18987
1545 -18987 5446 15971 4046 -14350 -31112 -45169 -2996 -13294 13300 22752 698 -7778
1533 -7778 -31626 -35019 -15092 -37426 -57268 -49191 -39996 -28241 -20429 -33156 -30689 -28395 -39869
1520 -39869 -37941 -24273 -22809 -16845 -13651 -33335 -28422 -14012 8472 12116 -11675 -34344 -41669
1507 -41669 -44273 -42349 -36149 -43008 -28210 -3082 -25898 -25638 -34794 -29091 -17908 -11678 -2247 -8223
$$ packed form
1601a3353j7112q64R168k834J47R47l31o132m797K734J1081k667k6044J6546M5778
1586A2267j418n283k403N24q640k1474q973J153j4075Q907j3341J8866M7918k0729
1572f701k5406R855Q703Q987m088j5694K775j1364O526j4359J4682L7186p519
1559C583l1952Q611j321K3101O273j2040j2153K428j5933Q815k768J445o315R239
1545a8987K4433J0525j1925j8396j6762j4057M2173j0298K6594R452k2054q476
1533g778k3848l393J9927k2334j9842Q077R195J1755P812j2727K467K294j1474
1520c9869J928J3668J464N964L194j9684M913J4410K2484L644k3791k2669p325
1507d1669k604J924O200o859J4798K5128k2816K60r156N703J1183O230R431n976
$$ plain form
1493 -8223 -3230 -14418 -5706 -17416 -39715 -43557 -57989 -30448 -30248 -56844 -26968 -11891 -5570
1480 -5570 4549 -23251 -28645 -16383 -26967 -11759 2657 1261 -12447 -16040 -15304 -22837 -26516
1467 -26516 5727 -27624 -43709 -46666 -15298 -2218 -4550 -12042 -42491 -40671 -9247 -10179 -17467
1454 -17467 -8886 -36760 -34238 -29203 -22107 -23260 -16262 -7772 -5507 -18318 -8386 -31324 -7896 -20743
1440 -20743 -38085 -37436 -46835 -18190 -28488 -24301 -30565 -37045 -16850 -29271 -13868 9693 -4257
1427 -4257 -38704 -7390 6086 -16896 -21232 -3239 -6376 -17204 -4675 -15435 -44696 -23888
1415 -23888 -13163 -5189 -7251 -39420 -31954 -46814 -26165 -10497 -823 3344 -196 -16001 -28159
1402 -28159 -24103 -10941 10791 17132 -7180 -27877 -34368 -13289 -32383 -39348 -16277 -23670 -33513
$$ packed form
1493h223M993j1188Q712j1710k2299l842j4432K7541K00k6596K9876J5077O321
1480e570J0119k7800n394J2262j0584J5208J4416j396j3708l593P36p533l679
1467b6516L2243l3351j6085k957L1368J3080k332p492l0449J820L1424r32p288
1454a7467Q581k7874K522N035P096j153O998Q490K265j2811R932k2938K3428j2847
1440b0743j7342O49r399K8645j0298M187o264o480K0195j2421J5403K3561j3950
1427d257l4447L1314J3476k2982m336J7993l137j0828J2529j0760k9261K0808
1415b3888J0725P974k062l2169P466j4860K0649J5668R674M167l540j5805j2158
1402b8159M056J3162K1732O341k4312k0697o491K1079j9094o965K3071p393r843
$$ plain form
1389 -33513 -31055 -42319 -32748 -5820 5559 -21471 -28353 -36492 -33002 -40429 -25626 -8899 -5258
1376 -5258 8878 -8619 -13503 -14074 -38703 -46908 3656 14525 5642 -18952 -14333 -22165 -14108 -8931
1362 -8931 -17454 -19438 -19876 -14316 3290 -10374 -16775 -14930 -14756 -558 1191 -30199 -42674 -34224
1348 -34224 -51121 -44122 -33771 -32685 -43801 -48412 -25298 -11718 -12348 1921 228 -6065 -15311
1335 -15311 -5487 2423 -9073 -47081 -25113 -24866 -26430 -32929 -21580 -21071 -2390 26402 9214
$$ packed form
1389c3513K458j1264R571K6928J1379k7030o882q139L490p427J4803J6727L641
1376e258J4136j7497m884n71k4629q205N0564J0869q883k4594M619p832Q057N177
1362h931q523j984m38N560J7606j3664o401J845J74J4198J749l1390j2475Q450
1348c4224j6897O999J0351J086j1116m611K3114J3580o30J4269j693o293r246
1335a5311R824P910j1496l8008K1968K47j564o499J1349N09J8681K8792j7188
$$ [...]
##END NTUPLES=NMR SPECTRUM
##END=
