##TITLE=1H_EC-3303(4)
 CDCl3
 8 sc, 
 13.2.2024
##JCAMPDX= 6.0         $$ Bruker NMR JCAMP-DX V2.0
##DATA TYPE= NMR SPECTRUM
##DATA CLASS= NTUPLES
##ORIGIN= UXNMR, Bruker Analytische Messtechnik GmbH
##OWNER= root
$$ XWIN-NMR		Version 3.5
$$ Tue Feb 13 14:22:50 2024 Russian Standard Time (UT+4h)  she@DPX200
##.OBSERVE FREQUENCY= 200.1313
##.OBSERVE NUCLEUS= ^1H
##.ACQUISITION MODE= SIMULTANEOUS
##.ACQUISITION SCHEME= undefined
##.AVERAGES= 8
##.DIGITISER RES= 18
##SPECTROMETER/DATA SYSTEM= spect
##.PULSE SEQUENCE= zg30
##.SOLVENT NAME= D2O
##.SHIFT REFERENCE= (INTERNAL, D2O, 0, 15.5408)
##AUDIT TRAIL= $$ (NUMBER, WHEN, WHO, WHERE, WHAT)
$$ ##TITLE= Audit trail, XWIN-NMR		Version 3.5
$$ ##JCAMPDX= 5.01
$$ ##ORIGIN= Bruker BioSpin GmbH
$$ ##OWNER= she
$$ F:/spectra/data/she/nmr/H-F/1/pdata/1/auditp.txt
$$ ##AUDIT TRAIL=  $$ (NUMBER, WHEN, WHO, WHERE, WHAT)
(   1,<2024-02-13 14:21:35.75 +0400>,<she>,<DPX200>,
      <created by zg, POWCHK disabled, PULCHK disabled
       configuration hash MD5:
       00 E9 B6 7A A2 85 ED C7 34 08 36 98 17 FE 4E 26
       data hash MD5: 16K
       4D BA D9 7B 9F FB 68 6A 5E 2B EF 72 0A BF 8A 9D>)
(   2,<2024-02-13 14:21:37.89 +0400>,<she>,<DPX200>,
      <Start of raw data processing
       efp BC_mod = 2 LB = 0.24 FT_mod = 6 PKNL = 1 PHC0 = -24954.39 PHC1 = 15.2527 SI = 16K 
       data hash MD5: 16K
       5E 8F 66 7A 7A 4A 49 9D 09 F9 F8 4C 7F A2 5E FA>)
(   3,<2024-02-13 14:21:58.31 +0400>,<she>,<DPX200>,
      <pk PHC0 = 3.59768 PHC1 = -0.4000001 
       data hash MD5: 16K
       FF 7E 8D CA 01 FC 15 A5 A4 92 A5 EC 10 DD C6 31>)
(   4,<2024-02-13 14:22:01.35 +0400>,<she>,<DPX200>,
      <abs ABSG = 5 
       data hash MD5: 16K
       66 07 E8 B3 BB 5D 56 3D E7 DD BB 40 A2 04 3E A8>)
$$ ##END=
$$ 
$$ hash MD5
$$ 35 8A 9D 11 FF C2 23 F2 89 4E F4 52 F4 44 38 21
##$RELAX= 
##$RELAX= 
##$RELAX= 
##$RELAX= 
##$RELAX= 
##$RELAX= 
$$ Bruker specific parameters
$$ --------------------------
##$DU= <F:/spectra>
##$EXPNO= 1
##$NAME= <H-F>
##$PROCNO= 1
##$TYPE= <nmr>
##$USER= <she>
##$AMP= (0..31)
100 100 100 100 100 100 100 100 100 100 100 100 100 100 100 100 100 100 
100 100 100 100 100 100 100 100 100 100 100 100 100 100 
##$AQSEQ= 0
##$AQ_mod= 1
##$AUNM= <au_zg>
##$AUTOPOS= <>
##$BF1= 200.13
##$BF2= 200.13
##$BF3= 200.13
##$BF4= 200.13
##$BF5= 200.13
##$BF6= 200.13
##$BF7= 200.13
##$BF8= 200.13
##$BYTORDA= 1
##$CFDGTYP= 0
##$CFRGTYP= 5
##$CHEMSTR= <none>
##$CNST= (0..31)
1 1 145 1 1 1 1 1 1 1 1 1 1 1 1 1 1 1 1 1 1 1 1 1 1 1 1 1 1 1 1 1 
##$CPDPRG= <>
##$CPDPRG1= <>
##$CPDPRG2= <>
##$CPDPRG3= <>
##$CPDPRG4= <mlev>
##$CPDPRG5= <mlev>
##$CPDPRG6= <mlev>
##$CPDPRG7= <mlev>
##$CPDPRG8= <mlev>
##$CPDPRGB= <>
##$CPDPRGT= <>
##$D= (0..31)
0 1.2 0 0 0 0 0 0 0 0.06 0 0.03 0 0 0 0 0.0002 0 0 0 0 0 0 0 0 0 0 0 0 
0 0 0 
##$DATE= 1707819695
##$DBL= (0..7)
120 120 120 120 120 120 120 120 
##$DBP= (0..7)
150 150 150 150 150 150 150 150 
##$DBP07= 0
##$DBPNAM0= <>
##$DBPNAM1= <>
##$DBPNAM2= <>
##$DBPNAM3= <>
##$DBPNAM4= <>
$$ [...]
##$SUBNAM3= <"">
##$SUBNAM4= <"">
##$SUBNAM5= <"">
##$SUBNAM6= <"">
##$SUBNAM7= <"">
##$SUBNAM8= <"">
##$SUBNAM9= <"">
##$SW= 18.0517328524113
##$SWIBOX= (0..15)
0 0 2 0 0 0 0 0 0 0 0 0 0 0 0 0 
##$SW_h= 3612.71676300578
##$TD= 16384
##$TD0= 1
##$TE= 0
##$TE2= 300
##$TE3= 300
##$TEG= 300
##$TL= (0..7)
0 120 120 120 120 120 120 120 
##$TP= (0..7)
150 150 150 150 150 150 150 150 
##$TP07= 0
##$TPNAME0= <>
##$TPNAME1= <>
##$TPNAME2= <>
##$TPNAME3= <>
##$TPNAME4= <>
##$TPNAME5= <>
##$TPNAME6= <>
##$TPNAME7= <>
##$TPOAL= (0..7)
0.5 0.5 0.5 0.5 0.5 0.5 0.5 0.5 
##$TPOFFS= (0..7)
0 0 0 0 0 0 0 0 
##$TUNHIN= 0
##$TUNHOUT= 0
##$TUNXOUT= 0
##$USERA1= <user>
##$USERA2= <user>
##$USERA3= <user>
##$USERA4= <user>
##$USERA5= <user>
##$V9= 5
##$VALIST= <valist>
##$VCLIST= <CCCCCCCCCCCCCCC>
##$VD= 0
##$VDLIST= <DDDDDDDDDDDDDDD>
##$VPLIST= <PPPPPPPPPPPPPPP>
##$VTLIST= <TTTTTTTTTTTTTTT>
##$WBST= 1024
##$WBSW= 4
##$XGAIN= (0..3)
0 0 0 0 
##$XL= 0
##$YL= 0
##$YMAX_a= 719545
##$YMIN_a= -827876
##$ZGOPTNS= <>
##$ZL1= 120
##$ZL2= 120
##$ZL3= 120
##$ZL4= 120
##$ABSF1= 15.48907
##$ABSF2= -2.562779
##$ABSG= 5
##$ABSL= 3
##$ALPHA= 0
##$AQORDER= 0
##$ASSFAC= 0
##$ASSFACI= 0
##$ASSFACX= 0
##$ASSWID= 0
##$AUNMP= <proc_1d>
##$AZFE= 0.1
##$AZFW= 0.1
##$BCFW= 0
##$BC_mod= 2
##$BYTORDP= 0
##$COROFFS= 0
##$CY= -3
##$DATMOD= 1
##$DC= 0
##$DFILT= <>
##$DTYPP= 0
##$F1P= 0
##$F2P= 0
##$FCOR= 1
##$FTSIZE= 16384
##$FT_mod= 6
##$GAMMA= 0
##$GB= 0
##$INTBC= 1
##$INTSCL= 3.70164e-10
##$ISEN= 128
##$LB= 0.24
##$LEV0= 0
##$LPBIN= 0
##$MAXI= 10000
##$MC2= 0
##$MEAN= 0
##$ME_mod= 0
##$MI= 1.114404
##$NCOEF= 0
##$NC_proc= -4
##$NLEV= 6
##$NOISF1= 3.799351
##$NOISF2= 2.8
##$NSP= 0
##$NTH_PI= 0
##$NZP= 0
##$OFFSET= 15.54085
##$PC= 1
##$PHC0= -24950.79
##$PHC1= 14.8527
##$PH_mod= 1
##$PKNL= yes
##$PPARMOD= 0
##$PSCAL= 0
##$PSIGN= 0
##$REVERSE= no
##$SF= 200.129996166862
##$SI= 16384
##$SIGF1= 3
##$SIGF2= 2
##$SINO= 5.538805
##$SIOLD= 16384
##$SREGLST= <1H.CDCl3>
##$SSB= 0
##$STSI= 16384
##$STSR= 0
##$SW_p= 3612.71676300578
##$SYMM= 0
##$S_DEV= 0
##$TDeff= 16384
##$TDoff= 0
##$TI= <>
##$TILT= no
##$TM1= 0
##$TM2= 0
##$TOPLEV= 0
##$USERP1= <user>
##$USERP2= <user>
##$USERP3= <user>
##$USERP4= <user>
##$USERP5= <user>
##$WDW= 1
##$XDIM= 16384
##$YMAX_p= 459641620
##$YMIN_p= -95791
$$ End of Bruker specific parameters
$$ ---------------------------------
##NTUPLES= NMR SPECTRUM
##VAR_NAME=  FREQUENCY,     SPECTRUM/REAL,   SPECTRUM/IMAG
##SYMBOL=    X,             R,               I
##VAR_TYPE=  INDEPENDENT,   DEPENDENT,       DEPENDENT
##VAR_FORM=  AFFN,          ASDF,            ASDF
##VAR_DIM=   16384,         16384,           16384
##UNITS=     HZ,            ARBITRARY UNITS, ARBITRARY UNITS
##FACTOR=    0.220516191357247, 1,           1
##FIRST=     3110.1901880227, 0,             0
##LAST=      -502.526574983076, 0,           0
##MIN=       -502.526574983076, -95791,      0
##MAX=       3110.1901880227, 459641620,     0
$$ Real data points
##PAGE= N=1
##DATA TABLE= (X++(R..R)), XYDATA
$$ [...]
$$ plain form
8371 35160 30213 10518 -3909 -21667 -20137 4237 -13108 -10284 -26190 -45047 -36782 -19443 7320
8358 7320 5245 -8971 -8671 -9735 -32397 -13178 -10237 -7403 -1823 -4645 -2866 -18803 -27831 -3811
8344 -3811 -10350 13 17232 15950 29408 -8054 4314 5003 8780 6474 8712 13409 17539 12283
8330 12283 17754 -3408 -15071 -12068 -32749 -12965 8624 10786 39622 9433 -5799 275 -10322
8317 -10322 -18115 -38600 -23923 -31514 -18973 -13105 -11259 -11086 8873 11507 -21157 -40768 -28533
8304 -28533 -13465 -13205 -22011 -13488 -14611 -5440 12318 -2726 -22991 -22412 -12092 -18608 3633 -12312
8290 -12312 -38234 -5546 28219 19784 15770 -10748 -32008 -31828 -22533 -27697 -24226 -43656 -27729
8277 -27729 -1867 -7821 5370 7848 4926 27809 12732 -3372 1089 -6834 -14113 -9488 16792
$$ packed form
8371C5160m947j9695j4427j7758J530K4374j7345K824j5906j8857Q265J7339K6763
8358G320k075j4216L00j064k2662J9219K941K834N580k822J779j5937r028K4020
8344c811o539J0363J7219j282J3458l7462J2368O89L777k306K238M697M130n256
8330A2283N471k1162j1663L003k0681J9784K1589K162K8836l0189j5232O074j0597
8317a0322p793k0485J4677p591J2541N868J846J73J9959K634l2664j9611J2235
8304b8533J5068K60q806Q523j123R171J7758j5044k0265N79J0320o516K2241j5945
8290a2312k5922L2688L3765q435m014k6518k1260J80R295n164L471j9430J5927
8277b7729K5862n954J3191K478k922K2883j5077j6104M461p923p279M625K6280
$$ plain form
8264 16792 18747 6864 16908 -2929 -3489 12394 -3532 -9146 8579 -7344 11319 1394 -20156
8251 -20156 -12206 -5779 5339 -1727 2174 -10929 -26008 -6959 3924 -12661 -14554 -1647 17676
8238 17676 -2048 -31655 -29045 -20032 -9288 4019 -27553 -31402 -33095 -15268 -23111 -27711 -21547
8225 -21547 -26797 -31605 -18796 -2884 5887 -17507 -24743 -22948 -11984 -6020 -10076 -13166 5273
8212 5273 13290 16146 -1557 -19427 -11707 -11236 -3310 4968 13256 -8651 -20391 -32417 -27484 -43123
8198 -43123 -19349 -34558 -25538 -35300 -44550 -95489 -95791 19496 14576 -14051 7408 14271 -809
8185 -809 14197 35146 16617 -24074 -16570 -21869 6874 -4953 10836 17342 -3779 -3150 -6751
8172 -6751 -10499 15150 14451 -14994 -9393 3017 1734 24477 20032 -15388 -13100 7646 -9581
$$ packed form
8264A6792J955j1883J0044j9837n60J5883j5926n614J7725j5923J8663r925k1550
8251b0156P950O427J1118p066L901j3103j5079J9049J0883j6585j893J2907J9323
8238A7676j9724k9607K610R013J0744J3307l1572l849j693J7827p843m600O164
8225b1547n250m808J2809J5912Q771k3394p236J795J0964N964m056l090J8439
8212E273Q017K856j7703j7870P720M71P926Q278Q288k1907j1740j2026M933j5639
8198d3123K3774j5209R020r762r250n0939l02J15287m920k8627K1459O863j5080
8185h09J5006K0949j8529m0691P504n299K8743j1827J5789O506k1121O29l601
8172f751l748K5649o99k9445N601J2410j283K2743m445l5420K288K0746j7227
$$ plain form
8159 -9581 -22913 6369 -14520 -2242 -3216 -23474 -4607 8013 -16913 -1933 8749 29531
8147 29531 28825 315 -4225 9515 6241 -22883 -3909 24980 34789 17411 17330 18939 4264 -32355
8133 -32355 -7626 -3989 -2663 -5122 -5410 -5978 12723 -23267 -10944 -15021 -27632 -8059 6525
8120 6525 8106 5151 17948 -10324 2639 1976 -2500 -3858 -7525 -10994 -6270 -5502 -1132 -5827 -8348
8105 -8348 -27092 -23930 5503 1713 -10763 9070 -31293 -18699 -8775 3157 7139 -7659 -21862
8092 -21862 -20301 -4967 -27249 -5162 -8407 -7683 6586 5882 6527 -15320 -8701 -19193 10073 8002
8078 8002 372 33157 33164 20436 -14215 -16557 -3373 12556 35869 25567 16804 -8375 -12445 -4421
8064 -4421 -27880 -4524 -10624 -41490 -19120 7487 32544 22973 3283 -15116 -2435 -2772 -8114
$$ packed form
8159i581j3332K9282k0889J2278r74k0258J8867J2620k4926J4980J0682K0782
8147B9531p06k8510m540J3740l274k9124J8974K8889R809j7378q1J609j4675l6619
8133c2355K4729L637J326k459k88n68J8701l5990J2323m077j2611J9573J4584
8120F525J581k955J2797k8272J2963o63m476j358l667l469M724P68M370m695k521
8105h348j8744L162K9433l790j2476J9833m0363J2594R924J1932L982j4798j4203
8092b1862J561J5334k2282K2087l245P24J4269p04O45k1847O619j0492K9266k071
8078H002p630L2785Pj2728l4651k342J3184J5929K3313j0302q763k5179m070Q024
8064d421k3459K3356o100l0866K2370K6607K5057r571j9690j8399J2681l37n342
$$ plain form
8051 -8114 12121 -2219 5763 -1119 -24705 -9715 -28150 2329 -2966 -6377 -472 -36060 -44464
8038 -44464 -16899 -522 6330 -6210 -9329 7221 -14483 -23226 -29056 -3513 17368 -15278 -14241
8025 -14241 13894 22826 3346 -3815 -8100 -26218 -13216 -22910 -32267 -21987 -14575 -8288 -3781
8012 -3781 9496 6886 26476 17029 -2315 -10776 1171 -27670 -14095 30864 18754 34724 22545
7999 22545 7521 -2336 -2937 -2590 -8460 -11738 -8774 -5834 150 -20776 -20176 -9852 6209 -725
7985 -725 -5754 -10132 4379 17634 34486 14839 -25135 3444 19295 -17576 8883 19622 -4544
7972 -4544 -30627 -15325 -14969 4505 22663 -21667 -30789 -7220 -9868 8874 14917 2311 -1998
7959 -1998 21250 -6048 -37027 -20012 11581 3874 -26238 -17744 10642 31408 20042 5138
$$ packed form
8051h114K0235j4340P982o882k3586J4990j8435L0479n295l411N905l5588q404
8038d4464K7565J6377O852j2540l119J6550k1704q743n830K5543K0881l2646J037
8025a4241K8135Q932j9480p161m285j8118J3002r694r357J0280P412O287M507
8012c781J3277k610J9590r447j9344q461J1947k8841J3575M4959j2110J5970j2179
7999B2545j5024r857o01L47n870l278K964K940N984k0926O00J0324J6061o934
7985g25n029m378J4511J3255J6852j9647l9974K8579J5851l6871K6459J0739k4166
7972d544k6083J5302L56J9474J8158m4330r122K3569k648J8742O043j2606m309
7959a998K3248k7298l0979J7015L1593p707l0112Q494K8386K0766j1366j4904
$$ plain form
7947 5138 -31630 -6034 8665 -670 25127 35802 29590 31642 7416 8843 14583 -3780 -1411
7934 -1411 16787 -2906 11308 20803 872 -11415 -41809 -26768 14744 -7225 2533 1368 -5256
7921 -5256 -10745 12960 30711 24982 -3921 3439 2766 -17376 42063 11590 -14305 -14904 -22272 -41798
7907 -41798 -5826 3009 7712 -22431 -27658 -15052 14258 8432 -4960 -14043 3670 43310 49129
7894 49129 21637 -4698 9090 101 -12579 -5364 -1832 -23196 -18646 -16711 5016 1868 11711
7881 11711 -9219 5131 22306 -2154 -24589 -16754 -21601 -5056 19385 15308 -19676 9406
7869 9406 35370 146 -9724 -6778 2571 -7164 -27921 -29723 -4676 -25344 -12532 -3935 -6721
7856 -6721 1266 -969 -1047 6909 689 12803 17619 12297 -9920 -12891 -34553 -35565 -30286 -17498
$$ packed form
7947E138l6768K5596J4699r335K5797J0675o212K052k4226J427N740j8363K369
7934a411J8198j9693J4214R495j9931j2287l0394J5041M1512k1969R758j165o624
7921e256n489K3705J7751n729k8903P360o73k0142N9439l0473k5895n99p368j9526
7907d1798L5972Q835M703l0143n227J2606K9310n826j3392r083J7713L9640N819
7894D9129k7492k6335J3788q989j2680P215L532k1364M550J935K1727l148R843
7881A1711k0930J4350J7175k4460k2435P835m847J6545K4441m077l4984K9082
7869I406K5964l5224r870K946R349r735k0757j802K5047k0668J2812Q597k786
7856f721P987k235p8P956o220J2114M816n322k2217k971k1662j012N279J2788
$$ plain form
7842 -17498 -7066 -14503 -11079 -4399 31016 16087 -5006 -12319 20545 10313 -4005 -25235 -25729
7829 -25729 -26219 -16643 5750 -10976 -16234 530 -9676 9292 14881 21924 20278 29744 37370 37696
7815 37696 22548 1356 -8131 -9838 -39405 -39698 -29513 3108 -27654 -355 52362 35235 28601
7802 28601 -15150 5246 -6661 -21640 -1453 -13600 4872 11945 5213 28342 35631 7458
7790 7458 -5960 11933 32488 20164 39207 47047 29225 -11987 -30239 -6130 -2452 6456 12917
7777 12917 6844 18405 28058 4749 6368 24705 13388 11785 39134 33865 20768 16623 14662
7764 14662 -3279 11365 11312 16366 24737 -256 -9265 11675 11511 17348 8641 32614 22098 -13789
7750 -13789 10514 12580 -2195 -12848 -12173 12609 3989 3833 1208 -21647 4881 14373 -5594
$$ packed form
7842a7498J0432p437L424O680L5415j4929k1093p313L2864j0232j4318k1230m94
7829b5729m90R576K2393j6726n258J6764j0206J8968N589P043j646R466P626L26
7815C7696j5148k1192r487j707k9567k93J0185L2621l0762K7299N2717j7127o634
7802B8601m3751K0396j1907j4979K0187j2147J8472P073o732K3129P289k8173
7790G458j3418J7893K0555j2324J9043P840j7822m1212j8252K4109L678Q908O461
7777A2917o073J1561R653k3309J619J8337j1317j603K7349n269j3097m145j961
7764A4662j7941J4644n3N054Q371k4993r009K0940j64N837q707K3973j0516l5887
7750a3789K4303K066j4775j0653O75K4782q620j56k625k2855K6528R492j9967
$$ plain form
7737 -5594 -19424 -32690 -4172 2847 -2765 -24796 -25804 -2912 10263 -12269 -20999 -20995 20691 34277
7723 34277 20287 2544 -15563 -7268 2410 -18144 -11673 7753 16707 23689 22256 9967 16875
7710 16875 15817 10803 20331 26401 30949 30663 4216 -22658 -14273 -13000 -7975 19723 39491 18462
7696 18462 -5294 -2992 -8673 -15546 -17233 -19514 -271 -4966 -18633 25649 16232 5264 18261
7683 18261 23537 13759 -22818 -30048 -8841 12728 10052 5292 19930 40580 27147 14196 26111
7670 26111 9266 -2811 -2050 14495 18449 24176 -813 -36408 -10628 -10676 4622 36601 34346
7657 34346 13519 5737 629 15229 13663 35477 48766 39067 22001 13753 23958 23867 10724
7644 10724 10789 -3956 9610 21355 28418 22356 11400 -10364 31786 27273 1500 6539 5569 28009
$$ packed form
7737e594j3830j3266K8518P019n612k2031j008K2892J3175k2532q730MM1686J3586
7723C4277j3990j7743j8107Q295R678k0554O471J9426Q954O982j433j2289O908
7710A6875j058n014R528O070M548k86k6447k6874Q385J273N025K7698J9768k1029
7696A8462k3756K302n681o873j687k281J9243m695j3667M4282r417j0968J2997
7683A8261N276r778l6577p230K1207K1569k676m760J4638K0650j3433j2951J1915
7670B6111j6845j2077P61J6545L954N727k4989l5595K5780m8J5298L1979k255
7657C4346k0827p782n108J4600j566K1814J3289r699j7066q248J0205r1j3143
7644A0724O5j4745J3566J1745P063o062j0956k1764M2150m513k5773N039r70K2440
$$ plain form
7630 28009 34029 18940 9712 4761 -14275 15151 28107 20554 6013 10237 20081 22762 2908
7617 2908 -19237 8010 8047 9641 -7106 -6704 15875 11145 7013 37341 17579 10473 34134 22073
7603 22073 -12715 -103 -132 18362 33344 34153 31452 10754 -13615 -9920 10176 32101 40217
7590 40217 16360 1169 8361 38184 33718 36957 32956 26470 16377 34821 45189 30003 49592
7577 49592 47791 32586 44901 33739 10803 20713 16555 4902 1795 7401 -8989 -4184 -10572
7564 -10572 -28460 -9379 11538 33391 8475 6251 29604 13810 21320 18872 12618 23211 37060
7551 37060 76483 57058 41876 38045 7283 18722 25589 28396 13029 38131 52256 29823
7539 29823 48198 39418 21681 27538 41656 52575 69375 70721 50520 48721 52318 25467 47677
$$ packed form
7630B8009O020j5089r228m951j9036K9426J2956p553j4541M224R844K681j9854
7617B908k2145K7247L7J594j6747M02K2579m730m132L0328j9762p106K3661j2061
7603B2073l4788J2612k9J8494J4982Q09k701k0698k4369L695K0096K1925Q116
7590D0217k3857j5191P192K9823m466L239m001o486j0093J8444J0368j5186J9589
7577D9592j801j5205J2315j1162k2936R910m158j1653l107N606j6390M805o388
7564a0572j7888J9081K0917K1853k4916k224K3353j5794P510k448o254J0593J3849
7551C7060L9423j9425j5182l831l0762J1439O867K807j5367K5102J4125k2433
7539B9823J8375q780j7737N857J4118J0919J6800J346k0201j799L597k6851K2210
$$ plain form
7526 47677 59754 52695 93873 103893 91752 102166 107534 164313 203156 202589 165206 125636 82624
7513 82624 75807 95900 79867 51612 38287 44763 55156 23150 54329 58889 60955 51794 43671
7500 43671 17298 7708 36879 72662 53512 51915 57804 54881 44814 31192 20713 6246 21794
7487 21794 4250 16912 26205 30400 39338 22952 32071 47228 45538 55433 34482 29649 15151
7474 15151 29595 42346 28869 41792 37794 22665 29536 35435 22547 33353 7920 16299 27293
7461 27293 43068 52961 38377 46817 60948 63791 46346 53062 15483 22707 32059 12370 18356
7448 18356 39237 44813 47200 42535 32365 32665 30615 37816 44920 35310 14140 27764 34821 38669
7434 38669 49822 36994 33973 31922 35857 63731 59645 32695 24423 22377 14040 41632 52437
$$ packed form
7526D7677J2077p059M1178J0020j2141J0414N368N6779L8843n67l7383l9570m3012
7513H2624o817K0093j6033k8255j3325O476J0393l2006L1179M560K066r161q123
7500D3671k6373r590K9171L5783j9150j597N889k923j0067j3622j0479j4467J5548
7487B1794j7544J2662R293M195Q938j6386R119J5157j690R895k0951m833j4498
7474A5151J4444J2751j3477J2923l998j5129O871N899j2888J0806k5433Q379J0994
7461B7293J5775R893j4584Q440J4131K843j7445O716l7579P224R352j9689N986
7448A8356K0881N576K387m665j0170L00k050P201P104r610k1170J3624P057L848
7434C8669J1153j2828l021k051L935K7874m086k6950q272k046q337K7592J0805
$$ plain form
7421 52437 29641 23760 30881 9107 50 25662 35313 45560 28606 45742 44543 40369 40855
7408 40855 41424 48261 40891 38642 19964 33224 37240 23855 46159 32250 48859 36767 60062
7395 60062 54809 78593 39750 24801 18349 25848 52532 45469 48286 54686 34265 37434 42791
7382 42791 45492 35666 54462 53601 70861 64345 46232 54132 48101 54293 30602 8548 33254
7369 33254 52075 31272 30781 29531 51688 50648 80526 48641 50483 65278 78805 70409 53608
7356 53608 58425 71758 90541 81565 58668 71880 63853 62741 61659 76156 61381 85358 87042
7343 87042 91324 93789 72752 57312 26111 49765 64640 71997 64641 53864 81836 70855 74050
7330 74050 80078 84142 81084 64711 87006 83971 76464 75081 88823 102079 110786 115857 106353 103249
$$ packed form
7421E2437k2796n881P121k1774r057K5612R651J0247j6954J7136j199m174M86
7408D0855N69O837p370k249j8678J3260M016j3385K2304j3909J6609j2092K3295
7395F0062n253K3784l8843j4949o452P499K6684p063K817O400k0421L169N357
7382D2791K701r826J8796q61J7260o516j8113P900o031O192k3691k2054K4706
7369C3254J8821k0803m91j250K2157j040K9878l1885J842J4795J3527q396j6801
7356E3608M817J3333J8783q976k2897J3212q027j112j082J4497j4775K3977J684
7343H7042M282K465k1037j5440l1201K3654J4875P357p356j0777K7972j0981L195
7330G4050O028M064l058j6373K2295l035p507j383J3742J3256Q707N071r504l104
$$ plain form
7316 103249 112533 123311 108823 87016 63546 78407 84027 63855 70579 99018 101916 109510 102053
7303 102053 126025 156222 127453 124867 120280 117890 102989 108780 88108 93243 115036 130042 122638
7290 122638 120035 108010 121160 126739 119230 142211 116078 106129 98479 133175 144886 167411 151294
7277 151294 151445 143544 156646 144720 152557 167436 154863 187175 181089 163780 173592 182349 169492
7264 169492 151091 166270 143947 127411 142040 149523 163850 169406 173935 163403 179876 158781
7252 158781 154892 202942 223180 210368 208943 190994 195253 206202 233718 222026 225627 207401
7240 207401 214004 213136 181531 207929 222513 236818 257865 253485 277901 283297 305078 320475 330213
7227 330213 346291 354321 331620 310885 299704 324840 351978 344635 334187 344188 384409 402195
$$ packed form
7316A03249R284J0778j4488k1807k3470J4861N620k0172O724K8439K898P594p457
7303A02053K3972L0197k8769k586m587k390j4901N791k0672N135K1793J5006p404
7290A22638k603j2025J3150N579p509K2981k6133r949p650L4696J1711K2525j6117
7277A51294J51p901J3102j1926P837J4879j2573L2312o086j7309R812Q757j2857
7264A69492j8401J5179k2323j6536J4629P483J4327N556M529j0532J6473k1095
7252A58781l889M8050K0238j2812j425j7949M259J0949K7516j1692L601j8226
7240B07401O603q68l1605K6398J4584J4305K1047m380K4416N396K1781J5397R738
7227C30213J6078Q030k2701k0735j1181K5136K7138p343j0448J0001M0221J7786
$$ plain form
7215 402195 412609 432374 438833 455339 452580 459128 469216 446525 477949 505660 487360 520663
7203 520663 516083 524241 536625 531316 532387 527004 544436 544206 583036 600396 616520 656337 696501
7190 696501 690475 683548 711051 738596 745822 748447 764405 780624 763292 790866 799114 815802 841890
7177 841890 844447 846493 876543 880986 914253 919731 963424 994889 1027745 1073947 1094750 1149244
7165 1149244 1209381 1260103 1290195 1327262 1369715 1451014 1511348 1572723 1646979 1706375 1795906
7154 1795906 1877118 1941792 1995032 2049317 2120635 2202966 2281722 2348725 2379701 2444002 2530545
7143 2530545 2608847 2729496 2818164 2882462 2969384 3045405 3168459 3265828 3378652 3527242 3738025
7132 3738025 3951970 4268415 4616496 5000671 5445747 6010351 6678302 7464041 8439164 9722150
$$ packed form
7215D02195J0414J9765O459J6506k759O548J0088k2691L1424K7711j8300L3303
7203E20663m580Q158J2384n309J071n383J7432k30L8830J7360J6124L9817M0164
7190F96501o026o927K7503K7545P226K625J5958J6219j7332K7574Q248J6688K6088
7177H41890K557K046L0050M443L3267N478M3693L1465L2856M6202K0803N4494
7165A149244O0137N0722L0092L7067M2453Q1299O0334O1375P4256N9396Q9531
7154A795906Q1212O4674N3240N4285P1318Q2331P8756O7003L0976O4301Q6543
7143B530545P8302J20649Q8668O4298Q6922P6021J23054R7369J12824J48590K10783
7132C738025K13945L16445L48081L84175M45076N64604O67951P85739R75123J282986
$$ plain form
7122 9722150 11612119 14200011 17583163 22229953 29046508 35297025 34839909 28937128
7114 28937128 22454743 16715701 13005678 10508181 8701845 7325087 6240844 5436179
7106 5436179 4844622 4341902 3928837 3597661 3339066 3134564 2936496 2765786 2600886 2416654
7096 2416654 2229750 2094525 1955394 1826122 1702873 1620406 1571482 1524793 1459535 1389879
7086 1389879 1339691 1312339 1274986 1200080 1146254 1091705 1040392 1007669 961196 940221 926808
7075 926808 920891 889939 856095 839753 822880 786834 747330 705285 687556 678536 669667 667888
7063 667888 647324 615712 646755 628202 600497 596836 582856 536051 507880 487934 461757 439320
7051 439320 431187 421467 422691 416546 380954 325935 341386 333629 342939 341438 316056 318596 341510
$$ packed form
7122I722150J889969K587892L383152M646790O816555O250517m57116n902781
7114B8937128o482385n739042l710023k497497j806336j376758j084243q04665
7106E436179n91557n02720m13065l31176k58595k04502j98068j70710j64900j84232
7096B416654j86904j35225j39131j29272j23249q2467m8924m6689o5258o9656
7086A389879n0188k7352l7353p4906n3826n4549n1313l2723m6473k0975j3413
7075I26808n917l0952l3844j6342j6873l6046l9504m2045j7729r020q869j779
7063F67888k0564l1612L1043j8553k7705l661j3980m6805k8171j9946k6177k2437
7051D39320q133r720J224o145l5592n5019J5451p757R310j501k5382K540K2914
$$ plain form
7038 341510 356167 343003 325758 327736 306154 293549 294462 270155 255038 266150 247999 252145
7026 252145 244973 240794 224150 246802 254758 237447 202265 203325 222333 225430 207482 209434 201390
7013 201390 201710 216800 211231 221570 207448 182248 188012 179436 158456 160754 184958 186791 186913
7000 186913 198514 176574 187360 174189 170102 169285 153875 163914 177347 152774 156734 167198
6988 167198 175906 167536 161461 134817 153386 143879 116986 136413 155710 163004 142310 134955 154954
6975 154954 169910 133910 124139 137571 175816 146534 145366 120404 96485 125184 115308 129117
6963 129117 133593 106752 98985 117262 116234 115914 117195 130844 138325 132202 134935 118797 90744
6950 90744 90113 89734 64876 51435 74411 81144 98943 93568 101021 81811 61014 72021 77461
$$ packed form
7038C41510J4657j3164j7245J978k1582j2605R13k4307j5117J1112j8151M146
7026B52145p172m179j6644K2652P956j7311l5182J060J9008L097j7948J952q044
7013B01390L20J5090n569J0339j4122k5200N764q576k0980K298K4204J833J22
7000A86913J1601k1940J0786j3171m087q17j5410J0039J3433k4573L960J0464
6988A67198Q708q370o075k6644J8569r507k6893J9427J9297P294k0694p355J9999
6975A54954J4956l6000r771J3432L8245k9282j168k4962k3919K8699r876J3809
6963A29117M476k6841p767J8277j028l20J281J3649P481o123K733j6138k8053
6950I0744o31l79k4858j3441K2976O733J7799n375P453j9210k0797J1007N440
$$ plain form
6937 77461 69653 90852 87390 87482 90064 97308 82627 55737 74111 94971 69201 62374 98067
6924 98067 93246 99777 89444 75422 58096 44334 55980 34884 67542 47486 41363 60022
6912 60022 70615 79555 76984 53298 72699 84113 71746 76110 78816 88050 75416 66307 89311
6899 89311 101115 90872 115511 93413 54248 67177 75000 45653 67396 91844 82365 71544
6887 71544 68806 40461 43259 53183 34210 35964 47610 77873 105410 100312 74745 84657 96019
6874 96019 70578 60233 65663 54134 61939 65068 72494 55641 73874 99822 112477 93113 82376
6861 82376 67503 76893 86985 71349 64968 59330 56487 76336 74211 77149 89753 89547 85482 69667
6847 69667 71946 61354 77945 76569 94664 81512 91022 83091 83439 74956 57194 67672 100952
$$ packed form
6937G7461p808K1199l462R2K582P244j4681k6890J8374K0860k5770o827L5693
6924I8067m821O531j0333j4022j7326j3762J1646k1096L2658k0056o123J8659
6912F0022J0593Q940k571k3686J9401J1414j2367M364K706R234j2634r109K3004
6899H9311J1804j0243K4639k2098l9165J2929P823k9347K1743K4448r479j0821
6887G1544k738k8345K798R924j8973J754J1646L0263K7537n098k5567R912J1362
6874I6019k5441j0345N430j1529P805L129P426j6853J8233K5948J2655j9364j0737
6861H2376j4873R390J0092j5636o381n638k843J9849k125K938J2604k06m065j5815
6847F9667K279j0592J6591j376J8095j3152R510p931L48q483j7762J0478L3280
$$ plain form
6834 100952 115769 121458 109579 122402 116577 94563 103221 107071 91586 95578 107965 106890 89517
6821 89517 96360 84231 68114 75342 75420 90123 77670 69536 80329 92196 133340 91889 115459
6808 115459 111930 76278 81195 71908 81522 69038 60553 61015 52742 56507 52748 57212 76434 107220
6794 107220 103739 87757 71254 76329 100190 73155 86864 80463 85495 100630 115882 91239
6782 91239 90293 105370 82751 84831 97622 67098 78140 75963 100424 103833 84107 112900 121141
6769 121141 113521 122158 116157 117278 101039 102612 87604 68905 77884 56717 78892 102775 80874
6756 80874 55356 71216 96141 100347 101664 112435 117842 120390 116575 100624 104673 117245 122170
6743 122170 110988 127057 119513 114174 116685 110859 124575 116488 111374 126336 152808 124523 148250
$$ packed form
6834A00952J4817N689j1879J2823n825k2014Q658L850j5485L992J2387j075j7373
6821H9517O843j2129j6117P228P8J4703j2453q134J0793J1867M1144m1451K3570
6808A15459l529l5652M917r287R614j2484q485M62q273L765l759M464J9222L0786
6794A07220l481j5982j6503N075K3861k7035J3709o401N032J5135J5252k4643
6782I1239r46J5077k2619K080J2791l0524J1042k177K4461L409j9726K8793Q241
6769A21141p620Q637o001J121j6239J573j5008j8699Q979k1167K2175K3883k1901
6756H0874k5518J5860K4925M206J317J0771N407K548l815j5951M049J2572M925
6743A22170j1182J6069p544n339K511n826J3716q087n114J4962K6472k8285K3727
$$ plain form
6730 148250 138037 149752 158299 164268 173014 210461 216343 193685 172719 177235 171675 165465 168973
6717 168973 174109 215537 221800 277133 326211 352543 382234 364540 327306 281039 262724 239485
6705 239485 235249 220873 213756 215317 203656 211056 212701 210673 204901 208096 199528 221067 234309
6692 234309 238450 266711 303348 305700 291373 290198 283911 256998 262377 238817 266513 250460 234340
6679 234340 209965 238897 252004 241801 250300 253578 255414 253930 271273 240924 256107 290093
6667 290093 296902 304970 296600 266978 263856 270419 252339 271515 300604 273633 277976 294306 301216
6654 301216 316334 293807 302158 340061 326659 333520 334625 336042 342329 324935 328387 337052 372578
6641 372578 344884 345695 354203 378866 413064 409994 382886 376402 344026 364585 396961 376883 399719
$$ packed form
6730A48250j0213J1715Q547N969Q746L7447N882k2658k0966M516n560o210L508
6717A68973N136M1428O263N5333M9078K6332K9691j7694l7234m6267j8315k3239
6705B39485m236j4376p117J561j1661P400J645k028n772L195q568K1539J3242
6692B34309M141K8261L6637K352j4327j175o287k6913N379k3560K7696j6053j6120
6679B34340k4375K8932J3107j0203Q499L278J836j484J7343l0349J5183L3986
6667B90093O809Q068q370k9622l122O563j8080J9176K9089k6971M343J6330O910
6654C01216J5118k2527Q351L7903j3402O861J105J417O287j7394L452Q665L5526
6641C72578k7694Q11Q508K4663L4198l070k7108o484l2376K0559L2376k0078K2836
$$ plain form
6628 399719 435681 441228 452944 428818 408958 419588 444416 464961 470494 513559 520208 521300
6616 521300 546337 579664 598154 627040 677148 703949 742962 783302 815329 876847 929730 916789
6604 916789 853638 837373 827962 828313 854817 901890 924320 956453 1024496 1093660 1143865 1188415
6592 1188415 1225953 1249302 1255478 1297096 1338638 1400995 1469921 1547064 1583824 1638730 1697227 1830203
6580 1830203 1980516 2161304 2238358 2140529 1974758 1770463 1570748 1441147 1337273 1250131
6570 1250131 1217176 1208337 1209382 1209435 1213341 1194795 1153040 1031624 969949 905192 810946 747382
6558 747382 701450 667162 641667 649342 621690 592095 570215 550099 550452 553489 570360 520303
6546 520303 516899 540551 565806 566990 579004 558304 533104 542361 520973 510631 493042 488941
$$ packed form
6628C99719L5962N547J1716k4126j9860J0630K4828K0545N533M3065O649J092
6616E21300K5037L3327J8490K8886N0108K6801L9013M0340L2027O1518N2883j2941
6604I16789o3151j6265r411L51K6504M7073K2430L2133O8043O9164N0205M4550
6592A188415L7538K3349O176M1618M1542O2357O8926P7143L6760N4906N8497J32976
6580A830203J50313J80788P7054r7829j65771k04295j99715j29601j03874q7142
6570A250131l2955q839J045N3L906j8546m1755j21416o1675o4757r4246o3564
6558G47382m5932l4288k5495P675k7652k9595k1880k0116L53L037J6871n0057
6546E20303l404K3652K5255J184J2014k0700k5200R257k1388j0342j7589m101
$$ plain form
6534 488941 488619 488107 472218 454061 446009 452741 430982 452128 444170 450959 476562 469268 465088 484793
6520 484793 489713 486736 482012 463076 473416 481220 479364 494143 483137 467273 491561 506012 513120
6507 513120 544446 534216 524564 547501 535734 542703 532391 525667 541894 550852 556783 559284 563365
6494 563365 576773 574812 593315 623331 604601 601488 586533 609878 642088 669678 667805 669021
6482 669021 684761 681773 680053 703001 736377 772118 825332 826184 847355 864505 847319 856661 861601
6469 861601 855944 875286 871633 882452 898768 901152 926591 926727 944336 970181 969739 994486 1015549
6456 1015549 1005416 985548 972647 969656 958966 990156 1016046 1017696 1037219 1048051 1058070 1042560
6444 1042560 1052336 1030447 1020664 1041486 1035984 1060651 1061425 1077520 1078035 1084440 1099362 1082793 1107525
$$ packed form
6534D88941l22n12j5889j8157q052O732k1759K1146p958O789K5603p294m180J9705
6520D84793M920k977m724j8936J0340P804j856J4779j1006j5864K4288J4451P108
6507E13120L1326j0230r652K2937j1767O969j0312o724J6227Q958N931K501M081
6494E63365J3408j961J8503L0016j8730l113j4955K3345L2210K7590j873J216
6482F69021J5740k988j720K2948L3376L5741N3214Q52K1171J7150j7186R342M940
6469H61601n657J9342l653J0819J6316K384K5439J36J7609K5845m42K4747K1063
6456A015549j0133j9868j2901k991j0690L1190K5890J650J9523J0832J0019j5510
6444A042560R776k1889r783K0822n502K4667P74J6095N15O405J4922j6569K4732
$$ plain form
6431 1107525 1082788 1106763 1115276 1149200 1177714 1199460 1193627 1211857 1210932 1239854 1267594 1257642
6419 1257642 1280753 1296480 1310382 1340898 1331881 1348619 1357047 1403740 1428691 1424910 1469679 1498761
6407 1498761 1526895 1542438 1562395 1595126 1627860 1640891 1677787 1722266 1734660 1758838 1794955
6396 1794955 1841634 1862865 1878992 1906871 1933128 1994022 2032874 2086992 2121101 2160174 2204966
6385 2204966 2245089 2276614 2316746 2384802 2432724 2464008 2542710 2609492 2632699 2668682 2752301
6374 2752301 2806084 2868340 2944796 2997230 3092792 3198693 3312319 3459546 3583168 3728313
6364 3728313 3859329 4012994 4209804 4424603 4695511 5019616 5465646 6073125 6761818 7670019
6354 7670019 8721201 9575462 9496517 8624809 7694035 6865047 6344525 5988483 5745612 5644182
$$ packed form
6431A107525k4737K3975Q513L3924K8514K1746n833J8230r25K8922K7740r952
6419A257642K3111J5727J3902L0516r017J6738Q428M6693K4951l781M4769K9082
6407A498761K8134J5543J9957L2731L2734J3031L6896M4479J2394K4178L6117
6396A794955M6679K1231J6127K7879K6257O0894L8852N4118L4109L9073M4792
6385B204966M0123L1525M0132O8056M7922L1284P8702O6782K3207L5983Q3619
6374B752301N3783O2256P6456N2434R5562J05901J13626J47227J23622J45145
6364C728313J31016J53665J96810K14799K70908L24105M46030O07479O88693R08201
6354G670019J051182Q54261p8945q71708r30774q28988n20522l56042k42871j01430
$$ plain form
6344 5644182 5549219 5475706 5452105 5466477 5466548 5468373 5531825 5602062 5650586 5725961 5803671 5882023
6332 5882023 5976735 6060471 6145497 6259537 6403085 6558997 6722839 6908588 7067614 7254300
6322 7254300 7469514 7622098 7804245 7931466 8095949 8276954 8463582 8659247 8870364 9122390
6312 9122390 9349556 9594025 9885760 10198493 10482614 10792305 11157325 11523426 11887459 12260808
6302 12260808 12669827 13033397 13417226 13815425 14251784 14724789 15226576 15758945 16304214
6293 16304214 16865607 17450137 18110225 18782028 19532532 20343195 21231685 22242296 23432363
6284 23432363 24818666 26424566 28149134 29961131 31948651 34218510 36811537 39672084
6276 39672084 42816326 46629322 51406358 57426343 64998415 74188192 83410347 88727977
$$ packed form
6344E644182r4963p3513k3601J4372P1J825O3452P0237M8524P5375P7710P8352
6332E882023R4712Q3736Q5026J14040J43548J55912J63842J85749J59026J86686
6322G254300K15214J52584J82147J27221J64483J81005J86628J95665K11117K52026
6312I122390K27166K44469K91735L12733K84121L09691L65020L66101L64033L73349
6302A2260808M09019L63570L83829L98199M36359M73005N01787N32369N45269
6293A6304214N61393N84530O60088O71803P50504Q10663Q88490J010611J190067
6284B3432363J386303J605900J724568J811997J987520K269859K593027K860547
6276C9672084L144242L812996M777036O019985P572072R189777R222155N317630
$$ plain form
6268 88727977 86916714 80576806 73501405 67717179 64085622 62408923 62414007 63997716 67202894
6259 67202894 72144961 78301624 83647785 85567257 84529287 83553932 84501894 88106774
6251 88106774 93870996 99575868 101673880 98310571 91114887 83449450 77656379 74652232
6243 74652232 74601387 76888065 79735093 80003389 76315087 70981333 66214087 62923593 61611024
6234 61611024 62244071 64828296 69421467 76134740 83992119 89613129 87852954 78636350
6226 78636350 66921564 55881585 47068384 40435532 35350562 31235154 27996683 25368841
6218 25368841 23199473 21365110 19828167 18512451 17463646 16549460 15733134 14970145 14276463
6209 14276463 13623255 13070822 12515114 11981160 11521689 11081243 10677967 10307864 9972393
$$ packed form
6268H8727977j811263o339908p075401n784226l631557j676699N084J583709L205178
6259F7202894M942067O156663N346161J919472j037970r75355R47962L604880
6251H8106774N764222N704872K098012l363309p195684p665437n793071l004147
6243G4652232n0845K286678K847028K68296l688302n333754m767246l290494j312569
6234F1611024O33047K584225M593171O713273P857379N621010j760175r216604
6226G8636350j1714786j1039979q813201o632852n084970m115408l238471k627842
6218B5368841k169368j834363j536943j315716j048805r14186q16326p62989o93682
6209A4276463o53208n52433n55708n33954m59471m40446m03276l70103l35471
$$ plain form
6200 9972393 9659342 9324827 9026611 8744781 8443971 8153405 7863606 7599707 7370392 7151564
6190 7151564 6926460 6705588 6495222 6297304 6123255 5978342 5866472 5743870 5614822 5514194
6180 5514194 5433388 5329894 5179414 5063230 4934250 4772614 4576446 4400740 4237155 4084824
6170 4084824 3958701 3799441 3667517 3570534 3486547 3385682 3250891 3182421 3103024 3027772
6160 3027772 2965025 2886031 2819922 2715324 2643741 2585691 2534062 2487854 2456228 2421158 2409741
6149 2409741 2410516 2391436 2382858 2357927 2396585 2422977 2413521 2350390 2238621 2145595 2085146 2043631
6137 2043631 1991394 1921569 1873048 1810217 1767380 1735608 1731147 1738569 1739947 1750549 1745169 1760689
6125 1760689 1773088 1753916 1697686 1666314 1617308 1547615 1506107 1478887 1492027 1467680 1461530 1440307
$$ packed form
6200I972393l13051l34515k98216k81830l00810k90566k89799k63899k29315k18828
6190G151564k25104k20872k10366j97918j74049j44913j11870j22602j29048j00628
6180E514194q0806j03494j50480j16184j28980j61636j96168j75706j63585j52331
6170D084824j26123j59260j31924r6983q3987j00865j34791o8470p9397p5252
6160C027772o2747p8994o6109j04598p1583n8050n1629m6208l1626l5070j1417
6149B409741P75j9080q578k4931L8658K6392r456o3131j11769r3026o0449m1515
6137B043631n2237o9825m8521o2831m2837l1772m461P422J378J0602n380J5520
6125A760689J2399j9172n6230l1372m9006o9693m1508k7220J3140k4347o150k1223
$$ plain form
6113 1440307 1416162 1393199 1393771 1411539 1412928 1436237 1444217 1424490 1433332 1415860 1388340 1390458 1365046
6100 1365046 1313618 1336371 1307579 1310221 1297339 1286957 1259238 1252966 1229413 1261833 1261623 1259618
6088 1259618 1212685 1183287 1191610 1191531 1134513 1126575 1149796 1144213 1136177 1095982 1094242 1099853 1083585
6075 1083585 1043941 1026450 1062596 1045111 1038802 1055718 1038025 1019859 1019782 1028464 1013157 1020825 1024171
6062 1024171 980931 954274 959463 946548 945463 953277 963840 938124 926618 918809 957274 983985
6050 983985 974058 972298 972892 1020448 1079141 1096738 1109195 1160459 1229475 1294779 1309703 1304640 1271438
6037 1271438 1226951 1182207 1164404 1151239 1140868 1128200 1146522 1185446 1206079 1213296 1199385 1195968
6025 1195968 1160023 1154809 1155701 1189250 1202924 1245781 1223550 1207354 1170006 1175410 1201910 1179668
$$ packed form
6113A440307k4145k2963N72J7768J389K3309P980j9727Q842j7472k7520K118k5412
6100A365046n1428K2753k8792K642j2882j0382k7719o272k3553L2420k10k005
6088A259618m6933k9398Q323p9n7018p938K3221n583q036m0195j740N611j6268
6075A083585l9644j7491L6146j7485o309J6916j7693j8166p7Q682j5307P668L346
6062A024171m3240k6657N189j2915j085P814J0563k5716j1506p809L8465K6711
6050I83985r927j760N94M7556N8693J7597J2457N1264O9016O5304J4924n063l3202
6037A271438m4487m4744j7803j3165j0371j2668J8322L8924K0633P217j3911l417
6025A195968l5945n214Q92L3549J3674M2857k2231j6196l7348N404K6500k2242
$$ plain form
6013 1179668 1138902 1119642 1110702 1082134 1050353 1044962 1029857 1015876 1005319 1016307 1045723 1068418
6001 1068418 1097962 1107023 1063635 1032555 1020047 985049 941431 938394 952504 930155 929048 957928
5989 957928 952922 962387 963988 982641 993836 986814 966483 987420 981053 1006125 1037138 1066418 1076539
5976 1076539 1062286 1041028 1061054 1058450 1040485 1054025 1062316 1080480 1087998 1102079 1117874 1146294
5964 1146294 1194864 1226100 1264941 1300503 1351130 1366302 1393184 1412191 1400871 1380488 1346015
5953 1346015 1324728 1312726 1349406 1366957 1389612 1434978 1470689 1526779 1543584 1555033 1583453
5942 1583453 1609024 1647490 1712246 1708954 1725691 1742025 1760202 1770657 1753019 1760779 1774257 1845123
5930 1845123 1894833 1957075 1963501 1955412 1928155 1890006 1849536 1845421 1813356 1829657 1876527 1934898
$$ packed form
6013A179668m0766j9260q940k8568l1781n391j5105j3981j0557J0988K9416K2695
6001A068418K9544R061m3388l1080j2508l4998m3618l037J4110k2349j107K8880
5989I57928n006R465J601J8653J1195p022k0331K0937o367K5072L1013K9280J0121
5976A076539j4253k1258K0026k604j7965J3540Q291J8164P518J4081J5795K8420
5964A146294M8570L1236L8841L5562N0627J5172K6882J9007j1320k0383l4473
5953A346015k1287j2002L6680J7551K2655M5366L5711N6090J6805J1449K8420
5942A583453K5571L8466O4756l292J6737J6334J8177J0455j7638P760J3478P0866
5930A845123M9710O2242O426q089k7257l8149m0470m115l2065J6301M6870N8371
$$ plain form
5918 1934898 1981340 2012715 2029919 2007857 1999728 1976350 1933701 1947289 1956917 1965240 1979662 1945555
5906 1945555 1902078 1883534 1838516 1817268 1826176 1846769 1841816 1876530 1910226 1891480 1903758 1928610
5894 1928610 1935305 1944856 1931939 1949028 2015412 2068043 2123294 2135514 2113472 2045541 2014309 1939086
5882 1939086 1885773 1862975 1839101 1851876 1849190 1823246 1806083 1840985 1860122 1853058 1846996 1839515
5870 1839515 1849219 1858139 1870522 1868324 1886562 1930974 1953995 1979287 1982197 1966279 1962713 2033070
5858 2033070 2088299 2120317 2159614 2221160 2255024 2304006 2358588 2382769 2429553 2464351 2473912 2503452
5846 2503452 2515094 2545219 2575477 2591804 2622442 2683301 2727349 2793953 2834661 2890110 2928552
5835 2928552 2985117 3016054 3074349 3090397 3118381 3167746 3202854 3224317 3281097 3341738 3403296
$$ packed form
5918A934898M6442L1375J7204k2062q129k3378m2649J3588R628Q323J4422l4107
5906A945555m3477j8544m5018k1248Q908K0593m953L4714L3696j8746J2278K4852
5894A928610O695R551j2917J7089O6384N2631N5251J2220k2042o7931l1232p5223
5882A939086n3313k2798k3874J2775k686k5944j7163L4902J9137p064o062p481
5870A839515R704Q920J2383k198J8238M4412K3021K5292K910j5918l566P0357
5858B033070N5229L2018L9297O1546L3864M8982N4582K4181M6784L4798R561K9540
5846B503452J1642L0125L0258J6327L0638O0859M4048O6604M0708N5449L8442
5835B928552N6565L0937N8295J6048K7984M9365L5108K1463N6780O0641O1558
$$ plain form
5824 3403296 3431673 3505639 3617197 3659908 3718743 3817758 3872586 3994045 4071410 4124386 4167851
5813 4167851 4200809 4292529 4381406 4495835 4611553 4740483 4899159 5068110 5143480 5186577
5803 5186577 5206571 5209558 5266767 5354922 5424123 5531732 5675012 5797931 5934557 6075871 6191946
5792 6191946 6282307 6431033 6556973 6663859 6763466 6862296 6992776 7125026 7225708 7353779
5782 7353779 7530855 7682143 7857560 8054743 8250499 8463987 8708345 8925615 9152494 9381539
5772 9381539 9618445 9819427 10081544 10334111 10554341 10807441 11083817 11339546 11651428 11958457
5762 11958457 12306270 12674281 13055324 13478091 13959646 14450010 14948804 15441100 15967146
5753 15967146 16556033 17191034 17879836 18671744 19513911 20344780 20997484 21443816 21833827
$$ packed form
5824C403296K8377P3966J11558M2711N8835R9015N4828J21459P7365N2976M3465
5813D167851L2958R1720Q8877J14429J15718J28930J58676J68951P5370M3097
5803E186577J9994K987N7209Q8155O9201J07609J43280J22919J36626J41314J16075
5792F191946R0361J48726J25940J06886R9607R8830J30480J32250J00682J28071
5782G353779J77076J51288J75417J97183J95756K13488K44358K17270K26879K29045
5772I381539K36906K00982K62117K52567K20230K53100K76376K55729L11882L07029
5762A1958457L47813L68011L81043M22767M81555M90364M98794M92296N26046
5753A5967146N88887O35001O88802P91908Q42167Q30869O52704M46332L90011
$$ plain form
5744 21833827 22211065 22697726 23295088 24003431 24901133 25944054 27170659 28565038 29987655
5735 29987655 31335054 32683099 34031096 35596822 37558108 40021732 42964195 46430944
5727 46430944 50538671 55591237 61954131 69814482 79492392 90659781 100776794 104842450
5719 104842450 100512683 92027248 83430255 76882643 73050604 71557147 71933139 74058656
5711 74058656 78101104 83668923 88724476 90239716 88209203 85623908 84504764 85958507
5703 85958507 90173960 96639382 103740672 108134548 107278993 101893255 95221072 89916572
5695 89916572 87282640 87422583 88541966 87705157 83270689 77258345 71730534 67798035
5687 67798035 65884133 65844461 67493886 70721652 75620574 82170759 88921087 92475963
$$ packed form
5744B1833827L77238M86661N97362P08343Q97702J042921J226605J394379J422617
5735B9987655J347399J348045J347997J565726J961286K463624K942463L466749
5727D6430944M107727N052566O362894P860351R677910J1167389J0117013M065656
5719A04842450m329767q485435q596993o547612l832039j493457L75992K125517
5711G4058656M042448N567819N055553J515240k030513k585295j119144J453743
5703H5958507M215453O465422P101290M393876q55555n385738o672183n304500
5695H9916572k633932J39943J119383q36809m434468o012344n527811l932499
5687F7798035j913902l9672J649425L227766M898922O550185O750328L554876
$$ plain form
5679 92475963 89171739 80477378 70482872 61476082 54565695 49450977 45649944 42744338
5671 42744338 40597106 39052843 38072731 37401623 36976774 36667416 36603982 36687754 36880790
5662 36880790 37111876 37639773 38600258 40076394 41987716 44796040 48597620 51069253 50026454
5653 50026454 47302535 44473256 42324718 41112043 40424528 40114446 40152492 40448493 40990319
5644 40990319 41683426 42375394 43023157 43794786 44572034 45499352 46517762 47805471 49419355
5635 49419355 51529608 54149410 57438693 61138779 65572519 70833377 77514155 85668123
5627 85668123 95504996 107003524 121022315 138527466 161068859 189432113 225910128
5620 225910128 266328692 294842417 287755109 251706887 209744988 171456672 142943688
$$ packed form
5679I2475963l304224q694361r994506r006790o910387n114718l801033k905606
5671D2744338k147232j544263r80112o71108m24849l09358o3434Q3772J93036
5662C6880790K31086N27897R60485J476136J911322K808324L801580K471633j042799
5653E0026454k723919k829279k148538j212675o87515l10082L8046K96001N41826
5644D0990319O93107O91968O47763P71629P77248R27318J018410J287709J613884
5635D9419355K110253K619802L289283L700086M433740N260858O680778Q153968
5627H5668123R836873J1498528J4018791J7505151K2541393K8363254L6478015
5620B25910128M0418564K8513725p087308l6048222m1961899l8288316k8512984
$$ plain form
5613 142943688 121968038 106258753 93783577 83960824 76122653 69960889 64818262 60552235
5605 60552235 56985409 54247538 51887196 49779697 47678582 45610045 43475994 41372715
5597 41372715 39244393 37213648 35268429 33564774 32057549 30751765 29525470 28378026
5589 28378026 27180074 26024450 24942391 24011514 23103541 22205014 21331731 20567484 19921641
5580 19921641 19474278 19099082 18870515 18635090 18357861 17947159 17400371 16698286 15903860
5571 15903860 15110559 14420815 13833322 13378150 13001562 12680366 12361889 12088558 11804994
5562 11804994 11487355 11161294 10855164 10537564 10209683 9914296 9619054 9341523 9009853
5553 9009853 8674862 8392420 8122881 7893840 7706312 7563689 7456593 7295810 7142731 6982094
$$ packed form
5613A42943688k0975650j5709285j2475176r822753p838171o161764n142627m266027
5605F0552235l566826k737871k360342k107499k101115k068537k134051k103279
5597D1372715k128322k030745j945219j703655j507225j305784j226295j147444
5589B8378026j197952j155624j082059r30877r07973q98527q73283p64247o45843
5580A9921641m47363l75196k28567k35425k77229m10702n46788p02085p94426
5571A5903860p93301o89744n87493m55172l76588l21196l18477k73331k83564
5562A1804994l17639l26061l06130l17600l27881k95387k95242k77531l31670
5553I009853l34991k82442k69539k29041j87528j42623j07096j60783j53079j60637
$$ plain form
5543 6982094 6790347 6582068 6430193 6254838 6098213 5967792 5826062 5667580 5560979 5467554
5533 5467554 5386229 5330499 5278305 5211769 5164208 5111970 4989810 4815259 4655968 4529448 4414818
5522 4414818 4300043 4203654 4148964 4101637 4064331 4005776 3991733 3949156 3887843 3860112 3865145
5511 3865145 3819641 3767381 3681624 3565859 3480281 3398030 3306761 3208034 3105336 3049623 3041295
5500 3041295 3005823 3016934 2987580 2952934 2931675 2891441 2833423 2828444 2834837 2774207 2757374 2770515
5488 2770515 2776901 2775658 2769631 2744338 2680849 2599114 2529278 2505576 2472473 2445375 2433870 2401518
5476 2401518 2353419 2302410 2234533 2166451 2082851 2033314 1951511 1898779 1874765 1859886 1835201
5465 1835201 1807231 1783782 1763821 1749759 1773301 1758311 1781034 1797124 1779359 1713352 1673696
$$ packed form
5543F982094j91747k08279j51875j75355j56625j30421j41730j58482j06601r3425
5533E467554q1325n5730n2194o6536m7561n2238j22160j74551j59291j26520j14630
5522D414818j14775r6389n4690m7327l7306n8555j4043m2577o1313k7731N033
5511C865145m5504n2260q5757j15765q5578q2251r1269r8727j02698n5713q328
5500C041295l5472J1111k9354l4646k1259m0234n8018m979O393o0630j6833J3141
5488B770515O386j243o027k5293o3489q1735o9836k3702l3103k7098j1505l2352
5476B401518m8099n1009o7877o8082q3600m9537q1803n2732k4014j4879k4685
5465A835201k7970k3449j9961j4062K3542j4990K2723J6090j7765o6007l9656
$$ plain form
5454 1673696 1664400 1673379 1653062 1613922 1561393 1525191 1494660 1522735 1502577 1520651 1551807 1578278
5442 1578278 1566468 1575457 1575388 1592848 1606709 1616491 1574878 1560481 1534418 1508483 1501533 1493756 1483713
5429 1483713 1506462 1505548 1524315 1512628 1479268 1491330 1464113 1409683 1402764 1410544 1429183 1440628
5417 1440628 1490435 1526436 1529073 1527109 1545191 1547542 1556239 1604231 1618983 1638606 1690262 1691515
5405 1691515 1727302 1767685 1823016 1879556 1955963 2080098 2171661 2314617 2479056 2708389 2972871
5394 2972871 3269814 3571709 3829534 3830819 3539061 3137248 2788284 2557447 2388563 2248148
5384 2248148 2139868 2076027 1996971 1935843 1916352 1932353 1984608 2001461 2069452 2131130 2166708
5373 2166708 2205227 2247136 2177192 2062432 1972294 1870298 1779283 1735719 1697670 1641538 1601196
$$ packed form
5454A673696r296Q979k0317l9140n2529l6202l0531K8075k0158J8074L1156K6471
5442A578278j1810Q989o9J7460J3861R782m1613j4397k6063k5935o950p777j0043
5429A483713K2749r14J8767j1687l3360J2062k7217n4430o919P780J8639J1445
5417A440628M9807L6001K637j964J8082K351Q697M7992J4752J9623N1656J253
5405A691515L5787M0383N5331N6540P6407J24135R1563J42956J64439K29333K64482
5394B972871K96943L01895K57825J285k91758m01813l48964k30837j68884j40415
5384B248148j08280o3841p9056o1128j9491J6001N2255J6853O7991O1678L5578
5373B166708L8519M1909o9944j14760r0138j01996r1015m3564l8049n6132m0342
$$ plain form
5362 1601196 1573135 1577179 1596673 1629955 1653920 1679363 1742009 1756018 1712494 1692885 1650378 1635209
5350 1635209 1658490 1661538 1648481 1670994 1712223 1745519 1774265 1769616 1722677 1674131 1612666 1565330
5338 1565330 1504887 1484749 1454774 1455032 1497468 1485417 1502693 1525426 1572711 1585521 1577830 1572084
5326 1572084 1583615 1606470 1630365 1658060 1685084 1676068 1739189 1787577 1819410 1872895 1970511 2016919
5314 2016919 2009256 2000452 2002402 2006189 2047399 2032880 2121037 2196035 2342028 2456159 2556962 2669080
5302 2669080 2726113 2705534 2667176 2576339 2518973 2481652 2468157 2436536 2393281 2322245 2307480
5291 2307480 2263923 2314352 2302156 2306452 2309569 2313931 2329301 2334030 2319743 2391000 2447488 2509727
5279 2509727 2602119 2720808 2875425 2996265 3138129 3296175 3463146 3700228 3957167 4198390
$$ packed form
5362A601196k8061M044J9494L3282K3965K5443O2646J4009m3524j9609m2507j5169
5350A635209K3281L048j3057K2513M1229L3296K8746m649m6939m8546o1465m7336
5338A565330o0443k0138k9975K58M2436j2051J7276K2733M7285J2810p691n746
5326A572084J1531K2855K3895K7695K7024r016O3121M8388L1833N3485R7616M6408
5314B016919p663q804J950L787M1210j4519Q8157P4998J45993J14131J00803J12118
5302B669080N7033k0579l8358r0837n7366l7321j3495l1621m3255p1036j4765
5291B307480m3557N0429j2196M296L117M362J5370M729j4287P1257N6488O2239
5279B509727R2392J18689J54617J20840J41864J58046J66971K37082K56939K41223
$$ plain form
5269 4198390 4245352 4146699 3935154 3673317 3426471 3203085 3018465 2849458 2711826 2622897
5259 2622897 2562231 2541186 2510378 2462649 2443247 2454057 2495138 2542179 2618347 2690688 2768896
5248 2768896 2838652 2887415 2926385 2968191 3015199 3111002 3256698 3532942 3838148 4181550 4505149
5237 4505149 4733534 4781589 4667379 4419978 4188424 3968286 3780190 3641205 3518995 3410381
5227 3410381 3304626 3220962 3123056 3034059 3006979 2984620 2988531 2986664 3050964 3080611 3147659 3195032
5215 3195032 3233315 3252270 3326015 3382651 3488558 3543553 3716010 3883099 4059355 4186091
5205 4186091 4293773 4338396 4366949 4376505 4369061 4323779 4364476 4410717 4502096 4569587 4669063 4680385
5193 4680385 4724870 4751805 4837606 4901426 5028485 5145985 5232919 5241437 5263296 5266049 5305077
$$ packed form
5269D198390M6962r8653k11545k61837k46846k23386j84620j69007j37632q8929
5259B622897o0666k1045l0808m7729j9402J0810M1081M7041P6168P2341P8208
5248B768896O9756M8763L8970M1806M7008R5803J45696K76244L05206L43402L23599
5237D505149K28385M8055j14210k47401k31554k20138j88096j38985j22210j08614
5227C410381j05755q3664r7906q8997k7080k2359L911j867O4300K9647O7048M7373
5215C195032L8283J8955P3745N6636J05907N4995J72457J67089J76256J26736
5205D186091J07682M4623K8553R556p444m5282M0697M6241R1379O7491R9476J1322
5193D680385M4485K6935Q5801O3820J27059J17500Q6934Q518K1859K753L9028
$$ plain form
5182 5305077 5361186 5485108 5597887 5805632 5977690 6157139 6361042 6616160 6782118 6959502
5172 6959502 7088653 7229517 7333947 7472773 7673795 7893413 8089032 8284301 8489531 8687340
5162 8687340 8850479 9011597 9223787 9470018 9719801 10045940 10356073 10784267 11160641 11485006
5152 11485006 11703795 11810119 11847936 11938956 12042082 12127674 12238972 12374184 12548000 12714064
5142 12714064 12855857 13019041 13197048 13433291 13722586 14050561 14417950 14869668 15375391
5133 15375391 15915700 16517860 17104498 17640926 18136508 18644402 19278083 20024405 20755656
5124 20755656 21536641 22389157 23334295 24308089 25347514 26390894 27432412 28399363 29396131
5115 29396131 30298519 31299935 32314249 33426066 34488426 35595866 36588451 37676263
$$ packed form
5182E305077N6109J23922J12779K07745J72058J79449K03903K55118J65958J77384
5172F959502J29151J40864J04430J38826K01022K19618J95619J95269K05230J97809
5162H687340J63139J61118K12190K46231K49783L26139L10133M28194L76374L24365
5152A1485006K18789J06324L7817R1020J03126Q5592J11298J35212J73816J66064
5142A2714064J41793J63184J78007K36243K89295L27975L67389M51718N05723
5133A5375391N40309O02160N86638N36428M95582N07894O33681P46322P31251
5124B0755656P80985Q52516R45138R73794J039425J043380J041518R66951R96768
5115B9396131R02388J001416J014314J111817J062360J107440R92585J087812
$$ plain form
5107 37676263 38816236 40201807 41845405 43890326 46137496 48669108 51369335 54612426
5099 54612426 57707809 59782682 60460292 61363112 62724442 65296752 68932163 73915964
5091 73915964 79579523 86480365 94799490 105541098 117816995 131652756 147457711 168490844
5083 168490844 195791081 231019925 275349269 335859723 407904263 459641620 442061521
5076 442061521 375343544 303663654 240318027 197032921 164614229 138959792 117800103
5069 117800103 101447687 88747214 79268715 71175323 64657779 59069021 54747947 50914642
5061 50914642 47651243 44499591 41742653 38976536 36574414 34108284 31938387 29880938
5053 29880938 28265947 26794980 25647858 24544175 23561828 22512469 21508366 20550187
$$ packed form
5107C7676263J139973J385571J643598K044921K247170K531612K700227L243091
5099E4612426L095383K074873O77610R02820J361330K572310L635411M983801
5091G3915964N663559O900842Q319125J0741608J2275897J3835761J5804955K1033133
5083A68490844K7300237L5228844M4329344O0510454P2044540N1737357j7580099
5076D42061521o6717977p1679890o3345627m3285106l2418692k5654437k1159689
5069A17800103j6352416j2700473r478499q093392o517544n588758m321074l833305
5061E0914642l263399l151652k756938k766117k402122k466130k169897k057449
5053B9880938j614991j470967j147122j103683r82347j049359j004103r58179
$$ plain form
5045 20550187 19763670 18972151 18295888 17590185 16944949 16334189 15804573 15298890 14924979
5036 14924979 14567353 14230618 13917187 13573596 13157450 12683642 12173174 11765240 11345575
5027 11345575 11019833 10714580 10441457 10236585 10100783 9941414 9755206 9496830 9179104
5018 9179104 8861683 8527903 8227681 7903144 7591815 7303586 7020801 6810973 6615891 6380829
5008 6380829 6201554 5995261 5834358 5704409 5551879 5420706 5334674 5231588 5211908 5161731
4998 5161731 5080962 4931756 4813387 4668193 4573449 4462210 4370547 4269405 4197188 4046133
4988 4046133 3983612 3876668 3796532 3641098 3537510 3393081 3324588 3216021 3152072 3103783
4978 3103783 3097373 3065275 3097629 3073033 3043343 3009702 2987365 2911581 2862414 2734295 2651847
$$ packed form
5045B0550187p86517p91519o76263p05703o45236o10760n29616n05683l73911
5036A4924979l57626l36735l13431l43591m16146m73808n10468m07934m19665
5027A1345575l25742l05253k73123k04872j35802j59369j86208k58376l17726
5018I179104l17421l33780l00222l24537l11329k88229k82785k09828j95082k35062
5008F380829j79275k06293j60903j29949j52530j31173q6032j03086j9680n0177
4998E161731q0769j49206j18369j45194r4744j11239r1663j01142p2217j51055
4988D046133o2521j06944q0136j55434j03588j44429o8493j08567o3949m8289
4978C103783o410l2098L2354k4596k9690l3641k2337p5784m9167j28119q2448
$$ plain form
4967 2651847 2575226 2539999 2479806 2456330 2401842 2379662 2341901 2357630 2311111 2329134 2314325
4956 2314325 2289941 2223631 2208392 2134062 2114195 2078040 2051994 2014616 1996818 1997918 1997684 1975924
4944 1975924 1997845 1979996 1937090 1900041 1867505 1893882 1931225 1947437 1966758 1933856 1895540
4933 1895540 1847127 1835332 1799283 1725847 1668447 1640000 1601087 1559301 1557601 1536656 1523192 1514327
4921 1514327 1517630 1558951 1577313 1620447 1639999 1623199 1619070 1648480 1610970 1561057 1508361 1418990
4909 1418990 1379188 1371568 1353293 1373618 1365075 1379452 1426276 1433307 1445136 1482013 1465714 1472308
4897 1472308 1501991 1536780 1546163 1508636 1475019 1422795 1425048 1437396 1489101 1535618 1545635 1539326
4885 1539326 1531180 1518337 1496819 1453462 1453137 1440229 1476528 1512296 1560978 1586148 1617936 1642628
$$ packed form
4967B651847p6621l5227o0193k3476n4488k2180l7761J5729m6519J8023j4809
4956B314325k4384o6310j5239p4330j9867l6155k6046l7378j7798J100k34k1760
4944A975924K1921j7849m2906l7049l2536K6377L7343J6212J9321l2902l8316
4933A895540m8413j1795l6049p3436n7400k8447l8913m1786j700k0945j3464q865
4921A514327L303M1321J8362M3134J9552j6800m129K9410l7510m9913n2696q9371
4909A418990l9802p620j8275K0325q543J4377M6824P031J1829L6877j6299O594
4897A472308K9683L4789R383l7527l3617n2224K253J2348N1705M6517J0017o309
4885A539326q146j2843k1518m3357l25j2908L6299L5768M8682K5170L1788K4692
$$ plain form
4873 1642628 1686824 1738602 1754586 1751531 1779084 1824774 1928963 1980737 2107601 2227356 2398132
4862 2398132 2529915 2646164 2784585 2928074 3180826 3600146 4151464 4905691 5875994 6877753
4852 6877753 7212849 6733123 6008063 5290636 4611159 3972843 3402441 2886139 2522806 2298558
4842 2298558 2137136 1973849 1858419 1784427 1725221 1680091 1608890 1534076 1469961 1427925 1403936
4831 1403936 1389284 1350172 1346673 1326288 1339035 1329644 1313520 1273111 1268659 1253861 1233893 1205181
4819 1205181 1206630 1153820 1142745 1175147 1190506 1206043 1233470 1257340 1328143 1342856 1410540 1483177
4807 1483177 1605962 1736849 1943282 2211338 2528320 2844691 3184202 3180198 2836697 2442843
4797 2442843 2087087 1821833 1622224 1475182 1364961 1282703 1235205 1207330 1145045 1136587 1103225
$$ packed form
4873A642628M4196N1778J5984l055K7553M5690J04189N1774J26864J19755J70776
4862B398132J31783J16249J38421J43489K52752M19320N51318P54227R70303J001759
4852F877753L35096m79726p25060p17427o79477o38316n70402n16302l63333k24248
4842B298558j61422j63287j15430p3992n9206m5130p1201p4814o4115m2036k3989
4831A403936j4652l9112l499k0385J2747r391j6124m0409m452j4798j9968k8712
4819A205181J449n2810j1075L2402J5359J5537K7427K3870P0803J4713O7684P2637
4807A483177J22785J30887K06433K68056L16982L16371L39511m004l43501l93854
4797B442843l55756k65254j99609j47042j10221q2258m7498k7875o2285q458l3362
$$ plain form
4786 1103225 1093071 1093294 1088043 1064478 1050750 1026593 1018603 1005578 988585 990413 991443 977946 982447
4773 982447 1025706 1042407 1100640 1143431 1129816 1211076 1315719 1426203 1587438 1811856 2108853
4762 2108853 2477433 2792182 2836806 2524405 2119608 1758304 1502609 1311039 1161463 1030611
4752 1030611 914359 858349 797860 736459 722130 671059 662427 665855 667360 652094 593172 565003
4740 565003 584904 564858 552520 528000 521544 501465 493127 463987 457742 455956 413428 409332 422825
4727 422825 393237 377262 368956 381548 361103 355775 338250 318772 335063 346772 327656 335167
4715 335167 341399 369480 347237 326345 306492 321236 314465 334083 344282 336511 359185 367547
4703 367547 342153 345582 364193 360671 358125 345984 323028 275487 283526 276827 283352 277306 267875
$$ packed form
4786A103225j0154K23n251k3565j3728k4157p990j3025j6993J828J030j3497M501
4773I82447M3259J6701N8233M2791j3615Q1260J04643J10484J61235K24418K96997
4762B108853L68580L14749M4624l12401m04797l61304k55695j91570j49576j30852
4752A030611j16252n6010o0489o1401j4329n1071q632L428J505j5266n8922k8169
4740E65003J9901k0046j2338k4520o456k0079q338k9140o245j786m2528m096J3493
4727D22825k9588j5975q306J2592k0445n328j7525j9478J6291J1709j9116P511
4715C35167O232K8081k2243k0892j9853J4744o771J9618J0199p771K2674Q362
4703C67547k5394L429J8611l522k546j2141k2956m7541Q039o699O525o046r431
$$ plain form
4690 267875 270835 264248 221728 215591 212191 205436 229579 257428 265655 254530 247350 238951 234129
4677 234129 215502 215305 218428 251657 251130 230637 207073 202301 205841 226445 211839 193483 174732
4664 174732 166012 181512 165819 145757 163104 172132 152295 152070 158530 160337 174680 179155 164621
4651 164621 145807 149335 130567 152579 165402 161067 166490 169503 119271 114226 120299 138803 153768
4638 153768 161192 158419 125995 126971 144888 137582 142605 184337 186534 162071 137510 141828 129426
4625 129426 115269 104654 131838 145565 132014 121021 121393 122528 136229 130962 138830 165698 201124
4612 201124 153703 146978 129430 161344 177858 166593 187062 195993 190955 160249 118743 128457
4600 128457 132832 139352 130233 147283 131481 153211 149731 164004 140045 132942 119821 121182 113274
$$ packed form
4690B67875K960o587m2520o137l400o755K4143K7849Q227j1125p180q399m822
4677B34129j8627j97L123L3229n27k0493k3564m772L540K0604j4606j8356j8751
4664A74732q720J5500j5693k0062J7347R028j9837k25O460J807J4343M475j4534
4651A64621j8814L528j8768K2012J2823m335N423L013n0232n045O073J8504J4965
4638A53768P424k773l2424R76J7917p306N023M1732K197k4463k4561M318j2402
4625A29426j4157j0615K7184J3727j3551j0993L72J135J3701n267P868K6868L5426
4612B01124m7421o725j7548L1914J6514j1265K0469Q931n038l0706m1506R714
4600A28457M375O520r119J7050j5802K1730l480J4273k3959p103j3121J361p908
$$ plain form
4587 113274 124966 138118 139093 134322 117848 99536 99952 117126 125744 91684 90606 105228 96851
4574 96851 97881 102804 124363 136086 144425 155826 143943 149887 132585 127915 127923 151063 134193 122197
4560 122197 137389 121301 136352 118558 144744 138382 124402 122229 134495 143336 128685 125957
4548 125957 136503 125041 124405 148580 127800 99329 113536 109752 153537 186655 198333 195069
4536 195069 177031 179990 159368 135127 110851 105034 122161 123035 110400 117933 138172 148984 153666
4523 153666 136197 116173 73572 85399 79259 79975 102014 102468 95653 120088 115648 108880 106604
4510 106604 98019 115562 122002 128350 105241 109512 109407 117705 129938 95082 104848 124470 135099
4497 135099 125139 123589 135142 152698 121537 124103 152554 172718 166144 161280 157288 157249 175154
$$ packed form
4587A13274J1692J3152R75m771j6474j8312M16J7174Q618l4060j078J4622q377
4574I6851J030M923K1559J1723Q339J1401j1883N944j7302m670QK3140j6870j1996
4560A22197J5192j6088J5051j7794K6186o362j3980k173J2266Q841j4651k728
4548A25957J0546j1462o36K4175k0780k8471J4207l784M3785L3118J1678l264
4536A95069j8038K959k0622k4241k4276n817J7127Q74j2635P533K0239J0812M682
4523A53666j7469k0024m2601J1827o140P16K2039M54o815K4435m440o768k276
4510A06604q585J7543O440O348k3109M271j05Q298J2233l4856R766J9622J0629
4497A35099r960j550J1553J7556l1161K566K8451K0164o574m864l992l9J7905
$$ plain form
4484 175154 173771 157334 176858 157298 117567 118355 127875 124563 154969 146497 139699 170924 154983
4471 154983 135979 136014 106140 118404 136422 160832 152267 138807 139285 143247 167931 132778 137531
4458 137531 144989 123462 117555 114732 135553 117465 102701 119476 144376 132732 137528 130187 147855
4445 147855 140635 164174 146183 144816 165666 160784 156368 157365 169496 175424 180396 170785 159249
4432 159249 130088 144204 166535 168815 156757 154455 153124 167468 146914 137002 130562 139565 139537
4419 139537 112192 126011 148452 158754 175713 157189 150212 168359 176423 179380 180553 167816
4407 167816 163022 160606 172018 171746 160500 149886 163993 162889 164027 176659 213267 211577 199890
4394 199890 183873 183184 178265 193403 171582 194412 190582 184324 199752 186784 192829 160033 178233
$$ packed form
4484A75154j383j6437J9524j9560l9731P88R520l312L0406q472o798L1225j5941
4471A54983j9004L5k9874J2264J8018K4410q565j3460M78L962K4684l5153M753
4458A37531P458k1527n907k823K0821j8088j4764J6775K4900j1644M796p341J7668
4445A47855p220K3539j7991j367K0850m882m416R97J2131N928M972r611j1536
4432A59249k9161J4116K2331K280j2058k302j331J4344k0554r912o440R003k8
4419A39537k7345J3819K2441J0302J6959j8524o977J8147Q064K957J173j2737
4407A67816m794k416J1412k72j1246j0614J4107j104J138J2632L6608j690j1687
4394A99890j6017o89m919J5138k1821K2830l830o258J5428j2968O045l2796J8200
$$ plain form
4381 178233 203814 199179 192403 184924 185355 198100 187474 200141 209587 206745 219335 225276 190387
4368 190387 187525 202813 208376 202884 206148 231369 239799 260554 241408 244841 253830 256259 259713
4355 259713 270436 250220 253441 264145 245829 240044 258005 265395 264222 270571 299361 309729 320434
4342 320434 312574 319019 337292 337563 346070 376247 430791 474998 471232 426820 383882 375380 370092
4329 370092 357952 357708 374584 368520 382190 371958 372650 383546 400435 376159 396398 419108 419823
4316 419823 420074 428130 449853 433425 465123 488240 502390 486436 492228 504847 526728 532807 556124
4303 556124 607120 621986 658539 695400 703322 745239 806933 867050 885215 839000 835173 836384
4291 836384 825583 824469 831491 842631 851484 906026 965513 1029731 1074914 1130220 1129625 1104539 1047106
$$ packed form
4381A78233K5581m635o776p479M31J2745j0626J2667R446k842J2590N941l4889
4368A90387k862J5288N563n492L264K5221Q430K0755j9146L433Q989K429L454
4355B59713J0723k0216L221J0704j8316n785J7961P390j173O349K8790J0368J0705
4342C20434p860O445J8273K71Q507L0177N4544M4207l766m4412m2938q502n288
4329C70092j2140k44J6876o064J3670j0232O92J0896J6889k4276K0239K2710P15
4316D19823K51Q056K1723j6428L1698K3117J4150j5954N792J2619K1881O079K3317
4303E56124N0996J4866L6553L6861P922M1917O1694O0117J8165m6215l827J211
4291H36384j0801j114P022J1140Q853N4542N9487O4218M5183N5306n95k5086n7433
$$ plain form
4278 1047106 1022417 1017899 1022494 1051526 1048777 1069795 1072121 1076410 1117181 1139872 1134498 1143968 1172154
4265 1172154 1186864 1204562 1231667 1216374 1218809 1234849 1245998 1262308 1289538 1360291 1425739 1490814
4253 1490814 1475740 1398538 1271729 1194148 1140421 1092668 1041505 988738 947969 938138 932184 887002
4241 887002 830457 799361 768359 763780 754495 720520 690792 708711 688995 654138 607648 579233
4229 579233 596577 595002 564690 560079 535577 521431 502770 501018 469611 479818 478032 465856
4217 465856 437633 431450 427212 417715 415803 387570 420450 421148 399567 429292 420554 369006 394563
4204 394563 398844 365970 365069 381754 364708 380724 371052 371702 377116 386869 422168 446798 433008
4191 433008 479251 497947 486638 467248 439321 416884 440314 442973 405833 398102 379054 399384
$$ packed form
4278A047106k4689m518M595K9032k749K1018K326M289M0771K2691n374R470K8186
4265A172154J4710J7698K7105j5293K435J6040J1149J6310K7230P0753O5448O5075
4253A490814j5074p7202j26809p7581n3727m7753n1163n2767m0769r831n954m5182
4241H87002n6545l1096l1002m579r285l3975k9728J7919j9716l4857m6490k8415
4229E79233J7344j575l0312m611k4502j4146j8661j752l1407J0207j786j2176
4217D65856k8223o183m238r497j912k8233L2880O98k1581K9725q738n1548K5557
4204C94563M281l2874r01J6685j7046J6016r672O50N414R753L5299K4630j3790
4191D33008M6243J8696j1309j9390k7927k2437K3430K659l7140p731j9048K0330
$$ plain form
4179 399384 404083 396029 423421 451220 527744 569595 636822 630324 589211 519237 443348 385380
4167 385380 325862 324846 300308 278324 290052 257926 237537 238220 222460 232954 215985 194351
4155 194351 179252 176704 190034 181579 175911 169213 179063 187147 184995 208009 189158 185220 206795
4142 206795 185416 189234 174119 148275 150272 178350 154746 164922 132105 103949 148769 126235
4130 126235 124171 127771 143488 140202 144799 143566 147043 124261 104129 109376 122367 134556 122603
4117 122603 102938 126786 134923 123612 116989 109145 103072 104530 94468 117129 117097 110301 134024
4104 134024 133562 129377 120826 130465 133500 107101 124518 121619 70567 63926 60006 91532 92417 92757
4090 92757 84484 84499 85359 95972 99807 89741 79821 57450 55288 91711 92868 119496 125016 137635
$$ packed form
4179C99384M699q054K7392K7799P6524M1851O7227o498m1113o9974p5889n7968
4167C85380n9518j016k4538k1984J1728l2126k0389O83j5760J0494j6969k1634
4155A94351j5099k548J3330q455n668o698R850Q084k152K3014j8851l938K1575
4142B06795k1379L818j5115k5844J997K8078k3604J0176l2817k8156M4820k2534
4130A26235k064L600J5717l286M597j233L477k2782k0132N247J2991J2189j1953
4117A22603j9665K3848Q137j1311o623p844o073J458j0062K2661l2o796K3723
4104A34024m62m185q551R639L035k6399J7417k899n1052o641l920L1526Q85L40
4090I2757q273J5Q60J0613L835j0066r920k2371k162L6423J157K6628N520J2619
$$ plain form
4076 137635 166360 152584 139345 149769 131902 129095 104944 100340 105857 106134 86557 65959 92859
4063 92859 93744 89279 93040 86262 90632 101724 76480 75977 89977 83473 76740 82541 78285 60636
4049 60636 71316 84970 86583 57876 52584 81098 99545 104545 75957 59002 79012 86759 74343
4036 74343 59475 67833 85930 67826 97976 70904 63280 49256 29038 26190 52899 66338
4024 66338 69763 55454 59116 65361 57046 76095 100364 81275 92742 92958 59316 54364 61516
4011 61516 78748 77339 63124 43350 38706 64091 84372 88960 72546 87818 88006 50305 33860
3998 33860 47438 60066 82313 48698 47911 71543 75956 79481 82013 77983 83971 59031 60764
3985 60764 74708 67760 76446 78130 59531 82911 97620 78474 79353 60391 55666 68792 74257
$$ packed form
4076A37635K8725j3776j3239J0424j7867k807k4151m604N517K77j9577k0598K6900
4063I2859Q85m465L761o778M370J1092k5244n03J4000o504o733N801m256j7649
4049F0636J0680J3654J613k8707n292K8514J8447N000k8588j6955K0010P747j2416
4036G4343j4868Q358J8097j8104L0150k7072p624j4024k0218k848K6709J3439
4024F6338L425j4309L662O245q315J9049K4269j9089J1467K16l3642m952P152
4011F1516J7232j409j4215j9774m644K5385K0281M588j6414J5272J88l7701j6445
3998C3860J3578J2628K2247l3615p87K3632M413L525K532m030N988k4940J733
3985F0764J3944o948Q686J684j8599K3380J4709j9146Q79j8962m725J3126N465
$$ plain form
3972 74257 63886 55858 52318 43096 34241 38680 29870 39827 70889 54909 41439 61695 49083
3959 49083 71177 55863 37399 48390 59976 61925 54667 62532 78810 47443 53395 53925 65236
3946 65236 103591 70436 52724 79411 82900 102931 97072 77127 63593 66887 74956 77673 83060
3933 83060 78181 80030 78758 90175 79876 59289 61415 67307 71254 70054 46982 66170 55296
3920 55296 63985 59695 76606 77161 57951 83475 111784 113987 96778 66406 73134 118329 103194
3907 103194 90127 101461 108212 78630 64660 46757 74259 81920 77964 76639 110413 114770 108428
3894 108428 79768 89486 89732 76678 80744 114518 128733 122078 108750 91840 92970 106151 89605
3881 89605 95141 101055 98300 80828 91528 98176 87873 126834 120260 109206 83348 94488 102823
$$ packed form
3972G4257j0371q028l540r222q855M439q810R957L1062j5980j3470K0256j2612
3959D9083K2094j5314j8464J0991J1586J949p258P865J6278l1367N952N30J1311
3946F5236L8355l3155j7712K6687L489K0031n859j9945j3534L294Q069K717N387
3933H3060m879J849j272J1417j0299k0587K126N892L947j200k3072J9188j0874
3920E5296Q689m290J6911N55j9210K5524K8309K203j7209l0372O728M5195j5135
3907A03194j3067J1334O751k9582j3970j7903K7502P661l956j325L3774M357o342
3894A08428k8660R718K46j3054M066L3774J4215o655j3328j6910J130J3181j6546
3881H9605N536N914k755j7472J0700O648j0303L8961o574j1054k5858J1140Q335
$$ plain form
3868 102823 131859 136999 109986 94132 98288 86568 82168 101589 93482 103165 129034 129347 117967
3855 117967 106535 107786 122278 112945 128965 125753 112988 104889 101307 120131 136452 132263 128162
3842 128162 134573 125426 149719 163485 159632 149778 145931 137160 133369 156551 170376 175945 152961
3829 152961 115396 96696 130357 149985 135121 107609 104445 98610 138935 148049 144939 138988 123650
3816 123650 131518 110063 134144 135180 167862 178864 167572 159352 186002 168338 171768 185837
3804 185837 185430 172164 169778 185689 183000 168980 176590 210218 198907 181750 184722 168182 171772
3791 171772 191543 208973 201937 185571 187407 193052 207350 221866 231800 255797 228005 194867
3779 194867 224288 243272 238884 224122 228386 269120 275146 276795 253288 252392 256432 237343 229830
$$ packed form
3868A02823K9036N140k7013j5854M156j1720m400J9421q107R683K5869L13j1380
3855A17967j1432J251J4492r333J6020l212j2765q099l582J8824J6321m189m101
3842A28162O411r147K4293J3766l853r854l847q771l791K3182J3825N569k2984
3829A52961l7565j8700L3661J9628j4864k7512l164n835M0325R114l110n951j5338
3816A23650P868k1455K4081J036L2682J1002j1292q220K6650j7664L430J4069
3804A85837m07j3266k386J5911k689j4020P610L3628j1311j7157K972j6540L590
3791A71772J9771J7430p036j6366J836N645J4298J4516R934K3997k7792l3138
3779A94867K9421J8984m388j4762M264M0734O026J649k3507q96M040j9089p513
$$ plain form
3766 229830 237871 242946 249280 235312 265770 265253 258089 249951 235231 257160 272146 276438 276740 294330
3752 294330 292238 283499 253324 307933 320930 327907 322419 302981 300199 304226 323854 328709 334082
3739 334082 335203 344953 356058 335022 343793 357655 366849 336851 315230 304743 326729 352576
3727 352576 310936 307017 304225 309693 308905 324966 347962 351612 355359 359379 349484 356673 380247 384497
3713 384497 380607 387796 385599 350612 351567 349463 337187 358250 357293 369660 358872 354302 362312 380098
3699 380098 386049 365274 348491 354316 351456 380386 359373 349806 338986 348810 353137 351539 372601
3686 372601 333439 348530 339342 366007 380025 364442 374950 406861 363724 352331 362465 359865
3674 359865 353859 354062 331714 327083 339265 338306 350316 366937 352039 336481 342752 366280 352283
$$ packed form
3766B29830Q041N075O334j3968L0458n17p164q138j4720K1929J4986M292L02J7590
3752B94330k092q739l0175N4609J2997O977n488j9438k782M027J9628M855N373
3739C34082J121R750J1105k1036Q771J3862R194k9998k1621j0487K1986K5847
3727C52576m1640l919k792N468p88J6061K2996L650L747M020r895P189K3574M250
3713C84497l890P189k197l4987R55k104j2276K1063r57J2367j0788m570Q010J7786
3699C80098N951k0775j6783N825k860K8930k1013r567j0820R824M327j598K1062
3686C72601l9162J5091r188K6665J4018j5583J0508L1911m3137j1393J0134k600
3674C59865o006K03k2348m631J2182r59J2010J6621j4898j5558O271K3528j3997
$$ plain form
3661 352283 339990 334507 325146 342392 317845 301652 317860 304830 297917 300048 307178 332033 334483
3648 334483 356154 372718 355608 349131 348593 344555 332035 328200 361922 364394 365351 362992 359228 346555
3634 346555 327967 357881 356704 353215 364613 355851 373962 387877 382958 401216 403349 404210 409097
3621 409097 388967 395308 429560 430889 436063 406152 410307 432223 456361 510199 511216 515143 537014
3608 537014 527929 572754 614909 607245 634175 649325 667844 658642 651860 652300 639095 646413 666745
3595 666745 661302 670941 694492 730928 751833 764655 804357 816805 838757 880781 901748 933539
3583 933539 973189 1013345 1064500 1124234 1181462 1271869 1373793 1529324 1726725 1893617 2144614
3572 2144614 2411619 2697557 2979335 3159281 3180892 3031361 2776730 2441808 2198373 2010710
$$ packed form
3661C52283j2293n483r361J7246k4547j6193J6208j3030o913K131P130K4855K450
3648C34483K1671J6564j7110o477n38m038j2520l835L3722K472R57k359l764j2673
3634C46555j8588K9914j177l489J1398q762J8111J3915m919J8258K133Q61M887
3621D09097k0130O341L4252J329N174k9911M155K1916K4138N3838J017L927K1871
3608E37014r085M4825M2155p664K6930J5150J8519r202o782M40j3205P318K0332
3595F66745n443R639K3551L6436K0905J2822L9702J2448K1952M2024K0967L1791
3583I33539L9650M0156N1155N9734N7228R0407J01924J55531J97401J66892K50997
3572B144614K67005K85938K81778J79946K1611j49531k54631l34922k43435j87663
$$ plain form
3562 2010710 1863693 1773826 1679275 1605598 1528664 1495451 1491454 1493322 1487906 1480865 1506086 1552533
3550 1552533 1583153 1616661 1681206 1750857 1828958 1952376 2103396 2303466 2560150 2874484
3540 2874484 3293617 3737658 4289933 4869515 5343765 5464085 5162843 4592810 3962562 3418634
3530 3418634 2978244 2641011 2400670 2181516 2084131 1975091 1868123 1779127 1724998 1694523
3520 1694523 1647104 1583319 1563427 1556146 1525007 1537493 1546715 1562883 1580834 1603716 1673182 1776117
3508 1776117 1866389 2028859 2203029 2412482 2662900 2889458 2983614 2904300 2689308 2423466
3498 2423466 2137611 1953966 1815499 1716009 1648440 1585663 1527280 1487605 1447837 1380425 1305829
3487 1305829 1251897 1204536 1167633 1131809 1097634 1061867 1017351 992869 982417 979996 969288 971324
$$ packed form
3562B010710j47017q9867r4551p3677p6934l3213l997J868n416p041K5221M6447
3550A552533L0620L3508O4545O9651P8101J23418J51020K00070K56684L14334
3540B874484M19133M44041N52275N79582M74250J20320l01242n70033o30248n43928
3530C418634m40390l37233k40341k19154r7385j09040j06968q8996n4129l0475
3520A694523m7419o3785j9892p281l1139J2486R222J6168J7951K2882O9466J02935
3508A776117R0272J62470J74170K09453K50418K26558R4156p9314k14992k65842
3498B423466k85855j83645j38467r9490o7569o2777n8383l9675l9768o7412p4596
3487A305829n3932m7361l6903l5824l4175l5767m4516k4482j0452k421j0708K036
$$ plain form
3475 971324 982683 973425 959818 951434 928538 966298 1033531 1062047 1045570 1008990 985733 994355
3463 994355 977718 957948 975347 954345 945587 984397 1005070 1016605 1042741 1055308 1099531 1127927
3451 1127927 1174094 1212588 1227396 1225939 1178944 1170511 1144714 1131287 1120122 1126752 1144626 1176218
3439 1176218 1205017 1193620 1190268 1224236 1239090 1283635 1341611 1348386 1420527 1442689 1494577 1581346
3427 1581346 1665690 1757814 1863639 1967312 2097550 2271486 2452966 2660178 2937793 3225584
3417 3225584 3510473 3814158 4117853 4268458 4238292 4015776 3743468 3483139 3198328 2923599
3407 2923599 2664683 2433788 2255707 2120532 2030567 1945057 1873245 1825547 1813993 1816076 1822586
3396 1822586 1846989 1869401 1910589 1985732 2105440 2186899 2322539 2479416 2695099 2987077
$$ packed form
3475I71324J1359r258j3607q384k2896L7760O7233K8516j6477l6580k3257Q622
3463I94355j6637j9770J7399k1002q758L8810K0673J1535K6136J2567M4223K8396
3451A127927M6167L8494J4808j457m6995q433k5797j3427j1165O630J7874L1592
3439A176218K8799j1397l352L3968J4854M4545N7976O775P2141K2162N1888Q6769
3427A581346Q4344R2124J05825J03673J30238J73936J81480K07212K77615K87791
3417C225584K84889L03685L03695J50605l0166k22516k72308k60329k84811k74729
3407B923599k58916k30895j78081j35175q9965q5510p1812m7698j1554K083O510
3396A822586K4403K2412M1188P5143J19708Q1459J35640J56877K15683K91978
$$ plain form
3386 2987077 3387187 3881448 4519396 5249075 5874752 6117992 5821791 5253473 4660069 4144341
3376 4144341 3691342 3231296 2838448 2521459 2263191 2100398 1950322 1829562 1747736 1661855
3366 1661855 1583999 1543170 1518532 1503079 1511383 1493745 1509279 1530049 1549348 1574190 1622900 1731285
3354 1731285 1871673 2058957 2318688 2618352 2905926 3056339 2943730 2687470 2426824 2165840
3344 2165840 1922926 1715862 1558155 1399027 1275278 1156941 1087526 1022618 961044 922680
3334 922680 882323 818535 769731 773729 746748 712557 703466 689318 666723 655754 613217 573407
3322 573407 549019 531376 534912 525054 524444 514913 509012 512106 506131 505426 492614 491163 498582 477021
3308 477021 471407 451053 432346 430980 429505 401360 402027 417854 391256 414086 393947 378861 356517
$$ packed form
3386B987077M00110M94261O37948P29679O25677K43240k96201n68318n93404n15728
3376D144341m52999m60046l92848l16989k58268j62793j50076j20760q1826q5881
3366A661855p7856m0829k4638j5453Q304j7638J5534K0770J9299K4842M8710J08385
3354A731285J40388J87284K59731K99664K87574J50413j12609k56260k60646k60984
3344B165840k42914k07064j57707j59128j23749j18337o9415o4908o1574l8364
3334I22680m0357o3788m8804L998k6981l4191r091j4148k2595j0969m2537l9810
3322E73407k4388j7643L536r858o10r531n901L094n975p05j2812j451P419k1561
3308D77021n614k0354j8707j366j475k8145O67J5827k6598K2830k0139j5086k2344
$$ plain form
3295 356517 337930 342010 339449 341938 342643 330547 316073 309023 285845 297451 283936 306365 299091
3282 299091 304290 342215 330670 312019 300292 319872 349749 324612 297500 264530 246425 246304
3270 246304 278929 270580 231089 225096 239155 238035 256866 234604 215389 225355 227392 246738 233436
3257 233436 235851 205136 221903 227153 209098 210242 237722 228718 222890 229648 224824 229023 266368
3244 266368 243408 216969 226252 229019 194467 195438 187537 220558 209657 186288 185644 176924 178690
3231 178690 186414 190202 187798 185740 198623 191362 172066 207182 205411 207932 226317 228479 214489
3218 214489 210225 209612 218999 201878 198076 199625 191785 206219 208003 198880 224316 232776 235319 209632
3204 209632 191097 219667 234261 232064 252275 255515 248666 275209 279263 285896 261169 256292 262117
$$ packed form
3295C56517j8587M080k561K489P05j2096j4474p050k3178J1606j3515K2429p274
3282B99091N199L7925j1545j8651j1727J9580K9877k5137k7112l2970j8105j21
3270B46304L2625q349l9491n993J4059j120J8831k2262j9215R966K037J9346j3302
3257B33436K415l0715J6767N250j8055J144K7480r004n828O758m824M199L7345
3244B66368k2960k6439R283K767l4552R71p901L3021j0901k3369o44q720J766
3231A78690P724L788k404k058J2883p261j9296L5116j771K521J8385K162j3990
3218B14489m264o13R387j7121l802J549p840J4434J784r123K5436Q460K543k5687
3204B09632j8535K8570J4594k197K0211L240o849K6543M054O633k4727m877N825
$$ plain form
3191 262117 249043 254890 264802 266495 276080 290168 297085 305637 307344 353619 351207 354380 359834 385962
3177 385962 413756 411446 434662 458808 494688 550558 562760 563190 635288 688739 715085 693593
3165 693593 665728 653960 648495 630611 650565 690607 674102 682086 675001 684680 658835 633742
3153 633742 621872 567844 566225 595952 610349 591034 613008 622586 627460 620414 617129 623799 640877
3140 640877 649678 715669 778918 870446 971487 1008300 1015790 1000587 970068 911294 874222 861564
3128 861564 874671 902153 928237 934315 889060 808607 729868 685600 671266 619416 611761 584392
3116 584392 571669 532451 535729 529790 531620 527471 528962 519757 521460 529445 542525 585560 589065
3103 589065 593764 594282 578265 576418 564035 533550 520413 518232 487715 497142 511260 542396 521631
$$ packed form
3191B62117j3074N847R912J693R585J4088O917Q552J707M6275k412L173N454K6128
3177C85962K7794k310K3216K4146L5880N5870J2202M30P2098N3451K6346k1492
3165F93593k7865j1768n465j7884J9954M0042j6505P984p085R679k5845k5093
3153F33742j1870n4028j619K9727J4397j9315K1974R578M874p046l285O670J7078
3140F40877Q801O5991O3249R1528J01041L6813P490j5203l0519n8774l7072j2658
3128H61564J3107K7482K6084O078m5255q0453p8739m4268j4334n1850p655k7369
3116E84392j2723l9218L278n939J830m149J491r205J703P985J3080M3035L505
3103E89065M699N18j6017j847j2383l0485j3137k181l0517R427J4118L1136k0765
$$ plain form
3090 521631 484608 497320 481173 456760 420466 428899 433559 425492 430672 433715 403346 396784 379928
3077 379928 359076 344551 374085 343460 323808 340768 334043 306210 297147 280770 278997 276757
3065 276757 274261 276455 281117 286648 272924 271513 290882 279375 281160 274092 239672 265997 260625
3052 260625 267015 247753 257402 266474 290749 300633 282446 263307 260776 260985 220617 204043 193370
3039 193370 203436 195812 205505 212184 228292 199455 183511 137061 150704 162984 155991 175105
3027 175105 170047 194280 186657 169098 132049 156092 184278 157963 146552 138767 121059 113629
3015 113629 103837 137297 124924 114874 112801 123963 127432 124107 115433 121378 117393 104102 62035
3002 62035 61604 64185 65516 75191 96731 111451 71657 83816 82706 81223 91918 71033 64252
$$ packed form
3090E21631l7023J2712j6147k4413l6294Q433M660q067N180L043l0369o562j6856
3077C79928k0852j4525K9534l0625j9652J6960o725k7833r063j6377j773k240
3065B76757k496K194M662N531j3724j411J9369j1507J785p068l4420K6325n372
3052B60625O390j9262R649R072K4275R884j8187j9139k531K09m0368j6574j0673
3039A93370J0066p624R693O679J6108k8837j5944m6450J3643J2280o993J9114
3027A75105n058K4233p623j7559l7049K4043K8186k6315j1411p785j7708p430
3015A13629r792L3460j2373j0050k073J1162L469l325q674N945l985j3291m2067
3002F2035m31K581J331R675K1540J4720l9794J2159j110j483J0695k0885o781
$$ plain form
2989 64252 84985 87006 76945 78324 83737 72774 60798 59533 75307 85119 69861 41944 53970
2976 53970 60949 100972 95488 78974 58876 61036 46674 36621 21881 29040 51649 48954 65308
2963 65308 33628 22793 57349 81596 59162 40391 46217 44911 53387 38681 48277 40071 30879
2950 30879 43737 30588 49016 51186 77007 64860 61112 57043 33916 28690 44518 44707 34818
2937 34818 37274 36062 34259 14935 7307 33695 17620 -2742 8835 12937 47742 39897 56973
2924 56973 64680 45700 47431 58789 60912 20711 19803 50404 56253 34222 27174 40360 18238
2911 18238 47510 91193 51568 33345 52325 51959 56201 28791 -3703 2088 18422 23664 27259
2898 27259 5709 1074 19746 13296 -21000 -28180 783 24035 37061 16384 5123 -11694
$$ packed form
2989F4252K0733K021j0061J379N413j0963j1976j265J5774R812j5258k7917J2026
2976E3970O979M0023n484j6514k0098K160j4362j0053j4740P159K2609k695J6354
2963F5308l1680j0835L4556K4247k2434j8771N826j306Q476j4706R596q206r192
2950C0879J2858j3149J8428K170K5821j2147l748m069k3127n226J5828J89r889
2937C4818K456j212j803j9324p628K6388j6075k0362J1577M102L4805p845J7076
2924E6973P707j8980J731J1358K123m0201r08L0601N849k2031p048J3186k2122
2911A8238K9272M3683l9625j8223J8980l66M242k7410l2494N791J6334N242L595
2898B7259k1550m635J8672o450l4296p180K8963K3252J3026k0677j1261j6817
$$ plain form
2886 -11694 -9722 11269 -9852 3437 -152 20144 45653 51371 38465 31996 17561 36439 48390
2873 48390 34977 27205 20047 30146 22052 6669 -22405 3867 16302 3722 -14808 14304
2861 14304 17458 -4349 10892 35645 34428 30018 36094 11139 5085 9610 7738 30538 21425
2848 21425 45449 42197 15147 2759 -13443 -11175 6900 27461 33979 36767 65418 42115 -8497
2835 -8497 1127 4909 5177 12559 8561 18767 26576 37853 30275 47586 37165 40145 43830 17633
2821 17633 24604 20284 42509 48671 17922 9200 228 2559 -4321 14202 40081 30738 32583 46252
2807 46252 23823 9539 33725 38230 46312 47474 33986 26768 26285 38057 29453 19457 -6000
2794 -6000 -12874 -8503 -5919 12635 27676 33443 37725 33131 41444 29626 48304 50907 50929 58695
$$ packed form
2886a1694J972K0991k1121J3289l589K0296K5509N718j2906o469j4435J8878J1951
2873D8390j3413p772p158J0099q094j5383k9074K6272J2435j2580j8530K9112
2861A4304L154k1807J5241K4753j217m410O076k4955o054M525j872K2800r113
2848B1425K4024l252k7050j2388j6202K268J8075K0561O518K788K8651k3303n0612
2835h497R624L782K68P382l998J0206P809J1277p578J7311j0421K980L685k6197
2821A7633O971m320K2225O162l0749q722q972K331o880J8523K5879r343J845J3669
2807D6252k2429j4284K4186M505Q082J162j3488p218m83J1772q604r996k5457
2794f000o874M371K584J8554J5041N767M282m594Q313j1818J8678K603K2P766
$$ plain form
2780 58695 32064 11445 44915 53112 35605 40108 42254 12369 26941 57007 15864 12843 41957
2767 41957 23079 -15154 -21168 -22587 17515 35367 36615 13656 21943 20343 22432 3683 5488
2754 5488 8760 32839 17377 11299 6677 38751 36598 41225 36708 41320 47113 30263 34007 38374
2740 38374 22445 68236 46876 34949 26542 39896 50707 48737 42422 4840 -5206 4924
2728 4924 7886 -1164 30941 23520 8240 7122 23876 2075 16485 13661 5772 5371 -17915 -17671
2714 -17671 -7654 -31784 -35165 -9098 -4653 10821 14720 -7929 9517 -2978 -278 13158 28329
2701 28329 19662 10690 10992 11562 41815 8001 -5632 12513 1595 -2959 -10976 -10810 -4114 3348
2687 3348 12825 11542 -9149 9137 29139 53843 17807 18137 -5966 15096 39682 42300 31490
$$ packed form
2780E8695k6631k0619L3470Q197j7507M503K146k9885J4572L0066m1143l021K9114
2767D1957j8878l8233o014j419M0102J7852J248k2959Q287j600K089j8749J805
2754E488L272K4079j5462o078m622L2074k153M627m517M612N793j6850L744M367
2740C8374j5929M5791k1360j1927q407J3354J0811j970o315l7582j0046J0130
2728D924K962r050L2105p421j5280j118J6754k1801J4410k824p889m01k3286K44
2714a7671J0017k4130l381K6067M445J5474L899k2649J7446j2495K700J3436J5171
2701B8329q667q972L02N70L0253l3814j3633J8145j0918m554q017J66O696P462
2687C348R477j283k0691J8286K0002K4704l6036L30k4103K1062K4586K618j0810
$$ plain form
2674 31490 18292 12479 -4677 10257 12229 18412 -1516 -18733 10706 38018 30617 -6167 -11803
2661 -11803 8773 -2070 13450 -10390 -18307 -19494 -2270 -22392 -43745 -1561 6919 -656 -16169
2648 -16169 -7447 -3411 3697 -1401 5291 -24004 -3180 16266 20070 28512 -6701 14241 27376
2635 27376 22120 44704 30927 6225 -2114 -8774 -24631 -6578 7928 7810 19739 11471 -8442
2622 -8442 -13545 -8101 -1264 4031 -41139 -17849 -18495 -6592 9794 -9268 6200 12933 -5693
2609 -5693 -17619 -2360 -9151 -2926 608 16482 22598 30223 9978 -4665 136 5406 6878 19958
2595 19958 4528 -3438 4172 17877 30892 18983 17195 10075 21542 -12366 -12083 -6177 -11901
2582 -11901 10809 10215 11133 -5411 -5532 6399 18308 24967 15261 19177 4548 16987 6092 23846
$$ packed form
2674C1490j3198n813j7156J4934J972O183j9928j7217K9439K7312p401l6784n636
2661a1803K0576j0843J5520k3840p917j187J7224k0122k1353M2184Q480p575j5513
2648a6169Q722M036P108n098O692k9295K0824J9446L804Q442l5213K0942J3135
2635B7376n256K2584j3777k4702q339o660j5857J8053J4506j18J1929q268j9913
2622h442n103N444O837N295m5170K3290o46J1903J6386j9062J5468O733j8626
2609e693j1926J5259o791O225L534J5874O116P625k0245j4643M801N270J472J3080
2595A9958j5430p966P610J3705J3015j1909j788p120J1467l3908K83N906n724
2582a1901K2710n94R18j6544j21J1931J1909O659r706L916j4629J2439j0895J7754
$$ plain form
2568 23846 -6005 -7800 24262 24867 15066 12505 23431 48156 28676 26707 39159 45509 42520
2555 42520 25016 10710 28068 22949 20474 50586 58335 77019 44181 43488 55300 55244 59071 74348
2541 74348 60786 37959 38582 13063 9572 27123 13793 6247 -6853 -25767 -11869 23140 30775
2528 30775 20651 4592 -2217 -11935 2870 17724 3216 -11204 -9095 5396 -15019 3464
2516 3464 37739 19569 -30255 -22092 -2448 -3925 4648 9380 -7779 633 25022 22764 25129
2503 25129 15991 13749 5183 30944 50657 16862 14052 -2779 18092 29614 25258 22657 15110
2490 15110 9251 6370 -362 12119 21441 -11541 -17706 20196 18163 42245 40429 30425 5757
2477 5757 13385 37253 26322 31644 48379 53580 24639 44792 12569 15459 674 -8232 23254
$$ packed form
2568B3846k9851j795L2062O05r801k561J0926K4725j9480j969J2452O350k989
2555D2520j7504j4306J7358n119k475L0112P749J8684l2838o93J1812n6L827J5277
2541G4348j3562k2827O23k5519l491J7551j3330p546j3100j8914J3898L5009P635
2528C0775j0124j6059o809r718J4805J4854j4508j4420K109J4491k0415J8483
2516C464L4275j8170m9824Q163J9644j477Q573M732j7159Q412K4389k258K365
2503B5129r138k242q566K5761J9713l3795k810j6831K0871J1522m356k601p547
2490A5110n859k881o732J2481R322l2982o165L7902k033K4082j816j0004k4668
2477E757P628K3868j0931N322J6735N201k8941K0153l2223K890j4785q906L1486
$$ plain form
2464 23254 32118 12373 18479 23477 19828 -9745 49262 49064 4540 23991 54982 50140 38749
2451 38749 45126 17661 6842 12710 3934 21825 21096 22916 34573 44536 33928 31372 49150
2438 49150 55784 67930 71060 70271 44569 27592 38380 46843 49256 30538 38182 33750 42055 44813
2424 44813 21208 68457 71986 35986 54056 58204 31953 31683 46808 41711 31444 37923 56851
2411 56851 62524 54026 34275 15784 35841 28657 4594 26951 45312 45977 55960 66893 44147
2398 44147 32810 59082 85762 58625 35728 64753 52920 29869 39528 58181 62296 66994
2386 66994 57169 49870 41626 71452 92336 80155 104872 103218 93259 106972 129110 94330 97908
2373 97908 126613 110675 127120 113889 125373 145628 162305 167170 137305 142322 149247 129078
$$ packed form
2464B3254Q864j9745O106M998l649k9573N9007j98m4524J9451L0991m842j1391
2451C8749O377k7465j0819N868q776J7891p29J820J1657R963j0608k556J7778
2438D9150O634J2146L130p89k5702j6977J0788Q463K413j8718P644m432Q305K758
2424D4813k3605M7249L529l6000J8070M148k6251k70J5125n097j0267O479J8928
2411E6851N673q498j9751j8491K0057p184k4063K2357J8361O65R983J0933k2746
2398D4147j1337K6272K6680k7137k2897K9025j1833k3051R659J8653M115M698
2386F6994r825p299q244K9826K0884j2181K4717j654r959J3713K2138l4780L578
2373I7908K8705j5938J6445j3231J1484K0255J6677M865k9865N017O925k0169
$$ plain form
2361 129078 139923 135412 139902 151715 145111 138745 144407 131073 149428 175764 204020 195913 169558
2348 169558 177342 192773 195835 217274 215339 215414 224310 257409 245024 233607 233223 251829 275080
2335 275080 283398 300576 292505 280386 291723 326282 323041 335259 347487 365409 398263 423086
2323 423086 411747 431502 474211 475870 500643 535635 566740 582270 621858 620441 633411 654817
2311 654817 696740 692672 707823 721566 751592 799409 847121 874913 891258 920268 963955 1035313
2299 1035313 1064946 1126927 1255215 1359000 1457436 1543203 1600424 1664298 1806326 2008897 2230357
2288 2230357 2439355 2818697 3334762 4016012 4901796 6086878 7812103 9788912 10748111
2279 10748111 9493981 7642450 5873151 4547159 3721627 3093169 2594373 2206328 1944370
$$ packed form
2361A29078J0845m511M490J1813o604o366N662j3334J8355K6336K8256q107k6355
2348A69558P784J5431L062K1439j935P5Q896L3099j2385j1417l84J8606K3251
2335B75080Q318J7178q071j2119J1337L4559l241J2218J2228J7922L2854K4823
2323D23086j1339J9755M2709J659K4773L4992L1105J5530L9588j417J2970K1406
2311F54817M1923m068J5151J3743L0026M7817M7712K7792J6345K9010M3687P1358
2299A035313K9633O1981J28288J03785R8436Q5767N7221O3874J42028K02571K21460
2288B230357K08998L79342N16065O81250Q85784J185082J725225J976809R59199
2279A0748111j254130j851531j769299j325992q25532o28458m98796l88045k61958
$$ plain form
2270 1944370 1771699 1612115 1475895 1395107 1332066 1297550 1230012 1163820 1039565 952172 863946
2259 863946 805786 750268 672918 631525 616363 570637 528546 496280 481824 480637 434528 422629
2247 422629 417705 431218 424385 388655 355544 327940 353357 334249 326320 301077 277593 307936
2235 307936 322591 287857 283357 275727 259548 226438 210283 211265 220458 219877 188564 184024 187670
2222 187670 160652 174738 167665 152469 157959 168756 171302 157466 152445 155843 141102 124691 137950
2209 137950 154450 151962 130284 145713 125742 127855 127914 104390 117518 104969 107727 122049 99703
2196 99703 79549 88443 70327 81512 77936 86181 78833 91373 76844 68263 62602 71295 81368
2183 81368 71737 63154 57646 47323 48873 41534 55405 73097 86322 63142 50154 58273 46890
$$ packed form
2270A944370j72671j59584j36220q0788o3041l4516o7538o6192j24255q7393q8226
2259H63946n8160n5518p7350m1393j5162m5726m2091l2266j4456j187m6109j1899
2247D22629m924J3513o833l5730l3111k7604K5417j9108p929k5243k3484L0343
2235C07936J4655l4734m500p630j6179l3110j6155R82R193n81l1313m540L646
2222A87670k7018J4086p073j5196N490J0797K546j3836n021L398j4741j6411J3259
2209A37950J6500k488k1678J5429j9971K113N9k3524J3128j2549K758J4322k2346
2196I9703k0154Q894j8116J1185l576Q245p348J2540j4529q581n661Q693J0073
2183H1368r631q583n508j0323J550p339J3871J7692J3225k3180j2988Q119j1383
$$ plain form
2170 46890 81755 73094 70170 48941 64125 66456 45389 45653 32098 19765 22147 35645 39956
2157 39956 39778 35353 34089 31801 11845 28317 32059 33799 31394 25159 27096 45685 64444 33937
2143 33937 6313 14675 37590 48888 43862 51312 66248 47720 70365 64934 79940 53043 41887
2130 41887 34679 41841 50699 26666 40083 32669 39420 32984 40524 33548 36229 53402 42163 34271
2116 34271 28961 17857 -3367 6240 28190 42173 29662 56861 45876 34471 44040 -5714
2104 -5714 19368 30169 32522 21900 24794 21223 29568 20817 32476 52743 57782 22539 22197 35252
2090 35252 14260 47232 49668 15468 2355 21803 42114 24816 22400 35403 41785 466
2078 466 -5449 15893 7072 33271 30269 16318 1028 -6381 20759 25411 31381 20960 21559 22139
$$ packed form
2170D6890L4865q661k924k1229J5184K331k1067K64j3555j2333K382J3498M311
2157C9956j78m425j264k288j9956J6472L742J740k405o235J937J8589J8759l0507
2143C3937k7624Q362K2915J1298n026P450J4936j8528K2645n431J5006k6897j1156
2130D1887p208P162Q858k4033J3417p414O751o436P540o976K681J7173j1239p892
2116C4271n310j1104k1224R607K1950J3983j2511K7199j0985j1405R569m9754
2104e714K5082J0801K353j0622K894l571Q345q751J1659K0267N039l5243l42J3055
2090C5252k0992L2972K436l4200j3113J9448K0311j7298k416J3003O382m1319
2078D66n915K1342q821K6199l002j3951j5290p409K7140M652N970j0421N99N80
$$ plain form
2064 22139 7786 27570 19276 7113 -11925 -15504 25371 40221 37518 18177 -17643 3717
2052 3717 17838 12559 14147 -881 -3237 29352 12082 9782 529 -27256 -14136 -10123 13640
2039 13640 -22018 -26847 602 -8796 -13785 -33716 -14627 4458 -5385 13580 -2403 -17253 -14540
2026 -14540 9089 18711 -3362 -22344 -10470 19644 24373 24104 48571 23399 7864 50722 37109
2013 37109 29761 46410 77507 69169 59269 60716 27536 48437 8958 -777 16677 19426 10945
2000 10945 28460 14166 14765 39142 41421 12527 -5999 -10006 -9203 8040 -18697 12379 11288
1987 11288 30681 -11120 -10984 335 -9484 -2358 -2036 -27530 -14864 9298 10650 15906 23479 20900
1973 20900 38326 20177 -12718 -11176 -22267 -45090 -33017 1921 29385 18330 20885 4473
$$ packed form
2064B2139j4353J9784q294j2163j9038l579M0875J4850k703j9341l5820K1360
2052C717J4121n279J588j5028k356L2589j7270k300r253k7785J3120M013K3763
2039A3640l5658m829K7449r398m989j9931J9089J9085r843J8965j5983j4850K713
2026a4540K3629R622k2073j8982J1874L0114M729k69K4467k5172j5535M2858j3613
2013C7109p348J6649L1097q338r900J447l3180K0901l9479r735J7454K749q481
2000A0945J7515j4294N99K4377K279k8894j8526m007Q03J7243k6737L1076j091
1987A1288J9393m1801J36J1319r819P126L22k5494J2666K4162J352N256P573k579
1973B0900J7426j8149l2895J542j1091k2823J2073L4938K7464j1055K555j6412
$$ plain form
1961 4473 20787 4284 -9357 12634 -1040 -27354 -13878 -218 16025 380 -17103 -7844
1949 -7844 -20841 6744 16635 8552 220 11497 1243 -536 5054 5888 -1417 12212 -14672 -3503
1935 -3503 1972 -19653 -23411 6188 21918 14996 17907 25879 42045 38579 53088 55433 31702
1922 31702 41698 26641 27242 -7638 15055 6953 -11451 11603 30641 25730 4887 9618 -29757
1909 -29757 -32235 -20778 -29431 -21315 -5073 988 5173 26271 -2899 -16459 -3110 2499 17648
1896 17648 8673 17239 8037 -4453 -8366 8324 8613 -11214 -29708 -30799 -294 -13253 -5953
1883 -5953 19320 9925 -3769 1386 10291 3145 -25789 -64371 -38815 -14793 18951 3953 541
1870 541 -13928 -16437 -15847 -124 -11864 -25968 -12705 -6130 -15009 -11140 21276 23014 6074 511
$$ packed form
1961D473J6314j6503j3641K1991j3674k6314J3476J3660J6243j5645j7483R259
1949g844j2997K7585R891q083q332J1277j0254j779N590Q34p305J3629k6884J1169
1935c503N475k1625l758K9599J5730o922K911P972J6166l466J4509K345k3731
1922C1702R996j5057O01l4880K2693q102j8404K3054J9038m911k0843M731l9375
1909b9757k478J1457q653Q116J6242O061M185K1098k9170j3560J3349N609J5149
1896A7648q975Q566r202j2490l913J6690K89j9827j8494j091L0505j2959P300
1883e953K5273r395j3694N155Q905p146k8934l8582K5556K4022L3744j4998l412
1870E41j4469k509N90J5723j1740j4104J3263O575q879L869L2416J738j6940n563
$$ plain form
1856 511 -10070 -4641 -2354 -18457 -17951 -56652 -48474 -1153 9895 5478 27622 19068 18593 -7508
1842 -7508 -3864 -1592 11430 4646 -6507 1564 -9663 -8311 6739 12902 14183 24105 25127 8778
1828 8778 -17734 -37335 -34843 -42494 -43443 5533 3925 9550 9287 -13400 -652 846 -15940 -36825
1814 -36825 -12517 24913 15437 -32558 -17323 -7628 686 30933 33618 9649 -1752 8470 20181
1801 20181 23397 -3774 11035 8599 -12730 13976 10812 -10412 -8741 1014 26350 32758 15825
1788 15825 3146 7035 23471 50225 29618 2898 -30166 -11200 8821 -25714 -20776 19320
1776 19320 18789 -13890 -9006 4738 -1776 -9244 -12063 -15392 8131 20892 10194 -5268 -6588
1763 -6588 5479 10123 11924 -3152 -14660 -2008 -11601 -23601 -16833 -17775 16955 11826 -2851
$$ packed form
1856E11j0581N429K287j6103N06l8701Q178M7321J1048m417K2144q554m75k6101
1842g508L644K272J3022o784j1153Q071j1227J352J5050O163J281R922J022j6349
1828H778k6512j9601K492p651r49M8976j608N625k63k2687J2748J498j6786k0885
1814c6825K4308L7430r476m7995J5235R695Q314L0247K685k3969j1401J0222J1711
1801B0181L216k7171J4809k436k1329K6706l164k1224J671R755K5336O408j6933
1788A5825j2679L889J6436K6754k0607k6720l3064J8966K0021l4535M938M0096
1776A9320n31l2679M884J3744o514p468k819l329K3523J2761j0698j5462j320
1763f588J2067M644J801j5076j1508J2652r593j2000O768r42L4730n129j4677
$$ plain form
1750 -2851 3753 -3256 -172 -12812 -26892 -41355 -7933 14153 23304 21526 -5930 -17459 1428
1737 1428 -2265 -29114 -29368 3182 9282 16336 9942 -34485 -32823 -33522 -14022 -12269 2205 10886
1723 10886 -822 -569 20021 24444 10310 8808 4762 -2079 -10244 -19891 -13632 -21199 -24692 -16337
1709 -16337 6370 17842 578 -11273 -16897 -23267 -46139 -50437 -23193 -34333 -31250 -21830 -21776
1696 -21776 -41158 -21488 -28535 -13382 35306 4762 -3996 -2646 -15398 -34629 -28359 -19124 -26909
1683 -26909 -45309 -37941 -19859 10865 -1175 -21068 -10075 -21089 2652 20040 6637 20006
1671 20006 8548 12186 -18577 -37253 -3896 -3669 -12162 12375 6313 -9765 -253 14657 14511
1658 14511 233 14828 38682 17729 173 -3244 5156 13632 31425 28430 -24069 -32016 -36345
$$ packed form
1750b851O604p009L084j2640j4080j4463L3422K2086R151j778k7456j1529J8887
1737A428l693k6849k54L2550O100P054o394m4427J662o99J9500J753J4474Q681
1723A0886j1708K53K0590M423j4134j502m046o841q165r647O259p567l493Q355
1709a6337K2707J1472j7264j1851n624o370k2872m298K7244j1140L083R420N4
1696b1776j9382J9670p047J5153M8688l0544q758J350j2752j9231O270R235p785
1683b6909j8400P368J8082L0724j2040j9893J0993j1014K3741J7388j3403J3369
1671B0006j1458L638l0763j8676L3357K27q493K4537o062j6078R512J4910j46
1658A4511j4278J4595K3854k0953j7556l417Q400Q476J7793k995n2499p947m329
$$ plain form
1645 -36345 -14884 -20149 -47017 -38733 -11519 -28113 -10396 -6821 -4786 8389 -4941 405 -3737
1632 -3737 6690 19470 -2614 -20588 -10605 8923 39099 7980 -1959 -11865 -40823 -11783 -19591
1619 -19591 -26365 -35776 -29412 17865 14401 -3093 -4038 -10322 3402 12805 -11863 -21996 -8827
1606 -8827 22612 18178 6185 9787 5285 -9119 4605 -7805 22433 3814 1932 6986 -22594
1593 -22594 -1501 4368 -11875 -1347 -758 8913 -8387 -22906 -18602 -15008 -14396 -20278 -30446 2968
1579 2968 -11606 -31826 -15433 -28224 -1121 -5152 -14443 -18736 -22812 -17707 -32437 -24867 -10616
1566 -10616 -34483 -29019 -28101 11214 11280 -13633 -23993 -1570 10139 7785 13496 5143 -9511 -11698
1552 -11698 -15 -5727 -10181 -3990 -24814 -1591 14193 -20588 -18237 1770 -6959 -29677 -28509
$$ packed form
1645c6345K1461n265k6868Q284K7214j6594J7717L575K035J3175j3330N346m142
1632c737J0427J2780k2084j7974R983J9528L0176l1119r939r906k8958K9040p808
1619a9591o774r411O364M7277l464j7494r45o284J3724R403k4668j0133J3169
1606h827L1439m434j1993L602m502j4404J3724j2410L0238j8619j882N054k9580
1593b2594K1093N869j6243J0528N89R671j7300j4519M304L594O12n882j0168L3414
1579B968j4574k0220J6393j2791K7103m031r291m293m076N105j4730P570J4251
1566a0616k3867N464R18L9315O6k4913j0360K2423J1709k354N711q353j4654k187
1552a1698J1683n712m454O191k0824K3223J5784l4781K351K0007q729k2718J168
$$ plain form
1539 -28509 -16099 13525 7910 15644 10475 5153 8596 -10857 9321 -4013 -18161 -8677 -3809
$$ packed form
1539b8509J2410K9624n615P734n169n322L443j9453K0178j3334j4148R484M868
$$ [...]
##END NTUPLES=NMR SPECTRUM
##END=
