##TITLE=1H_EC-3302
 CDCl3
 8 sc, 
 24.10.2023
##JCAMPDX= 6.0         $$ Bruker NMR JCAMP-DX V2.0
##DATA TYPE= NMR SPECTRUM
##DATA CLASS= NTUPLES
##ORIGIN= UXNMR, Bruker Analytische Messtechnik GmbH
##OWNER= root
$$ XWIN-NMR		Version 3.5
$$ Tue Oct 24 13:43:50 2023 Russian Standard Time (UT+4h)  she@DPX200
##.OBSERVE FREQUENCY= 200.13135
##.OBSERVE NUCLEUS= ^1H
##.ACQUISITION MODE= SIMULTANEOUS
##.ACQUISITION SCHEME= undefined
##.AVERAGES= 8
##.DIGITISER RES= 18
##SPECTROMETER/DATA SYSTEM= spect
##.PULSE SEQUENCE= zg30
##.SOLVENT NAME= D2O
##.SHIFT REFERENCE= (INTERNAL, D2O, 0, 15.7414)
##AUDIT TRAIL= $$ (NUMBER, WHEN, WHO, WHERE, WHAT)
$$ ##TITLE= Audit trail, XWIN-NMR		Version 3.5
$$ ##JCAMPDX= 5.01
$$ ##ORIGIN= Bruker BioSpin GmbH
$$ ##OWNER= she
$$ F:/spectra/data/she/nmr/H-F/1/pdata/1/auditp.txt
$$ ##AUDIT TRAIL=  $$ (NUMBER, WHEN, WHO, WHERE, WHAT)
(   1,<2023-10-24 13:42:30.84 +0400>,<she>,<DPX200>,
      <created by zg, POWCHK disabled, PULCHK disabled
       configuration hash MD5:
       00 E9 B6 7A A2 85 ED C7 34 08 36 98 17 FE 4E 26
       data hash MD5: 16K
       54 B8 42 F6 69 63 29 47 A9 17 3F B3 25 B2 B7 26>)
(   2,<2023-10-24 13:42:33.07 +0400>,<she>,<DPX200>,
      <Start of raw data processing
       efp BC_mod = 2 LB = 0.24 FT_mod = 6 PKNL = 1 PHC0 = -23157.64 PHC1 = 13.2527 SI = 16K 
       data hash MD5: 16K
       E3 3C 02 61 6A 3F 0D D0 5B 66 1E 8D A9 F3 22 38>)
(   3,<2023-10-24 13:42:53.81 +0400>,<she>,<DPX200>,
      <pk PHC0 = 3.561077 PHC1 = 6.600002 
       data hash MD5: 16K
       0D 71 E8 63 94 56 C1 91 C8 9E 2D 52 F8 F7 CA 90>)
(   4,<2023-10-24 13:42:59.79 +0400>,<she>,<DPX200>,
      <abs ABSG = 5 
       data hash MD5: 16K
       AD 22 50 59 FD 78 9D 8E 76 F6 5A C8 D5 8A D9 BE>)
$$ ##END=
$$ 
$$ hash MD5
$$ 41 4A 3E 89 5D 3B 2C C2 BC 5E 46 D1 39 73 D4 3A
##$RELAX= 
##$RELAX= 
##$RELAX= 
##$RELAX= 
##$RELAX= 
##$RELAX= 
$$ Bruker specific parameters
$$ --------------------------
##$DU= <F:/spectra>
##$EXPNO= 1
##$NAME= <H-F>
##$PROCNO= 1
##$TYPE= <nmr>
##$USER= <she>
##$AMP= (0..31)
100 100 100 100 100 100 100 100 100 100 100 100 100 100 100 100 100 100 
100 100 100 100 100 100 100 100 100 100 100 100 100 100 
##$AQSEQ= 0
##$AQ_mod= 1
##$AUNM= <au_zg>
##$AUTOPOS= <>
##$BF1= 200.13
##$BF2= 200.13
##$BF3= 200.13
##$BF4= 200.13
##$BF5= 200.13
##$BF6= 200.13
##$BF7= 200.13
##$BF8= 200.13
##$BYTORDA= 1
##$CFDGTYP= 0
##$CFRGTYP= 5
##$CHEMSTR= <none>
##$CNST= (0..31)
1 1 145 1 1 1 1 1 1 1 1 1 1 1 1 1 1 1 1 1 1 1 1 1 1 1 1 1 1 1 1 1 
##$CPDPRG= <>
##$CPDPRG1= <>
##$CPDPRG2= <>
##$CPDPRG3= <>
##$CPDPRG4= <mlev>
##$CPDPRG5= <mlev>
##$CPDPRG6= <mlev>
##$CPDPRG7= <mlev>
##$CPDPRG8= <mlev>
##$CPDPRGB= <>
##$CPDPRGT= <>
##$D= (0..31)
0 1.2 0 0 0 0 0 0 0 0.06 0 0.03 0 0 0 0 0.0002 0 0 0 0 0 0 0 0 0 0 0 0 
0 0 0 
##$DATE= 1698140550
##$DBL= (0..7)
120 120 120 120 120 120 120 120 
##$DBP= (0..7)
150 150 150 150 150 150 150 150 
##$DBP07= 0
##$DBPNAM0= <>
##$DBPNAM1= <>
##$DBPNAM2= <>
##$DBPNAM3= <>
##$DBPNAM4= <>
$$ [...]
##$SUBNAM3= <"">
##$SUBNAM4= <"">
##$SUBNAM5= <"">
##$SUBNAM6= <"">
##$SUBNAM7= <"">
##$SUBNAM8= <"">
##$SUBNAM9= <"">
##$SW= 18.05172834244
##$SWIBOX= (0..15)
0 0 2 0 0 0 0 0 0 0 0 0 0 0 0 0 
##$SW_h= 3612.71676300578
##$TD= 16384
##$TD0= 1
##$TE= 0
##$TE2= 300
##$TE3= 300
##$TEG= 300
##$TL= (0..7)
0 120 120 120 120 120 120 120 
##$TP= (0..7)
150 150 150 150 150 150 150 150 
##$TP07= 0
##$TPNAME0= <>
##$TPNAME1= <>
##$TPNAME2= <>
##$TPNAME3= <>
##$TPNAME4= <>
##$TPNAME5= <>
##$TPNAME6= <>
##$TPNAME7= <>
##$TPOAL= (0..7)
0.5 0.5 0.5 0.5 0.5 0.5 0.5 0.5 
##$TPOFFS= (0..7)
0 0 0 0 0 0 0 0 
##$TUNHIN= 0
##$TUNHOUT= 0
##$TUNXOUT= 0
##$USERA1= <user>
##$USERA2= <user>
##$USERA3= <user>
##$USERA4= <user>
##$USERA5= <user>
##$V9= 5
##$VALIST= <valist>
##$VCLIST= <CCCCCCCCCCCCCCC>
##$VD= 0
##$VDLIST= <DDDDDDDDDDDDDDD>
##$VPLIST= <PPPPPPPPPPPPPPP>
##$VTLIST= <TTTTTTTTTTTTTTT>
##$WBST= 1024
##$WBSW= 4
##$XGAIN= (0..3)
0 0 0 0 
##$XL= 0
##$YL= 0
##$YMAX_a= 178460
##$YMIN_a= -223504
##$ZGOPTNS= <>
##$ZL1= 120
##$ZL2= 120
##$ZL3= 120
##$ZL4= 120
##$ABSF1= 17.64421
##$ABSF2= -0.4076729
##$ABSG= 5
##$ABSL= 3
##$ALPHA= 0
##$AQORDER= 0
##$ASSFAC= 0
##$ASSFACI= 0
##$ASSFACX= 0
##$ASSWID= 0
##$AUNMP= <proc_1d>
##$AZFE= 0.1
##$AZFW= 0.1
##$BCFW= 0
##$BC_mod= 2
##$BYTORDP= 0
##$COROFFS= 0
##$CY= -3
##$DATMOD= 1
##$DC= 0
##$DFILT= <>
##$DTYPP= 0
##$F1P= 0
##$F2P= 0
##$FCOR= 1
##$FTSIZE= 16384
##$FT_mod= 6
##$GAMMA= 0
##$GB= 0
##$INTBC= 1
##$INTSCL= 3.70164e-10
##$ISEN= 128
##$LB= 0.24
##$LEV0= 0
##$LPBIN= 0
##$MAXI= 10000
##$MC2= 0
##$MEAN= 0
##$ME_mod= 0
##$MI= 1.114404
##$NCOEF= 0
##$NC_proc= -9
##$NLEV= 6
##$NOISF1= 3.799351
##$NOISF2= 2.8
##$NSP= 0
##$NTH_PI= 0
##$NZP= 0
##$OFFSET= 15.74138
##$PC= 1
##$PHC0= -23154.08
##$PHC1= 19.8527
##$PH_mod= 1
##$PKNL= yes
##$PPARMOD= 0
##$PSCAL= 0
##$PSIGN= 0
##$REVERSE= no
##$SF= 200.130006035044
##$SI= 16384
##$SIGF1= 3
##$SIGF2= 2
##$SINO= 5.538805
##$SIOLD= 16384
##$SREGLST= <1H.CDCl3>
##$SSB= 0
##$STSI= 16384
##$STSR= 0
##$SW_p= 3612.71676300578
##$SYMM= 0
##$S_DEV= 0
##$TDeff= 16384
##$TDoff= 0
##$TI= <>
##$TILT= no
##$TM1= 0
##$TM2= 0
##$TOPLEV= 0
##$USERP1= <user>
##$USERP2= <user>
##$USERP3= <user>
##$USERP4= <user>
##$USERP5= <user>
##$WDW= 1
##$XDIM= 16384
##$YMAX_p= 376332995
##$YMIN_p= -1991949
$$ End of Bruker specific parameters
$$ ---------------------------------
##NTUPLES= NMR SPECTRUM
##VAR_NAME=  FREQUENCY,     SPECTRUM/REAL,   SPECTRUM/IMAG
##SYMBOL=    X,             R,               I
##VAR_TYPE=  INDEPENDENT,   DEPENDENT,       DEPENDENT
##VAR_FORM=  AFFN,          ASDF,            ASDF
##VAR_DIM=   16384,         16384,           16384
##UNITS=     HZ,            ARBITRARY UNITS, ARBITRARY UNITS
##FACTOR=    0.220516191357247, 1,           1
##FIRST=     3150.32242193664, 0,            0
##LAST=      -462.394341069139, 0,           0
##MIN=       -462.394341069139, -1991949,    0
##MAX=       3150.32242193664, 376332995,    0
$$ Real data points
##PAGE= N=1
##DATA TABLE= (X++(R..R)), XYDATA
$$ [...]
5817A6639241n12833L31355L45642l79118J06736o46767n10722J94313k84495
5808A5283352k66539L77529j38188K48443o66836L39057M80793k63940L94182
5799A5787853j83636M36215N91837j82917n75301l11433K51561M74539M4590N40266
5789A6873574N40168K37785M68936O31631L88313Q04564j254750k85309M87419
5780A8892331L21677j270950J92300k92630k84790J093193K94462p32086m43749
5771A7769758l71467L45189L88200l73602K64671J92341m11206K46993k15330
5762A7835547p4416J388212K892r40633k820k80888k34119R55626R43984N8095
5752A9651480l5006N16153M52802j61386k86898O10368o08020J69893m60575J21037
$$ plain form
5817 16639241 16126408 16457763 16803405 16424287 16531023 15884256 15373534 15567847 15283352
5808 15283352 15016813 15394342 15256154 15504597 14837761 15176818 15657611 15393671 15787853
5799 15787853 15604217 16040432 16632269 16449352 15874051 15562618 15814179 16288718 16333308 16873574
5789 16873574 17413742 17651527 18120463 18752094 19140407 19944971 18690221 18404912 18892331
5780 18892331 19214008 17943058 18135358 17842728 17557938 18651131 18945593 18213507 17769758
5771 17769758 17398291 17743480 18131680 17758078 18022749 18215090 17803884 18050877 17835547
5762 17835547 17761131 19149343 19152235 18211602 18208782 17927894 17693775 18649401 19593385 19651480
5752 19651480 19616474 20132627 20585429 20424043 20137145 20747513 20139493 20309386 19848811 19969848
5742A9969848L39560p08080K24758N31956p5052J97443m40408N38365J107819
5733B1686209P10192j72793l31102N9125M69950M13206K013961P33516L68396
5724B5950660L61625J132317J340572P92185J655472Q8317Q46111k66389j106027
5715C0794843j167134j159904j24173q95669l08205o8890j54546O93218Q60325
5706B8469865J015108J806983P50125J431663J569519N48340J037907N96048R98688
5697C8224246P66816k05340j043611j071156n52519o45727k085106j791002j433770
5688C0162831j703759r68669k81465N31594M23153j68404j029682L84584K67877
5679B7618060P61440O01657R08367J167970L11121M23923l04469k46797j572402
$$ plain form
5742 19969848 20309408 19601328 19826086 20358042 20282990 20480433 20040025 20578390 21686209
5733 21686209 22396401 22223608 21892506 21951631 22421581 22834787 24848748 25582264 25950660
5724 25950660 26312285 27444602 28785174 29577359 31232831 31321148 32167259 31900870 30794843
5715 30794843 29627709 28467805 28343632 27447963 27139758 27070868 26916322 27609540 28469865
5706 28469865 29484973 31291956 32042081 33473744 35043263 35591603 36629510 37225558 38224246
5697 38224246 38991062 38785722 37742111 36670955 36118436 35472709 33387603 31596601 30162831
5688 30162831 28459072 27490403 27208938 27740532 28163685 27995281 26965599 27350183 27618060
5679 27618060 28379500 28981157 29889524 31057494 31368615 31792538 31488069 31241272 29668870
5670B9668870j420237j495298p25886q39813K81375o87479l38448j281060q76032
5661B2285992r7403o02547j04267R4637o9614M13033N16755l43548N44481J80033
5651B2817552J67403p89290j661123L41990j157413p85170L38702l61487o60165
5642A8250999O2140M01733K47122Q17509J033438O62094R42041J184896J242123
5633B4844095J189663l78444j370833J66083l42493q71033P11145O54939l64641
5624B4238481j39232J759429J967147K459367K374438R61092m25163j522281l026667
5615B8646611j842666j153775j426795j300515m60736j047135j76567k39337K5782
5606B1024867m63979J120257L00505N42780M0559l90441O31639n26170P76332
$$ plain form
5670 29668870 28248633 26753335 26027449 25187636 25469011 24781532 24443084 23162024 22285992
5661 22285992 22188589 21586042 21481775 21576412 21506798 21919831 22436586 22093038 22637519 22817552
5651 22817552 22984955 22195665 20534542 20876532 19719119 18933949 19272651 18911164 18250999
5642 18250999 18313139 18714872 18961994 19779503 20812941 21475035 22417076 23601972 24844095
5633 24844095 26033758 25655314 24284481 24450564 24108071 23237038 23948183 24603122 24238481
5624 24238481 24099249 25858678 27825825 30285192 32659630 33620722 33195559 31673278 28646611
5615 28646611 26803945 25650170 24223375 22922860 22462124 21414989 21238422 20999085 21024867
5606 21024867 20560888 21681145 21981650 22524430 22564989 22174548 22806187 22280017 23056349
5597B3056349m19423J8952J359131P52483J876983N93825J712933K684985J935047
5588C3571265L489745K930702J711488j475436l028557m006532n082207k284936
5580B5825532q20545j674823j882052j079244L15857J61936o22722J79890R30054
5571B1333883P955k31515r01610L63179j70065K82206Q736K20715J047782K29824
5561B2191090N92213R70904J466941J580525J445170J495985L644157J704414
5553C5091399N05005j015628l044450l170876k297346j740451k43881n3478j097862
5544B2932432n41524N51020l51684n6213J234180M97170m26803j466751q048k50937
5534B2112842R76487o66500J1760J70688l22765K89181Q31226O57739N21852P64847
$$ plain form
5597 23056349 22636926 22655878 24015009 24767492 26644475 27238300 28951233 31636218 33571265
5588 33571265 37061010 39991712 41703200 40227764 37199207 33192675 28110468 25825532
5580 25825532 25004987 23330164 21448112 20368868 20684725 20846661 20223939 20403829 21333883
5571 21333883 21341838 21110323 20208713 20571892 20401827 20684033 20692769 20913484 21961266 22191090
5561 22191090 22783303 23754207 25221148 26801673 28246843 29742828 33386985 35091399
5553 35091399 35596404 34580776 31536326 28365450 26068104 24327653 24083772 24030294 22932432
5544 22932432 22390908 22941928 22590244 22534031 23768211 24265381 23838578 22371827 22363779 22112842
5534 22112842 23089329 22422829 22434589 22605277 22282512 22571693 23402919 24060658 24582510 25347357
5524B5347357R68210k76156J263624M04803M51235J57056j86307N09566J128J080188
5514B9720704J42185J039193J84793L42169O05586R76649Q61660O23907m14521
5505C4082325j514594J72246n56880n84021o30695K94283K24096p18859j152263
5496B9615638j678918m17795J87203p16707j062225j98207k06550p5447k08894
5487B5238098J13110r83902K20466P15005Q42942N96442j50702K64635M47710
5478B7303804j36237J142643J85252m66165P84169j77723J057359M73588p37358
5469B9429332O81247J127656O60971N32289K26417N37404K131048J321185P19219
5460C7366768O74861J731004K05983J290325J249069J187199J752769J196126
$$ plain form
5524 25347357 26315567 26039411 27303035 27707838 28159073 28316129 28129822 28639388 28640516 29720704
5514 29720704 29862889 30902082 31086875 31429044 32034630 33011279 33872939 34496846 34082325
5505 34082325 32567731 32739977 32183097 31599076 30968381 31262664 31486760 30767901 29615638
5496 29615638 27936720 27518925 27706128 26989421 25927196 25728989 25522439 25446992 25238098
5487 25238098 25351208 24367306 24587772 25302777 26145719 26742161 26591459 26856094 27303804
5478 27303804 27167567 28310210 28495462 28029297 28813466 28635743 29693102 30166690 29429332
5469 29429332 30110579 31238235 31899206 32431495 32657912 33195316 35326364 36647549 37366768
5460 37366768 38041629 39772633 39978616 41268941 42518010 43705209 45457978 46654104
5452D6654104P96172K144882Q15343L15713M76150j98228N98997K2622J308381
5443E2934136j831307n59352P76526m41444P37705m59315o21791j073749j173991
5434D8287418J68391j631549j882645j061914j574013j44467j159774j718041
5426C9283406l23065k06080K96404l29777o35389n5400j3082M66932J568759Q22367
5416D0875075P97111N74107L59906J291771K70961J492497J184123J220403K256330
5407E0322284J930826J684243J683475K658715J837212K060231K649805K243896
5399F7070687J936579J603469R93439J877092N51431R63511J205215M81261L08459
5390G6991143l34220J29022J310335j183202q12340m02314q96080j796993j534006
$$ plain form
5452 46654104 47450276 49595158 50410501 50726214 51202364 51004136 51603133 51625755 52934136
5443 52934136 51102829 50543477 51320003 50878559 51616264 51156949 50535158 49461409 48287418
5434 48287418 48455809 46824260 44941615 43879701 42305688 42161221 41001447 39283406
5426 39283406 38960341 38754261 39050665 38720888 38085499 38030099 38017017 38483949 40052708 40875075
5416 40875075 41672186 42246293 42606199 43897970 44168931 45661428 46845551 48065954 50322284
5407 50322284 52253110 53937353 55620828 58279543 60116755 62176986 64826791 67070687
5399 67070687 69007266 70610735 71604174 73481266 74032697 74996208 76201423 76682684 76991143
5390 76991143 76656923 76785945 78096280 76913078 76100738 75698424 74802344 73005351 71471345
5381G1471345j316748o22139j070757j033509p45136j104149j79573l78024m35855
5372F4585455J79209j79003j615818o79k96362k08264j16268j216193m98030q69190
5362E9764857m65535o94569j482271o55493m63028j246594k18069m48682j485888
5353E2604728j030741j100103j499220k020227Q8409O3418n46921j450824r56865
5344D4151654j240762J16937r15521o05169N12179M17102J175314O98386M4898
5335D4355018o87077j02514N8716j324841j168269r97221r32232r2925o66707
5326C8441948j466777J39183K93597p12456J249926Q9215L77125K05633K03787
5317C8821181J590558m49138K79992J476069O92613Q32195L8174J620825J513458
$$ plain form
5381 71471345 70154597 69532458 68461701 67428192 66683056 65578907 65399334 65021310 64585455
5372 64585455 64764664 64585661 62969843 62969164 62672802 62464538 62348270 61132077 60634047 59764857
5362 59764857 59299322 58604753 57122482 56466989 56003961 54757367 54539298 54090616 52604728
5353 52604728 51573987 50473884 48974664 46954437 47042846 47106264 46559343 45108519 44151654
5344 44151654 42910892 43027829 42112308 41507139 42019318 42436420 43611734 44310120 44355018
5335 44355018 43667941 43565427 43624143 42299302 41131033 40133812 39201580 39108655 38441948
5326 38441948 36975171 37114354 37407951 36695495 37945421 38034636 38411761 38617394 38821181
5317 38821181 40411739 39962601 40242593 41718662 42411275 43243470 43281644 44902469 46415927
5308D6415927J119587J419031J899721K755644K157398J600840J456522K90522
5300E9115192j63320k15796j101556K00450p42774k36938j437669j335440r91472
5291E3090677j834417m08362K13722p08318j556148l32185k53435j048598j725955
5282D5436981j438256j457895j526164j518299j325160L31120o58588j58361L7071
5273C7722449R3864n491r07877o40939R21163k95702j43447J68482J35060M57240
5263C7504802j624951O63236j72696m0559O8613Q55928J72593L59654P97664Q88333
5253C9472617L13201L77841j1787j420283n84971q70603j27866j62156j57557
5244C6828436L98222o45801j47386O33008l64116J19413O72500J003662O43372
$$ plain form
5308 46415927 47535514 48954545 50854266 53609910 55767308 57368148 58824670 59115192
5300 59115192 58951872 58736076 57634520 57834970 57092196 56855258 55417589 54082149 53090677
5291 53090677 51256260 50847898 51061620 50353302 48797154 48464969 48211534 47162936 45436981
5282 45436981 43998725 42540830 41014666 39496367 38171207 38502327 37843739 37685378 37722449
5273 37722449 37816313 37810822 36902945 36262006 37183169 36887467 36744020 36912502 37047562 37504802
5263 37504802 35879851 36543087 36370391 36329832 36398445 37254373 37426966 37786620 38584284 39472617
5253 39472617 39785818 40163659 40151872 38731589 38146618 37276015 37148149 36985993 36828436
5244 36828436 37226658 36580857 36433471 37066479 36702363 36821776 37494276 38497938 39141310
5235C9141310J40005R59812R67611N86877q88985j537364l56411r98167p1225
5226C7943463O7720j457012j91735M57784R1418m55152o35134K9652k40586K94409
5216C5904827k03101q80020m55155J194740n83822j218055k279977j667644n79818
5207B9231975o32578l3131o51536L39459P58202J24646O47626L68230N3771K81130
5197C0487794q48337n14554r57430n72362r72438o43721N26185j8059J95401J442521
5187B8125000j61536R65764J071182M28800k15543l88890K96630o1173j512038
5178B8548196n75746j203852j135262P5045l15982p43338r94954N85754r85075
5169B3254786o13991O12148N314M9262j53285k95970M03002n61721K02272J25389
$$ plain form
5235 39141310 39281315 40241127 41208738 41795615 40906630 39369266 39012855 38014688 37943463
5226 37943463 38011183 36554171 36362436 36820220 36911638 36456486 35821352 35851004 35610418 35904827
5216 35904827 35701726 34821706 34366551 35561291 34977469 33759414 31479437 29811793 29231975
5207 29231975 28599397 28566266 27914730 28254189 29012391 29137037 29784663 30152893 30206664 30487794
5197 30487794 29639457 29124903 28167473 27595111 26622673 25978952 26505137 26487078 26682479 28125000
5187 28125000 27963464 28929228 30000410 30429210 30213667 29824777 30121407 30060234 28548196
5178 28548196 27972450 26768598 25633336 25708381 25392399 24649061 23654107 24239861 23254786
5169 23254786 22640795 23252943 23258257 23307519 23154234 22858264 23261266 22699545 22901817 23027206
5159B3027206L45781k9019l26683j259399J97079k02336J176934K06633J20714
5150B3256910R38812l99121L34543j51057o1627k65590p67805l67972l65291L08227
5140B2460029M81207q8407J576596l29074N44934L28420m98961K23461p25342
5131B3972863p16308R81372M79596L60137l8454Q4820Q62026j0552M67211J37823
5121B6580534J148250J591335L52180N11327K38828O65166p51194j117213l67729
5112B8851484M1960M03708n47694m48656J59392P64994o0849M3502K12415N90434
5102C0010690k6149n18552n22746q88342P5730J50488L24036m61197j47627P93880
5092B8790211N99637P92373m90476r27005K03435Q67030P06182n1594N20100J594412
$$ plain form
5159 23027206 23372987 23343968 23017285 21757886 21954965 21752629 22929563 23136196 23256910
5150 23256910 24195722 23796601 24131144 23980087 23918460 23652870 22885065 22517093 22151802 22460029
5140 22460029 22941236 22852829 24429425 24100351 24645285 24973705 24474744 24698205 23972863
5131 23972863 23256555 24237927 24717523 25077660 25039206 25124026 25986052 25975500 26442711 26580534
5121 26580534 27728784 29320119 29672299 30183626 30422454 31087620 30336426 29219213 28851484
5112 28851484 28893444 29297152 28749458 28300802 28460194 29225188 29164339 29207841 29420256 30010690
5102 30010690 29984541 29465989 28943243 28054901 28130631 28281119 28605155 28143958 27996331 28790211
5092 28790211 29389848 30182221 29691745 28764740 28968175 29835205 30541387 30489793 31009893 32604305
5082C2604305J101577M51636J371471Q54489J478947K285990K183580K285009
5074D4617004J605981K770564L265648J419927J080601o47078k450901k667256
5066D8994490k221961k363040j796643j384081m60772q17342p91158P307j530354
5057C7636446k60773j1178O20191K80097N17722Q65521O45330M75743P54386K153824
5047D3677309J997454L386766K925297K677294K104344J853099J848907L461469
5039F3931939K005656J292724q63420l930826m800006m229801l270712o54237
5031D9481317k39902n06642J23071L92242k73266p88130j77368N94971J338082
5022D9944375m85291J064726Q60185Q26509J518426J757040J761441K820206L778626
$$ plain form
5082 32604305 33705882 34157518 35528989 36383478 37862425 40148415 42331995 44617004
5074 44617004 46222985 48993549 52259197 53679124 54759725 54112647 51661746 48994490
5066 48994490 46772529 44409489 42612846 41228765 40767993 39950651 39159493 39166800 37636446
5057 37636446 37375673 37364495 37984686 38264783 38782505 39648026 40293356 40769099 41523485 43677309
5047 43677309 45674763 49061529 51986826 54664120 56768464 58621563 60470470 63931939
5039 63931939 65937595 67230319 66366899 62436073 57636067 53406266 50135554 49481317
5031 49481317 49241415 48734773 48857844 49250086 48976820 48188690 48011322 48606293 49944375
5022 49944375 49459084 50523810 51383995 52210504 53728930 55485970 57247411 60067617 63846243
5013F3846243L851657K169045L091656m91820k208152j664410n49296Q3952j323362
5004F6805513l615548m273253n855394m995219m030246j010831n81251j056924
4996D1386847o89539j52336k96993K28640L0983p50420M63585R95687J436474
4987D2652928P51113K436947J398668K014899K740364K903221L742669L831283
4979F2472092J714493l45773l995661m439753l487223k001548j602135j715858
4971D6598634j848612k482456k257970k366057m92809r38171p64583l59987M0025
4962C5128014m24986m16500Q03565M24219O10798j44310l5005M32237J004845
4953C7382877J201291L04590J962719J861702Q10625J645437J632195m38749k064099
$$ plain form
5013 63846243 67697900 69866945 72958601 72466781 70258629 68594219 68044923 68128875 66805513
5004 66805513 63189965 58916712 53061318 48066099 44035853 43025022 42443771 41386847
4996 41386847 40697308 40544972 40247979 40476619 40507602 39757182 40220767 41216454 42652928
4987 42652928 43404041 45840988 47239656 49254555 51994919 54898140 58640809 62472092
4979 62472092 64186585 63840812 59845151 55405398 51918175 49916627 48314492 46598634
4971 46598634 44750022 42267566 40009596 37643539 37150730 36212559 35447976 35087989 35128014
4962 35128014 34703028 34286528 35090093 35514312 36125110 35980800 35945795 36378032 37382877
4953 37382877 38584168 38888758 40851477 42713179 43523804 45169241 46801436 46362687 44298588
4944D4298588l390702k121217j611945r28834q30157j711725k66394o04849K00954
4935C3033719K92510J47839l29970N595L76208O30863l37948M32069K24819J381212
4925C5856916P29388K65429K41049J074444R01414K22042l00036N79741J426210
4916D0996597M05299J095727N17685l34136o15287j497400p58243p95712j770620
4907C7243910q32477q03511J25129L37607N89577l18215q92489k5968p1000J079836
4897C6432399J34618j78971J027377L90223J044205J881439O98345J206722P48530
4888D3384887Q94978J179910R7472P99204J40551k51514o74126n50803o40737
4879D4379822p77471k98679j302282q28163m89084o63478n40783m39791m29390
$$ plain form
4944 44298588 40907886 38786669 37174724 36245890 35415733 33704008 33437614 32832765 33033719
4935 33033719 33326229 33474068 33144098 33149693 33525901 34156764 33818816 34250885 34475704 35856916
4925 35856916 36586304 36851733 37092782 38167226 39068640 39290682 38990646 39570387 40996597
4916 40996597 41401896 42497623 43015308 42681172 42065885 40568485 39810242 39014530 37243910
4907 37243910 36411433 35607922 35733051 36070658 36660235 36342020 35449531 35423563 35352563 36432399
4897 36432399 36567017 36388046 37415423 37805646 38849851 40731290 41429635 42636357 43384887
4888 43384887 44279865 45459775 45557247 46356451 46497002 46245488 45571362 45020559 44379822
4879 44379822 43602351 43303672 42001390 41173227 40684143 40020665 39479882 39040091 38610701
4870C8610701j17448n91950O58070O84406M66732N90702M5907Q91413J331733
4861D2570266R99434M36485J495526J048199J490376N06359Q23332O9742m68459
4852D8971260l54652j561086o68230l19902r48809L90237L44239M92638j62850
4843D6182845r27179J125335N15697k41888J889147L73062k67138K39801R96466
4834D9886148P06206Q59892J199734O25696J484417R30258L35640R44284P26709
4825E7698984M07682P62687k99153L85671j59713K11171L27640n88733L38053
4816E9084289q60334n32P71570R124M71290o0637J073037J729894J429148K419747
4806F6066596P81464J474282K334679K081117J779103K950531K216240J609839
$$ plain form
4870 38610701 38493253 37901303 38559373 39243779 39710511 40301213 40347120 41238533 42570266
4861 42570266 43569700 44006185 45501711 46549910 48040286 48546645 49369977 49439719 48971260
4852 48971260 48616608 47055522 46387292 46067390 45118581 45508818 45853057 46345695 46182845
4843 46182845 45255666 46381001 46896698 46654810 48543957 48917019 48649881 48889682 49886148
4834 49886148 50592354 51452246 52651980 53277676 54762093 55692351 56027991 56972275 57698984
4825 57698984 58106666 58869353 58570200 58955871 58796158 59007329 59334969 58746236 59084289
4816 59084289 58223955 58223423 58994993 59004117 59475407 59414770 60487807 62217701 63646849 66066596
4806 66066596 66848060 68322342 70657021 72738138 74517241 77467772 79684012 81293851
4798H1293851J695144K023830J787415K002853K196714P86632P46593m8926R58510
4789I3442616L78073j153459J524207K243626J819301L137242K701625O26805
4781A04720036o91055j792524k428303j816584r17642N35108l38837P40202P83473
4772I8793874K270930K865990L095609K902583K072956K705406J986239L809343
4764A20502930L484111L932349M032884K504596M047578K990212K090002J628969
4756A45213631J198953M63182J638544J882013K073243J556749J120725M5238
4748A55192278j238417Q24633R0722p89152j160426j801470j453345j066023k013729
4739A46585071o20227k019229k000905j139724j247976j63854j394166N14091
$$ plain form
4798 81293851 82988995 85012825 86800240 88803093 90999807 91786439 92533032 92484106 93442616
4789 93442616 93820689 92667230 94191437 96435063 98254364 101391606 104093231 104720036
4781 104720036 104028981 102236457 99808154 97991570 97073928 97609036 97270199 98010401 98793874
4772 98793874 101064804 103930794 107026403 109928986 112001942 114707348 116693587 120502930
4764 120502930 123987041 127919390 131952274 134456870 138504448 141494660 143584662 145213631
4756 145213631 146412584 146875766 148514310 150396323 152469566 154026315 155147040 155192278
4748 155192278 153953861 154778494 154869216 154080064 152919638 151118168 149664823 148598800 146585071
4739 146585071 145964844 143945615 141944710 140804986 139557010 139393156 137998990 138513081
4731A38513081m25228j141650m98264N457M93692m52938J305697J122552K48109
4722A39170508J615484J013367K321416K369758K434317Q31458o5882k187632
4714A47502794l353408m374941n998670m618969m219429l942255k871933k291465
4706A15831724k550242k177855r82811j734778j205445n40783k00787j1455Q58321
4697A07285889J560176N69086J073479R24779R84631R67423N96737M45786L14250
4688A14722236L59744o38124r56785q60020k141407j418501k490216j728729j592085
4679A03256113k499774l107958j350583j648498k336835j562433j473218k174712
4671H7102102j600487k178285j431516j621386m75666j090951q47765j168906
$$ plain form
4731 138513081 138087853 136946203 136447939 136453396 136947088 136494150 137799847 138922399 139170508
4722 139170508 140785992 141799359 144120775 146490533 148924850 149756308 149690426 147502794
4714 147502794 144149386 139774445 133775775 129156806 124937377 120995122 118123189 115831724
4706 115831724 113281482 111103627 110120816 108386038 107180593 106639810 106439023 106427568 107285889
4697 107285889 108846065 109415151 110488630 111413409 112398040 113365463 113962200 114407986 114722236
4688 114722236 115081980 114443856 113487071 112627051 110485644 109067143 106576927 104848198 103256113
4679 103256113 100756339 97648381 96297798 94649300 92312465 90750032 89276814 87102102
4671 87102102 85501615 83323330 81891814 80270428 79794762 78703811 77856046 76687140
4663G6687140r79593o07759j242720o50519p05669q14274r61082j76449n29519
4654G0019556J7972J01681K70176j422392m80758n31415o77329o0926j610533
4645F5626032p54644r18670p74036N51160p35009K19587l79689N87316J267826
4636F4689873o04336J99794J72843j242186M16798q02806j556682K50317p6276
4627F1447339j13210j95216q7728r14666j67078k2448p5794N28224L07223p4798
4617F0631848k48615k94112k81560N4262O40601k20890J80910M94647k36676o58783
4607F0061632O41876N64338n54539Q65953o57732J053075M77118n10752n80394
4598F1360575r01257j199036j354395m77721J34841j303437m80277o2790Q34237
$$ plain form
4663 76687140 75707547 75099788 73857068 73206549 72500880 71686606 70725524 70549075 70019556
4654 70019556 70037528 70139209 70409385 68986993 68506235 67974820 67297491 67236565 65626032
4645 65626032 64871388 63952718 63178682 63729842 62994833 63214420 62834731 63422047 64689873
4636 64689873 64085537 64285331 64458174 63215988 63632786 62829980 61273298 61523615 61447339
4627 61447339 61334129 61138913 61051185 60136519 59969441 59946993 59871199 60399423 60706646 60631848
4617 60631848 60383233 60089121 59807561 59861823 60502424 60281534 60462444 60957091 60720415 60061632
4607 60061632 60703508 61267846 60713307 61579260 60921528 61974603 62451721 61940969 61360575
4598 61360575 60459318 59260282 57905887 57428166 57563007 56259570 55779293 55716503 56550740
4589E6550740n8271j160910L61469j5001q73879j13702O306m93618M19825j34867
4579E4488092J81352N45269Q66379Q21919R58030N09427k23031N43953N52356
4570E9243746M37115N81951q71098J21830j160940j121059j467326k006967j294082
4561E2463170j463321n46998j022030r79139J51531j52180j74662J52054k19883
4552D8208542m01986O2014K83820K98081j46963l43715Q50695O96044l69776o35006
4542D8501750M90622R3189J66676J459202j79042K18397L70310p85757j086193
4533D9249154L87212j74382j480951j231082q23003p95511r40969p43372n66406
4524D2880690l56418j253027J22500N95095r73787L84499R264j47184N5395k667
$$ plain form
4589 56550740 56492469 55331559 55693028 55678027 54804148 54690446 54696752 54203134 54622959 54488092
4579 54488092 54669444 55214713 56081092 56903011 57861041 58370468 58147437 58691390 59243746
4570 59243746 59680861 60262812 59391714 59513544 58352604 57231545 55764219 53757252 52463170
4561 52463170 50999849 50452851 49430821 48451682 48603213 48451033 48276371 48428425 48208542
4552 48208542 47806556 47868570 48152390 48450471 48303508 47959793 48810488 49506532 49136756 48501750
4542 48501750 48992372 49085561 49252237 50711439 50532397 50750794 51121104 50335347 49249154
4533 49249154 49636366 49461984 47981033 46749951 45926948 45131437 44190468 43447096 42880690
4524 42880690 42524272 41271245 41393745 41988840 41015053 41399552 41408816 41261632 41317027 41314360
4514D1314360k15057j59547L24523l20968K968K97531R11792J131044R59937p7387
4504D4169196k51386O54606k78396M59168L96178q64807n19942J8310l17860n95938
4494D2869129q75303k21401K3001k86217J234307m5173P05324K0851K77369Q37009
4484D4538896m03103N64658L7310r0761P72678M31328J376268P63986N73607R17771
4474D9482638N47162J306659J221626J019799n3816J500594J125806l85122P89438
4465E6554784N81412J21572O50152J552205M68415M78364J407607J454869J274894
4456F4544274J356741J203981J800972J014374J621262L075321J503363K430949
4448G8551237K583884K234950L566967K458737M122984M191740M302411N823308
$$ plain form
4514 41314360 41099303 40939756 41264279 40943311 40946279 41243810 42155602 43286646 44246583 44169196
4504 44169196 43917810 44572416 44294020 44753188 45149366 44284559 43764617 43782927 43465067 42869129
4494 42869129 41993826 41772425 41795426 41509209 42743516 42698343 43403667 43424518 43701887 44538896
4484 44538896 44135793 44700451 44737761 44647000 45419678 45851006 47227274 47991260 48564867 49482638
4474 49482638 50029800 51336459 52558085 53577884 53524068 55024662 56150468 55765346 56554784
4465 56554784 57136196 57257768 57907920 59460125 59928540 60406904 61814511 63269380 64544274
4456 64544274 65901015 67104996 68905968 69920342 71541604 74616925 76120288 78551237
4448 78551237 81135121 83370071 86937038 89395775 93518759 97710499 102012910 107836218
4440A07836218N872480O135383O828338Q236671Q576043J0218464J2309164J4939217
4432A80951978J6061925J7475580J9855771J9632628J7509771J3541629P398591
4425B92427873J32832m972355n318398m746852o329403q906389j0959145j3211678
4417B38116485j4176740j4812166j3936361j2925490j2104650j0047917r957978
4410A50155183q811957p983755p708232o428425n675523o037686o929840n304545
4402I5275220n240957m531547m240323m551737l146743l213799l353496k935946
4394F4060672k195334j493360k793265j934974j774764k066623p21940j134697
4386D9945715p87893j349753j445352j003368q08223k29268k96892j440166l55825
$$ plain form
4440 107836218 113708698 119844081 126672419 134909090 143485133 153703597 166012761 180951978
4432 180951978 197013903 214489483 234345254 253977882 271487653 285029282 292427873
4425 292427873 292560705 287588350 282269952 277523100 271193697 262287308 251328163 238116485
4417 238116485 223939745 209127579 195191218 182265728 170161078 160113161 150155183
4410 150155183 141343226 133359471 125651239 119222814 113547291 107509605 100579765 95275220
4402 95275220 90034263 85502716 81262393 76710656 73563913 70350114 66996618 64060672
4394 64060672 61865338 60371978 57578713 55643739 53868975 51802352 51080412 49945715
4386 49945715 49157822 47808069 46362717 45359349 44551126 44321858 44024966 42584800 42228975
4377D2228975q25233M7029k76006m92196k07639n62893p21708o96608J24265k4296
4367C8593690m28513m2247l14130R19243P75186P98031P08650l44871J133761
4358D1798800J033339L15317k34604m7321n1226p99337k002444j159585j698739
4349C7154200n41018j465050j038480m65471p33231m78062m20319j289335q73802
4340B9849432p90051Q2145J82801j600159p9619n6994o15044M32909k07980k92369
4330B6905071k23059j043387P02072m39500R70804N95258j346943L92763p54143
4321B5758936m41386j03052k6965k4875j2440K11357k64204M18033O22480J45051
4311B6282935o0466M4813M84767k93190J153763J280172M83923J490127L20618
$$ plain form
4377 42228975 41403742 41450771 41174765 40682569 40474930 39912037 39190329 38493721 38617986 38593690
4367 38593690 38165177 38122930 37808800 38728043 39503229 40301260 41009910 40665039 41798800
4358 41798800 42832139 43147456 42912852 42865531 42814305 42014968 40012524 38852939 37154200
4349 37154200 36613182 35148132 34109652 33644181 32910950 32432888 32012569 30723234 29849432
4340 29849432 29059381 29141526 29324327 27724168 27644549 27587555 26972511 27405420 27197440 26905071
4330 26905071 26682012 25638625 26340697 25901197 26872001 27467259 26120316 26513079 25758936
4321 25758936 25317550 25214498 25187533 25162658 25150218 25361575 25097371 25515404 26137884 26282935
4311 26282935 26222469 26267282 26752049 26458859 27612622 28892794 29376717 30866844 31187462
4302C1187462N3190J06018j577165j105787j074053k048673p04377q37826r72311
4293B3026478j302140j98554J041367l26683J17930m30585p88439J9115k54298
4284B0904191L19572r29490n16608J27137L67769p34133r5442N13369k15457q78124
4274A8862784j84676Q95622j5208K66687M88833j178678P52121O32782q31295
4265A9688972P27597K41615N7657l04894N2107M54111l56566n44366o5273o26851
4255A9324109k24750O36423P04677n5235k80099k7011n23702N43634L97355M96038
4245B0991439O75247l16753N72957J73429l71688l5230M47944J22687j7279K98486
4235B2541239k91310m08854N48784k96033j061567J99209P50961n81630k87486
$$ plain form
4302 31187462 31240652 31346670 29769505 28663718 27589665 25540992 24836615 23998789 23026478
4293 23026478 21724338 21525784 22567151 22240468 22358398 21927813 21139374 21158489 20904191
4284 20904191 21223763 20294273 19777665 19904802 20272571 19538438 19442996 19956365 19740908 18862784
4274 18862784 18678108 19573730 19558522 19825209 20314042 19135364 19887485 20520267 19688972
4265 19688972 20416569 20658184 20715841 20410947 20463054 20917165 20560599 20016233 19950960 19324109
4255 19324109 19099359 19735782 20440459 20385224 20105125 20078114 19554412 20098046 20495401 20991439
4245 20991439 21666686 21349933 21922890 22096319 21724631 21689401 22137345 22260032 22242753 22541239
4235 22541239 22249929 21841075 22389859 22093826 21032259 21231468 21982429 21400799 21113313
4226B1113313N96997P49159P17994L4565M74527j66979j94767K6596j63095m87161
4216B2701149N0482K21377j65995j86686J036740L7116j60442N3020K1279N22004
4206B4130044k00466Q41548j84747k3982M66832O70721N54658J1291l46809r6538
4196B5822552J72556Q28529P41408j57199N00172k5664k5943m74132l46559N62601
4186B7598321m42781J92104M96187R04573P43365r43188O78083k5769J99303O62793
4176C0062991N791O94470N6933L93282L55911M47839N81648J53927M01985J011775
4166C4166552J228763R05752K69729R53103J543890J105552J939488K052905K446960
4157D6612694L934454M228991O347615O029964N824941K824638m661297p576907
$$ plain form
4226 21113313 21710310 22459469 23177463 23212028 23686555 23519576 23324809 23351405 23188310 22701149
4216 22701149 22751631 22973008 22807013 22620327 23657067 23694183 23533741 23586761 23608040 24130044
4206 24130044 23929578 24771126 24586379 24562397 25029229 25699950 26254608 26265899 25919090 25822552
4196 25822552 25995108 26823637 27565045 27407846 27908018 27882354 27856411 27382279 27035720 27598321
4186 27598321 27155540 27347644 27843831 28748404 29491769 28548581 29226664 29200895 29400198 30062991
4176 30062991 30068782 30763252 30820185 31213467 31569378 32017217 32598865 32752792 33154777 34166552
4166 34166552 35395315 36301067 36570796 37523899 39067789 40173341 42112829 44165734 46612694
4157 46612694 50547148 54776139 61123754 67153718 72978659 75803297 71142000 63565093
4149F3565093q280917o114815l144063k575739j164358j318756o19004l66989
4141C9980452j66167J596587J432853Q45198J114796R91219K23251j245162k561009
4132D2212018k075679j197943j051458q86879J89930k90803j52175J21512N60740
4123C7429263n07066q7359L764j84248J163300m51632N84216N46008k72584J002801
4113C9226463r6216J26570P60660n1746L34470J208028J460534K79635O85224
4104D3933622N38045m15183J105718J188984Q10348J409591M52454l81210N11920
4095D9154289J275528K512844J749582J370858J510613J145921J680604K771720
4087F3171959K617091J278777J717498K522367K019063L072815K987333L105534
$$ plain form
4149 63565093 55284176 49169361 46025298 43449559 42285201 40966445 40347441 39980452
4141 39980452 39814285 41410872 42843725 43688923 44803719 45794938 46018189 44773027 42212018
4132 42212018 40136339 38938396 37886938 37000059 37189989 36899186 36747011 36868523 37429263
4123 37429263 36922197 36834838 36838602 36654354 37817654 37366022 37950238 38496246 38223662 39226463
4113 39226463 39130247 39256817 40017477 39965731 40300201 41508229 42968763 43248398 43933622
4104 43933622 44471667 44056484 45162202 46351186 47161534 48571125 49023579 48642369 49154289
4095 49154289 50429817 52942661 54692243 56063101 57573714 58719635 60400239 63171959
4087 63171959 65789050 67067827 68785325 71307692 73326755 76399570 79386903 82492437
4079H2492437M358644M571905O132951P777503Q131442J1880490J2739087J3555471
4071A51639930J0858322r227236j6611446j2897894q497402l977166k124379j126999
4063A08035730q17175L30472k95924R0993m09100j45493R12749L72211O20204
4054A08694667J693224N48539J76004K5467j87068O98477k74735K16343J102443
4045A12693361m12534K7669O66610J002086M67558J5387P4570p1015r90788M39866
4035A13912770j16078p60976O71734j598472j74709n38632m01694r31082o21275
4026A09441586k19151L10525N55884p58857j026717n96351n12063r72903l67067
4017A05854886L60419R46233j174619r94813L38223l36778J07804o79588p66908
$$ plain form
4079 82492437 86851081 91422986 97555937 105333440 113464882 125345372 138084459 151639930
4071 151639930 162498252 153271016 136659570 123761676 115264274 111287108 109162729 108035730
4063 108035730 107218555 107549027 107253103 107344096 106934996 106789503 107702252 108074463 108694667
4054 108694667 110387891 110936430 111112434 111137901 110950833 111649310 111374575 111590918 112693361
4045 112693361 112280827 112308496 112975106 113977192 114444750 114460137 114534707 114463692 113472904 113912770
4035 113912770 113796692 113035716 113707450 112108978 111934269 111395637 110993943 110062861 109441586
4026 109441586 109222435 109532960 110088844 109329987 108303270 107706919 107194856 106221953 105854886
4017 105854886 106215305 107161538 105986919 104992106 105330329 104993551 105101355 104421767 103654859
4008A03654859K8630o46360m76259l66747K17136M24467j119426m53226J3743
3999A01276817o85242n23560M1416M60640n17437l57377l59612o90717m83835
3990I8161093o70938n08836Q86129l85864o7466p00719P49035n61074r97347n02944
3980I5401069j021133m00497o24657n99180n81667o442K51730N89034j91335j084603
3970I1732319j32985J97233J62549p279K9084k65526o57089q9257K24474n83577
3960I0609946l40414L70797N28090M81445o8901J48803o67914j366809j60966
3951H9534077K5339N9878L48586Q77805P70672R62333N23929R29866J374230J23499
3941I5530214P32090O85701J339458n42094M99811J251551J268486J299903J047889
$$ plain form
4008 103654859 103683489 103037129 102560870 102194123 102411259 102835726 101716300 101263074 101276817
3999 101276817 100591575 100068015 100109431 100570071 100052634 99695257 99335645 98644928 98161093
3990 98161093 97490155 96981319 97867448 97481584 97414118 96713399 97462434 96901360 95904013 95401069
3980 95401069 94379936 93979439 93354782 92755602 92173935 92167493 92419223 93008257 92816922 91732319
3970 91732319 91599334 91796567 91959116 91951837 91980921 91715395 91058306 90969049 91193523 90609946
3960 90609946 90269532 90640329 91168419 91649864 91580963 91729766 91061852 89695043 89534077
3951 89534077 89559416 89619294 89967880 90845685 91616357 92578690 93102619 94032485 95406715 95530214
3941 95530214 96262304 96948005 98287463 97745369 98245180 99496731 100765217 102065120 103113009
3932A03113009O39043J345027J232682m80331M22160K56462j33376N52871R7460
3923A07045007L48234M38256N85404L37334J439695K16753J057494L22584R7968
3914A11888729J43108M22943j41855r22259M06986p51892k49885L13634R46982
3905A12056491R29042K18032R33604K8921q34542M64640O23341M94986M32129
3896A15346644J881185J280556O40732P06756M01702M36256J374590M98969J63526
3887A22730916l49092K41663M72124N50057J188243P45702O81168M56439Q45040
3878A27562260L85345j856869n46529O26q81607L3587J20235m0002M66184k71913
3868A24971317m70801l54110k28038l03423j611142j943981j946679j744591k017843
$$ plain form
3932 103113009 103752052 105097079 106329761 105849430 106271590 106528052 106394676 106947547 107045007
3923 107045007 107393241 107831497 108416901 108754235 110193930 110410683 111468177 111790761 111888729
3914 111888729 112031837 112454780 112312925 111390666 111797652 111045760 110795875 111109509 112056491
3905 112056491 112985533 113203565 114137169 114166090 113331548 113796188 114419529 114914515 115346644
3896 115346644 117227829 118508385 119149117 119855873 120257575 120693831 122068421 122567390 122730916
3887 122730916 122381824 122623487 123095611 123645668 124833911 125579613 126260781 126717220 127562260
3878 127562260 127947605 126090736 125544207 125544833 124663226 124696813 124817048 124777046 125243230 124971317
3868 124971317 124500516 124146406 123918368 123614945 122003803 120059822 118113143 116368552 114350709
3859A14350709j205522j600232n04552p27292j349238l51296j198188N52146Q14569
3850A08781104M347O22390J030576K60617L42855q8893r88019m94966P50359l08987
3840A09911383m51006p33656r14615p1296l83986J291442j577869k82806J73481
3831A06961072m14413n10710j483554k172480k632981k696018k590987k666473
3823I1793456k707150j519023l570558j444901j764351j699892k013691j776192
3815G5297698j375779k098532j983647j276654r58174k121724k097898j328480
3807F2056810r27502j000808p3521j548234q10822j48244K30048o44792o06626
3798E6526309O97680J112783O8000K00739M00631N54613L92884n10736N14082
$$ plain form
3859 114350709 113145187 111544955 111040403 110313111 108963873 108612577 107414389 107966535 108781104
3850 108781104 108785451 109407841 110438417 110699034 111041889 110952996 109964977 109470011 110220370 109911383
3840 109911383 109460377 108726721 107812106 107740810 107356824 108648266 107070397 106787591 106961072
3831 106961072 106546659 106035949 104552395 102379915 99746934 97050916 94459929 91793456
3823 91793456 89086306 87567283 83996725 82551824 80787473 79087581 77073890 75297698
3815 75297698 73921919 71823387 69839740 68563086 67604912 65483188 63385290 62056810
3807 62056810 61129308 60128500 60054979 58506745 57695923 57547679 57777727 57132935 56526309
3798 56526309 57223989 58336772 58404772 58605511 59006142 59560755 59953639 59442903 59956985
3789E9956985J60368m59759R11415k771N38581K63356M9187O81362J98141M28988
3779F2725853n56712r14858Q0752M01243j18082n61089r81350r91931q47173p68464
3769E7468189o27806j052143j321051p67230k70280k96254q10604R23378m14329
3760E2831870j672932j047610j491390j52740r23580n89976J58950J2992L0207
3751D7155791q47157R7540k24172m88819Q98293j55953k48729M35858O7876O76213
3741D7366741R7024L68211K3698l83289P52437P81159J61633L99443O25417Q50369
3731E1042843k35263Q73758J048641l58427L82522q4696P35413J536597j090193
3722E3851195O68245P58590O51297N51066P40334M13561O61445K68845O82181
$$ plain form
3789 59956985 60117353 59657594 60569009 60566238 61104819 61368175 61417362 62098724 62296865 62725853
3779 62725853 62169141 61254283 61335035 61736278 61618196 61057107 60075757 59083826 58236653 57468189
3769 57468189 56840383 55788240 54467189 53699959 53429679 53133425 52322821 53246199 52831870
3760 52831870 51158938 50111328 48619938 48467198 47543618 46953642 47112592 47125584 47155791
3751 47155791 46308634 46406174 46182002 45693183 46591476 46435523 46186794 46622652 46690528 47366741
3741 47366741 47463765 47831976 47855674 47472385 48224822 49005981 49167614 49567057 50192474 51042843
3731 51042843 50807580 51681338 52729979 52371552 52754074 52669378 53404791 54941388 53851195
3722 53851195 54519440 55278030 55929327 56480393 57220727 57634288 58295733 58564578 59246759
3713E9246759R55599J389188J706046Q61630J045038J67028J912513Q46882L11809
3704F8442492P72520P95632K603752K275743J917595L168811K537628K628751
3696H5142924L005436K710382L274760L723271M288433L653708L802973L860948
3688A13462835L261697L593395L613609L027862K682437J872438K083483K775699
3680A36373455K101516P34308o77564j344232j311876l079208j871630o9105j511397
3671A29344267j777874j321222j228833k933127j641335j582036j788181r88288
3663A16083371q50621r37141L63320j52580K58119J513692J479229J433809J078048
3654A20269246K622176K121380K138948K257273L01231N2159q47074K94807M53814
$$ plain form
3713 59246759 60202358 61591546 63297592 64159222 65204260 65371288 67283801 68130683 68442492
3704 68442492 69215012 70010644 72614396 74890139 76807734 79976545 82514173 85142924
3696 85142924 88148360 90858742 94133502 97856773 102145206 105798914 109601887 113462835
3688 113462835 116724532 120317927 123931536 126959398 129641835 131514273 133597756 136373455
3680 136373455 138474971 139209279 138531715 137187483 135875607 132796399 130924769 130855664 129344267
3671 129344267 127566393 126245171 125016338 122083211 120441876 118859840 117071659 116083371
3663 116083371 115232750 114295609 114658929 114506349 114764468 116278160 117757389 119191198 120269246
3654 120269246 122891422 125012802 127151750 129409023 129710254 129762413 128915339 129210146 129663960
3645A29663960O65073J743663J272658J260544K051900J850562K117209J948071
3637A42573640K584245K987386L193530L388186K702861L952455L721705L524956
3629A68628964M460900K854000M393684M613311M250546L981012N030942M031194
3621B02244553M060402M761833N088939N544870N563037N969542M848573O700469
3613B44782218O136513N808414N750743M804799M606529M028113L165275L489908
3605B82572512K922771K663085K951942L045086L300910K602442K681302K319269
3597C05059319J754256K139936m5125j025139k991614l272008k839388l468252
3589B95311985m452126l530520l502374l517650m217131l491417l947426n146240
$$ plain form
3645 129663960 130329033 132072696 133345354 134605898 136657798 138508360 140625569 142573640
3637 142573640 145157885 148145271 151338801 154726987 157429848 161382303 165104008 168628964
3629 168628964 173089864 175943864 180337548 184950859 189201405 193182417 198213359 202244553
3621 202244553 206304955 211066788 216155727 221700597 227263634 233233176 238081749 244782218
3613 244782218 250918731 256727145 262477888 267282687 271889216 275917329 279082604 282572512
3605 282572512 285495283 288158368 291110310 294155396 297456306 300058748 302740050 305059319
3597 305059319 306813575 308953511 308908386 307883247 304891633 301619625 298780237 295311985
3589 295311985 290859859 287329339 283826965 280309315 276092184 272600767 268653341 263507101
3581B63507101l170576m093839m209542m748856m965987m642549m804989n406302
3573B27464461m015812m338263l251842m876128m234837k245149k705064j998846
3565A99798520l054945k802823j041984k078471j737069j423556j492556k103907
3557A84063209k118865o94430j373641j177731p90188r67477r36882j84101J99184
3548A76019078J064132j029686Q22754n86218O28887N3225o01326P55294K5365
3539A77151505J168279O01387l06632J66547L53889L3233n71577l06997j363030
3530A76926604j172229j074004j112769k286927k135769j977981k045578j046717
3522A64074630k976264k720860k394612k689322k893954l408696l158109k329261
$$ plain form
3581 263507101 260336525 256242686 252033144 247284288 242318301 237675752 232870763 227464461
3573 227464461 223448649 219110386 215858544 210982416 206747579 204502430 201797366 199798520
3565 199798520 196743575 193940752 192898768 190820297 189083228 187659672 186167116 184063209
3557 184063209 181944344 181249914 179876273 178698542 177908354 176940877 176003995 175819894 176019078
3548 176019078 177083210 176053524 176876278 176290060 176918947 176972172 176370846 177126140 177151505
3539 177151505 178319784 178921171 178614539 178781086 179134975 179168208 178596631 178289634 176926604
3530 176926604 175754375 174680371 173567602 171280675 169144906 167166925 165121347 164074630
3522 164074630 161098366 158377506 155982894 153293572 150399618 146990922 143832813 141503552
3514A41503552k930909k763414k092623k633479k065777k146814k504872j830122
3506A22535542j078061n89883j476362j131655k97180j060016p12214j696728
3498A14493443j24261r92905j111249P29154r49388O7173o7151n07415l00322
3489A11237079m92514n67856m45073j327154n51081j898648j718612j683386j298789
3480A01253966j103689j518780m84420j341200q87518r93618k526980r85793j462348
3471H9949620j182734r86309j126710p55536j516634p19172r71110j715977j065150
3462G9910288p29064l30981o27636o33391K54797m33387j035785m12862m61870
3453G5500109K02539p85717j14943k72799j007610J24122p77199p57353Q43173
$$ plain form
3514 141503552 138572643 135809229 133716606 131083127 129017350 126870536 124365664 122535542
3506 122535542 121457481 120867598 119391236 118259581 117962401 116902385 116190171 114493443
3498 114493443 114369182 113376277 112265028 112994182 112044794 112111967 112044816 111537401 111237079
3489 111237079 110744565 110176709 109731636 108404482 107853401 105954753 104236141 102552755 101253966
3480 101253966 100150277 98631497 98147077 96805877 95918359 94924741 92397761 91411968 89949620
3471 89949620 88766886 87780577 86653867 85898331 84381697 83662525 82691415 80975438 79910288
3462 79910288 79181224 78850243 78222607 77589216 77844013 77410626 76374841 75961979 75500109
3453 75500109 75702648 74916931 74801988 74529189 73521579 73645701 72868502 72111149 72954322
3444G2954322j04026m59924l06044o96602L40021J23828Q42782q0028L6429L92964
3434G3043722k84769J89370J079614l76311l31309R24978l92028J185803m4610
3425G4994460N37633K66623J50097J255957M43708Q28034J486873K020251K221469
3416H4205105J198189J566618J003505M57094J517671k55366J14571l7970L99876
3407I0169293M38086j115077l2658j055970j759790j415388j610366k57620j12947
3398H3247563n42044J073160J446728J845244K321875J464860K016039k10536
3390I2662889J92686l32183q83249J236221J679114J752405K507984K461643J317642
3381A02595152j67957N3045k195851j876025k405683k888696k109235j253721
$$ plain form
3444 72954322 72850296 72390372 72084328 71387726 71727747 71851575 72694357 72614329 72650758 73043722
3434 73043722 72758953 72948323 74027937 73651626 73320317 74245295 73853267 75039070 74994460
3425 74994460 75532093 75798716 75948813 77204770 77648478 78476512 79963385 81983636 84205105
3416 84205105 85403294 86969912 87973417 88430511 89948182 89692816 89807387 89769417 90169293
3407 90169293 90607379 89492302 89459644 88403674 86643884 85228496 83618130 83360510 83247563
3398 83247563 82705519 83778679 85225407 87070651 89392526 90857386 92873425 92662889
3390 92662889 92855575 92523392 91640143 92876364 94555478 96307883 98815867 101277510 102595152
3381 102595152 102427195 102480240 100284389 98408364 96002681 93113985 91004750 89751029
3373H9751029j044802k61205N33170P26520J492528k52725J718957K534179K065641
3364I7263292K307285J390909K205345K855152L630226M179806L371856L199857
3356A20403728K828483L810751L536084K855240M087817K922298K798871K629788
3348A45873060J292716R61917P27172o07097j450687j610196j619495j413872
3340A42153518j376760k275927k971334r39445l547616k574328k111899l134580
3332A23221629j550990k543911k756166k385594k041804j256184k741557k092299
3324A05853124k076578j800757j306915r13148p04048j152717k97493j539273
3316I6062195j138832j92822M22879Q3603j028359N67647K93172N90960O94164
$$ plain form
3373 89751029 88706227 88445022 88978192 89704712 91197240 90944515 92663472 95197651 97263292
3364 97263292 99570577 100961486 103166831 106021983 109652209 113832015 117203871 120403728
3356 120403728 123232211 127042962 130579046 133434286 137522103 140444401 143243272 145873060
3348 145873060 147165776 148127693 148854865 148247768 146797081 145186885 143567390 142153518
3340 142153518 140776758 138500831 135529497 134590052 131042436 128468108 126356209 123221629
3332 123221629 121670639 119126728 116370562 113984968 111943164 110686980 107945423 105853124
3324 105853124 103776546 101975789 100668874 99755726 99051678 97898961 97601468 96062195
3316 96062195 94923363 94730541 95153420 95237023 94208664 94776311 95069483 95660443 96354607
3307I6354607M13608O67816P68535J556725J342060J281272J946253K049106K092320
3298A08472302K469042L566518M408048M568225N626949O223120N542878J308081
3290A42185163n279966o144059l543326k128036n66022K9810k63360l9280J228767
3281A25479691P44365J194495K384685J396009J523073J790189J646475L383037
3273A39542019J549744K888365K921648M399788M530858L944519M394984O066710
3265A70238635P228121R238013J1002761J1976234J1963852J3164993N291469
3258B40104078p887999r894601n324176j047900K207407L275996M136404O599589
3250B32168798O750322N115341O079447P470188P723125R704131J0648404J1942482
$$ plain form
3307 96354607 96768215 97436031 98204566 99761291 101103351 102384623 104330876 106379982 108472302
3298 108472302 110941344 114507862 118915910 123484135 129111084 135334204 140877082 142185163
3290 142185163 136905197 130761138 127217812 125089776 124523754 124553564 124290204 124250924 125479691
3281 125479691 126224056 127418551 129803236 131199245 132722318 134512507 136158982 139542019
3273 139542019 141091763 143980128 146901776 151301564 155832422 159776941 164171925 170238635
3265 170238635 177466756 186704769 197707530 209683764 221647616 234812609 240104078
3258 240104078 232216079 222321478 216997302 215949402 218156809 221432805 225569209 232168798
3250 232168798 238919120 244034461 250113908 257584096 265307221 275011352 285659756 297602238
3242B97602238J3308844J3897275J2936069J3168458J1033832Q049150N603904
3235C75599770P33225m984754r049097j0605203j1061946j2415806q591821o693249
3227C12931119j0110782j3897067j4258541j1344884q327357q592970o081173
3220B40318345m711132l386152m821034p402914q265054r221431q182740o856531
3212A87471357o246652m115811k305430j131339l05899q1514N73414J282911L017527
3203A78158564L454876K686320J851761j289547l569926n903549o590257n378647
3195A63419595m097121k669037k489214j009927k86420M25276J583617K096347
3187A56973116K616160K552306M619053M320045N114426N892515O599584M383075
$$ plain form
3242 297602238 310911082 324808357 337744426 350912884 361946716 369995866 375599770
3235 375599770 376332995 371348241 362299144 351693941 340631995 328216189 319624368 312931119
3227 312931119 302820337 288923270 274664729 263319845 254992488 246399518 240318345
3220 240318345 235607213 232221061 227400027 219997113 211732059 202510628 194327888 187471357
3212 187471357 181224705 177108894 174803464 173672125 173366226 173284712 173858126 175141037 178158564
3203 178158564 181613440 184299760 186151521 184861974 181292048 175388499 168798242 163419595
3195 163419595 159322474 156653437 154164223 153154296 152867876 153293152 154876769 156973116
3187 156973116 159589276 162141582 166760635 171080680 176195106 182087621 188687205 193070280
3179A93070280k810281j0300112j2900506j0833020q791111m818733l297119j635030
3171A37684368q54499o46070l71427n66098j010726j087123j810011j811401l97305
3162A29129708j132188j454J826700J303448J748819N77285K010803L059843M947952
3153A43470916P703417R889320J3158573J6270583J6918847J5736315P677610
3146B30825581j1819793k5193682k6263373j8960818j3713486r051356n977189
3139A19845884n153766l962730k885017j216309k078811j579104p75341K77291
3131A02472097J019202J295539R38238J767485Q61923Q59383k52169q46566j169203
3122A06945929P04345K189479L583541N193003P783654R025172Q508882P004651
$$ plain form
3179 193070280 190259999 179959887 167059381 156226361 147435250 142616517 139319398 137684368
3171 137684368 136829869 136183799 135812372 135246274 134235548 133148425 131338414 129527013 129129708
3162 129129708 127997520 127996066 129822766 131126214 132875033 133452318 135463121 138522964 143470916
3153 143470916 151174333 161063653 174222226 190492809 207411656 223147971 230825581
3146 230825581 219005788 193812106 167548733 148587915 134874429 125823073 119845884
3139 119845884 114692118 110729388 107844371 106628062 104549251 102970147 102194806 102472097
3131 102472097 103491299 104786838 105725076 107492561 108354484 109213867 108961698 108115132 106945929
3122 106945929 107650274 109839753 113423294 118616297 126399951 135425123 143934005 150938656
3114A50938656J6237p546963j1205700j0107113p187812n609093l875284k823500
3106A02599428l688654k039490k895924k356606j855703k534642j709657k501513
3098H3017239j448987j156825N5424O48357q22420j073462j215647p26203m90356
3089G6787120n60270m12781k37057M92847J364890J615917J808434K636851L178882
3080H6674833L142323J957582J532274j68332q76538p86171k684242l180628l113872
3071H2497229l284604k665771k380448k113867k050531j161305n92508j904337
3063F6343858j76347o6400m26202m3462q79414M91177R65187j94089Q31600Q5618
3053F6931526K13868J118532O35814J016057K184225J673696J826089R91836Q94949
$$ plain form
3114 150938656 150954893 143407930 132202230 122095117 114907305 109298212 105422928 102599428
3106 102599428 98910774 96871284 93975360 91618754 89763051 87228409 85518752 83017239
3098 83017239 81568252 80411427 80466851 81115208 80292788 79219326 78003679 77277476 76787120
3089 76787120 76226850 75814069 75577012 76069859 77434749 79050666 80859100 83495951 86674833
3080 86674833 89817156 91774738 93307012 93138680 92262142 91475971 88791729 85611101 82497229
3071 82497229 79212625 76546854 74166406 72052539 70002008 68840703 68248195 66343858
3063 66343858 66167511 66101111 65674909 65631447 64752033 65243210 66208397 66014308 66845908 66931526
3053 66931526 67145394 68263926 68899740 69915797 72100022 73773718 75599807 76591643 77486592
3044G7486592L73935R6855k31841j321340N893r29909L11964O46809j2370J480156
3034G7906744K565172J967807L386716L412247M535400N166514N026709M683710
3026A08651019K103715r32273k795394l075184m383923n283003l503744l761201
3018H7020012l305668j311215k651656r36987j202292j85201P77924L91538P52921
3009G9349376J418478J543698J724903K283674K172167K158951L434064N572661
3001I9657972M876958N940438O931078P606746R493345J0721914J0332529Q192585
2993A63753565L688441k465706r182985j2194673j1131269j1543329r392585p744424
2985A03787035o116368m370530l824739l066765k518269j273957r39010q49615
$$ plain form
3044 77486592 77860527 77957382 77725541 76404201 76410094 75480185 75792149 76438958 76426588 77906744
3034 77906744 80471916 82439723 85826439 89238686 93774086 98940600 103967309 108651019
3026 108651019 110754734 109822461 107027067 103951883 99567960 94284957 90781213 87020012
3018 87020012 83714344 82403129 79751473 78814486 77612194 77426993 78204917 78596455 79349376
3009 79349376 80767854 82311552 84036455 86320129 88492296 90651247 94085311 99657972
3001 99657972 104534930 110475368 117406446 125013192 134506537 145228451 155560980 163753565
2993 163753565 167442006 164976300 155793315 143598642 132467373 120924044 111531459 103787035
2985 103787035 97670667 93300137 89475398 86408633 83890364 82616407 81677397 80827782
2977H0827782p41957q89559k51796k84881m4881L37180J206794J695630K692661
2968H4546973K021110K257702K229746L416110L056106L787788L136481J932289
2960A06384305Q58796k029230l789115n090135n398809m528886l684083l630191
2952G9092652k333383k215484j450486r05552p00191O06018r88866j572628n86289
2943F8945791r30116p86458p2518j69323M87837n40430l30900N64184J428447
2934F8596514J065376J35451N15843k15949J148719L973N73780R52922N08771
2925G3285400J1928J631121P99813J70259Q90014R46634M65346J90941L39669
2916G8731125J53530J03450Q32628O06714R85313K42174o2107R27208J106554
$$ plain form
2977 80827782 80085825 79196266 78944470 78659589 78614708 78951888 80158682 81854312 84546973
2968 84546973 86568083 88825785 91055531 94471641 97527747 101315535 104452016 106384305
2960 106384305 107243101 105213871 101424756 96334621 90935812 86406926 82722843 79092652
2952 79092652 76759269 74543785 73093299 72187747 71487556 72093574 71104708 69532080 68945791
2943 68945791 68015675 67229217 67156699 66987376 67475213 66934783 66603883 67168067 68596514
2934 68596514 69661890 69797341 70313184 70097235 71245954 71249927 71823707 72776629 73285400
2925 73285400 73297328 74928449 75728262 75898521 76788535 77735169 78200515 78391456 78731125
2916 78731125 78884655 78988105 79820733 80427447 81412760 81654934 81592827 82520035 83626589
2907H3626589J236300J705831O88132K040891M132362K324666K489344K968758
2899A01212873L361419K429703J908686O36518j326459j198053m283465n066723
2891I7674499l465803l474568l178871j951585j775359o38880K8692j07582j51633
2882H2958910k8024J61163N59933J429419J321666Q75266J713140P11150R06616
2873I0609239M85963l0842J38707J22064N82596l65343j604367k357217j289462
2864H6291338j625745l044524l746788k636576k476416k893760k028431j082658
2856F6756440j070487k138593j887787j166730j082293L18932O6524p69897m93645
2847E8532464k22872q99614o85906j708606j014275l60904j757511j882246o68671
$$ plain form
2907 83626589 84862889 86568720 87256852 89297743 93430105 95754771 98244115 101212873
2899 101212873 104574292 107003995 108912681 109549199 108222740 107024687 102741222 97674499
2891 97674499 94208696 90734128 87555257 85603672 83828313 83189433 83218125 83110543 82958910
2882 82958910 82930886 83092049 83651982 85081401 86403067 87278333 88991473 89702623 90609239
2873 90609239 91095202 91064360 91203067 91325131 91907727 91542384 89938017 87580800 86291338
2864 86291338 84665593 81621069 77874281 75237705 72761289 69867529 67839098 66756440
2856 66756440 65685953 63547360 61659573 60492843 59410550 59729482 59796006 59026109 58532464
2847 58532464 58309592 57409978 56724072 55015466 54001191 53640287 51882776 50000530 49331859
2838D9331859j465220j888928j999373j808701j251498j581351j398634p22530
2830C7215624j051857j600889j156910n07143j43353Q52153l18668j349083j011333
2821C0928541p08002n75227m75792O88535j284232o56647r99064p47762k95267
2812B5875083j116618j031349l04234N86261q9311o28354j75750m29596j096374
2803B1589758R21962o23697n27799j026792n64032l70942p87419M17109q57652
2794A8170496N40179l40628n02129p66846J3003J6314j72198j541572k10015L69161
2784A5575765q02943M93952Q9982M54627m67228n20077p40711k28097J40188n74012
2774A3421446N6619o80609j52214R7312j098973K99241k07072J06559j27750l81261
$$ plain form
2838 49331859 47866639 45977711 43978338 42169637 40918139 39336788 37938154 37215624
2830 37215624 36163767 34562878 33405968 32898825 32755472 33607625 33288957 31939874 30928541
2821 30928541 30220539 29645312 29169520 29858055 28573823 27917176 26918112 26170350 25875083
2812 25875083 24758465 23727116 23422882 24009143 23919832 23291478 23115728 22686132 21589758
2803 21589758 22511720 21888023 21360224 20333432 19769400 19398458 18611039 19028148 18170496
2794 18170496 18710675 18370047 17867918 17101072 17114075 17130389 16958191 15416619 15206604 15575765
2784 15575765 14772822 15266774 15356756 15811383 15344155 14824078 14083367 13855270 13995458 13421446
2774 13421446 13478065 12797456 12645242 12742554 11643581 11942822 11735750 11842309 11714559 11333298
2764A1333298m16188n04146K17201k25956J46631J017743k19834o96040n79245
2755A0073464n07076P2403J097309J48497j24666q37427n72043p72755l80216
2746H197490j12508J204O4498N72921K1130j172698P24991l14430l08806L58100
2736H031892o3819M35105j220791n00060J94518M03322K4294r56109k4444N42281
2726F866189L10011p82007p44207R73158K01851m50359O1870r31827N33550o22964
2716E415265l35305Q08079j67448M5930m92239k74806M84583j92860l9622N93970
2706E845547M8691N76307p16881n16906O48201K20302o38822q23358l96598K55366
2696D501849K82651k04722j72745n93806K08606J35982K57681l57296M42017Q8005
$$ plain form
2764 11333298 10917110 10412964 10630165 10404209 10550840 11568583 11348749 10652709 10073464
2755 10073464 9566388 9638791 10736100 10884597 10759931 9922504 9350461 8577706 8197490
2746 8197490 8084982 8086186 8150684 8723605 8744735 7572037 8297028 7982598 7673792 8031892
2736 8031892 7968073 8403178 7182387 6682327 6876845 7280167 7304461 6348352 6323908 6866189
2726 6866189 7176200 6394193 5649986 6623144 6824995 6374636 6436506 5504679 6038229 5415265
2716 5415265 5079960 5888039 5720591 5766521 5274282 4999476 5484059 5291199 5251577 5845547
2706 5845547 5894238 6470545 5753664 5236758 5884959 6105261 5466439 4643081 4246483 4501849
2696 4501849 4784500 4579778 4407033 3813227 4021833 4157815 4415496 4058200 4500217 4588222
2686D588222l07431M2243j26773N1136K45755j87718M76437j03241q25179k56211
2676C597240o490R07300L15929o85615O0245k69255M2599Q3890k35855N4383q26458
2665C037913p10947O72016Q48840J64541r49721K9544q14951L12479O50264j46833
2655C093145P18501l90648j03152Q0274J71780Q0455j122174P45204k51640o47118
2645B374627L62988Q0684p80457J8563R3733J180610J66989m19658o29878M08633
2635B856834L31086m42139L6000K42123N07002m70289N63466l87790M3638r67193
2625B312738l0704l91296N46195L402q00402O36050J079859k28400q16692n04929
2615A805821P83124P36830o33277L14203o35570P81005K59482n24487J023220
$$ plain form
2686 4588222 4280791 4323034 4196261 4247397 4493152 4305434 4781871 4678630 3853451 3597240
2676 3597240 3590750 4498050 4813979 4128364 4188609 3919354 3961953 4045843 3809988 3864371 3037913
2665 3037913 2326966 2998982 3847822 4012363 3062642 3092186 2277235 2589714 3239978 3093145
2655 3093145 3811646 3420998 3317846 3398120 3569900 3650355 2528181 3273385 3021745 2374627
2645 2374627 2737615 2818299 2037842 2056405 2150138 3330748 3497737 3078079 2448201 2856834
2635 2856834 3187920 2745781 2781781 3023904 3530906 3060617 3624083 3236293 3279931 2312738
2625 2312738 2282034 1890738 2436933 2440335 1639933 2275983 3355842 3127442 2310750 1805821
2615 1805821 2588945 3325775 2692498 3006701 2371131 3152136 3411618 2887131 3910351
2606C910351k61554O88428m90826q84626L10093j033581N4912K99599L36141Q57412
2596C786349r94818L31769Q4050N73639J35795q17038l82954J97796R12579p92454
2586C034713p17799P35205L27092l0452J9066k98961o82544l40516J155585N84335
2576C785724j861959J99746J275357J87844p73673k85227k47340J11057J47387
2567B538916j36974n54565J48140J51828j44055M31037n41266J10065l53113j0758
2557A639255k02453L38246R0641j81262r15356L43537M80566n8044J31725k77078
2547A389777N8133o21269O87237P12205r6400l81436N42947N13570r3850o74930
2537B035984m46069j83400K50360O00268l20348l22099r48145n997J67385R7623
$$ plain form
2606 3910351 3648797 4337225 3846399 2961773 3271866 2238285 2293197 2592796 2928937 3786349
2596 3786349 2791531 3123300 3207350 3780989 3916784 3099746 2716792 2914588 3827167 3034713
2586 3034713 2316914 3052119 3379211 3348759 3367825 3068864 2386320 2045804 3201389 3785724
2576 3785724 1923765 2123511 3398868 3586712 2813039 2527812 2280472 2391529 2538916
2567 2538916 2401942 1847377 1995517 2147345 2003290 2434327 1893061 2003126 1650013 1639255
2557 1639255 1436802 1775048 1865689 1684427 769071 1112608 1593174 1535130 1666855 1389777
2547 1389777 1447910 826641 1513878 2226083 2129683 1748247 2291194 2804764 2710914 2035984
2537 2035984 1589915 1406515 1656875 2257143 1936795 1614696 666551 660554 827939 925562
2527I25562P48913m04364M62641k9569o43576J01953n3875N03441J23648q54092
2517H80682O393o06118J01926N89007k64063J06954k59487R97280K0120j040925
2507E31769O82095o383n00163K00770N99399m55364o08883L96119O5492L30033
2497A234884p48379l48152L84213r446m52362J01830P24516R1774r4248p89968
2487I4662L58448L49501l84609J32825K05174l50938n80037j12250K52488N03643
2477D68907k13167j30375j03829O79078L87181l84943m86115p17144Q51328R36046
2467A286967r12430N56267q46927L36822M94819o38523j22295P55193l34609k20950
2457C54334M03140l77704J82229N76926m12094j01972K08226M5480l67489l89842
$$ plain form
2527 925562 1674475 1270111 1732752 1703183 1059607 1161560 1107685 1611126 1734774 880682
2517 880682 887075 280957 382883 971890 707827 814781 555294 1552574 1572694 531769
2507 531769 1213864 1207481 707318 908088 1507487 1052123 443240 839359 904851 1234884
2497 1234884 486505 138353 522566 513120 60758 162588 887104 978878 884630 94662
2487 94662 453110 802611 418002 550827 756001 405063 -174974 -287224 -34736 468907
2477 468907 255740 125365 21536 700614 1087795 702852 216737 -500407 350921 1286967
2467 1286967 374537 930804 83877 420699 915518 276995 154700 909893 575284 354334
2457 354334 757474 379770 561999 1138925 726831 624859 833085 878565 511076 121234
2447A21234M24136K65600j57641q4014j09650N54164m95706L34211M55561p02713
2437F05182N90598q79924K23036K45507J54866J57168N30395k04012q16050m33815
2427A72951N69434o4996m8826K14808k04663k94521J5344J86814l23929L07269
2417E29685M3343p53735J97143p598J49644J86600L10589K71779p27981l41908
2407a42439J17486K26659q7733j8983o5038n40068j14251j4284l92280Q33673
2397a97258J23002M74757m20074L63985j59341l01414K0280j94813P88539L14678
2387H12341j687p70503j54950P48055j05222j73386N21540p11225M04544j94074
2377C75433n6364K34594j8530O34306p28922R575k7619l66481R96352Q8410N13449
$$ plain form
2447 121234 545370 810970 653329 569315 459665 1013829 518123 852334 1307895 605182
2437 605182 1195780 315856 538892 784399 939265 1096433 1626828 1422816 606766 172951
2427 172951 742385 677389 628563 843371 638708 344187 359531 546345 222416 529685
2417 529685 573028 -180707 16436 8838 158482 345082 655671 927450 199469 -142439
2407 -142439 -24953 201706 113973 94990 29952 -510116 -624367 -638651 -1030931 -197258
2397 -197258 -74256 400501 -19573 344412 185071 -116343 -96063 -290876 497663 812341
2387 812341 810654 40151 -114799 633256 528034 354648 876188 164963 569507 375433
2377 375433 319069 553663 535133 1169439 440517 450092 422473 55992 1052344 1140754 1654203
2366A654203J91306l090j90540r8769l53518m84137j009132L94877N13114K60415
2356H74729q2266m41348J34230o24075R0749l03549L74483K29684l6571j22690
2346I3376K69514J2131j65715K8626k63621L78674l11057K20361K36320m2071
2336D56538k0081J38592l01329R8520N59270J95508m11394m19298m37332l50016
2326d91022l75927K18408J467183q29920k38572K59771L84358R355M19192L96855
2316A219681l37953J79257L33463o08815j55079L82002M74594j000586q8328L19960
2306G18196o19161M91038l4101o375k62394L73679n07565j85893N19552K9437
2296E16413j46394N40419j74624j5712J67751k99742l48967M9777J007159j98281
$$ plain form
2366 1654203 1845509 1842419 1651879 1553110 1199592 715455 -293677 101200 614314 874729
2356 874729 792463 351115 485345 -138730 -47981 -351530 22953 252637 216066 93376
2346 93376 362890 375021 209306 237932 -25689 352985 41928 262289 498609 456538
2336 456538 436457 575049 273720 372240 931510 1127018 715624 296326 -141006 -491022
2326 -491022 -866949 -648541 818642 -11278 -249850 9921 394279 403634 822826 1219681
2316 1219681 881728 1060985 1394448 785633 630554 1012556 1487150 486564 398236 718196
2306 718196 99035 590073 555972 549597 287203 660882 153317 -32576 486976 516413
2296 516413 370019 910438 735814 720102 887853 588111 239144 288921 1296080 1097799
2286A097799q03825L04793Q1555L88844p9631j62456N07412r9357L42879L33973
2276A911986o35500m0841O7645m72263N51865J47242j65605K36997n37170M78811
2266A543167N6947K468m54139P7745m94790o11701L74960l56675M42805P36770
2256A317557K07476L82579k45579n93428K48638K22047N76142r71649l79922j95753
2246E68108L40511N22247O95906l63413J44540J76641l27445r4716L75851j51705
2236A886525n86147J056100n83391Q90245Q40849n97265L07904r07785K00063
2227B507098O08759r73869j19140k36936Q23518k59666L29793N52076n94765j65671
2217B471197J74989J79608j94618m79428J039243J050520l38750J32266l24766
$$ plain form
2286 1097799 293974 598767 680322 1069166 989535 827079 1334491 1235134 1578013 1911986
2276 1911986 1276486 1235645 1303290 831027 1382892 1530134 1364529 1601526 1064356 1543167
2266 1543167 1600114 1602582 1148443 1226188 731398 119697 494657 137982 580787 1317557
2256 1317557 1525033 1907612 1662033 1068605 1317243 1539290 2115432 1143783 763861 568108
2246 568108 908619 1430866 2126772 1763359 1907899 2084540 1757095 1662379 2038230 1886525
2236 1886525 1300378 2356478 1773087 2663332 3504181 2906916 3214820 2307035 2507098
2227 2507098 3115857 2141988 2022848 1785912 2609430 2349764 2679557 3231633 2636868 2471197
2217 2471197 2646186 2825794 2631176 2151748 3190991 4241511 3902761 4035027 3710261
2208C710261n96995L40477L5985j30131l22619k27263J016191k49761M27532k00451
2198C803226K61209N30952j105335N43409J673171j061577k85698q06882P19338
2189D271813K29244k1536N92655K66800M3592M23535p38741J56100P60519R18347
2179F902328p22389j321196K0634M53279O69625O54283r0321L13178R470R29080
2169G817971P98278l6933O38286q53993K72045L94444L96726L21683j50201k47024
2159I351282q0407K74927N06186J96182K46902m56314K83203O34449M59501M84679
2149A1900590O89820L4977Q95182K37944J335090k34148K83110J701258J64315
2140A7008138j8889J077406M18915M73725N36083M1113L02299J230479J089881
$$ plain form
2208 3710261 3113266 3453743 3489728 3359597 3036978 2809715 3825906 3576145 4003677 3803226
2198 3803226 4064435 4595387 3490052 4033461 5706632 4645055 4359357 3552475 4271813
2189 4271813 4501057 4479521 5072176 5338976 5382568 5806103 5067362 5223462 5983981 6902328
2179 6902328 6179939 4858743 4879377 5332656 6002281 6656564 6566243 6879421 6888891 7817971
2169 7817971 8616249 8579316 9217602 8363609 8635654 9030098 9426824 9748507 9598306 9351282
2159 9351282 9270875 9545802 10051988 10248170 10495072 10038758 10321961 10956410 11415911 11900590
2149 11900590 12590410 12625387 13520569 13758513 15093603 14859455 15142565 16843823 17008138
2140 17008138 16989249 18066655 18485570 18959295 19495378 19536491 19838790 21069269 22159150
2131B2159150R19757J021927R63526N37656O43661N02047K23359J367404J030748
2122B9369235R69996J403965K244705J357019J252847K310271L060727M353853
2114D6322618M538751L533454M710596L153059K329215L824494M528519N902796
2106G8843502Q104968J0520500J3271072J8104196K4018579L0964584M0317654
2099B24145055M8110640M6306340M3307297k4279224p6887335o8322727m7062416
2092A45317630k8843334k0631926j4222961j2028115q784326p336621m645699
2085D8824648m669358k357607j684608o10695k824704l838047l802507k036800
2077B7000322j728757j910324r78169n60131j384154j255453j232380q62097j115135
$$ plain form
2131 22159150 23078907 24100834 25064360 25602016 26245677 26747724 26971083 28338487 29369235
2122 29369235 30339231 31743196 33987901 35344920 36597767 38908038 41968765 46322618
2114 46322618 50861369 54394823 59105419 62258478 64587693 68412187 72940706 78843502
2106 78843502 86948470 97468970 110740042 128844238 152862817 183827401 224145055
2099 224145055 272255695 318562035 361869332 337590108 260702773 192380046 145317630
2092 145317630 116474296 95842370 81619409 69591294 60806968 53470347 48824648
2085 48824648 44155290 41797683 40113075 39502380 36677676 32839629 29037122 27000322
2077 27000322 25271565 23361241 22383072 21822941 20438787 19183334 17950954 17088857 15973722
2068A5973722j195652j007981j64629l29528q67972l10864r6580o17658o01972
2059A0780886k32628l59893o88620p94768j17759L02609j086670M37209l49244
2050G891122m34833o7023l21605o51272j10082p68008n04808j51573P94037j1652
2040E664303Q8522o70313p85608J36767R9462J2507L1379r54759j17020N79271
2030D084511M44346n72460K93587R7659l12212l25486j68729m09126K87225j95943
2020C223372k69683q69195L52096L20745k01092k35119n40850K87452K25766j5358
2010B278134j54301L0572j39654k26539N28403J77299o62633J022229J7006j133877
2000A736639o46285J230877J85890j059955p77679R09876j82273o34731k67534
$$ plain form
2068 15973722 14778070 13770089 13605460 13275932 12407960 12097096 12000516 11382858 10780886
2059 10780886 10548258 10188365 9499745 8704977 8587218 8889827 7803157 8240366 7891122
2050 7891122 7456289 7389266 7067661 6416389 6306307 5538299 5033491 4881918 5675955 5664303
2040 5664303 5752825 5082512 4296904 4433671 4533133 4545640 4577019 3622260 3505240 4084511
2030 4084511 4528857 3956397 4249984 4347643 4035431 3709945 3541216 3132090 3419315 3223372
2020 3223372 2953689 2084494 2436590 2757335 2556243 2321124 1780274 2067726 2293492 2278134
2010 2278134 2123833 2154405 2014751 1788212 2316615 2493914 1831281 2853510 2870516 1736639
2000 1736639 1090354 2321231 2507121 1447166 669487 1579363 1397090 762359 494825
1991D94825J622217k86167n0304K89630p24861O35226m67857o17800K17327o03446
1981E08790L24008j0283r0632o3859J10620R75164k97232k90578J5352K93272
1971A474622M74608J0045N27031q80288m94967K81610K49750k76607J91775l47324
1961A210255J60972n44136l29942J76638J57780N8963j51857r3843O7259m38730
1951B73359N05493l2994r95913j47981L7100N37996q2683L96791K82597n31779
1941B41986k87236L20764j96722P50781O7015R6972l62169o047L61149m42019
1931E44474o20274m32648N21702L87536M82055r32949O46096k58541j5061k79041
1921D3349M00053L48083M41326M82154j215731k8999J59727K79932K7646m59616
$$ plain form
1991 494825 2117042 1830875 1780571 2070201 1345340 1980566 1512709 894909 1112236 508790
1981 508790 832798 822515 731883 668024 778644 1753808 1456576 1165998 1181350 1474622
1971 1474622 1949230 1959275 2486306 1606018 1111051 1392661 1642411 1365804 1557579 1210255
1961 1210255 1371227 827091 497149 673787 831567 890530 738673 644830 712089 273359
1951 273359 778852 745858 -250055 -398036 -360936 177060 94377 491168 773765 241986
1941 241986 -45250 275514 78792 829573 896588 993560 631391 625344 986493 544474
1931 544474 -75800 -508448 13254 400790 882845 -50104 595992 337451 322390 43349
1921 43349 443402 791485 1232811 1714965 499234 470235 629962 909894 937540 477924
1911D77924R4735j36714n35398P93023m52369k10167O1463k16451j746L24790
1901A99090M38609l00810j22224L42956k11582k08727M93284k19395R3206L95571
1891H99978J26017j417949q6212J174418m19064k6388l11689P5569L68786K98984
1881F82450J10619o46076j71708L2473K65098M66689k03713O562K03441k37472
1871E08363j51845J48572k38576N3262k33298p1020q5682O18906K84008l75682
1861D57008n91743L46545m2329n13496o6904N21368j16417n854M82110j42015
1851C28273n45350L31409m29994j25050J08173N53461k6934k65772K23074l80024
1841b28734j15393M47289j67923O76257l50513n75614M74878O07832j56159o0160
$$ plain form
1911 477924 572659 435945 -99453 693570 241201 31034 92497 -123954 -125700 199090
1901 199090 637699 336889 214665 557621 346039 137312 630596 411201 504407 899978
1891 899978 1025995 -391954 -478166 696252 277188 250800 -60889 14680 383466 682450
1881 682450 793069 146993 -24715 7758 272856 739545 535832 542394 745835 508363
1871 508363 356518 505090 266514 319776 86478 15458 -70224 548682 832690 457008
1861 457008 -134735 211810 169481 -344015 -410919 110449 -5968 -11822 470288 328273
1851 328273 -217077 114332 -315662 -440712 -332539 220922 193988 -71784 151290 -228734
1841 -228734 -344127 103162 -64761 611496 260983 -314631 160247 768079 611920 551760
1831E51760J142496J84687o24220J054389Q37860p81824j353561K90459r86210
1822C15836k63847N7954j09536P95950K33061m10000p03419j01960j76226Q17547
1812D55360K60318J78757j50709q51667l62864P40613o86860j04867J310475M95934
1802A284490q40637j31845R850o88969K79549L57045j148225Q4263j74857J614027
1792F44691J78145o80270m95993k16014o5431P06914O37755n8032J73036k57616
1782E67185M41223l81333p4604p6312L05791j90075L8798j00252j033303K96739
1772b06143L89477L49244k51167R5472j276078o06993J143893L60403Q31587n08041
1762C21654n69807k44257J92051k12768j065342P01387L00501J57789R65867J18932
$$ plain form
1831 551760 1694256 1878943 1254723 2309112 3146972 2365148 1011587 1302046 315836
1822 315836 51989 109943 407 796357 1029418 619418 -84001 -185961 -362187 455360
1812 455360 715678 894435 743726 -107941 -470805 269808 -417052 -521919 788556 1284490
1802 1284490 443853 312008 321858 -367111 -87562 269483 -878742 -794479 -969336 644691
1792 644691 822836 142566 -353427 -569441 -634872 72042 709797 651765 824801 567185
1782 567185 1008408 627075 552471 476159 781950 591875 630673 530421 -502882 -206143
1772 -206143 183334 532578 281411 376883 -899195 -1506188 -362295 -1892 829695 321654
1762 321654 -248153 -492410 -300359 -513127 -1578469 -877082 -576581 -418792 547075 666007
1752F66007k96126P96379n34690l74236J90497m47271q36931J84895J27255J66932
1742c57289O24712l8980l14478N6806J14783l93405L11055m19275M43316N87895
1732F15140R4795K34281o82061M70009L84116m11469m17379j30681j06635m86557
1722d36441L2391L15846J79183k09497n61503M79203Q8840K99211m48334K35174
1712b5927Q04586k93897p37726N233l12347K59085N16106J3708j025213k8511
1702h24903M64118j54174L42137n26427k10525N45183R60000q00649l5022O24432
1692C84170l35852j09560O00658k05456r86705m73206J086974J42726M68881m83343
1682H9287j4818n75728k075J93290O55101m8939N53605p31233j11053J94248q85847
$$ plain form
1752 666007 369881 1166260 631570 257334 447831 560 -836371 -651476 -524221 -357289
1742 -357289 267423 228443 -86035 -29229 85554 -307851 3204 -416071 27245 615140
1732 615140 709935 944216 262155 732164 1116280 704811 287432 156751 50116 -436441
1722 -436441 -404050 -88204 90979 -118518 -680021 -200818 -111978 187233 -261101 -25927
1712 -25927 778659 484762 -252964 -247731 -560078 -300993 215113 228821 -796392 -824903
1702 -824903 -360785 -514959 -172822 -699249 -909774 -364591 595409 -205240 -240262 384170
1692 384170 48318 -61242 539416 333960 -652745 -1125951 -38977 103749 572630 89287
1682 89287 74469 -501259 -503334 -310044 345057 296118 849723 118490 7437 201685 -684162
1671f84162K62651k5947Q92001j13192j198094n9078M81371O22117K5999m86003
1661b82337K55463n98889L12998p78423N01141O81060j79252N12573J21446K84691
1651H30471j081777P07593k31918J89000K03549m20193l34701k18913M8603O87381
1641C79095o33601P1380m62248N75442M23706m7042Q0884p60364Q31269j310712
1631h52191j07740L62138J20332M14461m84341p21491K20062N89944j17895p11147
1621a287868L96459k8503L89525J40411j16780k86271p5402L35106P90190J25725
1611C82592r37K384m1643L516m76977j89311O52003r25667P07774l79923m12809
1600f78998q9719L02668N58690J66019M66037K86520q43611m54813j41704M34925
$$ plain form
1671 -684162 -421511 -447458 444543 331351 -866743 -925821 -444450 177667 203666 -282337
1661 -282337 -26874 -625763 -312765 -1091188 -590047 91013 -88239 424334 545780 830471
1651 830471 -251306 456287 224369 413369 616918 196725 -137976 -356889 -308286 379095
1641 379095 -254506 -183126 -645374 -69932 353774 306732 387616 -372748 458521 -852191
1631 -852191 -959931 -597793 -477461 -63000 -547341 -1268832 -1048770 -458826 -576721 -1287868
1621 -1287868 -891409 -919912 -530387 -389976 -506756 -793027 -868429 -533323 256867 382592
1611 382592 381655 384039 342396 345912 -131065 -320376 331627 -594040 113734 -266189 -678998
1600 -678998 -768717 -466049 92641 258660 724697 1011217 167606 -287207 -428911 6014
1590F014l91039q87216R07023n23236N59362O98642l60706o33525k25097P26967
1580a22811Q21310o4856q20618m94148P78704N9889k26460o01578N43740j143
1570a27971j25853q0530k15266P91816k34947O17790o81166j21315Q63339n61323
1560A24574O7465K95060n61940j55313n3008P80789j84996n68051l84581n56594
1550a196595J284282K42957m30328K99163k27843J84761n98640o20343R31959
1541a30627O6954q8295j25450P98481l43633q66321M62212O56139o82380P06242
1531D53322R33534j038075k84205l25669N29368o4276n37457Q14026J47206M3004
1521F70778p43488N84163k30348J73037m12810j422568R15269Q34257O05609L47096
$$ plain form
1590 6014 -385025 -1272241 -365218 -888454 -329092 369550 8844 -624681 -849778 -122811
1580 -122811 698499 633643 -186975 -681123 97581 157470 -68990 -670568 -126828 -127971
1570 -127971 -253824 -334354 -549620 242196 7249 625039 -56127 -177442 685897 124574
1560 124574 192039 487099 -74841 -230154 -283162 497627 312631 -255420 -640001 -1196595
1550 -1196595 87687 330644 -99684 199479 -28364 156397 -442243 -1062586 -130627
1541 -130627 -63673 -151968 -277418 521063 177430 -688891 -226679 429460 -252920 453322
1531 453322 1386856 348781 64576 -261093 268275 203999 -333458 480568 627774 670778
1521 670778 -72710 511453 281105 454142 41332 -1381236 -465967 368290 973899 1320995
1511A320995n26736k25240J22185o13150J04361j27757n8347m88128Q6968P2874
1501c31975N56502m26932l37185l46754M23307p0317J65049L72923J13318k33215
1491a15279p45028N14689N4385N04075k9071K91561m23110k23491N5437O26910
1481E11078p23171n92875J10328P64263L74597p62538N83L9115m29773R07377
1471A98984m51755J27674N13959n43695L30562n61904o72769M41977M08568K53112
1461D4713L8251L07182l24714j77784n69961o40037R45628L70690K46865m88753
1451b47920l03959K66411Q8954k51881j84544K6214O28313o23471R2639L59739
1441a49505k94229N28201J585l52556m53980R7092Q28248N4271k86532j0795m94072
$$ plain form
1511 1320995 794259 569019 691204 78054 182415 54658 -3689 -491817 -404849 -331975
1501 -331975 224527 -202405 -539590 -886344 -463037 -533354 -368305 4618 117936 -115279
1491 -115279 -860307 -345618 -291233 212842 183771 475332 52222 -171269 -115832 511078
1481 511078 -212093 -804968 -694640 69623 444220 -318318 -317735 -278620 -708393 198984
1471 198984 -252771 -125097 388862 -154833 175729 -386175 -1058944 -616967 -208399 44713
1461 44713 82964 390146 65432 -112352 -682313 -1322350 -376722 -6032 240833 -247920
1451 -247920 -551879 -285468 -196514 -448395 -632939 -606725 21588 -601883 -509244 -149505
1441 -149505 -443734 84467 86052 -266504 -720484 -623392 204856 259127 -27405 -38200 -532272
1430e32272P71132l09017L98049O24021j59566q64527l28122K08919o30186K11274
1420f10295l07045j03654L12363M02200j11845l81192K98951L61461K12377K50723
1410C24044q51470L0860J69340M44006R3817k47885l47392L25220n42927K07447
1400c94940O80757m6629K4593Q4188j012971p13607P31194j88591k38457M55820
1390f18643N56351L99097k7235N2473m39567j66840L20990J44467l1773M45129
1380F34449k89241j070917K02875K51500P08455J21833n30875m14036Q98859J60729
1370F73631J72687o31259j37008M92915o36993r6835n1493J97301k07434n11026
1360g35514K88601J551609N36233P6642j425809K71988o22248j013272J409023
$$ plain form
1430 -532272 238860 -70157 327892 951913 792347 -72180 -400302 -191383 -821569 -610295
1420 -610295 -917340 -1020994 -708631 -306431 -418276 -799468 -500517 -139056 73321 324044
1410 324044 -527426 -496566 -327226 116780 210597 -37288 -384680 -59460 -602387 -394940
1400 -394940 285817 239188 263781 347969 -665002 -1378609 -647415 -836006 -1074463 -618643
1390 -618643 -62292 336805 309570 362043 -77524 -244364 76626 221093 189320 634449
1380 634449 345208 -725709 -522834 -271334 437121 558954 28079 -385957 512902 673631
1370 673631 846318 215059 78051 570966 -66027 -162862 -214355 -17054 -224488 -735514
1360 -735514 -446913 1104696 1640929 1717571 291762 563750 -58498 -1071770 337253
1351C37253j64098n78249P7943j17844O62246O0325r34813r98420P34529N41477
1341c79651o35161J243121J087384P2809J61446n36872l98754q09436l93797P70447
1331A81536k85915n0694j32764P46366k9181l71956M10701L65385m56035n43292
1321a65849p8313k88926o75799Q3750J55783k3353k2477M60708Q4536K08771K81666
1310B0497j26271j91563n30343k73241J69444O44695N94373k20565j53210q9131
1300a55315N35755J95231o19983p28667l87225K50596L44966m49361N89988L0316
1290c93699N62686J15918j040297N13699M3821p3378O61599J71646Q11p75136
1280b12330j57104J37728Q4155L61725J17340P4934k17262k5382j58882j95075
$$ plain form
1351 337253 173155 -405094 -327151 -444995 217251 277576 -657237 -1655657 -921128 -379651
1341 -379651 -1014812 228309 1315693 1388502 1549948 1013076 614322 -195114 -588911 181536
1331 181536 -104379 -155073 -287837 458529 429348 57392 468093 833478 377443 -165849
1321 -165849 -244162 -533088 -1208887 -1125137 -969354 -992707 -1015184 -554476 -469940 -261169 20497
1310 20497 -105774 -297337 -827680 -1100921 -931477 -286782 307591 87026 -66184 -155315
1300 -155315 380440 575671 -44312 -772979 -1160204 -909608 -564642 -1014003 -424015 -393699
1290 -393699 168987 284905 -755392 -241693 -197872 -271250 390349 561995 562806 -212330
1280 -212330 -369434 -231706 -147551 214174 331514 406448 189186 163804 4922 -190153
1270a90153R31573K91823q36519k41807m36182L8269J36091J4787K38706j99757
1260b53169L6476J87581k9312Q24814j04654n80463j20629K31055o0700j37929
1250f930K36015Q1532n60216J6928j45405M47382m67093j51383o62989R22627
1240b89532P59160q45401m8999k39263K42078n48561N35438J26957o3994j84829
1230e56946l26625P18004M50244M11056m96495K79329N23677j058802m02763n3037
1220e12358l7790P97462j32752k9027K63984j3228L47069m50475p12817J58510
1210c21422Q49309J35618o03570N8116K13716k65836j98085o3067P24302j16074
1200D13007q93123Q29364j029540N32499o3201k34799L32523q13860q1912R29525
$$ plain form
1270 -190153 741420 1033243 196724 -45083 -481265 -442996 -306905 -292118 -53412 -253169
1260 -253169 -216693 -29112 -58424 766390 661736 81273 -39356 191699 130999 -6930
1250 -6930 229085 310617 -249599 -232671 -378076 69306 -397787 -549170 -1212159 -289532
1240 -289532 469628 -375773 -424772 -664035 -421957 -970518 -435080 -308123 -372117 -556946
1230 -556946 -883571 -165567 284677 695733 199238 478567 1002244 -56558 -459321 -512358
1220 -512358 -550148 247314 114562 85535 349519 336291 683360 232885 -479932 -321422
1210 -321422 527887 663505 59935 118051 331767 65931 -132154 -195221 529081 413007
1200 413007 -480116 349248 -680292 -147793 -210994 -445793 -113270 -927130 -1009042 -79517
1190g9517O12771M3211J15786o95193O07677q99535L20534k24266J87557J02238
1180I1263k59864K28957j036958k78544O03712M80652K07932j911n69712N91080
1170E6607N0451L02258M27714l20146J83768j398896O03782J28535k21482L23595
1160A36186l62316P38050o6016j026457M65795Q27154j04687o37794p4202L77956
1150B73669n09230K4080J00685k40943J14006K04081O79642R8252q11927L55722
1140B88037O41063n61800o91289M5353j36288k41852k69278K22012j23283L79442
1130d47883L94715n02818j2206R92276j57013k69386L85796q505k70138Q93198
1120I98036p89121l82390M23274l36562P42318j19844p247k21247K6524O10738
$$ plain form
1190 -79517 533254 576465 692251 -2942 604735 -294800 25734 -198532 -10975 91263
1180 91263 -168601 60356 -976602 -1255146 -651434 -170782 37150 35239 -534473 56607
1170 56607 107058 409316 837030 516884 700652 -698244 -94462 34073 -187409 136186
1160 136186 -226130 511920 445904 -580553 -114758 712396 607709 -30085 -104287 273669
1150 273669 -235561 -211481 -110796 -351739 -237733 -33652 645990 744242 -67685 288037
1140 288037 929100 367300 -323989 -278636 -414924 -656776 -926054 -704042 -827325 -447883
1130 -447883 -53168 -555986 -568192 424084 267071 -2315 383481 374976 104838 998036
1120 998036 208915 -173475 249799 -86763 655555 535711 528464 307217 333741 944479
1110I44479M7595l63913p91907M2049N18121n98397k43349L08993m53743N79324
1100a0748m82283o84058J353066M3506l0902N80198p7778p25650J32520k92385
1090a94514l02962K39763M24890j27565N77180m48587j17287O35056l23277o01101
1080b38404l68787N2853K13960Q9092j85588j05746l13572M52987j21162J50565
1070c73802L87095m63377M02404L36540L82354j43671M580J29000o57710L80694
1060C84107m07192O83161l23386L46051j95519j211502n11065N09734R72040m84822
1050b38393K20410j66838n13284P66454K09440L04457j15155j26344P3097l79129
1040C4715J69714j28798P36282J65874l28520m88471P1840l6440j20321n21391
$$ plain form
1110 944479 992074 628161 -163746 -121697 396424 -201973 -445322 -136329 -590072 -10748
1100 -10748 -493031 -1177089 175977 219483 188581 768779 691001 -34649 97871 -194514
1090 -194514 -497476 -257713 167177 39612 616792 168205 50918 685974 362697 -238404
1080 -238404 -607191 -554338 -340378 -251286 -436874 -542620 -856192 -403205 -524367 -373802
1070 -373802 13293 -450084 -47680 288860 671214 527543 532123 661123 3413 384107
1060 384107 -23085 660076 336690 682741 487222 -724280 -1235345 -725611 246429 -238393
1050 -238393 -17983 -184821 -698105 68349 277789 582246 467091 340747 413844 34715
1040 34715 204429 75631 811913 977787 649267 160796 232636 196196 75875 -445516
1030d45516P13483n71884j030618J093970M14929N4162k2231K17853n83877p71148
1020i30877L17743j899Q43002k95575J77825k59519k30584K10348k29390R28142
1010E29216o20759k40131O34728l93656m28600N72524j37069l52489K97995O91187
1000E52946P08992L6443r12295m37499m4613N22363r4026o2493k65808K90719
990B94729K6831m84482J18286k28083Q88851l21271J4824L71844n50519m45321
980c14311M76341k4361K27321n1280K86495k72399j016806L87009m13386J60187
970e55190O13144k92920k2390k64899P24599J39870q2796R69350j241130P1187
960E8825M88734R8395r71551j65959J02527N66454K26075m98435j14437k60261
$$ plain form
1030 -445516 267967 -303917 -1334535 -240565 174364 228526 206295 424148 -159729 -930877
1020 -930877 -613134 -615033 227969 -67606 110219 -149300 -379884 -169536 -398926 529216
1010 529216 -91543 -331674 303054 -90602 -519202 53322 -83747 -436236 -138241 552946
1000 552946 1261938 1298381 386086 -51413 -96026 426337 332311 269818 4010 294729
990 294729 321560 -162922 -44636 -272719 616132 294861 309685 681529 131010 -314311
980 -314311 162030 137669 364990 313710 600205 327806 -689000 -301991 -715377 -555190
970 -555190 57954 -234966 -257356 -522255 202344 342214 259418 1228768 -12362 58825
960 58825 547559 645954 -325597 -491556 -389029 177425 403500 -94935 -209372 -469633
950d69633P05080r55724j07214L53969m75317O36185l2032l31082L16764L40997
940a8007M43870o77254k83603O64545n14064N35007j35524R0531J71668p4802
930B02367m20749l52785M03885O95793m18533p16011r3423K65644P08164O16488
920H90840M22987p53665j39701R8991m76395J53085J41740J97917m7292p18084
910b29577k321K51463k90121N34002j67229o56120K69082M49926P21730m95425
900C85410J32133j033126M78574n7152m66521P73209o29688j9621l9927r1670
890e68379p1020p45585K49461K31375O48729k70805m64781Q65104P36751J20246
880G31096K58952J1058m64307j85554l15878r008n6928q14905O96495l2233N99682
$$ plain form
950 -469633 235447 -720277 -827491 -473522 -948839 -312654 -344686 -675768 -359004 -18007
940 -18007 425863 -251391 -534994 129551 -384513 150494 14970 105501 277169 202367
930 202367 -218382 -571167 -167282 528511 109978 -606033 -699456 -433812 274352 890840
920 890840 1313827 560162 420461 519452 43057 196142 337882 535799 488507 -229577
910 -229577 -231898 19565 -270556 263446 96217 -559903 -290821 159105 880835 385410
900 385410 517543 -515583 -37009 -94161 -560682 212527 -417161 -436782 -476709 -568379
890 -568379 -639399 -1384984 -1135523 -904148 -255419 -526224 -991005 -125901 610850 731096
880 731096 990048 1001106 536799 351245 35367 26359 -30569 -845474 -148979 -181212 418470
869D18470R16021o49682M68686l77820j62075m99493o53748O78801K0424j0755
859A48829P89412j0194K42548j218255K70520M03533L27141K79314p54563R9277
849E77562m23772K0786L06715l14267k90903M58899l22070J1948o82169L72447
839b84824R33843N6328o20352l88321l18203M01937j92832p30967J05752j97746
829a235385J782364R0959n73556l02496k86214M50581M97851J35964J29599l55435
819C34232l30146R3458j94953k76621K92800J61291k90495o29057j08502K68605
809f79388K54258j17079J046129K59364m97673M74255M8038n21817q34736j84341
799g52990N45380K22057n3253K23026J39838L51497j198208k04454J030708k89469
$$ plain form
869 418470 1334491 684809 1153495 775675 613600 114107 -539641 139160 159584 148829
859 148829 938241 928047 1170595 -47660 222860 626393 953534 1232848 478285 577562
849 577562 153790 174576 481291 167024 -123879 335020 12950 24898 -657271 -284824
839 -284824 649019 705347 84995 -303326 -621529 -219592 -412424 -1143391 -1037639 -1235385
829 -1235385 546979 637938 64382 -238114 -524328 -73747 424104 560068 689667 334232
819 334232 4086 97544 -97409 -374030 -81230 80061 -210434 -839491 -947993 -679388
809 -679388 -425130 -542209 503920 763284 265611 739866 787904 266087 -568649 -752990
799 -752990 -207610 14447 -38806 184220 324058 675555 -522653 -727107 303601 14132
789A4132N54536q16921r74883J455878l46483p11799l15473R69969O35873L290
779D68119q33700k84897N364O94081M40203M31134m68317m70454P4834k23598
769a67231J45690J25344o28688L64140J50628l10806M74465J31377O09911j004764
759a09934M52853q15668M6849Q48245n96154J80880k76069n294l76918l3155j49663
748h34028m1907K60430Q89666o44802m38814p7215j31401M27579L4054Q19120
738B62682p94047L4347Q13650P9258m7986k86305n42618N95186l39071L43278
728A18374K62798k71424O41800j14943j38418J01629r78256m12661j47957P02846
718b36212N55118j28011l83272j63548n2288J276735Q04592q02637J19094j3494
$$ plain form
789 14132 568668 -248253 -1223136 232742 -113741 -825540 -1141013 -171044 464829 468119
779 468119 -365581 -650478 -645114 48967 489170 920304 451987 -18467 56367 -167231
769 -167231 -21541 103803 -524885 -160745 -10117 -320923 153542 284919 894830 -109934
759 -109934 342919 -472749 -425900 422345 -173809 7071 -268998 -274292 -651210 -684365 -834028
748 -834028 -875935 -615505 274161 -370641 -809455 -886670 -1018071 -590492 -556438 262682
738 262682 -531365 -497018 316632 395890 347904 61599 -481019 114167 -224904 118374
728 118374 381172 109748 751548 636605 498187 599816 -378440 -791101 -939058 -236212
718 -236212 318906 190895 -192377 -355925 -408213 868522 1673114 870477 989571 976077
708I76077l49090l97746k24355m93969k93207R69871M0694l49669k21460K10244
698a32610o48886N90730l6075O9989Q00315k94659r20552L78926K81021J3679
688A01878J14372l76587k52094l91545J52703M42023N76364k79298p8083J93140
678B02873k20384N8496k76278N0733j67893Q1020Q11054q43603K7696j052560
668a328846M95219O35007K25862L10813k69474j28164p3663k49134R98130K71631
658H87381l64784p84602N29941L68419l2310o7030M9887m53861K47807k90012
648I0836n7058K23212J99080r921O76115m12939q61018m03471M23967k20145q3042
637d34384L30330N3918J094602q83400o60399j36867m63287L86154M65313l31449
$$ plain form
708 976077 626987 229241 4886 -489083 -782290 187581 228275 -121394 -342854 -132610
698 -132610 -781496 -190766 -226841 -156852 643463 348804 -571748 -192822 88199 101878
688 101878 216250 -160337 -412431 -803976 -651273 -209250 367114 87816 9733 202873
678 202873 -17511 40985 -235293 -184560 -352453 -271433 539621 -303982 -276286 -1328846
668 -1328846 -833627 -198620 27242 338055 68581 -59583 -133246 -382380 615750 887381
658 887381 522597 -262005 267936 636355 604045 537015 586902 133041 380848 90836
648 90836 33778 256990 456070 446149 1122264 709325 -151693 -555164 -131197 -351342 -434384
637 -434384 -104054 -50136 1044466 161066 -499333 -636200 -1099487 -713333 -248020 -579469
627e79469M76837J89465J22053j73945m17270j63818P83459k55233L17403r80047
617f80565J39474R6883N99033J14931n79570m34827K42469j38643M25707m49529
607f64637j14290M92096m17213l52434n891O86208J928K80544r3537J35931J46049
596I4754k09755n7053Q78111j13603J05453k81406j59537J67564j52551K61865
586E33842j19240j63471l6469l24136p06861m25354Q69625o44138n16559N20774
576a011987J324511k54958m17893j10746K71205o00725N44337K61201j363674
567a358729L57103P8824L76667J65509q70389N31653M45738m4422K38350p54353
557h34049j29258Q55495Q02410J39310k07300l64963M61925J15029J9399p11491
$$ plain form
627 -579469 -102632 86833 208886 34941 -382329 -546147 237312 -17921 299482 -680565
617 -680565 -541091 -444208 154825 269756 -309814 -744641 -502172 -640815 -215108 -664637
607 -664637 -778927 -286831 -704044 -1056478 -1062369 -376161 -374233 -93689 -187226 -51295 94754
596 94754 -115001 -172054 706057 592454 697907 416501 256964 424528 271977 533842
586 533842 414602 251131 214662 -109474 -816335 -1241689 -372064 -1016202 -1532761 -1011987
576 -1011987 312524 57566 -360327 -471073 -199868 -800593 -256256 4945 -1358729
567 -1358729 -1001626 -922802 -546135 -380626 -1251015 -719362 -273624 -318046 -79696 -834049
557 -834049 -963307 -107812 694598 833908 626608 261645 723570 838599 857998 146507
547A46507j9963K60482l63248k37022l56004J46775P03474L26286P7513K36758
537I21558J54396j113763k80642J59306k61281N04089m60375l74477Q05829M78417
527E33057n70368m9125q84038Q78712k07839k69302O66872j211370L0895M48941
517f33565q5101m62601Q85306N0750N91767m137R83099l60230J68783O012j46150
506I93933o62613j067388N70043r2459n6378l52252m67809Q98838l2236K43656
496b4665O59283n03229m91049K05004P72748N6080n80843N64736q60788p89897
486i92620J0457j31620N11591J4675N2943k30571K04590R19263J253947j273220
476C39435l62719q40601O1704P2987j99381M14935N91993k66082l45526j2722
$$ plain form
547 146507 126544 387026 23778 -213244 -569248 -422473 281001 607287 684800 921558
537 921558 1075954 -37809 -318451 -159145 -420426 83663 -376712 -751189 54640 533057
527 533057 -37311 -86436 -970474 -91762 -299601 -568903 97969 -1113401 -1082506 -633565
517 -633565 -718666 -1181267 -295961 -245211 346556 342419 1325518 965288 1134071 1140083 993933
506 993933 331320 -736068 -166025 -258484 -314862 -667114 -1134923 -236085 -268321 -24665
496 -24665 634618 131389 -359660 -154656 618092 674172 93329 658065 -202723 -992620
486 -992620 -982163 -1113783 -602192 -587517 -534574 -765145 -560555 358708 1612655 339435
476 339435 -23284 -863885 -802181 -729194 -928575 -513640 78353 -187729 -533255 -545977
466e45977k10882n6324k69203M58711L33411P67192l90610j30829l06961L48455
456c017J111061j284553m07552K00942n9645k1100N89260K29042K67212l31071
446B90579k46740l95671N07464M86459l53821j2417k55753M61683J79226n36931
$$ plain form
466 -545977 -756859 -813183 -1082386 -623675 -290264 476928 86318 -44511 -351472 -3017
456 -3017 1108044 -176509 -584061 -383119 -442764 -463864 125396 354438 621650 290579
446 290579 43839 -351832 155632 642091 288270 275853 20100 481783 661009 124078
$$ [...]
##END NTUPLES=NMR SPECTRUM
##END=
