##TITLE=1H_EC-3302(III-3)
 CDCl3
 8 sc, 
 31.10.2023
##JCAMPDX= 6.0         $$ Bruker NMR JCAMP-DX V2.0
##DATA TYPE= NMR SPECTRUM
##DATA CLASS= NTUPLES
##ORIGIN= UXNMR, Bruker Analytische Messtechnik GmbH
##OWNER= root
$$ XWIN-NMR		Version 3.5
$$ Tue Oct 31 14:06:11 2023 Russian Standard Time (UT+4h)  she@DPX200
##.OBSERVE FREQUENCY= 200.13135
##.OBSERVE NUCLEUS= ^1H
##.ACQUISITION MODE= SIMULTANEOUS
##.ACQUISITION SCHEME= undefined
##.AVERAGES= 8
##.DIGITISER RES= 18
##SPECTROMETER/DATA SYSTEM= spect
##.PULSE SEQUENCE= zg30
##.SOLVENT NAME= D2O
##.SHIFT REFERENCE= (INTERNAL, D2O, 0, 15.7623)
##AUDIT TRAIL= $$ (NUMBER, WHEN, WHO, WHERE, WHAT)
$$ ##TITLE= Audit trail, XWIN-NMR		Version 3.5
$$ ##JCAMPDX= 5.01
$$ ##ORIGIN= Bruker BioSpin GmbH
$$ ##OWNER= she
$$ F:/spectra/data/she/nmr/H-F/1/pdata/1/auditp.txt
$$ ##AUDIT TRAIL=  $$ (NUMBER, WHEN, WHO, WHERE, WHAT)
(   1,<2023-10-31 14:04:48.09 +0400>,<she>,<DPX200>,
      <created by zg, POWCHK disabled, PULCHK disabled
       configuration hash MD5:
       00 E9 B6 7A A2 85 ED C7 34 08 36 98 17 FE 4E 26
       data hash MD5: 16K
       1E 4F E4 05 CB F5 89 8B 1F 5B B1 14 33 85 2B 07>)
(   2,<2023-10-31 14:04:50.96 +0400>,<she>,<DPX200>,
      <Start of raw data processing
       efp BC_mod = 2 LB = 0.24 FT_mod = 6 PKNL = 1 PHC0 = -23873.26 PHC1 = 8.85271 SI = 16K 
       data hash MD5: 16K
       85 F3 32 9C C9 25 AE BB 0D 4A 37 F2 76 9D 08 42>)
(   3,<2023-10-31 14:05:13.84 +0400>,<she>,<DPX200>,
      <pk PHC0 = 0.1043819 PHC1 = 0.4 
       data hash MD5: 16K
       4C 5C 2C F5 9D 16 8C 19 A5 E7 04 4A 46 D2 68 7C>)
(   4,<2023-10-31 14:05:17.01 +0400>,<she>,<DPX200>,
      <abs ABSG = 5 
       data hash MD5: 16K
       5E 08 8E 36 C6 0F 7E AF 0C C5 BB D6 58 04 49 DC>)
$$ ##END=
$$ 
$$ hash MD5
$$ A0 6F 4A 18 4E 3E C7 20 85 20 CD 45 DB 55 05 E0
##$RELAX= 
##$RELAX= 
##$RELAX= 
##$RELAX= 
##$RELAX= 
##$RELAX= 
$$ Bruker specific parameters
$$ --------------------------
##$DU= <F:/spectra>
##$EXPNO= 1
##$NAME= <H-F>
##$PROCNO= 1
##$TYPE= <nmr>
##$USER= <she>
##$AMP= (0..31)
100 100 100 100 100 100 100 100 100 100 100 100 100 100 100 100 100 100 
100 100 100 100 100 100 100 100 100 100 100 100 100 100 
##$AQSEQ= 0
##$AQ_mod= 1
##$AUNM= <au_zg>
##$AUTOPOS= <>
##$BF1= 200.13
##$BF2= 200.13
##$BF3= 200.13
##$BF4= 200.13
##$BF5= 200.13
##$BF6= 200.13
##$BF7= 200.13
##$BF8= 200.13
##$BYTORDA= 1
##$CFDGTYP= 0
##$CFRGTYP= 5
##$CHEMSTR= <none>
##$CNST= (0..31)
1 1 145 1 1 1 1 1 1 1 1 1 1 1 1 1 1 1 1 1 1 1 1 1 1 1 1 1 1 1 1 1 
##$CPDPRG= <>
##$CPDPRG1= <>
##$CPDPRG2= <>
##$CPDPRG3= <>
##$CPDPRG4= <mlev>
##$CPDPRG5= <mlev>
##$CPDPRG6= <mlev>
##$CPDPRG7= <mlev>
##$CPDPRG8= <mlev>
##$CPDPRGB= <>
##$CPDPRGT= <>
##$D= (0..31)
0 1.2 0 0 0 0 0 0 0 0.06 0 0.03 0 0 0 0 0.0002 0 0 0 0 0 0 0 0 0 0 0 0 
0 0 0 
##$DATE= 1698746687
##$DBL= (0..7)
120 120 120 120 120 120 120 120 
##$DBP= (0..7)
150 150 150 150 150 150 150 150 
##$DBP07= 0
##$DBPNAM0= <>
##$DBPNAM1= <>
##$DBPNAM2= <>
##$DBPNAM3= <>
##$DBPNAM4= <>
$$ [...]
##$SUBNAM3= <"">
##$SUBNAM4= <"">
##$SUBNAM5= <"">
##$SUBNAM6= <"">
##$SUBNAM7= <"">
##$SUBNAM8= <"">
##$SUBNAM9= <"">
##$SW= 18.05172834244
##$SWIBOX= (0..15)
0 0 2 0 0 0 0 0 0 0 0 0 0 0 0 0 
##$SW_h= 3612.71676300578
##$TD= 16384
##$TD0= 1
##$TE= 0
##$TE2= 300
##$TE3= 300
##$TEG= 300
##$TL= (0..7)
0 120 120 120 120 120 120 120 
##$TP= (0..7)
150 150 150 150 150 150 150 150 
##$TP07= 0
##$TPNAME0= <>
##$TPNAME1= <>
##$TPNAME2= <>
##$TPNAME3= <>
##$TPNAME4= <>
##$TPNAME5= <>
##$TPNAME6= <>
##$TPNAME7= <>
##$TPOAL= (0..7)
0.5 0.5 0.5 0.5 0.5 0.5 0.5 0.5 
##$TPOFFS= (0..7)
0 0 0 0 0 0 0 0 
##$TUNHIN= 0
##$TUNHOUT= 0
##$TUNXOUT= 0
##$USERA1= <user>
##$USERA2= <user>
##$USERA3= <user>
##$USERA4= <user>
##$USERA5= <user>
##$V9= 5
##$VALIST= <valist>
##$VCLIST= <CCCCCCCCCCCCCCC>
##$VD= 0
##$VDLIST= <DDDDDDDDDDDDDDD>
##$VPLIST= <PPPPPPPPPPPPPPP>
##$VTLIST= <TTTTTTTTTTTTTTT>
##$WBST= 1024
##$WBSW= 4
##$XGAIN= (0..3)
0 0 0 0 
##$XL= 0
##$YL= 0
##$YMAX_a= 424499
##$YMIN_a= -557177
##$ZGOPTNS= <>
##$ZL1= 120
##$ZL2= 120
##$ZL3= 120
##$ZL4= 120
##$ABSF1= 15.73477
##$ABSF2= -2.31708
##$ABSG= 5
##$ABSL= 3
##$ALPHA= 0
##$AQORDER= 0
##$ASSFAC= 0
##$ASSFACI= 0
##$ASSFACX= 0
##$ASSWID= 0
##$AUNMP= <proc_1d>
##$AZFE= 0.1
##$AZFW= 0.1
##$BCFW= 0
##$BC_mod= 2
##$BYTORDP= 0
##$COROFFS= 0
##$CY= -3
##$DATMOD= 1
##$DC= 0
##$DFILT= <>
##$DTYPP= 0
##$F1P= 0
##$F2P= 0
##$FCOR= 1
##$FTSIZE= 16384
##$FT_mod= 6
##$GAMMA= 0
##$GB= 0
##$INTBC= 1
##$INTSCL= 3.70164e-10
##$ISEN= 128
##$LB= 0.24
##$LEV0= 0
##$LPBIN= 0
##$MAXI= 10000
##$MC2= 0
##$MEAN= 0
##$ME_mod= 0
##$MI= 1.114404
##$NCOEF= 0
##$NC_proc= -8
##$NLEV= 6
##$NOISF1= 3.799351
##$NOISF2= 2.8
##$NSP= 0
##$NTH_PI= 0
##$NZP= 0
##$OFFSET= 15.76231
##$PC= 1
##$PHC0= -23873.16
##$PHC1= 9.252709
##$PH_mod= 1
##$PKNL= yes
##$PPARMOD= 0
##$PSCAL= 0
##$PSIGN= 0
##$REVERSE= no
##$SF= 200.130001845446
##$SI= 16384
##$SIGF1= 3
##$SIGF2= 2
##$SINO= 5.538805
##$SIOLD= 16384
##$SREGLST= <1H.CDCl3>
##$SSB= 0
##$STSI= 16384
##$STSR= 0
##$SW_p= 3612.71676300578
##$SYMM= 0
##$S_DEV= 0
##$TDeff= 16384
##$TDoff= 0
##$TI= <>
##$TILT= no
##$TM1= 0
##$TM2= 0
##$TOPLEV= 0
##$USERP1= <user>
##$USERP2= <user>
##$USERP3= <user>
##$USERP4= <user>
##$USERP5= <user>
##$WDW= 1
##$XDIM= 16384
##$YMAX_p= 514867507
##$YMIN_p= -2140314
$$ End of Bruker specific parameters
$$ ---------------------------------
##NTUPLES= NMR SPECTRUM
##VAR_NAME=  FREQUENCY,     SPECTRUM/REAL,   SPECTRUM/IMAG
##SYMBOL=    X,             R,               I
##VAR_TYPE=  INDEPENDENT,   DEPENDENT,       DEPENDENT
##VAR_FORM=  AFFN,          ASDF,            ASDF
##VAR_DIM=   16384,         16384,           16384
##UNITS=     HZ,            ARBITRARY UNITS, ARBITRARY UNITS
##FACTOR=    0.220516191357247, 1,           1
##FIRST=     3154.51113500738, 0,            0
##LAST=      -458.205627998404, 0,           0
##MIN=       -458.205627998404, -2140314,    0
##MAX=       3154.51113500738, 514867507,    0
$$ Real data points
##PAGE= N=1
##DATA TABLE= (X++(R..R)), XYDATA
$$ [...]
11568B8569L4365R3287n36166l53956N50318O66777j18587j020732k88065L82701
11558e61489M39338M52467K6641P10899n12858n10127r3263j78538j53520j34480
11548e14930K14677j54222k54377k22765o4358Q14031M47954Q01229J11902j176920
11538B221o90771J257950J026718n85455j330509n98267j21965J63446J42120
11529g34512K0799l40536J11342K18429N15610L95736k8016K84872L40638J31081
11519I15443J8309r8605m53498l33772j79253m83044n43754L78827J192574o4778
11509C48449p71698n32253Q8378P51264Q45006M11174m96466p03751o64575N92231
11499a32241L50332M13377K9259q83194j30370l53305M65510O61835l66106j153349
$$ plain form
11568 28569 62934 156221 -379945 -733901 -183583 483194 364607 -656125 -944190 -561489
11558 -561489 -122151 330316 356957 1067856 554998 44871 -48392 -226930 -380450 -514930
11548 -514930 -300253 -454475 -708852 -931617 -995975 -181944 266010 1067239 1179141 2221
11538 2221 -688550 569400 1596118 1010663 -319846 -918113 -1040078 -876632 -734512
11529 -734512 -713713 -1054249 -942907 -724478 -208868 186868 158852 443724 784362 915443
11519 915443 933752 835147 381649 47877 -131376 -614420 -1158174 -779347 413227 348449
11509 348449 -423249 -955502 -867124 -115860 729146 1140320 643854 -59897 -724472 -132241
11499 -132241 218091 631468 660727 -222467 -352837 -706142 -240632 421203 55097 -1098252
11489a098252m93015Q11329R41962J55804N57608j19762l80463j237953l22420
11480a185162J346870P2892R1347K19425n78363j340130m00102O02502J385385
11471B14664j44350o45151k05518K8889N73068J038810L11314k16453o57087o90052
11461c91866n11115N03624K34141n30851o15027K20812Q96459o7716L66303M40976
11451E45740M1984j038627q24609J281657J97847p09508O3570P83222K82220l23136
11441C00360l73529J03357m15993j58481k48371k28225M44079R50922k01403l7302
11431A35414r90440K55729M38088j67496k57174M07661L00060j018275l89108
11422a285541Q00634Q12756J0611n14330J44609J2153n58560O16580N63509k06436
$$ plain form
11489 -1098252 -1591267 -779938 162024 317828 875436 755674 375211 -862742 -1185162
11480 -1185162 161708 234600 325947 545372 -32991 -1373121 -1773223 -1170721 214664
11471 214664 70314 -574837 -780355 -751466 -178398 860412 1171726 955273 298186 -391866
11461 -391866 -902981 -399357 -165216 -696067 -1311094 -1090282 -193823 -261539 104764 545740
11451 545740 587724 -450903 -1275512 6145 203992 -505516 -441946 341276 623496 300360
11441 300360 -73169 30188 -385805 -544286 -792657 -1020882 -576803 374119 172716 135414
11431 135414 -855026 -599297 -161209 -328705 -585879 -178218 121842 -896433 -1285541
11422 -1285541 -484907 327849 338460 -175870 -31261 -19108 -577668 38912 602421 395985
11412C95985j105321N34005L20551K66488N89179O75643q76888j481554J38403
11403e43509J73478M24415M73641J39700j48939r06452r18127Q15471N84476J00814
11393A94968P8350q8114n00734p92904R84352P33820J60104p94954m63285N53022
11383F4625m10556m69811L54147Q1280P28131R36727l91033j140760o58418K23023
11373f82645Q40445L86757J84774n68756o44665o70563K18928O24843J61480l74855
11363e24257N72169R76388n11943j471353p14728Q97938R38067K46827l90622
11354A8486l81203k20910J00132O40875O81940R5286l52630j102731l53484O80901
11344a93338P161J86228J53979K13475L89320j401363p89809Q20319J91850K71227
$$ plain form
11412 395985 -709336 -175331 145220 411708 1000887 1676530 799642 -681912 -543509
11403 -543509 -370031 54384 528025 667725 518786 -387666 -1305793 -490322 94154 194968
11393 194968 273318 185204 -315530 -1108434 -124082 609738 769842 -25112 -488397 64625
11383 64625 -345931 -815742 -461595 -380315 347816 1284543 893510 -247250 -905668 -682645
11373 -682645 157800 544557 729331 160575 -484090 -1154653 -935725 -310882 -149402 -524257
11363 -524257 47912 1024300 512357 -958996 -1673724 -775786 162281 409108 18486
11354 18486 -362717 -583627 -483495 157380 839320 934606 581976 -520755 -874239 -193338
11344 -193338 -186177 51 154030 367505 756825 -644538 -1434347 -614028 -422178 -150951
11334a50951O25364Q2711o75949n95219O29500N67866j54536J42732p90323j99314
11324e18119m94907n5951j05832K79071J111265N91298m37450p54873K32727L57704
11314B04933l84577j50131j02562M7833L42788l14033j75652N05037L88352k76214
11304H5774k44416m0480r6589k04074J26271R26810J83404j215445p82772L99102
11294h62415K81042j92873M52829J56725L47755K58583K66641l39673n09218m98459
11284f39063J25132K39229o1117J46500P40446j00614l77957p93045k8960Q78444
11274A28995n4139k6875n95749L26268J51768N63560m68539o63542q7674l62557
11264a088484L64598K65045P43998N2986r09187j72039Q03027M44357q01321o05072
$$ plain form
11334 -150951 474413 557124 -118825 -714044 -84544 483322 328786 471518 -318805 -518119
11324 -518119 -1013026 -1068977 -1174809 -895738 215527 806825 369375 -385498 -152771 204933
11314 204933 -179644 -329775 -432337 -384504 -41716 -355749 -531401 -26364 361988 85774
11304 85774 -158642 -199122 -295711 -499785 -373514 553296 736700 -478745 -1261517 -862415
11294 -862415 -581373 -774246 -321417 -164692 183063 441646 708287 368614 -140604 -639063
11284 -639063 -513931 -274702 -335819 -189319 551127 450513 72556 -720489 -749449 128995
11274 128995 74856 47981 -547768 -221500 -69732 493828 25289 -638253 -725927 -1088484
11264 -1088484 -723886 -458841 285157 338143 -571044 -743083 59944 504301 -297020 -902092
11254i02092N59370K3205M03625l80005K32723J78014k23450N68796n84505q90488
11244a014807k06419J093755L80105k26685K18769j78642J61480k45713p9612
11235i7769j59189m35190K55414L16460m4143l55863j063266l57652O32277J658272
11225C49351Q06051q1040p62904m98103k96851K43308N1860K10851k18253k45879
11215d41609N63554N94004L63249j064758j415026J83243O73640j66367N76882
11206a33188K98110P6391k37972j10913q2804J090920K85567n67519n48070p81625
11196g11103j12031N43148k57810K5499O64934j36531m03850M25100L49678j030908
11186f43874M73614q8690l94280N80433P21978J09217q91209n9387k799K78699
$$ plain form
11254 -902092 -342722 -319517 84108 -295897 -63174 114840 -108610 460186 -124319 -1014807
11244 -1014807 -1221226 -127471 252634 25949 244718 66076 227556 -18157 -97769
11235 -97769 -256958 -692148 -436734 -120274 -164417 -520280 -1583546 -1941198 -1308921 349351
11225 349351 1155402 1074362 311458 -186645 -483496 -240188 -188328 22523 -195730 -441609
11215 -441609 121945 715949 1079198 14440 -1400586 -1217343 -543703 -710070 -133188
11206 -133188 164922 241313 3341 -107572 -190376 900544 1186111 618592 70522 -711103
11196 -711103 -823134 -279986 -537796 -512297 152637 16106 -387744 37356 387034 -643874
11186 -643874 -170260 -258950 -653230 -72797 649181 758398 -132811 -192198 -194997 83702
11176H3702j14105K5146L82403l46849l93531J63468n2613o51762p3909N85309
11166c92741J016146L14545p95983o36996P54422N14882n05068j8739o43569L41851
11156e1250K04079q6702J01715o1204l85223l48549K70120M59140K27102q11353
11146d82125l69281Q72644L43999J41104k68897l74359o36530J69836J27910K71975
11136b03724L71609J13408j64325r25312p7363J169696K05435j128889q23855
11127a463320J10580L05510M00102J140580P73022m31873j422993m135N2634K71099
11117b68794j01081R9389M07608m9176o7204j103618j38814O44899L71909O74353
11107D69471q3634l92206k44855K36349k83597j038844j12838R52184R62311J94055
$$ plain form
11176 83702 -30403 -5257 377146 30297 -363234 -199766 -252379 -904141 -978050 -392741
11166 -392741 623405 937950 141967 -495029 259393 774275 269207 250468 -393101 -51250
11156 -51250 152829 66127 167842 106638 -278585 -627134 -357014 102126 329228 -482125
11146 -482125 -851406 21238 365237 506341 237444 -136915 -773445 -603609 -475699 -203724
11136 -203724 167885 281293 116968 -808344 -885707 283989 489424 -639465 -1463320
11127 -1463320 -1352740 -1047230 -647128 493452 1266474 834601 -588392 -592527 -539893 -268794
11117 -268794 -369875 -270486 137122 87946 20742 -1082876 -1221690 -576791 -204882 469471
11107 469471 385837 -6369 -251224 -14875 -298472 -1337316 -1450154 -497970 464341 658396
11097F58396k036L26372N23441p75695r14835m16149k04551J3505N2102n7489
11087g96939J67989M66780K52288k80931j81130O32033l434j183028l51954J114510
11077a63816N71454q0468o32311n65006k73663Q45260K54197k26653L26382K56935
11067C12311J05109j94736n18016K52313n66769j94461O19967k61707J91563O52828
11057C98402J40919J61332k12930q05551p94786O40318K80907L72097r5548k04361
11047a19201N17326j114124m00991K85332P78170J77331k77995L72421Q1030o2900
11037B36399l24555k36750J57878l91082m06368K17721Q7149p6578M01368K71893
11027f2925Q8660n4424m39405k1206L34036K39217J35308r67695l95563N45901
$$ plain form
11097 658396 656360 982732 1506173 730478 -184357 -600506 -805057 -791552 -739450 -796939
11087 -796939 -628950 -162170 90118 -190813 -371943 260090 256656 -926372 -1278326 -163816
11077 -163816 407638 327170 -305141 -870147 -1143810 -298550 -44353 -271006 55376 312311
11067 312311 417420 222684 -295332 -43019 -609788 -804249 -184282 -445989 -254426 398402
11057 398402 539321 700653 487723 -317828 -1112614 -472296 -191389 180708 85160 -119201
11047 -119201 398125 -715999 -1116990 -831658 -53488 123843 -154152 218269 299299 236399
11037 236399 -88156 -324906 -167028 -558110 -964478 -746757 -659608 -736186 -334818 -62925
11027 -62925 25735 -28689 -468094 -489300 -155264 83953 219261 -748434 -1143997 -598096
11017e98096N97436L82183k35389o81402l3631K50098K501J36994l87114n77677
11007a144097l1872L28913K7016K28618J020035P0429p21820m16631l60388j77882
10997a177679o4380N39468J315477O2624m39014n98698K08276l36225o48975j49541
10987a288667Q75600J158519L8797p16541l51617M36693M4626J21868j83009n07742
10977c71473m85605l7165L59334N50701j69161n97418o33015M53421J313253J15650
10967D98522n07337m43995L86076M79116q96048n89468O21002Q36478r87560j120087
10957a723301P76267J488203O31451o42340n14407O6494k46652k39882k50284
10948f54451m01431M41051L29844j6143k06297m13271K42694j89202k50913M68345
$$ plain form
11017 -598096 -660 381523 146134 -535268 -568899 -318801 -316300 -179306 -566420 -1144097
11007 -1144097 -1175969 -847056 -820040 -591422 428613 499042 -222778 -639409 -999797 -1177679
10997 -1177679 -1242059 -702591 612886 675510 236496 -362202 -153926 -490151 -1139126 -1288667
10987 -1288667 -413067 745452 784249 67708 -283909 152784 197410 319278 136269 -371473
10977 -371473 -857078 -894243 -534909 15792 -153369 -750787 -1383802 -930381 382872 498522
10967 498522 -8815 -452810 -66734 412382 -483666 -1073134 -452132 384346 -603214 -1723301
10957 -1723301 -947034 541169 1172620 530280 15873 82367 -164285 -404167 -654451
10948 -654451 -1055882 -614831 -284987 -301130 -507427 -920698 -678004 -867206 -1118119 -649774
10938f49774J037774r4068j48313J80903K06140J56279k01767k24952m57488J4127
10928a81139N85510k85223m75426r1540n01962j83863M39105L54995j13108K07219
10918b45432O19434L14731k23813j064798j32259m470P83589O25334m83507o58611
10908d69802q18099O63339J38267l52938L93238J32085L13189K21048n23011K23636
10898g9048j77032j48873J94992L50810p78224M85473Q41862p15386o0611R21016
10888H34979l50885j092966k69879O17028m56244p80369M18933O53621R84945
10879E59163j74679l05657o40275m52757J01543K6583O22151L79051O18240l13233
10869D20130j235432M91098M60408n70742k73086L95776j14962J4931m24028k1892
$$ plain form
10938 -649774 388000 293932 145619 326522 532662 688941 487174 262222 -195266 -181139
10928 -181139 404371 119148 -356278 -447818 -949780 -1133643 -694538 -339543 -452651 -245432
10918 -245432 374002 688733 464920 -599878 -732137 -736607 46982 672316 188809 -469802
10908 -469802 -1287901 -624562 -486295 -839233 -445995 -313910 -721 220327 -302684 -79048
10898 -79048 -256080 -404953 -209961 140849 -637375 -151902 689960 -25426 -86037 834979
10888 834979 484094 -608872 -878751 -261723 -717967 -1498336 -1079403 -425782 559163
10879 559163 384484 78827 -561448 -1014205 -912662 -886079 -263928 115123 733363 420130
10869 420130 -815302 -324204 136204 -434538 -707624 -311848 -426810 -411879 -835907 -857799
10859h57799K79443L0016O12879O03494k35537m69305j19270n67511P39793J68414
10849A84617m64563r142L95858l53908k71018J07479O71735K67417j081784m25370
10839i78679j208O38624l98215J30422J59966M53995j41262k48314m48601l48925
10829a182197L89164m9779M87215M31796O07463o81651o17263j91602n48784O79199
10819f76439P53863R3854k31886n2044N4254J75798l21315j3597m07467m06387
10809a031366j71768N52580M41619j95738J1388O23925N53895n38089q71774p24309
10799a349637N41167N08361M06856k09660n3122K02830l89171o35281k97972J63178
10789a112451R29577N48766J6108J85058o52433o06038O74831J58439l44080K9496
$$ plain form
10859 -857799 -578356 -548340 64539 668033 432496 -36809 -156079 -723590 16203 184617
10849 184617 -279946 -289088 106770 -247138 -518156 -410677 261058 528475 -553309 -978679
10839 -978679 -979887 -341263 -739478 -609056 -449090 4905 -136357 -384671 -833272 -1182197
10829 -1182197 -793033 -842812 -355597 76199 683662 2011 -615252 -806854 -1355638 -676439
10819 -676439 77424 171278 -60608 -112652 -58398 117400 -203915 -217512 -624979 -1031366
10809 -1031366 -1203134 -650554 -208935 -404673 -393285 230640 784535 246446 -625328 -1349637
10799 -1349637 -808470 -300109 106747 -102913 -156035 46795 -342376 -977657 -1275629 -1112451
10789 -1112451 -182874 365892 382000 567058 -85375 -691413 -16582 141857 -202223 -172727
10779a72727L38825K87430j59914k32897k43409p87441K3518N74189J51000M6241
10769a75185O69123L3037n72480n03792k23572J28733J9353M11713O49685m18117
10759A8498m48580k35001L78567J054032p73147p13291r4441Q1998R82266j41437
10749A09464K00363K50244p70626n65294P3845M71850p01857L05807J066515J88813
10739F29124o62266o28937L23265L29994j49595l36360J85167l59369O52934Q4090
10729F8047m23777l85773k38425J76162M82885L94420M03948K44166n22786o19024
10719d20157k6587J222561j58301j34131k39498L19888J44447K30227n48749r47094
10709e57394Q2649R09718n69385j455292L83151R64541m066J31409K15750Q40764
$$ plain form
10779 -172727 166098 453528 293614 60717 -182692 -970133 -946615 -372426 -221426 -175185
10769 -175185 493938 526975 -45505 -549297 -772869 -644136 -624783 -213070 436615 18498
10759 18498 -430082 -665083 -286516 767516 -5631 -718922 -813363 -731365 250901 109464
10749 109464 309827 560071 -210555 -775849 -702004 -230154 -932011 -626204 440311 629124
10739 629124 -33142 -662079 -338814 -8820 -158415 -494775 -309608 -668977 -16043 68047
10729 68047 -355730 -741503 -979928 -803766 -320881 73539 477487 721653 198867 -420157
10719 -420157 -446744 775817 617516 483385 243887 563775 708222 938449 389700 -557394
10709 -557394 -474745 434973 -134412 -1589704 -1206553 -242012 -246078 -114669 101081 941845
10699I41845m20276r43822M4651L81021n23374l18336M86939o961n67714K83435
10689f42592L31661K04812J38339K34239m3141n12868P3515m11934J56404n07172
10679i78737L08785P4201K84765Q04432R975Q2343n20940l33822m71803p40551
10669a481352k12787J214115J248151l62201m57591j80038l23539l91577N71232
10660c75587Q90924j10364j418712M71328L72222p2498J2871O9151j9977n3070
10650b33712J18596l90797O88083l42579m17492l80227k08469R70445M01072k10517
10640e597m22941J920l66869L30209P21251L94686k74636p51874k79903M65773
10630a87981J18328l34833J53971P42532P49700r96152r68628J1901K41678N4614
$$ plain form
10699 941845 521569 -422253 -377602 3419 -519955 -838291 -351352 -358313 -926027 -642592
10689 -642592 -310931 -106119 32220 266459 223318 -289550 -216035 -627969 -471565 -978737
10679 -978737 -669952 -595751 -310986 493446 503421 585764 64824 -268998 -740801 -1481352
10669 -1481352 -1694139 -480024 768127 405926 -51665 -231703 -555242 -946819 -375587
10660 -375587 515337 404973 -1013739 -542411 -170189 -242687 -229816 -160665 -180642 -233712
10650 -233712 -115116 -505913 182170 -160409 -577901 -958128 -1166597 -196152 204920 -5597
10640 -5597 -428538 -426618 -793487 -463278 257973 652659 378023 -373851 -653754 -187981
10630 -187981 -69653 -404486 -250515 492017 1241717 245565 -723063 -711162 -469484 -414870
10620d14870n9996j35659M21491J19671J41085K9347j072297l37847J72049P51185
10610c85841K27734J12494l44971l1719K93110l93064j72419O3015L00738K14453
10600a16470N52249j72195o90126k20654m835M02885k13020k07311j22910k06431
10590i98818m9898N11328K24754l63034J5001R24691J94050m83944m00182j22900
10580e48952N1689K46657K48023n66534l05511k80053P19996K1258K88306l61052
10570d86173j80606J52251j75687L96909J25776l4818K67924J01401k69086k36266
10560c38375N72966J51986k56072k68412n61515l67673L90706O07811l69483R8699
10550c39362k82750k81046L09381j56964O8037n3766K71980P81207L98787M64962
$$ plain form
10620 -414870 -474866 -610525 -189034 -69363 71722 101069 -971228 -1309075 -1137026 -385841
10610 -385841 -158107 -45613 -390584 -422303 -129193 -522257 -694676 -631661 -330923 -116470
10600 -116470 435779 263584 -426542 -647196 -652031 -249146 -462166 -669477 -792387 -998818
10590 -998818 -1048716 -537388 -312634 -675668 -660667 264024 458074 -25870 -426052 -548952
10580 -548952 -497263 -250606 -2583 -569117 -874628 -1154681 -434685 -413427 -125121 -486173
10570 -486173 -666779 -514528 -690215 -293306 -167530 -202348 65576 166977 -102109 -338375
10560 -338375 234591 386577 130505 -137907 -699422 -1067095 -676389 -68578 -438061 -339362
10550 -339362 -622112 -903158 -593777 -750741 -682704 -736470 -464490 316717 715504 1180466
10540A180466j041785o85034j35394J02829L39343k42740O9375M96511j76876
10531i3305j183480k9822M62504M97812M61337J67262p29054n04644O2949P31256
10521a57185M90365o83907n37048k55368Q43259P42894L23715p41127m61381K69989
10511a65794K84338M7066r26466q22631K19873J374451J45650J28723n12809L27020
10501I9421q6011p64977N16674N78655N6956n76274p47115K92156P73884L67839
10491E11208n86782n33527L00361j30151M47176k42264P3237L63156L46121p87265
10481b38730q93444L62659K81744K36848k68026k24153N33995J95109n45079l23738
10471h82815J58403n7043R65189j20418o22816m7351K57484o121k29648P47952
$$ plain form
10540 1180466 138681 -546353 -681747 -578918 -239575 -482315 -412940 83571 -93305
10531 -93305 -1276785 -1306607 -844103 -346291 115046 282308 -446746 -951390 -888441 -157185
10521 -157185 333180 -350727 -887775 -1143143 -299884 443010 766725 25598 -435783 -165794
10511 -165794 118544 165610 -760856 -1583487 -1363614 10837 156487 285210 -227599 99421
10501 99421 13410 -751567 -234893 343762 400718 -175556 -922671 -630515 143369 511208
10491 511208 -75574 -609101 -308740 -438891 8285 -233979 -160742 202414 548535 -238730
10481 -238730 -1132174 -769515 -487771 -250923 -518949 -743102 -209107 -13998 -559077 -882815
10471 -882815 -724412 -781455 183734 63316 -559500 -606851 -349367 -355488 -585136 162816
10461A62816J63975n11603j289097N3878M38638L07641K06290P3570l3822k72786
10451g00500P48787L04492K58325p3920j86144l68919l96292l00027M05388M77426
10441A68616l55095l58884l68565q66741n3888Q07055R38499J47546J34472Q57583
10431A050598l14238p96480n37535l0382R55292j67419m31083n46109n09516N19943
10421h06929O52488J65184p55408j26668R62940J69452m20439L51077L17243q56185
10411c47245m38614J236437L4388j70816q64991L68006J34164k95209N21743M44811
10401F22674k50071o51956j26502k95930j07967M49026M31349k38381m21161j90301
10391g79220L99430N10489K47527p12165m92818L9119R71577L59637j73115j59758
$$ plain form
10461 162816 326791 -184812 -1473909 -1420031 -981393 -673752 -467462 -393892 -427714 -700500
10451 -700500 48287 352779 611104 537184 351040 -17879 -414171 -714198 -308810 168616
10441 168616 -186479 -545363 -913928 -1780669 -1834557 -1027502 -89003 58543 193015 1050598
10431 1050598 736360 -60120 -597655 -628037 327255 159836 -271247 -817356 -1326872 -806929
10421 -806929 -154441 10743 -744665 -871333 91607 261059 -159380 191697 508940 -347245
10411 -347245 -785859 450578 484966 314150 -550841 -182835 -48671 -343880 177863 622674
10401 622674 372603 -279353 -405855 -701785 -809752 -360726 70623 -167758 -588919 -779220
10391 -779220 -379790 130699 378226 -333939 -826757 -787638 183939 543576 370461 210703
10381B10703o28754J95731R2632n16433m86252N12766J104595K82521p48086p83277
10371g63854j60586N98581O85562K66227j054373j34906K54882Q32553p42219
10362b18133r14259Q32445Q34573q4045l55987k7133n48109m12470K14766R78601
10352C00249K79976p44604p62736M64021O44065O46592m4022m57846j063586j01061
10342h38952R06363M02196o67717j030413k11531N75619N7758L62130N45824N1229
10332A52506M07846n522p27686J30413k00684m58475l37812N97553m53917R043
10322h86735M79601L87478K5854n77745M36438K6188J62025n3349p92283j87777
10312i80305O75328Q68011L17027l81379n14686l82958j29947m81384N24242k7320
$$ plain form
10381 210703 -418051 -222320 -129688 -646121 -1132373 -619607 484988 767509 19423 -763854
10371 -763854 -924440 -325859 359703 625930 -428443 -563349 -308467 524086 -218133
10362 -218133 -1132392 -299947 534626 450581 94594 67461 -480648 -893118 -678352 300249
10352 300249 580225 -164379 -927115 -463094 180971 827563 783541 325695 -737891 -838952
10342 -838952 67411 469607 -198110 -1228523 -1440054 -864435 -806677 -444547 101277 152506
10332 152506 560352 554830 -172856 -42443 -243127 -701602 -1039414 -441861 -895778 -886735
10322 -886735 -407134 -19656 6198 -571547 -135109 -108921 53104 -245 -792528 -980305
10312 -980305 -304977 563034 880061 498682 -16004 -398962 -528909 -1010293 -486051 -513371
10302e13371o376J87450j54241R0649j79157J29476j10054P623K52970k98842
10292e93873K47882J76726O84457K70733j250403l17350O83934Q13779m19952
10283B95933j130640l08290J5304L94679O8498N60211J26997k87283J11263M04539
10273B51211j57490n52488M56751L02683k6782j97397j67864l8245k8346K05543
10263D7576p7701M72592l65222j106714N9476J01739M86065K66997n74553p6452
10253g66197M79947q9880j54706J103564k98338n57478o67524R036L89248J03693
10243d48635L82409N15614k85569j207315M2312N90165P94675K72689j298321
10234f41976n75930L90388J45484J00779k26889L91617M95128K26650o12077K55175
$$ plain form
10302 -513371 -519747 -332297 -486538 -395889 -575046 -445570 -555624 -548001 -295031 -593873
10292 -593873 -345991 -169265 515192 785925 -464478 -781828 -97894 715885 295933
10283 295933 -834707 -1142997 -1127693 -733014 -664516 -104305 22692 -264591 -153328 251211
10273 251211 93721 -458767 -2016 300667 273885 76488 -91376 -129621 -157967 47576
10263 47576 -30125 442467 77245 -1029469 -969993 -868254 -382189 -115192 -689745 -766197
10253 -766197 -286250 -376130 -530836 572728 274390 -283088 -950612 -941576 -552328 -448635
10243 -448635 -66226 449388 163819 -1043496 -1001184 -411019 383656 656345 -641976
10234 -641976 -1217906 -827518 -682034 -581255 -808144 -416527 78601 305251 -306826 -51651
10224e1651M7970o16980P1403M15414J57505m48640j17038R4707j58633M9114
10214e56829l86833R4256O50814M61575L17998o89187o73716j72254J513605J140970
10204A700399q76524j175756m32258j66403j12344O3261L80463K36659p6633J54146
10194c04990N17178m9480o48013j60057l74455P87063J270376M5229r56163l86951
10184b60263p60342m79118P26472J301911J039985p24330k191128n95918P64938
10175a177793N37941q2754P30963j47653r9230K77058P7601p49606o8519K26926
10165d75066J71504J29497L61586J96949q35261l02391L2726m5854M7593N08164
10155b10553o956j9159n05139p2699K31554M08720M47537J45740q24980m6922
$$ plain form
10224 -51651 -3681 -620661 -549258 -133844 23661 -424979 -542017 -447310 -605943 -556829
10214 -556829 -943662 -849406 -198592 262983 580981 -108206 -781922 -954176 559429 1700399
10204 1700399 823875 -351881 -784139 -950542 -1062886 -999625 -619162 -382503 -459136 -304990
10194 -304990 212188 162708 -485305 -645362 -1019817 -232754 1037622 1082851 126688 -260263
10184 -260263 -1020605 -1499723 -773251 528660 1568645 844315 -1346813 -1942731 -1177793
10175 -1177793 -639852 -722606 8357 -139296 -238526 38532 116133 -633473 -701992 -475066
10165 -475066 -303562 -174065 187521 384470 -450791 -753182 -720456 -766310 -718717 -210553
10155 -210553 -217509 -236668 -741807 -814506 -582952 -174232 273305 419045 -405935 -452857
10145d52857j08398o62937p1536J162777M29801k98419J96594M96845l24680r61190
10135e94000k55927N82920P12464N83630p3309r64702q56669J46534R909L65076
10125c44074L60857Q28685k35108p17789m99341k0900M2445L8132M65909J25817
10115D4633p26582m94688K54104L95719M30377j8111K44302J03485M60279O3478
10105G56996l11517p71089l24852q1902L9307O45963K53088l97110m73757O52226
10095a2647O25148N1691n20937q83998O35493m70771m30178m11440L02638O27322
10085d87679O95348j48175j04513O44820m80086k65558l68009m42906L29331M26068
10075b01359k76055k19448O01411m72028N353J11040k64245L76732K49659j30032
$$ plain form
10145 -452857 -561255 -1224192 -1295728 -132951 296850 -1569 195025 691870 367190 -594000
10135 -594000 -849927 -267007 445457 1029087 955778 -8924 -865593 -719059 -709150 -344074
10125 -344074 16783 845468 610360 -107429 -606770 -627670 -585225 -547093 -81184 44633
10115 44633 -681949 -1176637 -922533 -526814 -96437 -114548 129754 233239 693518 756996
10105 756996 445479 -325610 -650462 -732364 -693057 -47094 205994 -191116 -664873 -12647
10095 -12647 612501 664192 143255 -740743 -105250 -576021 -1006199 -1417639 -1115001 -487679
10085 -487679 207669 59494 -45019 599801 119715 -145843 -513852 -956758 -627427 -201359
10075 -201359 -477414 -696862 -95451 -567479 -562126 -451086 -715331 -338599 -88940 -218972
10065b18972o5657o6028J35256k16683J70820N52073K10915m22899p88896K79951
10055d30120l12450q5521J05139P72788L10630p10987l42022J78279N32737m85111
10045d66638m4222K42930K89608n0433r83104J80941L77067M18131j5886k9748
10035h1354N80500M9343p04209J36124r561l25534p00065O78319P25203J93545
10025E42311o81059o67977L30342m02669J92662j77310N78359N94408o03734K88447
10015f220j89507j45045o3058L83840J42905N0172q31188k87891L03914J26695
10005e15383K84818M93971K81647r24771l84359J54177O22987J55588o93575p55162
9995a280062K86040P02325L74199l76068j64418O40750N07552O49184p23664r75448
$$ plain form
10065 -218972 -284629 -350657 -215401 -432084 -261264 290809 501724 78825 -710071 -430120
10055 -430120 -742570 -828091 -722952 49836 360466 -350521 -692543 -514264 18473 -466638
10045 -466638 -510860 -267930 21678 -28755 -1011859 -830918 -453851 -35720 -51606 -81354
10035 -81354 499146 548489 -155720 -19596 -29157 -354691 -1054756 -376437 348766 542311
10025 542311 -138748 -806725 -476383 -879052 -686390 -863700 -285341 309067 -294667 -6220
10015 -6220 -195727 -340772 -403830 -19990 122915 173087 -658101 -945992 -642078 -515383
10005 -515383 -230565 263406 545053 -379718 -764077 -609900 13087 168675 -524900 -1280062
9995 -1280062 -994022 -291697 82502 -293566 -457984 182766 690318 1339502 615838 -359610
9985c59610p33615k28394N89912K50871O54452M22349k77144j402701n17437Q44203
9975g57114Q39177K54994p5041m05160j43859l41077M44242J29980j35377J28324
9965f0911L92310R6992m11405q32708k83585k86020O33985J038613P17322j25132
9955H79461j100568j175552m65633N26100R96473M67080n34101l65269O75659
9946i6350L48116k57780k12070m26494j19856K70563M39544L58117l07007k9812
9936c3029k9689J40111j40120J57969L20842k16598l79772m98535j26449O80112
9926a25158L71806P90042n29519n24909k0336n20435Q81895l75919r19885l68800
9916a341218J053856J08357J49336n21183L7343R63847J5084j420187l90400P62599
$$ plain form
9985 -359610 -1093225 -1321619 -731707 -480836 173616 595965 318821 -1083880 -1601317 -757114
9975 -757114 82063 337057 262016 -143144 -287003 -628080 -183838 -53858 -189235 -60911
9965 -60911 331399 428391 16986 -815722 -1099307 -1385327 -751342 287271 1004593 879461
9955 879461 -221107 -1396659 -1862292 -1336192 -339719 127361 -406740 -772009 -96350
9946 -96350 251766 -6014 -218084 -644578 -764434 -493871 -54327 303790 -3217 -33029
9936 -33029 -62718 77393 -62727 95242 416084 199486 -180286 -678821 -805270 -125158
9926 -125158 246648 1036690 507171 -17738 -38074 -558509 323386 -52533 -972418 -1341218
9916 -1341218 -287362 -179005 -29669 -550852 -513509 450338 465422 -954765 -1345165 -582566
9906e82566L54913N07384R2416r71073L3942M51700N53609m14151m49256O37691
9896B14609p7156n06304P3542N06640k4226j135856M52534J043102o6818r68748
9886d88681k35675N02723q1278R8387K40805J28853l075k64787k06271m87994
9876g96993L31039J255555j48366r33797n16813P92749J96718j49576J89727j02709
9866A17534n02263R9259Q7374J3355L61730k15208K87602J037567J00009j62892
9856A224067o90550r07283m50760P02718L26158q39730o78785K69197M38853P83000
9846A76885L02405k50238r53012j56639O23805Q6295l33310P8203Q05232R4229
9836D73855j37028r69278m80058N65596M97037P29709N29166j93323n37809l66436
$$ plain form
9906 -582566 -227653 279731 372147 -598926 -564984 -113284 440325 26174 -423082 214609
9896 214609 137453 -368851 -295309 211331 187105 -948751 -496217 546885 480067 -488681
9886 -488681 -724356 -221633 -302911 -204524 36281 165134 162059 -102728 -308999 -796993
9876 -796993 -465954 789601 641235 -292562 -809375 -16626 180092 30516 220243 117534
9866 117534 -384729 -285470 -198096 -184741 176989 -38219 249383 1286950 1386959 1224067
9856 1224067 533517 -373766 -824526 -121808 204350 -635380 -1314165 -1044968 -606115 176885
9846 176885 479290 229052 -723960 -880599 -256794 -170499 -503809 -425606 379626 473855
9836 473855 336827 -632451 -1112509 -546913 -49876 679833 1208999 1015676 477867 111431
9826A11431o51729j05800J29747N14792Q47342o24726o16314K73755j71542k01226
9816d94270N53306K95556j66552m78910o10480P22397j22658m21762O62673J97789
9806A37089J09002j20524l95538n44160Q55724Q620p53103J23952N45777J72795
9796A39634l37484p40943L05092R97490M5340p34352n39896K85427P42557o9582
9786I3283n06128L41008J56341q33103Q3575N21821K832m20422R1985J51488L11750
9775e570j12813l12381k23508q8402N5475j23272N90489O0063L72468O66804L52720
9764A232073o86301o11210k46984r70926k6852N16116o6394N0297M23085O41918
9754B54822J33383j44192r90576Q08073N37412r57540m86104n19028K46647O54740
$$ plain form
9826 111431 -540298 -646098 -516351 -1559 845783 221057 -395257 -121502 -293044 -494270
9816 -494270 59036 354592 188040 -290870 -901350 -178953 -301611 -723373 -60700 137089
9806 137089 246091 125567 -269971 -814131 41593 50213 -702890 -578938 -33161 139634
9796 139634 -197850 -938793 -633701 363789 409129 -325223 -865119 -579692 162865 93283
9786 93283 -412845 -71837 84504 -748599 -665024 -143203 -140371 -560793 -468808 -317320 -5570
9775 -5570 -118383 -430764 -654272 -742674 -687199 -810471 -219982 -159919 212549 879353 1232073
9764 1232073 545772 -65438 -312422 -1283348 -1310200 -794084 -860478 -810181 -387096 254822
9754 254822 388205 244013 -746563 61510 598922 -358618 -844722 -1363750 -1117103 -462363
9744d62363j10348m7346P1037K05890L09620L03361j70457q3073R6897q54136
9734g40918j68174m59658m8101O85757P81719L63949l98017J43960q3511O5737
9724A42743j13025m18676O85523j68747o14763K22672M1045p31304j081376J268032
9714g67876R45568l3947j92488Q18767J86113j130958l09851J13353K06849J4178
9704a50292L63100J59189m04728L27623j44809o30067p70212J98577J107173k2649
9694C2905l58420K65700k166k96001l01951P4012R63074L47639m87972o37857
9684d01037o45502K12706Q76230j26013l3647P41347j52598p17843l89880Q40528
9674B04291L26833n53431j31038N00112N18219j132640n8448k10980K61131L71949
$$ plain form
9744 -462363 -572711 -620057 -549020 -343130 -33510 269851 99394 16321 113218 -740918
9734 -740918 -909092 -1368750 -1416851 -731094 50625 414574 16557 160517 77006 142743
9724 142743 29718 -388958 296565 127818 -486945 -264273 -223228 -954532 -2035908 -767876
9714 -767876 177692 143745 -48743 770024 956137 -174821 -484672 -371319 -164470 -150292
9704 -150292 212808 371997 -32731 294892 150083 -479984 -1250196 -1051619 55554 32905
9694 32905 -325515 -59815 -61981 -357982 -659933 -585921 377153 724792 236820 -401037
9684 -401037 -1046539 -833833 42397 -83616 -117263 624084 471486 -246357 -636237 204291
9674 204291 531124 -22307 -153345 346767 864986 -267654 -326102 -537082 -275951 95998
9664I5998O03068M65364n17044r78690q13362j16034M22276M48152Q91084J22890
9654F23702j63387k30290j30889k36170o57852J88180R99869J92899p80238j9247
9644b13423J120798K50481j15197j090184l10089j34445j44529K96176k80980
9635f21392L6562j59521M61095Q43496J015352M1411o11857m00594o65639k59066
9625c20153J013603Q78857K33433r90886l16040N14291P87029J13415L98021l48628
9615A962942n65640O54410K37785P62889R71287N877j355978r96637k21553j99470
9605A255912p11191n4550K05883m53394q32735J18190Q35808l8053k04026O35875
9595G57719L58285n82833k07708N39668K40249p57725k93094K07366M60522l53738
$$ plain form
9664 95998 699066 1164430 647386 -331304 -1144666 -1260700 -838424 -390272 500812 623702
9654 623702 460315 230025 99136 -137034 -794886 -606706 393163 586062 -194176 -213423
9644 -213423 907375 1157856 1042659 -47525 -357614 -492059 -636588 -340412 -621392
9635 -621392 -584830 -744351 -283256 560240 1575592 1617003 1005146 604552 -61087 -320153
9625 -320153 693450 1572307 1805740 814854 498814 1013105 1800134 1913549 2311570 1962942
9615 1962942 1397302 2051712 2289497 3052386 4023673 4029550 2673572 1676935 1455382 1255912
9605 1255912 544721 490171 696054 242660 -590075 -471885 363923 325870 121844 757719
9595 757719 1116004 533171 325463 865131 1105380 347655 54561 261927 722449 368711
9585C68711J06250N84596o66481j035852j22388M56404M35610K05082k60670m50875
9575c79613O97921K84693n8128l43050k25166l51345L63825K10750P91609R4070
9565A085566k05804q57817q32683P73207K99938J40747n5768L7201K33878p63754
9555a45289p47655P79223R87600K54230m93882k60864m89384L25897L88950K7629
9545F26455K70682j030648j49479O3758k99292R02494P82550m27741p24775m18993
9535d04989n17095J56842J41762P90149J020652Q9225j74091k00314N16210L97837
9525A816188p36019p22854r16020J03395J46676O19073o45477K40935M30912o2077
9515B74732k58052N3263M27155j17672O5535L8172k3577j6991m21984K84858k7862
$$ plain form
9585 368711 474961 1059557 393076 -642776 -765164 -308760 126850 331932 71262 -379613
9575 -379613 318308 603001 544873 201823 -23343 -374688 -10863 199887 991496 1085566
9565 1085566 879762 21945 -810738 -37531 262407 403154 347386 384587 618465 -145289
9555 -145289 -892944 -113721 873879 1128109 634227 373363 -116021 209876 598826 626455
9545 626455 897137 -133511 -282990 -219232 -518524 383970 1166520 738779 14004 -404989
9535 -404989 -922084 -765242 -623480 166669 1187321 1276546 1102455 902141 1418351 1816188
9525 1816188 1080169 357315 -558705 -455310 -308634 310439 -335038 -94103 336809 274732
9515 274732 16680 69943 497098 379426 444961 483133 459556 442565 20581 305439 277577
9504B77577m25177k0875K3100J57454J43044N04121J25420l82338o12981q6239
9494b96894L01368M82682l3009l83953P1465l1926k56417J87608p3624J34662
9484A01962P55925K36556m57157o71586m48887N17469J09925o0046M2331J61091
9474B87583j03915m13857R18323Q55978l70501j498167r08996R88901R17240J54577
9464H27166m23619j80741M98252n94745r54568k91098K53379Q84280O30447K47920
9454H96673J19851k87308k50065L08488m8451L0179n07200o38221K18302O89449
9444E31697j13692L5777k71865M14043k98974R4732O49095P38095K01342k52609
9434A727641l23130n0947J41395j76228p14676P5987K04815J8191m68665k6842
$$ plain form
9504 277577 -147600 -168475 -145375 12079 155123 659244 784664 402326 -210655 -296894
9494 -296894 4474 487156 454147 70194 141659 109733 -146684 40924 -32700 101962
9484 101962 857887 1094443 637286 -34300 -483187 34282 144207 84161 126492 287583
9474 287583 183668 -230189 688134 1544112 1173611 -324556 -1233552 -244651 672589 827166
9464 827166 403547 222806 721058 126313 -828255 -1119353 -865974 18306 648753 896673
9454 896673 1016524 729216 479151 787639 739188 769367 262167 -376054 -157752 531697
9444 531697 418005 453782 181917 595960 296986 391718 1040813 1778908 1980250 1727641
9434 1727641 1404511 1353564 1494959 1318731 604055 680042 884857 903048 434383 407541
9424D07541Q62083Q1302m67671n81846K31751N3069P61297N92585m02344q45178
9414F92589o51747K11692K12037m53963L28454P9343j36946n57268N40977P83148
9404A048316O45200q55194j261445l13285J35462O84036K86888l68722L88447
9395C89703Q85414P58428m24520l71981K09782n75136j059598m88449J398868
9386G22511R41133k24844n96722q88764K80383N5823O41009L58956M97320K95074
9376B081879q56656n31299k39100N84330l55271L32389O06676j38776o71940o57853
9366A54379m61853o9844J56165R3605Q53796K00256j37153k30673J62186L76230
9356A097094O50457m76659r93907m14851M3137j87865J51146J61096M88861R50119
$$ plain form
9424 407541 1269624 1350926 883255 301409 533160 586229 1347526 1940111 1537767 692589
9414 692589 40842 252534 464571 10608 339062 418405 281459 -275809 265168 1048316
9404 1048316 1693516 838322 -423123 -736408 -600946 83090 369978 1256 389703
9395 389703 1275117 2033545 1609025 1237044 1446826 871690 -187908 -676357 722511
9386 722511 1663644 1438800 842078 -46686 233697 289520 930529 1289485 1786805 2081879
9376 2081879 1225223 693924 454824 1039154 683883 1016272 1622948 1484172 812232 154379
9366 154379 -307474 -377318 -221153 -127548 726248 926504 789351 558678 720864 1097094
9356 1097094 1747551 1270892 276985 -137866 -94729 -282594 -131448 29648 518509 1468628
9346A468628J93757k18669j119468k81110J95436m77283K29480R42793P86717
9337A720281o36979j016775N8997P69741k81777n54152N6085k73786J55976K17942
9327B15553J05802K23150Q58326j12889J37663j03321j99205n47111r05541k12561
9317e40134M47475r3332o69520M48304J108857O52213q5574j093692q65122L05017
9307c85508J763301J116861m69212j420719n05338m13694P36013M50540K15363
9298A087607J18190m061M51459j198607r5709J47966m57992q9727P32527Q52512
9288A544165o05508j94141L6482m96602j36689N12735R97329M80158O4724m87301
9278A715352j51544q58185n96067M40492L83211o0293Q5918l33761j56063K95832
$$ plain form
9346 1468628 1662385 1443716 324248 43138 238574 -238709 -9229 933564 1720281
9337 1720281 1083302 66527 125524 895265 613488 59336 115421 -158365 -2389 215553
9327 215553 321355 544505 1402831 1289942 1427605 1324284 1125079 577968 -327573 -540134
9317 -540134 -92659 -185991 -855511 -407207 701650 1353863 1268289 174597 -690525 -385508
9307 -385508 1377793 2494654 2025442 604723 99385 -314309 421704 872244 1087607
9298 1087607 1205797 1201736 1653195 454588 358879 506845 48853 -40874 691653 1544165
9288 1544165 938657 744516 780998 284396 147707 660442 1657771 2137929 2202653 1715352
9278 1715352 1563808 705623 109556 550048 933259 872966 958884 625123 469060 764892
9268G64892j90622N2830L57783P38563N19725Q76971o62969j262065p51239K96281
9258G40150R23366M62348o59384q36974m37074M66499K94342N66168J05529m67248
9248A157722L33994K04464L7011k51719R7405m92875j98998k65657P59267Q98694
9238B279308m002o46758O5884j76131p76653l12192K60480L74717O95672j32256
9228A628069r29648l19745Q87360O84449M61047K59519J83272k19064r24130p91608
9218I19521Q29736n8294o83046k06409O05521n60411o85191P63026O98904L27477
9208A950834L05961M08823l87296j042025l84304K86008P27863J7890m30456j57807
9198A295491n55159N48425J73210L29772o77964m17474K01055Q88620N49317k87325
$$ plain form
9268 764892 574270 627100 984883 1723446 2243171 3120142 2457173 1195108 443869 740150
9258 740150 1663516 2125864 1466480 629506 192432 658931 953273 1519441 1624970 1157722
9248 1157722 1491716 1696180 1733191 1481472 1578877 1086002 887004 621347 1380614 2279308
9238 2279308 2275306 1628548 1694432 1518301 741648 429456 689936 1064653 1760325 1628069
9228 1628069 698421 378676 1266036 1950485 2411532 2671051 2854323 2635259 1711129 919521
9218 919521 1749257 1690963 1007917 801508 1407029 846618 161427 924453 1623357 1950834
9208 1950834 2256795 2665618 2278322 1236297 851993 1138001 1865864 1883754 1453298 1295491
9198 1295491 740332 1288757 1461967 1791739 1113775 696301 897356 1785976 2335293 2047968
9188B047968j234612k825O76856M23037q58391O98096R32890m86668N99288K48894
9178C044533J31079m74628j51563J75231M41948P18607M42221j21493j224977
9169B980958n33482l55376k59388P1260K13789N4602j24048l45588l91009O94117
9159B005835j05408m26072N21448k93865r22739N38542J6817p4603L72702P45198
9149B377855l01086k44290K57641K12504j68369m44757k68793J79062R2197r6241
9139A595723k06418K66801m46362o88848M42107N96914N58880P6160o9852m82725
9129A642380m80735k71114L72067N89431O5612j68551K64488l01832l66142l75988
9119I69616k25032J32874K74260L44308J88318K76853J81297k46519k17948M28677
$$ plain form
9188 2047968 813356 810531 1487387 1910424 1052033 1750129 2683019 2196351 2795639 3044533
9178 3044533 3175612 2700984 2549421 2724652 3166600 3885207 4327428 4205935 2980958
9169 2980958 2447476 2092100 1832712 1903972 2117761 2172363 2048315 1702727 1311718 2005835
9159 2005835 1900427 1474355 1995803 1701938 779199 1317741 1334558 1259955 1632657 2377855
9149 2377855 2076769 1832479 2090120 2302624 2134255 1689498 1420705 1599767 1691964 1595723
9139 1595723 1389305 1656106 1209744 520896 963003 1559917 2118797 2194957 2125105 1642380
9129 1642380 1161645 890531 1262598 1852029 1917641 1749090 2013578 1711746 1345604 969616
9119 969616 744584 877458 1151718 1496026 1684344 1961197 2142494 1895975 1678027 2106704
9109B106704m4743p42389q88250M44823O44593K25809Q41945k4872o04347l18339
9099A640934j28273k6779k12136o32330N20198O29553J20470K76857J31837n2346
9089B267985o34713k71962K85466N50770p21877p5902K3337K55928n45982M18795
9079A551845J247933l60337m05689l53311O9506N2630L76480k121l46061o13373
9069A217502J43543n559M90372M17658O33287K60949p31849q49073J81733m9846
9059A708717m28267O60329P87713j26812o70930m28552J040446o2929p57212l66788
9049A355715M23503K89791J96566J42370m55332L65111P13915k51783j652442
9040A127414l85195Q55185J428548L76452j110411m24089J29085k66874K60280
$$ plain form
9109 2106704 2061961 1319572 431322 876145 1520738 1746547 2588492 2563620 1959273 1640934
9099 1640934 1512661 1485882 1273746 641416 1161614 1791167 1911637 2188494 2320331 2267985
9089 2267985 1633272 1361310 1646776 2197546 1475669 1399767 1423104 1679032 1133050 1551845
9079 1551845 2799778 2439441 2033752 1680441 1749947 1802577 2179057 2176936 1830875 1217502
9069 1217502 1361045 1355486 1845858 2263516 2896803 3157752 2425903 1576830 1758563 1708717
9059 1708717 1280450 1940779 2728492 2601680 1930750 1502198 2542644 2479715 1722503 1355715
9049 1355715 1779218 2069009 2265575 2407945 1952613 2317724 3031639 2779856 1127414
9040 1127414 742219 1597404 3025952 3402404 2291993 1867904 1996989 1730115 1990395
9031A990395Q44519K49386L55284j056084p28345N44750m4179j63171M5873L44397
9021B382825P84023O4530n61219k59293P08296J192889m53438j169257r2480j21134
9011B475742p75027P7006P72751J234046o80057q19633Q14436O0235r90208n13725
9001A655566J010932J203010K84632k07379l3300J6579n52951k92940m59169P62196
8991C387176L91731N68067l50246j096577N0759L56175M00405P20530N30836m02168
8981D556688p61188m18024m58976P0289R06870K24902q820K14603Q06262L99959
8971E532565l99170k09945l52799N0344o3249K23573j25315Q20830R85803m1640
8961F420997k3073L77112Q16232N16374q01921r33234M14216J776498R90020o92788
$$ plain form
9031 1990395 2834914 3084300 3439584 2383500 1655155 2199905 2155726 1992555 2038428 2382825
9021 2382825 3166848 3231378 2670159 2410866 3119162 4312051 3858613 2689356 2596876 2475742
9011 2475742 1700715 1777721 2550472 3784518 3104461 2284828 3099264 3159499 2169291 1655566
9001 1655566 2666498 3869508 4154140 3946761 3913461 3930040 3377089 3084149 2624980 3387176
8991 3387176 3778907 4346974 3996728 2900151 2950910 3307085 3707490 4428020 4958856 4556688
8981 4556688 3795500 3377476 2918500 2988789 3895659 4120561 4111741 4326344 5132606 5532565
8971 5532565 5133395 4923450 4570651 4620995 4557746 4781319 4656004 5476834 6462637 6420997
8961 6420997 6397924 6775036 7591268 8107642 7305721 6372487 6786703 8563201 9553221 8860433
8951H860433j141914p6074N04652k16203l24403p7750J00674K7474O28774M05810
8941H691473K3629L57229Q47480J3154k3599j90993K51219K05792L77876Q9117
8931A0642377p43733J75825k55013n43132l30751L95527P01101J149953K26633
8922A1418787q37759r92145P28531P65547K45730M85837L91947O93338m97989
8913A2401824k05871M08597L29171N27754J083773l71699M03402K19362m82471
8904A4313842p20757o53534L64935L32074k14769o39928k72679r7797r1877M20484
8894A2739994Q55978P59369m76529o86267k54688k02724L58383J261424L36551
8885A4691491p63883r79226n9636O1056o90200o03536L77109j0612o19596q84605
$$ plain form
8951 8860433 7718519 7642445 8147097 7930894 7606491 7528741 7629415 7656889 8285663 8691473
8941 8691473 8715102 9072331 9919811 9932965 9909366 9718373 9969592 10175384 10553260 10642377
8931 10642377 9898644 10074469 9819456 9276324 8945573 9341100 10042201 11192154 11418787
8922 11418787 10581028 9588883 10317414 11082961 11328691 11814528 12206475 12899813 12401824
8913 12401824 12195953 12604550 12933721 13461475 14545248 14173549 14576951 14796313 14313842
8904 14313842 13593085 12939551 13304486 13636560 13421791 12781863 12509184 12411387 12319510 12739994
8894 12739994 13595972 14355341 13878812 13192545 12937857 12735133 13093516 14354940 14691491
8885 14691491 13927608 12948382 12888746 12949802 12259602 11656066 12033175 12022563 11402967 10518362
8875A0518362m09959K02680J86686l52196l50988L63973L46786L46387N78476
8866A1430207O88880R88376N7574j15947K27662q11897j179542N88922J526644
8857A3400879p79452j548045l85441r6969k89427O49437J473534M12768j155657
8848A1681627Q1422J185781N50200N33652R8060j018519j281524K27560O10029
8839A2668288k07113n01177L1055p48841j106254l29643P35320P76825l42556
8830A0975904k14571k22999K77558N98832R03355J42964r56185k38083M18117
8821A1684892K60685L14925O6903R36830L93676J6140Q9085O01333m68996j136087
8811A2759386N02761J132812J85545o36237O86465O11325o73961M8324P99429
$$ plain form
8875 10518362 10108403 10311083 10497769 10145573 9794585 10158558 10505344 10851731 11430207
8866 11430207 12119087 13107463 13165037 13049090 13276752 12464855 11285313 11874235 13400879
8857 13400879 12621427 11073382 10687941 10590972 10301545 10950982 12424516 12837284 11681627
8848 11681627 11763049 12948830 13499030 14032682 14130742 13112223 11830699 12058259 12668288
8839 12668288 12461175 11959998 11991053 11242212 10135958 9806315 10541635 11318460 10975904
8830 10975904 10761333 10538334 10815892 11414724 12318079 12461043 11504858 11266775 11684892
8821 11684892 11945577 12260502 12327405 13264235 13657911 13674051 13763136 14364469 13895473 12759386
8811 12759386 13262147 14394959 14580504 13944267 14630732 15242057 14568096 14616420 15415849
8802A5415849O4675L18626J944707J239093L18721o1486J072753K073676M07415
8793B2794029P82664J263632J745255K555222J418255J111905J82122J122407
8785C2975491J325257J464996K60558p62293j070353j514908n4969l4308k76357
8776C2313114j92503k57778M37240R35553O51949M06649R05169J845209R42800
8767C7987402J500021J866430J687656L14206p61784n44868j164789j452371p85201
8758C8646702M0685o17024n98953N50730L97586J080916J777771J026512J487405
8749D3792330J694193J900143J981859J227769J731479J489873N15163l81848
8741E3950961j279114k09375J69683l0087j69039J21791K44910R75648J467184
$$ plain form
8802 15415849 15480524 15799150 17743857 18982950 19301671 19240185 20312938 22386614 22794029
8793 22794029 23576693 24840325 26585580 29140802 30559057 31670962 31853084 32975491
8785 32975491 34300748 35765744 36026302 35264009 34193656 32678748 32623779 32589471 32313114
8776 32313114 32120611 31862833 32300073 33235626 33887575 34294224 35199393 37044602 37987402
8767 37987402 39487423 41353853 43041509 43355715 42593931 42049063 40884274 39431903 38646702
8758 38646702 38687387 38070363 37471410 38022140 38419726 39500642 41278413 42304925 43792330
8749 43792330 45486523 47386666 49368525 50596294 52327773 53817646 54332809 53950961
8741 53950961 52671847 52462472 52632155 52602068 52433029 52554820 52799730 53775378 55242562
8732E5242562K717910L178622K498965K313188J820092J863386J770797K556440
8724G3961962K230245J547771J057919M64485L06778L24571J471293L164393M266505
8715H8795922M827711N547645N750867P854107J1822780J5208411J6743129J8564911
8707A75115483K1845086K9836169M0271544N2221937O9582532Q1408186M4586570
8700E14867507k0641080m7899083p0037506p3184375n5807862m2642512k8670257
8693A75984832k0254832j4220146j0588930q344512p565802o861679n809684n101290
8685I7237957o015937m793713m475224l804843l246657k517526k113496j471969
8677F8798592j036489p39932J15107K90974j86651r49133m91686J2245P66773
$$ plain form
8732 55242562 57960472 61139094 63638059 65951247 67771339 69634725 71405522 73961962
8724 73961962 76192207 77739978 78797897 79262382 79569160 79893731 81365024 84529417 88795922
8715 88795922 93623633 99171278 104922145 112776252 124599032 139807443 156550572 175115483
8707 175115483 196960569 226796738 267068282 319290219 388872751 470280937 514867507
8700 514867507 494226427 446327344 376289838 303105463 247297601 204655089 175984832
8693 175984832 155730000 141509854 130920924 122576412 115010610 108148931 102339247 97237957
8685 97237957 91222020 86428307 81953083 78148240 74901583 72384057 70270561 68798592
8677 68798592 67762103 67022171 67137278 67428252 67241601 66292468 65800782 65813027 66579800
8668F6579800K61559R2825n14567k198728k842581l291837k542333j426907k82505
8659E3834726p44292p3338l58703k26547L50387R74970J635033O03220M98068
8650E6493524J361433J572638J190108M38811m73554k402502k890106j856063
8642E3434289k090044k619676k433319m44995Q2708R47030J62685j21050k32817
8633D6684811K8248P99545r7569K57623J909754J298303l22445l45583j764821
8624D8447866l094289m112462l811635k994395k111478k043577j020762j085850
8616B8173418j742784p63014k83385o78661m39429k79592q8687R9531o80607p18169
8606B2598621k03189M20145J84919l52787p86717j64973j82082m83879r27713
$$ plain form
8668 66579800 66841359 66934184 66419617 64220889 61378308 58086471 55544138 54117231 53834726
8659 53834726 53090434 53017096 52658393 52431846 52782233 53757203 55392236 55995456 56493524
8650 56493524 57854957 59427595 60617703 61056514 60582960 58180458 55290352 53434289
8642 53434289 51344245 48724569 46291250 45846255 45928963 46875993 47038678 46917628 46684811
8633 46684811 46713059 47512604 47415035 47672658 49582412 50880715 50558270 50212687 48447866
8624 48447866 45353577 41241115 37429480 34435085 32323607 30280030 29259268 28173418
8616 28173418 26430634 25667620 25384235 24705574 24266145 23986553 23897866 23997397 23316790 22598621
8606 22598621 22395432 22815577 23000496 22647709 21860992 21696019 21513937 21030058 20102345
8597B0102345j036819q08371q13665L06913Q00186l97506o89860n09652j34366
8588A6819205j6606j126612r07956M75036O92945l67819q65915J02356K44909
8579A5049543J89361k64768p66417p7288r19229O21982M26748l96219L74841J12521
8569A4351075Q09385r0625N17119J73370J01947n92234m51524q197r1293J90270
8559A4909293p79398K01160N29584l03867J40513L75055q92826n98985O92947
8550A4273476P95740p8318R7993j42874n5683p50387m32105K28504O98519K59233
8540A4894098j94444k62881q47963O8482O76887Q03871m27344m8669n181l21942
8530A4334914M90942m16238r95191L04647J427958Q57071O90124j57587j82861
$$ plain form
8597 20102345 19065526 18257155 17443490 17750403 18550589 18153083 17463223 16953571 16819205
8588 16819205 16802599 15675987 14768031 15243067 15936012 15568193 14702278 14804634 15049543
8579 15049543 15238904 14974136 14207719 14130431 13211202 13833184 14259932 13863713 14238554 14351075
8569 14351075 15160460 15069835 15586954 15760324 15862271 15270037 14818513 14810316 14719023 14909293
8559 14909293 14129895 14331055 14860639 14556772 14697285 15072340 14179514 13580529 14273476
8550 14273476 15069216 14990898 15088891 14946017 14890334 14139947 13707842 13936346 14634865 14894098
8540 14894098 14699654 14436773 13588810 13657292 14334179 15138050 14710706 14662037 14656856 14334914
8530 14334914 14825856 14409618 13414427 13719074 15147032 16004103 16694227 16536640 16353779
8521A6353779o98843k95949M85982P48310P27449O05327k6064j41164K05933L04360
8511A8269120R55453J207356R81105R7145L40275P49132J166558P61343P47087
8502B5274574J187442J796685J707499J645400J803450J800473J607585K660396
8494C9483504L474030L642145L166841K462352L131270K565097N34097j222249
8486E7237087j071714p42646j20706R41661K246744K433933J616420J230338J5384
8477F3786501j133870k157901k338122k310974k428132k504215k228770j698214
8469D6986303p74492m38899L36386Q20262M79126J332085J032955K221758K737000
8460E4732484L048759L071490K748534M038492L543423R81413q92380o65741J132240
$$ plain form
8521 16353779 15654936 15358987 15844969 16593279 17320728 17926055 17899991 17758827 17964760 18269120
8511 18269120 19224573 20431929 21413034 21510179 21850454 22599586 23766144 24527487 25274574
8502 25274574 26462016 28258701 29966200 31611600 33415050 35215523 36823108 39483504
8494 39483504 42957534 46599679 49766520 52228872 55360142 57925239 58459336 57237087
8486 57237087 56165373 55422727 55302021 56243682 58490426 60924359 62540779 63771117 63786501
8477 63786501 62652631 60494730 58156608 55845634 53417502 50913287 48684517 46986303
8469 46986303 46211811 45772912 46109298 46929560 47408686 48740771 49773726 51995484 54732484
8460 54732484 57781243 60852733 63601267 67639759 71183182 72164595 71272215 70606474 71738714
8451G1738714L010471M038436M948461N335188L986788K397782M09319k056739
8443I3808420l551648m284399l882496l489184k916533r95189R60999M33382r13015
8434G5170337k607915k573498k984155l426533l977534l700226l669555k745418
8426D9485503j170469m6443o8549m86070L95722P04607O10169N94171J324265
8417E1342906J514537K040739K828108J715277K92837q41097p35440j337477j809064
8408E5011326o10925j6289R49472J574607J739255P81112j473852k187426k156555
8399E3610725k639746l072766k916816k703663j914767j100799j680506j287875
8391C6293787p26521k28225K37040j12371n09730K15219L4783J94851O95085K99832
$$ plain form
8451 71738714 74749185 78787621 83736082 89071270 93058058 95455840 95865159 93808420
8443 93808420 90256772 85972373 82089877 78600693 75684160 74688971 75649970 76083352 75170337
8434 75170337 72562422 69988924 67004769 63578236 59600702 55900476 52230921 49485503
8426 49485503 48315034 48268591 48200042 47713972 48109694 48814301 49424470 50018641 51342906
8417 51342906 52857443 54898182 57726290 59441567 59734404 58893307 58157867 56820390 55011326
8408 55011326 54400401 54384112 55333584 56908191 58647446 59428558 57954706 55767280 53610725
8399 53610725 50970979 47898213 44981397 42277734 40362967 39262168 37581662 36293787
8391 36293787 35567266 35339041 35576081 35463710 34953980 35169199 35203982 35398833 36093918 36393750
8381C6393750l0481L15906J86914Q6654l8080k70442Q09284J237469Q56660M66712
8371D0014346R16545J396208J241521K039307K289400L371093K738424J901717
8363E5908561M69869l84269j189537p28806N04045J447059J881213K026798J854591
8354F1789524K134495J006807m79245j659333l330781k046679o05361N54771N06317
8345E7870515q60213q33521N3656R51547K24147q83661j189502k176219j193075
8336E1963674P27939J148271J1502R4274P24393J496861J329971J974831J783268
8327F1254984K013886L554881N081781M538811L481220K284833J467118j22597
8319H3554917l99316J239011J515627K121411L676642M950060K872217Q06611
$$ plain form
8381 36393750 36363269 36679175 36866089 36952743 36914663 36644221 37453505 38690974 39547634 40014346
8371 40014346 40930891 42327099 43568620 45607927 47897327 51268420 54006844 55908561
8363 55908561 56378430 55994161 54804624 54075818 54579863 56026922 57908135 59934933 61789524
8354 61789524 63924019 64930826 64451581 62792248 59461467 57414788 56809427 57364198 57870515
8345 57870515 57010302 56176781 56230437 57181984 57406131 56522470 55332968 53156749 51963674
8336 51963674 52691613 53839884 53851386 53945660 54670053 56166914 57496885 59471716 61254984
8327 61254984 63268870 66823751 71905532 76444343 79925563 82210396 83677514 83554917
8319 83554917 83155601 84394612 85910239 88031650 91708292 96658352 99530569 100337180
8311A00337180p30893k415922m005751m783247l959900l788652l458239k849075
8303G4345501j015888k92374j780977k801628l904719l038717k764532l839096
8295E4907570l805125k745579q27801K36727l42768j304505j19271L02930j44352
8286D6157826J54263R49137K259409K328287J782031P24073k85810m97254m76200
8277E3095762Q22061J91505l1488J229701J509504K458656J947596R13694j216248
8268F0920743j868989k538831l428317k837422k181432j152502j571579k361901
8260D2979770k577041j866012j695383k292073j793494k020443k114252j359207
8252B7261865j015053j173543o44403j492257k535422r89842k78998k19467P23104
$$ plain form
8311 100337180 99606287 97190365 93184614 88401367 84441467 80652815 77194576 74345501
8303 74345501 73329613 73037239 71256262 68454634 64549915 61511198 58746666 54907570
8295 54907570 51102445 48356866 47529065 47765792 47423024 46118519 45999248 46302178 46157826
8286 46157826 46312089 47261226 49520635 51848922 53630953 54355026 54069216 53571962 53095762
8277 53095762 53917823 54109328 54077840 55307541 56817045 59275701 61223297 62136991 60920743
8268 60920743 59051754 56512923 53084606 50247184 48065752 46913250 45341671 42979770
8260 42979770 40402729 38536717 36841334 34549261 32755767 30735324 28621072 27261865
8252 27261865 26246812 25073269 24428866 22936609 20401187 19411345 19132347 18912880 19635984
8243A9635984o44685o74622o34264k61152L2799N91578O28089l71236q74541j378008
8233A6049942j87502n93161j123311k42304J185691J015721o68509n76433j1842
8224A4848292l48548m80278j05906m89081j077500j187619j034839o74831k47013
8215I202677J82331R64729l82030j078106r93294l4086J2827J664Q39379j035485
8205G680606o48649k60581K2473J12771M00555k95453l43328p57885j34254R46377
8195F722632J231216p6115j360162o458261o68263M215722J627619K03746k83990
8186E154144L34363o31365J61114m30222l12437m53033l42500m81750R03727k42682
8176C659359k32751n94525l75590J118826J419029K6181q32194m44398k9788o44861
$$ plain form
8243 19635984 18991299 18316677 17682413 17421261 17454060 18045638 18673727 18302491 17427950 16049942
8233 16049942 15862440 15269279 14145968 13903664 15089355 16105076 15436567 14860134 14848292
8224 14848292 14499744 14019466 13913560 13424479 12346979 11159360 10124521 9449690 9202677
8215 9202677 9385008 10349737 9967707 8889601 7896307 7862221 7875048 7876712 8716091 7680606
8205 7680606 7031957 6771376 6793849 6906620 7307175 7011722 6668394 5910509 5776255 6722632
8195 6722632 7953848 7877733 6517571 59310 -608953 3606769 5234388 5438134 5154144
8186 5154144 5488507 4857142 5018256 4588034 4275597 3822564 3480064 2998314 3902041 3659359
8176 3659359 3426608 2832083 2456493 3575319 4994348 5020529 4188335 3743937 3714149 3069288
8166C069288J51316K54905n94630J52749J08500q7440m57915m45115N01912Q85971
8156C539541l44756k17388O97257n85849m52376k95338O33996P61227m31175j126431
8146B178708o34037L04557K47817M94259J27136r5462K0758j36669K29199M94804
8136C231070O0839k85131p61381L24708M36807p34100k01491N70636q1019o48849
8126A912089o8467Q10151J81461q38168j66948N26143J035230q372j372469L4009
8116B044659k0728L27620K18733q61924r24526P90972R27158M467o07012l37527
8106A561892M52221O98568n65393m16762K02847o1715j6292J63980j43086P3943
8096A950203j0686j40868K00612j40656n82626p18784J28501P87422L24414n27615
$$ plain form
8166 3069288 3220604 3475509 2880879 3033628 3142128 3054688 2596773 2151658 2653570 3539541
8156 3539541 3194785 2977397 3674654 3088805 2636429 2341091 2975087 3736314 3305139 2178708
8146 2178708 1544671 1849228 2097045 2591304 2718440 2622978 2643736 2507067 2736266 3231070
8136 3231070 3291909 3006778 2245397 2570105 3006912 2272812 2071321 2641957 2560938 1912089
8126 1912089 1843622 2653773 2835234 1997066 1830118 2356261 3391491 3383119 2010650 2044659
8116 2044659 2023931 2351551 2570284 1708360 783834 1574806 2501964 2506431 1899419 1561892
8106 1561892 2014113 2712681 2147288 1730526 1933373 1871658 1855366 2019346 1876260 1950203
8096 1950203 1939517 1798649 1999261 1858605 1275979 557195 685696 1473118 1797532 1269917
8086A269917J49885O52636L93587m14700L44492L68227m38817m57785K21568K25333
8076B314343n51940o86366P12338L84390R0186K03604l61833o82750l62822J62836
8066A221986l88773N19721R0760K42719k18147j98830M66118p7861O78939K76459
8056B613091L2832j678907r18675N23972J89422K09825R58527k99569k47004j3048
8046A370466L02051K58797J96085n16337n11639Q7312J4220L55839r06930o63050
8036a3186p7358N59412P35647K27053L45261L75703J38758o71858m82729Q9206
8026A225909J6208j18373l11365O25377m98697m65652O54580L34395J05946L07596
8016A875924r2352R7390O42079n1108j036800j225893L57189R90906J014910m57922
$$ plain form
8086 1269917 1419802 2072438 2466025 2051325 2395817 2764044 2325227 1867442 2089010 2314343
8076 2314343 1762403 1076037 1788375 2172765 2262951 2466555 2104722 1421972 1059150 1221986
8066 1221986 833213 1352934 1443694 1686413 1468266 1269436 1735554 1657693 2336632 2613091
8056 2613091 2645923 967016 48341 572313 761735 971560 1930087 1630518 1383514 1370466
8046 1370466 1672517 1931314 2127399 1611062 1099423 1186735 1200955 1556794 649864 -13186
8036 -13186 -90544 468868 1204515 1431568 1776829 2152532 2291290 1619432 1136703 1225909
8026 1225909 1242117 1123744 812379 1437756 939059 473407 1127987 1462382 1568328 1875924
8016 1875924 1783572 1880962 2523041 2471933 1435133 209240 566429 1557335 2572245 2114323
8006B114323n11767n52125q40907R35057R96984l45627j368394l39363R49016
7997A037197R14809l25813m70732L07080P848o31813j16146P07551Q97216L56838
7987B684035k47124j502203r49071K65274J393690M88852k5932l86147J08108
7978A829482o21256l91865J29877J190156m05219j137401R9827K42554P4166K59844
7968A270165J25885r31896M38776L290J75417K14236o8723J70542j78128l25023
7958H94541O20961L86927k98310n75831m57680m70473r84825J01832J888905J624943
7948B730990m262R9363p54191j325011p12391L71778L11048K86567P34729O6995
7938A805615n73356p71987R37696J083856j121106j152173M44287K56623k83538
$$ plain form
8006 2114323 1602556 1050431 209524 1144581 2141565 1795938 427544 88181 1037197
7997 1037197 1952006 1626193 1155461 1462541 1470389 838576 722430 1429981 2327197 2684035
7987 2684035 2436911 934708 -14363 250911 1644601 2133453 2107521 1721374 1829482
7978 1829482 1208226 816361 946238 2136394 1731175 593774 693601 936155 1010321 1270165
7968 1270165 1396050 464154 902930 906220 1081637 1295873 1227150 1397692 1219564 894541
7958 894541 1515502 1902429 1604119 1028288 570608 100135 -884690 -782858 1106047 2730990
7948 2730990 2726728 2826091 2071900 746889 34498 406276 717324 1003891 1738620 1805615
7938 1805615 1232259 460272 1397968 2481824 1360718 208545 652832 909455 625917
7929F25917J57437j10115j57605L10555p9283J97584O69457k97946n08441k33846
7919E73714o4954O80361L12183K8643j393616k49144O9385M91849L98019J48799
7909I95239P5378N78744p37633J5086L12406L18109j60230l72248J84744l9631
7899A169964k75393j54602O80449o67974p69664J09877K42911N89876N03231k22121
7889A206554k8001J89173m82456q5144J52537k70327J95346l74472K47411o0280
7879F90341n48695J66530O48287K38284n41536o81145K06291M40153L69946J023
7869I89479L04612l79632m24358M17363k48706M5351j44087l40771O02231N27701
7859A349183l99110k70080J04329j70555J69071J44996j93843j58253L4488M38595
$$ plain form
7929 625917 783354 673239 515634 826189 746906 944490 1613947 1316001 807560 573714
7919 573714 508760 1189121 1501304 1529947 136331 -112813 -43428 448421 846440 995239
7909 995239 1070617 1649361 911728 926814 1239220 1557329 1397099 1024851 1209595 1169964
7899 1169964 894571 739969 1420418 752444 -17220 92657 335568 925444 1428675 1206554
7889 1206554 1178553 1367726 885270 800126 952663 682336 877682 503210 750621 690341
7879 690341 141646 308176 956463 1194747 653211 -27934 178357 618510 988456 989479
7869 989479 1294091 914459 490101 907464 658758 704109 560022 219251 821482 1349183
7859 1349183 950073 679993 784322 613767 782838 927834 733991 575738 610226 1048821
7849A048821N29481n20882j50357Q9604M98315M81045J2433m30722L51610N20442
7839B429790m67497o54928N80083M17366q43022k79494p6036N277o7179J60422
7829A204782O24744L03708R6488k94030J81555j46124L91435K19860o11624j176037
7819G94757n17281N31735M09269j12018l94907l09572J21601Q47918O95217q86643
7809A180076m13113J54311j029147O85884K32836Q888p793k8272j24310P59895
7799A419255L16411m95210j20426o10168j58222L34729k32291k85949J50987L01858
7789F20974L2173j82378Q67542j88921J70603J28104q6612K67289m09899l10600
7779I08275j64281o37654m61072P60032J10698K61083K54615j55123n86864k77250
$$ plain form
7849 1048821 1578302 1057420 907063 996667 1494982 1976027 1988460 1557738 1909348 2429790
7839 2429790 1962293 1307365 1887448 2304814 1461792 1182298 1106262 1111539 1044360 1204782
7829 1204782 1829526 2133234 2229722 1935692 2117247 1971123 2362558 2582418 1970794 794757
7819 794757 277476 809211 1218480 1106462 711555 401983 523584 1371502 2066719 1180076
7809 1180076 766963 921274 -107873 578011 810847 819735 811942 783670 659360 1419255
7799 1419255 1735666 1240456 1120030 509862 351640 686369 454078 168129 319116 620974
7789 620974 653147 470769 1338311 1149390 1319993 1448097 1361485 1628774 1218875 908275
7779 908275 743994 106340 -354732 405300 515998 777081 1031696 876573 289709 12459
7769A2459L56421J81709M21174j65897r9420L92726q5150n78581m46171K99875
7759B89145N06021K94235m70513K8697P71788p96616j083224R4917R01957J67112
7749G03519P5983L47754o44446M37076M12840k79189n07055P6931P90714O6363
7739A480490m50022o46689k96051N73377n34606j76841L0815P35308P75815Q666
7729A500262n93424R369J25416J82507P37077N49261r93263j452684k89232J37872
7719h6839J97750l09033O44221O84302J4708j86294k15437l9077m47559J08158
7709C64900K30679M19680L43507P4223m63880p73676p05478M47212Q46236L98138
7699A181541M92333q18207n18257l20230O33084P5754L4827R49851N31503o39485
$$ plain form
7769 12459 368880 550589 971763 805866 706446 1099172 1014022 435441 -10730 289145
7759 289145 795166 1089401 618888 647585 1419373 622757 -460467 -365550 536407 703519
7749 703519 779502 1127256 482810 919886 1332726 1053537 546482 623413 1414127 1480490
7739 1480490 1030468 383779 87728 661105 126499 -50342 -19527 715781 1491596 1500262
7729 1500262 906838 916207 1041623 1224130 1961207 2510468 1517205 64521 -224711 -86839
7719 -86839 110911 -198122 446099 1130401 1145109 958815 743378 704301 256742 364900
7709 364900 595579 1015259 1358766 1432989 969109 195433 -510045 -62833 783403 1181541
7699 1181541 1673874 855667 337410 17180 650264 726018 760845 1710696 2242199 1602714
7689A602714r55073q31845L29257K28443L14029N37281P08228j014658j129137
7680b10761J28568L84510K63391K88548L10187m66849r8250L1499n66176J46434
7670B11101O78381J75452l97696l76059L89232N64852k12779k51955K3800n96466
7660B07863p65300l59932J021475J287194j61222j61010k4166m39697n35960O53626
7650G22871P31464J44374l71114o20988r34741M87570K26740n18548j14045O7701
7640a78716J156454L69544N7513o09639L22032J81260n8102L15873j66225m78018
7630I11976o45351j27006K75723M4383N7152O28894p4644n50117j70668M04109
7620G54451M59677k73507n90130n5176L76581N87768m30939o37455j63078j41127
$$ plain form
7689 1602714 647641 -184204 145053 373496 687525 1224806 1933034 918376 -210761
7680 -210761 -82193 302317 565708 854256 1164443 697594 599344 630843 64667 211101
7670 211101 889482 1064934 667238 291179 680411 1245263 1032484 780529 804329 207863
7660 207863 -557437 -917369 104106 1391300 1230078 1069068 1044902 605205 69245 722871
7650 722871 1454335 1598709 1227595 606607 -328134 159436 386176 -132372 -246417 -178716
7640 -178716 977738 1347282 1404795 795156 1117188 1298448 1240346 1556219 1389994 911976
7630 911976 266625 139619 415342 459725 516877 1145771 1071127 521010 350342 754451
7620 754451 1214128 940621 350491 295315 671896 1259664 828725 191270 28192 -112935
7610a12935Q20142P48124j33551J74253n67700l13203m34563L9506j94936K2067
7600D7204Q57372j23557L43336n97562l28420L84275J090731J78407p88121k17593
7590H46072q1045K71171m99433l59030L00035l56955L89124R52304N24044j169115
7580H17172m49816L25174O17120l80748K55976j75799n17805J0906R14663p4654
7570A342189l70544l40804j1190N19801N2791L13282n1808l74131n6738K15242
7560A238090q6837N95785p84567o73320k84005K44255J090542L40827M74275l38250
7550A816795n56573k52142l22880M39953J028009j010002o62031J1196M03622
7541H95947P46011l4624m989m54858l1353K38754L76553J90915O66296o61062
$$ plain form
7610 -112935 707207 1455331 1321780 1496033 928333 615130 180567 220073 25137 47204
7600 47204 904576 781019 1124355 526793 198373 582648 1673379 1851786 1063665 846072
7590 846072 765027 1036198 536765 177735 477770 120815 509939 1462243 1986287 817172
7580 817172 367356 692530 1309650 928902 1184878 1009079 491274 502180 1416843 1342189
7570 1342189 971645 630841 619651 1139452 1192243 1505525 1453717 1079586 1022848 1238090
7560 1238090 1151253 1747038 962471 289151 5146 249401 1339943 1680770 2155045 1816795
7550 1816795 1260222 1008080 685200 1125153 2153162 1143160 481129 492325 895947
7541 895947 1641958 1607334 1602345 1147487 1116134 1354888 1731441 1922356 2588652 1927590
7531A927590q63366K79030j19640j12105R49922M68734r81610l46787j11238k65624
7521H24906L30995j16495N55762Q92655n432o00446l86090N9171K70565r88223
7511H37368j53004O1667N71440M83058o5708j10240L83615O28796j67659r28202
7501A541131o73617N80153J74419M9518j13874J00028P2099j69360j753O5590
7491A624334K25564k1250m26063m50678J43491J26901K46841M04114L75699O0951
7481B309904k40806o31299L86827O00113J57957j50908p7607L9847j14249r62035
7471A317744j57168K23622L16458P1677Q44592M10104l75145r1506n94306L89673
7461B355745N59092J54960M77981m24926o61927O79618O64982m05280j7434P24877
$$ plain form
7531 1927590 1064224 1343254 1223614 1111509 2061431 2530165 1548555 1201768 1090530 824906
7521 824906 1155901 1039406 1595168 2487823 2482391 1881945 1495855 1555026 1825591 837368
7511 837368 684364 746031 1317471 1800529 1734821 1624581 2008196 2636992 2469333 1541131
7501 1541131 867514 1447667 1622086 1671604 1557730 1657758 1729857 1560497 1558744 1624334
7491 1624334 1849898 1828648 1402585 951907 1095398 1222299 1469140 1873254 2248953 2309904
7481 2309904 2069098 1437799 1824626 2424739 2582696 2431788 2354181 2394028 2279779 1317744
7471 1317744 1160576 1384198 1700656 1772333 2616925 3027029 2651884 2560378 1966072 2355745
7461 2355745 2914837 3069797 3547778 3122852 2460925 3140543 3805525 3400245 3382811 4107688
7451D107688o59518m05273K86900K68541k89702j20889J76846l23474M10548O49304
7441D100971P99820k05937r04323L12383Q44899L74407m06942K64874J11454J74157
7431E465763n19606N71741K65817l96173m53178K04432N41147J05104k59739j05211
7421E420097k45747j26165P21423K96483l22245j104202J19761M15641J317382
7412F492428K96273n93081k59316m91960j55082n28428M95023Q28021L01061k52085
7402F132854n6942K77148K46129o88472m15842j16917J31922N7822O54224L45390
7392F567316K45130P2744o41234l76501l78033Q6176K66613k55684k41128N5541
7382E400940j76409R9015N79091k13261l55832L90222N96857M85773o78003n51470
$$ plain form
7451 4107688 3448170 3042897 3329797 3598338 3308636 3187747 3364593 3041119 3451667 4100971
7441 4100971 4900791 4694854 3790531 4102914 4947813 5322220 4915278 5180152 5291606 5465763
7431 5465763 4946157 5517898 5783715 5387542 4934364 5138796 5679943 5785047 5525308 5420097
7421 5420097 5174350 5048185 5769608 6066091 5743846 4639644 4759405 5175046 6492428
7412 6492428 6788701 6195620 5936304 5444344 5289262 4760834 5255857 6083878 6384939 6132854
7402 6132854 6075912 6353060 6599189 5910717 5494875 5377958 5509880 5567702 6221926 6567316
7392 6567316 6812446 6885190 6243956 5867455 5489422 5575598 5842211 5586527 5345399 5400940
7382 5400940 5224531 5323546 5902637 5689376 5333544 5723766 6320623 6806396 6128393 5576923
7372E576923m50515n04587N2644L66998J7023K1803p5477l70930m31747K74737
7362D476872p7727r58885l13703K94643R34499j83137J76344j61380n84979l47447
7352C255100J4135O59674p2456o05134M1355J81630r7911m31568j70451k07804
7342B566570o80669j89266Q2122K51444J87092J041464l00431o87058O19976N1414
7332B942658o25471Q9778J49816r71189l06338J17207M46464J114840m00382q23684
7322A733699Q5985j0471m28642P1679J151787N94077j229684j148656o4131J017328
7312A772971J178604K37826o28813o14742o70169P3432N10180O83781p65264n99817
7302A177989q54352O77559J674224R89458j365999j372099K47073R40655Q35035
$$ plain form
7372 5576923 5126408 4621821 4674465 5041463 5058486 5080289 5004812 4633882 4202135 4476872
7362 4476872 4399145 3440260 3126557 3421200 4355699 4172562 4348906 4187526 3602547 3255100
7352 3255100 3269235 3928909 3856453 3251319 3292674 3474304 3376393 2944825 2774374 2566570
7342 2566570 1885901 1696635 1778757 2030201 2217293 3258757 2958326 2271268 2891244 2942658
7332 2942658 2317187 2406965 2556781 1585592 1279254 1396461 1842925 2957765 2557383 1733699
7322 1733699 1819684 1809213 1380571 1452250 2604037 3198114 1968430 819774 755643 1772971
7312 1772971 2951575 3189401 2560588 1945846 1275677 1349109 1859289 2543070 1777806 1177989
7302 1177989 323637 1001196 2675420 3664878 2298879 926780 1173853 2114508 2949543
7293B949543O86391L32587j301015p98775k8616N18095n06641M74254p71200o01977
7283I52646l68373l3739R83041R68734l922p63680l64855N52624N20332m72396
7273A970412n35372j60834O27265J024988q07836K51863J73035J09742Q9435j15859
7263B626839l63550l43360j21554k6948J017763M45770O9862l41576j87489l40177
7253B435580k0031m227R4533j658o6559L49270L81817L6139o78597p45324k06759
7242A574184Q04936N95811N50496O6209n55903r72649l42035J279038Q1842j36847
7232B945082q33899M8055k4956J39579l6333N39038M91860o15624m05546m61967
7222A785289K81893J024598N97166j53143j100682n79905r40779J034342R51984
$$ plain form
7293 2949543 3635934 3968521 2667506 1868731 1840115 2358210 1851569 2325823 1554623 952646
7283 952646 584273 550534 1533575 2502309 2498387 1734707 1369852 1922476 2442808 1970412
7273 1970412 1435040 1274206 1901471 2926459 2118623 2370486 2543521 2653263 2742698 2626839
7263 2626839 2263289 1919929 1798375 1771427 2789190 3234960 3304822 2963246 2775757 2435580
7253 2435580 2415549 2411322 2505855 2504197 2437638 2786908 3168725 3204864 2526267 1780943 1574184
7242 1574184 2379120 2974931 3525427 3591636 3035733 2063084 1721049 3000087 3081929 2945082
7232 2945082 2111183 2159238 2134282 2273861 2237528 2776566 3268426 2652802 2247256 1785289
7222 1785289 2067182 3091780 3688946 3535803 2435121 1855216 914437 1948779 2900763
7213B900763N48242M94708o56918p24786K57277p3237m2071P87881K62904j34819
7203C619944l96984n97577m50007R87064L79703m17719p31300j9263Q67858O34595
7193C876314o91134m14484N38025l11163l31344j72537j12437L44220M63112K2524
7183C211096r19603o62101n9202N20304P42323O19652l14752o55344J2409P41800
7173C236582p02151o34380l04111K39774M44149Q18229N18914q91551j013257
7164A712198J45540R24530L27862r52760o34736L47505L07592m9772N58161N11085
7154C197205l6822m70541m87480m32631J06979N93874M85403k3458p53769o50057
7144A528703R0517M27493O53649Q3646j69016P22615P6994p60953q31807J85368
$$ plain form
7213 2900763 3449005 3943713 3286795 2562009 2819286 2746049 2703978 3491859 3754763 3619944
7203 3619944 3222960 2625383 2175376 3162440 3542143 3124424 2393124 2373861 3241719 3876314
7193 3876314 3185180 2770696 3308721 2997558 2666214 2493677 2381240 2725460 3188572 3211096
7183 3211096 2291493 1629392 1570190 2090494 2832817 3452469 3137717 2482373 2494782 3236582
7173 3236582 2534431 1900051 1595940 1835714 2279863 3098092 3617006 2725455 1712198
7164 1712198 1857738 2782268 3110130 2157370 1522634 1870139 2177731 2127959 2686120 3197205
7154 3197205 3160383 2689842 2202362 1769731 1876710 2470584 2955987 2932529 2178760 1528703
7144 1528703 1619220 2046713 2700362 2784008 2614992 3337607 3414601 2653648 1821841 2007209
7134B007209O34184J93501j40710L7709N58631r73213o88381N04646J141726K80275
7124C555577q58085m78627k51937J46147j04204L26191J02304j54303J57245k93702
7114B146606p5808L22603O07792J20541j84923j39901P26903L30186q36494p37183
7104B280322k34314j04049P55789J297054M06661j478763q17624R42839Q67995
7095C915910j01248n87398m68379n13023N2164L79175j77926K42524J34732K69613
7085C146144j88603n12972k75207L18675n67948l42635O77133K94057K08224n23091
7075B233777J11328n35709n9878L77928M35535n59228j09897K52149M4500m54067
7065A736438L5588L26428j58744p68261l72475P48044P30694p3825L04423j21317
$$ plain form
7134 2007209 2641393 2834894 2694184 2731893 3290524 2317311 1628930 2133576 3275302 3555577
7124 3555577 2697492 2218865 1966928 2113075 2008871 2335062 2437366 2283063 2440308 2146606
7114 2146606 2070798 2393401 3001193 3121734 2936811 2796910 3523813 3853999 3017505 2280322
7104 2280322 2046008 1941959 2697748 3994802 4401463 2922700 2105076 3047915 3915910
7095 3915910 3814662 3227264 2758885 2245862 2298026 2677201 2499275 2741799 2876531 3146144
7085 3146144 2957541 2444569 2169362 2488037 1920089 1577454 2254587 2548644 2756868 2233777
7075 2233777 2345105 1809396 1749518 2127446 2562981 2003753 1893856 2146005 2190505 1736438
7065 1736438 1772026 2098454 1939710 1171449 798974 1547018 2277712 2203887 2508310 2386993
7055B386993j038841n24671R23526Q06660K21058m27420n84091l91276Q22020
7046B193958N83633j27747j503531j05546P83421M26437l2840l48346J32308n87677
7036A414070J49370M59302n9378J14577J17446J1458J4403j24624m23348l67679
7026A305597k4011O28446M50429m83428Q0758N65539K52606k2749j220686o40596
7016H91905O03710K56351k81698M65456K45169p0596n86422j48413J310322P96443
7006C482227m12399n95759m62313j25741o1397K84431l9574r7729m21387m62576
6996A087783L39244K30665q0337O61280R46774J58121l38789q51784K79622K22664
6986B655243J23574j73708K07331j97005n13597j074324m7311J12546M20800M04448
$$ plain form
7055 2386993 1348152 823481 1747007 2553667 2774725 2347305 1763214 1371938 2193958
7046 2193958 2777591 2649844 1146313 1040767 1824188 2250625 2217785 1869439 2001747 1414070
7036 1414070 1563440 2022742 1963364 2077941 2195387 2206845 2221248 2096624 1673276 1305597
7026 1305597 1281586 1910032 2360461 1877033 1957791 2523330 2775936 2753187 1532501 891905
7016 891905 1495615 1751966 1470268 1935724 2180893 2110297 1523875 1375462 2685784 3482227
7006 3482227 3069828 2474069 2011756 1886015 1824618 2109049 2069475 1971746 1550359 1087783
6996 1087783 1427027 1657692 1577355 2238635 3185409 3343530 3004741 2152957 2432579 2655243
6986 2655243 2778817 2605109 2812440 2615435 2101838 1027514 980203 1092749 1513549 1917997
6976A917997Q45166J039309L90594q58190m28883j47662o21882l96874N81614
6967B321189J149134N09255k67994m16971l79511J17498L1641k95593j01131K47448
6957B914965l54470J48264n11150Q21792J294415M6273j391703l04501R10783
6948C574668M19220K78135m69463m04860j85871M35677N10765K36814k35998j030824
6938C128263K22345J44471R4119j7064r818k5658k30577n41046M44913J125844
6928D335792M51054j09389m00628j46478K44031K00479q57780l19663K26011M82588
6918D106017K60476M83229L09454n16959q39773M1319j25457N38941J001856N54697
6908E813800j59151l53716o7833P29922P51694L95452p36676j83427k66229K72142
$$ plain form
6976 1917997 2763163 3802472 4193066 3334876 2905993 2758331 2136449 1739575 2321189
6967 2321189 3470323 3979578 3711584 3294613 2915102 3032600 3064241 2768648 2667517 2914965
6957 2914965 2560495 2708759 2197609 3019401 4313816 4360089 2968386 2663885 3574668
6948 3574668 3993888 4272023 3802560 3397700 3211829 3647506 4158271 4395085 4159087 3128263
6938 3128263 3350608 3495079 3589198 3572134 3562316 3536658 3306081 2765035 3209948 4335792
6928 4335792 4786846 4677457 4276829 4130351 4374382 4574861 3717081 3397418 3623429 4106017
6918 4106017 4366493 4849722 5159176 4642217 3802444 3843763 3718306 4257247 5259103 5813800
6908 5813800 5654649 5300933 5233100 5963022 6714716 7110168 6373492 6190065 5923836 6195978
6898F195978K94450J06606M1823O87125m3368M56027J531224J059417m3351m66459
6888I819472n97518K88715Q54691M02525L90774L21789J04914L67936Q14331O65230
6878A3432859O72775J095874M20453j92511l73515m16649L83852M99997M56492
6869A5979627N58604j76932j199136p29653J018913Q97620L84592Q03194j06324
6860A7430505M02737K28405M21631K64454n67879l01738L35886M95602L00413
6851A9010016M6194k98006K40577M20203J133061L53992K8084j5492j64834r16449
6841A9837346P32402K35124O2801m48845j586260L10423J053484J500807k26231
6832B1471051p61987n70361j0012K50604j75272J04310L45897n7987j53921q61986
$$ plain form
6898 6195978 6490428 6597034 6638857 7325982 7282614 7738641 9269865 10329282 10285931 9819472
6888 9819472 9221954 9510669 10365360 10767885 11158659 11480448 11585362 11953298 12767629 13432859
6878 13432859 14105634 15201508 15621961 15429450 15055935 14639286 15023138 15523135 15979627
6869 15979627 16538231 16361299 15162163 14432510 15451423 16349043 16733635 17536829 17430505
6860 17430505 17833242 18061647 18483278 18747732 18179853 17878115 18214001 18709603 19010016
6851 19010016 19056210 18758204 18998781 19418984 20552045 20906037 20934121 20918629 20753795 19837346
6841 19837346 20569748 20804872 20867673 20418828 18832568 19142991 20196475 21697282 21471051
6832 21471051 20709064 20138703 20128691 20379295 20204023 20308333 20654230 20596243 20442322 19580336
6822A9580336j24500l08402l37331m64844n83802N13317N79326J97932j434325
6813A7617707j117116j39197O85984J40565o38981N97590O31887j22570j368997
6804A6286872n26855J59314N23911k99005l66592o01404K76999J282439Q6218
6795A6821897j127222m33994l43792r5773k40156l01818l8322q31239j410242
6786A1999339o06334j15197j48141k85075o84664l67066o30704k93799L06588
6777I174947L9272q91334q95600j37169Q63996Q3908o71019q45656p11172k20109
6767E790064K48668K17607K38957p21543o25848j74920n26132k17603M471R21092
6757E154813J125466j78232r70049o44303L83789Q5636k59197N25380M6465j22889
$$ plain form
6822 19580336 19455836 19147434 18810103 18345259 17761457 18274774 18854100 19052032 17617707
6813 17617707 16500591 16361394 17047378 17187943 16548962 17146552 17778439 17655869 16286872
6804 16286872 15760017 15919331 16443242 16144237 15777645 15176241 15453240 16735679 16821897
6795 16821897 15694675 15260681 14916889 14821116 14580960 14279142 14240820 13409581 11999339
6786 11999339 11393005 11277808 11129667 10844592 10159928 9792862 9162158 8868359 9174947
6777 9174947 9214219 8322885 7427285 7290116 8154112 8238020 7567001 6721345 6010173 5790064
6767 5790064 6038732 6256339 6495296 5773753 5147905 4972985 4446853 4229250 4233721 5154813
6757 5154813 6280279 6102047 5131998 4487695 4871484 4957120 4697923 5223303 5269768 5146879
6747E146879L66975l15446r39469j113751q2849P83399P93437R74241L0037j72027
6737E471426j362093j191716Q32255J159244L49124J33229p94560k5180J5923
6728D587652j65510K71039M4228p0341J06068J064399L9316l93381n34798q068
6718D940604j68809k03016O73037O65821J52213m13178k5591o95376n90377Q46311
6708E181639J253845L60404p86944p99072n60793L18262R55768M67319l53533
6699F036895O98044O10433l08523p98632n10479J09726q5322n30484n90140O32187
6689E263705J398504M73430k59417m15881n86057l14567K90190L06467J0221n24472
6679E642123m68443K75862k95398j033848k31743J088869Q74663K7452m35392
$$ plain form
6747 5146879 5513854 5198408 4258939 3145188 3062339 3845738 4639175 5613416 5643453 5471426
6737 5471426 4109333 2917617 3749872 4909116 5258240 5391469 4596909 4571729 4587652
6728 4587652 4422142 4693181 4737409 4667068 4773136 5837535 5876851 5483470 4948672 4940604
6718 4940604 4771795 4568779 5241816 5907637 6059850 5646672 5621081 4925705 4335328 5181639
6708 5181639 6435484 6795888 6008944 5209872 4649079 4967341 5923109 6390428 6036895
6699 6036895 6734939 7345372 7036849 6238217 5727738 5837464 5752142 5221658 4631518 5263705
6689 5263705 6662209 7135639 6876222 6460341 5874284 5559717 5849907 6156374 6166595 5642123
6679 5642123 5173680 5449542 5154144 4120296 3888553 4977422 5852085 5879537 5444145
6670E444145n29058m22010M80259Q83065k26683k48517M93825K17931o67563P265
6660E432659J09621M78027j106944n89719J47378K78410o55753j92499L83602
6651D284782n05352o4482M2214o2611O08903J026828M00754p61424j240957K96339
6641D024994K59827L98920N30904N33930q81679p19679o5489j61999n65734n35317
6631B818678L33203M57034n7980j79806N50710M70955l46696O19505K87776k37345
6621D716034j148804J78815M69998L9089q40987m80968J31263R4477O52957P06748
6611D518622r32303q55026k41020P97038P61917Q2682K94308j20333l60822j23719
6601C821344M15934m58155l49931O57979R71113j41704j296102k15293m6232O64519
$$ plain form
6670 5444145 4915087 4493077 4973336 5856401 5629718 5381201 5875026 6092957 5425394 5432659
6660 5432659 5542280 6020307 4913363 4323644 4471022 4749432 4093679 3901180 4284782
6651 4284782 3779430 3714948 3757162 3694551 4303454 5330282 5731036 4969612 3728655 4024994
6641 4024994 4284821 4683741 5214645 5748575 4866896 4147217 4081728 3919729 3353995 2818678
6631 2818678 3151881 3608915 3550935 3371129 3921839 4392794 4046098 4665603 4953379 4716034
6621 4716034 3567230 3746045 4216043 4255132 3414145 2933177 3064440 3158917 3811874 4518622
6611 4518622 3586319 2731293 2490273 3287311 4049228 4131910 4426218 4305885 3945063 3821344
6601 3821344 4237278 3779123 3429192 4087171 5058284 4916580 3620478 3405185 3358953 4023472
6591D023472P01245k23909o5582j19585P74575L20069J68414m85763q92850j373112
6581B826974j40135J447608J380003n74591l72741J19540J76086o42375j47632
6572D072737M22534L18828P8271o9065J59701R1814R0917l42944J1839J94329
6562E028961J12879N71082N2053j72508n76127L41736K93418l84746l56881N78565
6552E488432P41945j85626o78871N18270M17540l93793n62936m33463p081l16832
6542D587585M06817K45805j85327M96864J389167l69785n54316M13870M03518
6533F834198m99438r01269Q90769P26337j259384k93476R09355J262149m9303
6524G619938r82355n00841j71779L17293P71813J7686j02073K47944j23523k34460
$$ plain form
6591 4023472 4724717 4500808 4435226 4315641 5090216 5410285 5578699 5092936 4200086 2826974
6581 2826974 2686839 4134447 5514450 4939859 4567118 4686658 4862744 4220369 4072737
6572 4072737 4495271 4814099 4892370 4823305 4983006 5074820 5165737 4822793 4834632 5028961
6562 5028961 5141840 5712922 5764975 5592467 5016340 5358076 5651494 5266748 4909867 5488432
6552 5488432 6230377 6044751 5365880 5884150 6301690 5907897 5344961 4911498 4904417 4587585
6542 4587585 4994402 5240207 5054880 5551744 6940911 6571126 6016810 6430680 6834198
6533 6834198 6334760 5433491 6324260 7050597 5791213 5497737 6407092 7669241 7619938
6524 7619938 6637583 6136742 5964963 6282256 7054069 7071755 6969682 7217626 7094103 6859643
6514F859643N31987J117672K93727o02378l90258P55741l29017m71011K8102n5057
6504G739151r3597O29452R81800M90934l05451l39660K85414J90082Q34933R96302
6494A1409360N82197L51007L06240l53158J31759j20366L88757O21203J514355
6485A4831354J245515N06541J211736R181N01642P95837Q08548K05007l83300
6476A9732061n00497k26370m4462o36565M79558K47188J29751N52170P6071N60933
6466B0369838l75761o87772j95130Q3353r56686j234713m05950k74168n10994
6457A5812017j296406l73824N71199k52780r59358j6206n30389n58401J37162
6448A2533014J105423R30523p2764m18908r19612P6817P83190P05659J2611n02383
$$ plain form
6514 6859643 7391630 8509302 8803029 8200651 7810393 8566134 8237117 7766106 7794208 7739151
6504 7739151 7645554 8275006 9256806 9747740 9442289 9102629 9388043 9578125 10413058 11409360
6494 11409360 11991557 12342564 12648804 12295646 12427405 12307039 12695796 13316999 14831354
6485 14831354 16076869 16583410 17795146 17804327 18305969 19101806 19910354 20115361 19732061
6476 19732061 19231564 19005194 18960732 18324167 18803725 19050913 19180664 19732834 19808905 20369838
6466 20369838 19994077 19306305 19111175 19194528 18237842 17003129 16597179 16323011 15812017
6457 15812017 14515611 14141787 14712986 14460206 13500848 13484642 12954253 12395852 12533014
6448 12533014 13638437 14568960 14496196 14077288 13157676 13234493 14017683 14723342 14735953 14233570
6438A4233570K59501J024134j31219n61089J95843M00225M67948P23288Q22027
6429A7434228J4020j8560L04604O72712M64484J246526R34624R01817M20531K57346
6419B2632332Q68767R57849J446858K446487K664742Q49680L2438K315766K875638
6410C7090557K630023J694756J180350J892371K060536J388201J559341J196896
6402E0693031M43751L69844M09819l46245n11183k88551J56926q79163j535492
6393D8512737l87722k24572r4685j079273j127300j488821j631862r5895N1213
6384D2433820r08332j063361j066723n73454n81298k52772n0467l77927r35786
6375C6623700l62868M6058O67546J406172O21068r29547o72261q03849M13253
$$ plain form
6438 14233570 14493071 15517205 15385986 14824897 15020740 15420965 15888913 16612201 17434228
6429 17434228 17448248 17429688 17734292 18407004 18871488 20118014 21052638 21954455 22374986 22632332
6419 22632332 23501099 24458948 25905806 28352293 31017035 31866715 31899153 34214919 37090557
6410 37090557 39720580 41415336 42595686 44488057 46548593 47936794 49496135 50693031
6402 50693031 51136782 51506626 51916445 51570200 51059017 50770466 50927392 50048229 48512737
6393 48512737 48125015 47900443 47805758 46726485 45599185 44110364 42478502 42382607 42433820
6384 42433820 41525488 40462127 39395404 38821950 38240652 37987880 37937413 37559486 36623700
6375 36623700 36260832 36306890 36974436 38380608 39001676 38072129 37399868 36596019 37009272
6366C7009272m9583j118095k050097q36352o23413n95369L18164n56383k86918
6357C1211226L50609L67658R45270J289755Q70416K75309Q47993l43495l41991
6348C5472750j77587M0459n20918j031778j030102p34667q55871o16897N1212
6339C0596601m86078l86084o47385q08324n89281L9391Q53326L03557M004O01700
6329B9481427M35561K63774m41763k04372O82143J282479P20113j09823L24017
6320C2433556r35447j410739q37326n87160m62444j639683r83456j40480O29935
6311B6066756J45810K8431m51369J56837N84391R09134M74279L60314M17596L58343
6301B9050522O31587J292056J633653J041210J301344R24667J370132J654818
$$ plain form
6366 37009272 36959689 35841594 33791497 32955145 32331732 31736363 32054527 31498144 31211226
6357 31211226 31561835 31929493 32874763 34164518 35034934 35310243 36158236 35814741 35472750
6348 35472750 35295163 35335622 34814704 33782926 32752824 32018157 31162286 30545389 30596601
6339 30596601 30110523 29724439 29077054 28268730 27679449 27718840 28572166 28875723 28879727 29481427
6329 29481427 29916988 30180762 29738999 29534627 30216770 31499249 32219362 32109539 32433556
6320 32433556 31498109 30087370 29250044 28662884 28200440 26560757 25577301 25436821 26066756
6311 26066756 26212566 26240997 25789628 25946465 26530856 27439990 27914269 28274583 28692179 29050522
6301 29050522 29682109 30974165 32607818 33649028 34950372 35875039 37245171 38899989
6293C8899989L04755L25686J9674n9342j56165P67058O09625k92472k98101N88850
6283D0709557M30921m55968j639356j458276o55902j427955j493424j482537q30192
6274C1696868p89661m32167n97059q86618k36388L36837K05203j874060o43337
6265B6779618J149369L95728m77031j046602j562919j462357m27049N74610J488942
6256B5412309J66603o65952j364723p45079j36381j72354K31674L72786k82101
6247B2816782k77155M98740k72919p03343m05757k85591k59230O62054K04466
6238B1978047P74542j16336k1851R05896J316108l62403J07250J454018Q49556
6229B6884827K14125l43277N13304J89303J4267K57759N14084Q40191L23698J31575
$$ plain form
6293 38899989 39204744 39530430 39550104 39490762 39334597 40101655 40711280 40418808 40120707 40709557
6283 40709557 41140478 40684510 39045154 37586878 36930976 35503021 34009597 32527060 31696868
6274 31696868 30907207 30475040 29877981 28991363 28754975 29091812 29297015 27422955 26779618
6265 26779618 27928987 28324715 27847684 26801082 25238163 23775806 23348757 23923367 25412309
6256 25412309 25578912 24912960 23548237 22803158 22666777 22494423 22726097 23098883 22816782
6247 22816782 22539627 23038367 22765448 22062105 21656348 21370757 21111527 21773581 21978047
6238 21978047 22752589 22636253 22614402 23520298 24836406 24474003 24581253 26035271 26884827
6229 26884827 27098952 26755675 27268979 27458282 27472549 27730308 28244392 29084583 29408281 29539856
6219B9539856j341m5086J50522K75063P09283K36714P63391Q55888N76804j024774
6209C2036320j120649k68727J60844j10607j4756j085032j283322j344664n39644
6200B6429763l07349r81084k91569n15961m49796k645p11905j534912k48546M29007
6190B1815003n34094j117703l24096L17154m09276n79549q3662P25969J91840
6181B0001586L23330N11627o10772o87223J60914M66879r5035n98319l8945q45628
6171A8588414j585944n91135M34819K12530o94744K76111M9978p87830k89901
6162A5612298N2852N79669j91930L28577O57103N25027o60148K39112R19573q07471
6152A7254662o95310q79868K11483J08271N17486J127285J30386k19689L8128
$$ plain form
6219 29539856 29538515 29493429 29643951 29919014 30628297 30865011 31628402 32484290 33061094 32036320
6209 32036320 30915671 30646944 30807788 30697181 30682425 29597393 28314071 26969407 26429763
6200 26429763 26122414 25141330 24849761 24333800 23884004 23881359 23169454 21634542 21385996 21815003
6190 21815003 21280909 20163206 19839110 20156264 19746988 19167439 19083777 19809746 20001586
6181 20001586 20324916 20836543 20225771 19538548 19699462 20166341 20071306 19472987 19434042 18588414
6171 18588414 17002470 16411335 16846154 17058684 16363940 16640051 16690029 15902199 15612298
6162 15612298 15665150 16244819 16052889 16381466 17038569 17563596 16903448 17142560 18062133 17254662
6152 17254662 16559352 15679484 15890967 15999238 16516724 17644009 17774395 17554706 17592834
6143A7592834L76495R75849R51764J021378N25998M04164Q64278J271179M21565
6134B4405504j019670j399630o80314l30961o39165k34045k1791j089416q40899
6125A8149613j77728L56792J78050j133037q78357Q485L36577m94262r15967r94356
6115A4435810j00443L99305J54858j41420o6543J31167o14304R2260M38927L2820
6105A4762437q51543p63000J87763j23785l07663L62562j5878O48048N26753l61316
6095A4064378l71631k93065O0416o16253j178784n57877L45106n42553o07306
6086A0302431l37570L57792N16250p29840m32891m20108k13907k36973J59053
6077H964237j70434L97399j87607q99548K15677J57849k10622k28717k56078j24001
$$ plain form
6143 17592834 17969329 18945178 19896942 20918320 21444318 21848482 22712760 23983939 24405504
6134 24405504 23385834 21986204 21305890 20974929 20335764 20101719 20079928 18990512 18149613
6125 18149613 17971885 18328677 18506727 17373690 16495333 16503818 16840395 16346133 15430166 14435810
6115 14435810 14335367 14734672 14889530 14748110 14681567 14812734 14198430 14290690 14729617 14762437
6105 14762437 13910894 13147894 13335657 13211872 12904209 13266771 13250893 13898941 14425694 14064378
6095 14064378 13692747 13399682 13460098 12843845 11665061 11107184 11452290 10909737 10302431
6086 10302431 9964861 10322653 10838903 10109063 9676172 9256064 9042157 8805184 8964237
6077 8964237 8793803 9191202 9003595 8104047 8319724 8477573 8266951 8038234 7782156 7658155
6067G658155K93174P006J98606M43530O7222r39474p13981k33216N25859K5282
6057G332163o44939j08348N60466P22863O1533j79150K29537L90359l36243j087963
6047F940278o32107L06729J193525Q48648J97124j68720n3784p76280l34738M40613
6037G961288P98220l57302o82366M35908N94966k2331m6857p3683p2117O54987
6027I190713P98782m28708p50147L30668M10333P24606J26857m89396m56465m76932
6017H980311m97395L35021N01215J19982J22541L70451P17852M87746m9756j55231
6007A0932737q55428J213032J551172J14962J2007l61014l6026l04628j233334
5998A1033480j4567O2553m83827n20425J189741R09764L88458l4242r22826n873
$$ plain form
6067 7658155 7951329 7958335 8156941 8600471 8667693 7728219 7014238 6781022 7306881 7332163
6057 7332163 6687224 6578876 7139342 7862205 7923738 7744588 7974125 8364484 8028241 6940278
6047 6940278 6308171 6614900 7808425 8657073 8854197 8685477 8631693 7855413 7520675 7961288
6037 7961288 8759508 8402206 7719840 8155748 8750714 8728383 8681526 8607843 8535726 9190713
6027 9190713 9989495 9560787 8810640 9141308 9551641 10276247 10403104 9913708 9457243 8980311
6017 8980311 8482916 8817937 9319152 9439134 9561675 9932126 10649978 11137724 11087968 10932737
6007 10932737 10077309 11290341 12841513 12956475 12968482 12607468 12571442 12266814 11033480
5998 11033480 11018913 11081466 10597639 10077214 11266955 12176719 12565177 12530935 11608109 11602236
5988A1602236Q32745N25082q49674k02078Q95455J610517J356270K73340j62808
5979A5881085k49632m93225P9287L35576O6642n6920K39135N3n08609l49293N87458
5968A5531557J658482L87465K38266R62371m2920n95304N24668J257435k878k69367
5958A9649775n29946R25873R21361P2156l64350l6227M09930J212258J261972
5949B3522802L32317M62474N03040j70267J09155P78012k46269o60424l37142
5940B4293698L04600P41273P66630J601540J546119Q34020O52098J339267O38324
5931C2717569k73502N87709j47767j85848n81507q14222m37217q47354p97479
5922B9220382j071356m61452m50788k70865k18957j052512o57076j222647o76512
$$ plain form
5988 11602236 12434981 12960063 12110389 11908311 12803766 14414283 15770553 16043893 15881085
5979 15881085 15631453 15138228 15217515 15553091 15619733 15562813 15801948 15802001 15293392 14944099 15531557
5968 15531557 17190039 17577504 17815770 18778141 18735221 18139917 18664585 19922020 19919142 19649775
5958 19649775 19119829 20045702 20967063 21039219 20674869 20638642 21048572 22260830 23522802
5949 23522802 23855119 24317593 24820633 24650366 24759521 25537533 25291264 24630840 24293698
5940 24293698 24598298 25339571 26106201 27707741 29253860 30087880 30739978 32079245 32717569
5931 32717569 32444067 33031776 32884009 32698161 32116654 31302432 30865215 30017861 29220382
5922 29220382 28149026 27687574 27236786 26965921 26746964 25694452 25037376 23814729 23138217
5913B3138217L17363K81595j043592p31186j47518O50347O59471L02003Q6254
$$ plain form
5913 23138217 23455580 23737175 22693583 21962397 21814879 22465226 23124697 23426700 23512954
$$ [...]
##END NTUPLES=NMR SPECTRUM
##END=
