##TITLE=1H_EC-3302(III-2)
 CDCl3
 8 sc, 
 31.10.2023
##JCAMPDX= 6.0         $$ Bruker NMR JCAMP-DX V2.0
##DATA TYPE= NMR SPECTRUM
##DATA CLASS= NTUPLES
##ORIGIN= UXNMR, Bruker Analytische Messtechnik GmbH
##OWNER= root
$$ XWIN-NMR		Version 3.5
$$ Tue Oct 31 14:00:00 2023 Russian Standard Time (UT+4h)  she@DPX200
##.OBSERVE FREQUENCY= 200.13135
##.OBSERVE NUCLEUS= ^1H
##.ACQUISITION MODE= SIMULTANEOUS
##.ACQUISITION SCHEME= undefined
##.AVERAGES= 8
##.DIGITISER RES= 18
##SPECTROMETER/DATA SYSTEM= spect
##.PULSE SEQUENCE= zg30
##.SOLVENT NAME= D2O
##.SHIFT REFERENCE= (INTERNAL, D2O, 0, 15.7348)
##AUDIT TRAIL= $$ (NUMBER, WHEN, WHO, WHERE, WHAT)
$$ ##TITLE= Audit trail, XWIN-NMR		Version 3.5
$$ ##JCAMPDX= 5.01
$$ ##ORIGIN= Bruker BioSpin GmbH
$$ ##OWNER= she
$$ F:/spectra/data/she/nmr/H-F/1/pdata/1/auditp.txt
$$ ##AUDIT TRAIL=  $$ (NUMBER, WHEN, WHO, WHERE, WHAT)
(   1,<2023-10-31 13:58:07.51 +0400>,<she>,<DPX200>,
      <created by zg, POWCHK disabled, PULCHK disabled
       configuration hash MD5:
       00 E9 B6 7A A2 85 ED C7 34 08 36 98 17 FE 4E 26
       data hash MD5: 16K
       89 9E C4 AB BD BB 75 F2 5C 53 F0 8B 67 43 15 98>)
(   2,<2023-10-31 13:58:09.70 +0400>,<she>,<DPX200>,
      <Start of raw data processing
       efp BC_mod = 2 LB = 0.24 FT_mod = 6 PKNL = 1 PHC0 = -23866.54 PHC1 = 11.05271 SI = 16K 
       data hash MD5: 16K
       29 D0 3E 59 B0 1D A3 B3 12 3D 2C D0 FE 5B 82 ED>)
(   3,<2023-10-31 13:58:29.67 +0400>,<she>,<DPX200>,
      <pk PHC0 = -6.722368 PHC1 = -2.2 
       data hash MD5: 16K
       32 F5 47 51 75 6F D7 F1 F2 43 B0 8D 57 80 CF 64>)
(   4,<2023-10-31 13:58:32.85 +0400>,<she>,<DPX200>,
      <abs ABSG = 5 
       data hash MD5: 16K
       67 A6 B1 47 7E C8 70 E6 21 93 01 C8 D5 4E BC 2D>)
$$ ##END=
$$ 
$$ hash MD5
$$ 40 BF D9 E5 FC DE 48 7E D6 D7 D8 F9 9E F4 6A F7
##$RELAX= 
##$RELAX= 
##$RELAX= 
##$RELAX= 
##$RELAX= 
##$RELAX= 
$$ Bruker specific parameters
$$ --------------------------
##$DU= <F:/spectra>
##$EXPNO= 1
##$NAME= <H-F>
##$PROCNO= 1
##$TYPE= <nmr>
##$USER= <she>
##$AMP= (0..31)
100 100 100 100 100 100 100 100 100 100 100 100 100 100 100 100 100 100 
100 100 100 100 100 100 100 100 100 100 100 100 100 100 
##$AQSEQ= 0
##$AQ_mod= 1
##$AUNM= <au_zg>
##$AUTOPOS= <>
##$BF1= 200.13
##$BF2= 200.13
##$BF3= 200.13
##$BF4= 200.13
##$BF5= 200.13
##$BF6= 200.13
##$BF7= 200.13
##$BF8= 200.13
##$BYTORDA= 1
##$CFDGTYP= 0
##$CFRGTYP= 5
##$CHEMSTR= <none>
##$CNST= (0..31)
1 1 145 1 1 1 1 1 1 1 1 1 1 1 1 1 1 1 1 1 1 1 1 1 1 1 1 1 1 1 1 1 
##$CPDPRG= <>
##$CPDPRG1= <>
##$CPDPRG2= <>
##$CPDPRG3= <>
##$CPDPRG4= <mlev>
##$CPDPRG5= <mlev>
##$CPDPRG6= <mlev>
##$CPDPRG7= <mlev>
##$CPDPRG8= <mlev>
##$CPDPRGB= <>
##$CPDPRGT= <>
##$D= (0..31)
0 1.2 0 0 0 0 0 0 0 0.06 0 0.03 0 0 0 0 0.0002 0 0 0 0 0 0 0 0 0 0 0 0 
0 0 0 
##$DATE= 1698746286
##$DBL= (0..7)
120 120 120 120 120 120 120 120 
##$DBP= (0..7)
150 150 150 150 150 150 150 150 
##$DBP07= 0
##$DBPNAM0= <>
##$DBPNAM1= <>
##$DBPNAM2= <>
##$DBPNAM3= <>
##$DBPNAM4= <>
$$ [...]
##$SUBNAM3= <"">
##$SUBNAM4= <"">
##$SUBNAM5= <"">
##$SUBNAM6= <"">
##$SUBNAM7= <"">
##$SUBNAM8= <"">
##$SUBNAM9= <"">
##$SW= 18.05172834244
##$SWIBOX= (0..15)
0 0 2 0 0 0 0 0 0 0 0 0 0 0 0 0 
##$SW_h= 3612.71676300578
##$TD= 16384
##$TD0= 1
##$TE= 0
##$TE2= 300
##$TE3= 300
##$TEG= 300
##$TL= (0..7)
0 120 120 120 120 120 120 120 
##$TP= (0..7)
150 150 150 150 150 150 150 150 
##$TP07= 0
##$TPNAME0= <>
##$TPNAME1= <>
##$TPNAME2= <>
##$TPNAME3= <>
##$TPNAME4= <>
##$TPNAME5= <>
##$TPNAME6= <>
##$TPNAME7= <>
##$TPOAL= (0..7)
0.5 0.5 0.5 0.5 0.5 0.5 0.5 0.5 
##$TPOFFS= (0..7)
0 0 0 0 0 0 0 0 
##$TUNHIN= 0
##$TUNHOUT= 0
##$TUNXOUT= 0
##$USERA1= <user>
##$USERA2= <user>
##$USERA3= <user>
##$USERA4= <user>
##$USERA5= <user>
##$V9= 5
##$VALIST= <valist>
##$VCLIST= <CCCCCCCCCCCCCCC>
##$VD= 0
##$VDLIST= <DDDDDDDDDDDDDDD>
##$VPLIST= <PPPPPPPPPPPPPPP>
##$VTLIST= <TTTTTTTTTTTTTTT>
##$WBST= 1024
##$WBSW= 4
##$XGAIN= (0..3)
0 0 0 0 
##$XL= 0
##$YL= 0
##$YMAX_a= 377750
##$YMIN_a= -470064
##$ZGOPTNS= <>
##$ZL1= 120
##$ZL2= 120
##$ZL3= 120
##$ZL4= 120
##$ABSF1= 15.75019
##$ABSF2= -2.30166
##$ABSG= 5
##$ABSL= 3
##$ALPHA= 0
##$AQORDER= 0
##$ASSFAC= 0
##$ASSFACI= 0
##$ASSFACX= 0
##$ASSWID= 0
##$AUNMP= <proc_1d>
##$AZFE= 0.1
##$AZFW= 0.1
##$BCFW= 0
##$BC_mod= 2
##$BYTORDP= 0
##$COROFFS= 0
##$CY= -3
##$DATMOD= 1
##$DC= 0
##$DFILT= <>
##$DTYPP= 0
##$F1P= 0
##$F2P= 0
##$FCOR= 1
##$FTSIZE= 16384
##$FT_mod= 6
##$GAMMA= 0
##$GB= 0
##$INTBC= 1
##$INTSCL= 3.70164e-10
##$ISEN= 128
##$LB= 0.24
##$LEV0= 0
##$LPBIN= 0
##$MAXI= 10000
##$MC2= 0
##$MEAN= 0
##$ME_mod= 0
##$MI= 1.114404
##$NCOEF= 0
##$NC_proc= -7
##$NLEV= 6
##$NOISF1= 3.799351
##$NOISF2= 2.8
##$NSP= 0
##$NTH_PI= 0
##$NZP= 0
##$OFFSET= 15.73477
##$PC= 1
##$PHC0= -23873.26
##$PHC1= 8.85271
##$PH_mod= 1
##$PKNL= yes
##$PPARMOD= 0
##$PSCAL= 0
##$PSIGN= 0
##$REVERSE= no
##$SF= 200.130007357932
##$SI= 16384
##$SIGF1= 3
##$SIGF2= 2
##$SINO= 5.538805
##$SIOLD= 16384
##$SREGLST= <1H.CDCl3>
##$SSB= 0
##$STSI= 16384
##$STSR= 0
##$SW_p= 3612.71676300578
##$SYMM= 0
##$S_DEV= 0
##$TDeff= 16384
##$TDoff= 0
##$TI= <>
##$TILT= no
##$TM1= 0
##$TM2= 0
##$TOPLEV= 0
##$USERP1= <user>
##$USERP2= <user>
##$USERP3= <user>
##$USERP4= <user>
##$USERP5= <user>
##$WDW= 1
##$XDIM= 16384
##$YMAX_p= 301058209
##$YMIN_p= -525498
$$ End of Bruker specific parameters
$$ ---------------------------------
##NTUPLES= NMR SPECTRUM
##VAR_NAME=  FREQUENCY,     SPECTRUM/REAL,   SPECTRUM/IMAG
##SYMBOL=    X,             R,               I
##VAR_TYPE=  INDEPENDENT,   DEPENDENT,       DEPENDENT
##VAR_FORM=  AFFN,          ASDF,            ASDF
##VAR_DIM=   16384,         16384,           16384
##UNITS=     HZ,            ARBITRARY UNITS, ARBITRARY UNITS
##FACTOR=    0.220516191357247, 1,           1
##FIRST=     3148.99960008552, 0,            0
##LAST=      -463.717162920264, 0,           0
##MIN=       -463.717162920264, -525498,     0
##MAX=       3148.99960008552, 301058209,    0
$$ Real data points
##PAGE= N=1
##DATA TABLE= (X++(R..R)), XYDATA
$$ [...]
7274e4254j32349J63996p6016R1533J0405j12579K7462K6720J11749M3942P9405
$$ -54254 -186603 -22607 -98623 -7090 3315 -109264 -81802 -55082 56667 100609 180014
7263A80014Q4363k10102J00642m2489K5973L2359k46108P3704k3062n1295L2455
$$ 180014 264377 54275 154917 112428 138401 170760 -75348 -1644 -24706 -76001 -43546
7252d3546N0212O4461J0363M4382j28544j25424J67853K51031m815j42365l4069
$$ -43546 6666 71127 81490 125872 -2672 -128096 39757 290788 285973 143608 109539
7241A09539j02873j9580K05815r09n4151k43124M3165L8545j33356P0512J49971
$$ 109539 6666 -12914 192901 191992 137841 -105283 -62118 -23573 -156929 -86417 63554
7230F3554Q3734J24520R8400j82558K6538N1598L6938J01050l5561q0614j47964
$$ 63554 147288 271808 370208 187650 214188 265786 302724 403774 368213 287599 139635
7219A39635o7302P0943P8423J5751j88382J68724J9147P5028M8439q784r9811
$$ 139635 72333 143276 221699 237450 49068 217792 236939 311967 360406 351622 251811
7208B51811m2574J10709J4275k84165M4337P7340m7379l9905J60649j94165L3441
$$ 251811 209237 319946 334221 50056 94393 171733 124354 84449 245098 50933 84374
7197H4374o6753Q3824J5464q7929J80989O7721j3606p2713j68704J73567k231
$$ 84374 17621 101445 116909 28980 209969 277690 264084 191371 22667 196234 194003
7186A94003j75857J20473l8633R2571j98196Q6431J5516J4217o7098J3764K05226
$$ 194003 18146 138619 99986 192557 -5639 80792 96308 110525 43427 57191 262417
7175B62417R6513n6789k7490J911k81678J55165J17531j38080p2540k9283N8069
$$ 262417 358930 302141 274651 276562 -5116 150049 267580 129500 56960 27677 85746
7164H5746J06545P3032J7688k68112J5933Q8932l2011m1244p4353k8490R3131
$$ 85746 192291 265323 283011 14899 30832 119764 87753 46509 -27844 -56334 36797
7153C6797r4043j07587J41341K7204J6264l6161O5534J67291m2674j49028J40227
$$ 36797 -57246 -164833 -23492 3712 19976 -16185 49349 216640 173966 24938 165165
7142A65165j63801J26224L1763j24321Q2382k35488J15270L8259j4345J87902
$$ 165165 1364 127588 159351 35030 117412 -118076 -2806 35453 21108 209010
7132B09010J03093j00466K15116J4766j84425k1874j1189M5353j49883Q3555J58310
$$ 209010 312103 211637 426753 441519 257094 235220 224031 269384 119501 203056 361366
7121C61366n2559p0757j34098P6610n5691o0432j4245j62147K09810J5236J65478
$$ 361366 308807 238050 103952 180562 124871 64439 50194 -111953 97857 113093 278571
7110B78571N4177p7158L0823k5443j95372j23792L48417K4157N2977n8556j20915
$$ 278571 332748 255590 286413 260970 65598 -58194 290223 314380 367357 308801 187886
7099A87886l7607j68233P5307M8613J76728o7578j78646J68223L0326j21892P2425
$$ 187886 150279 -17954 57353 105966 282694 215116 36470 204693 235019 113127 185552
7088A85552l7306J0191J83465n7114j5351J78286O53j43447o7293P3682L9790
$$ 185552 148246 158437 341902 284788 269437 447723 448376 304929 237636 311318 351108
7077C51108J15976j12444N665j3559k92080j7734K95380l994r8526k967j53579
$$ 351108 467084 354640 360305 346746 54666 36932 332312 328318 229792 226825 73246
7066G3246l1626K79237j24144j27627Q1366j23622j63850O0692L12403J13863
$$ 73246 41620 320857 196713 69086 150452 26830 -137020 -76328 236075 349938
7056C49938j15366J32032O5947n3030m1916j20987j38240J51315N5296m321P6382
$$ 349938 234572 366604 432551 379521 337605 216618 78378 229693 284989 280668 357050
7045C57050j27872o448j29572N1114J31974n3816q8319O6918L2416M3375J72772
$$ 357050 229178 222730 93158 144272 276246 222430 134111 201029 233445 276820 449592
7034D49592j70190m3548J96204K2981j27921j48741L3147k4503K15744J2857r820
$$ 449592 279402 235854 432058 455039 327118 178377 211524 187021 402765 415622 405802
7023D05802K42260k25994j30803K09369O3872J940K9415N5506K6522j01780J23847
$$ 405802 648062 422068 291265 500634 564506 566446 595861 651367 677889 576109 699956
7012F99956j79354j38058J63094p2704n6091K63597K52438J3584J2455m4469j54627
$$ 699956 520602 382544 545638 472934 416843 680440 932878 946462 958917 914448 759821
7001G59821J50816K8704j84942P1756K0876L9042K18165q4095o988J32404J15244
$$ 759821 910637 939341 754399 826155 847031 886073 1104238 1020143 1013155 1145559 1260803
6990A260803j41675K3411o2894j12823O7496J66038J92202K67220m34908o2266
$$ 1260803 1119128 1142539 1079645 966822 1034318 1200356 1392558 1659778 1224870 1162604
6980A162604K66433J1704K03844j08510q5970j62938K40339J43391k23781j99673
$$ 1162604 1429037 1440741 1644585 1536075 1450105 1287167 1527506 1670897 1447116 1247443
6970A247443J05875J7683o3898m5208R6052p195p5681o1164N1113N3797N6032
$$ 1247443 1353318 1371001 1307103 1261895 1357947 1350752 1275071 1213907 1265020 1318817 1374849
6959A374849K5786p8413m9812J72064r1491J3414n6515K08407j05253j9797l7484
$$ 1374849 1400635 1322222 1272410 1444474 1352983 1366397 1309882 1518289 1413036 1393239 1355755
6948A355755k42928j02899J70351p8821P0494p3784j45982J2382M4801J10755
$$ 1355755 1112827 1009928 1180279 1101458 1171952 1098168 952186 964568 1009369 1120124
6938A120124O6224J12127q6145j1219K68388J20761k31048K09604K16107n8848
$$ 1120124 1186348 1298475 1212330 1201111 1469499 1590260 1359212 1568816 1784923 1726075
6928A726075j4553J69037n8809j7476O0153k78755j58506J90124j04608p4961
$$ 1726075 1711522 1880559 1821750 1804274 1864427 1585672 1427166 1617290 1512682 1437721
6918A437721m3594j6288M8101j05263Q1445J61799J73691m9224K9151l7303L73454
$$ 1437721 1394127 1377839 1425940 1320677 1402122 1563921 1737612 1688388 1717539 1680236 2053690
6907B053690K01363m3568Q2537K4068j9111J3458N4877K32287K14732l0298J18795
$$ 2053690 2255053 2211485 2294022 2318090 2298979 2312437 2367314 2599601 2814333 2784035 2902830
6896B902830P2691L2841L2195j77177j88054J78012j90967k00113Q5773O2205
$$ 2902830 2975521 3008362 3040557 2863380 2675326 2853338 2662371 2462258 2548031 2610236
6886B610236j9498J3332n5119K72818J66320J99732J92483P9516r5466l0845O5038
$$ 2610236 2590738 2604070 2548951 2821769 2988089 3187821 3380304 3459820 3364354 3333509 3398547
6875C398547J84418P0684j85117o2936N4805l8160l1207K6270J6427J31005j8900
$$ 3398547 3582965 3653649 3468532 3405596 3460401 3422241 3391034 3417304 3433731 3564736 3545836
6864C545836l33128j71939j71149j39972k70182M2133L5123q031M0869j4062P0389
$$ 3545836 3212708 3040769 2869620 2729648 2459466 2501599 2536722 2528691 2569560 2555498 2625887
6853B625887L0227J77034J99324k3557O6005J00012q1713j67253l09326j85535
$$ 2625887 2656114 2833148 3032472 3008915 3074920 3174932 3093219 2925966 2616640 2431105
6843B431105J9527K1941o2618P7186p8909l05019j98184k31684j84503j10575
$$ 2431105 2450632 2472573 2409955 2487141 2408232 2103213 1905029 1673345 1488842 1378267
6833A378267J1491n8401J50610r8750o5755J13923k696Q424k0063M5277R8087
$$ 1378267 1389758 1331357 1481967 1383217 1317462 1431385 1428689 1437113 1417050 1462327 1560414
6822A560414m0837j9399O7803o1979j59111r7971n5907L60580k12028k59832j47624
$$ 1560414 1519577 1500178 1567981 1506002 1346891 1248920 1193013 1553593 1341565 1081733 934109
6811I34109j20m0628j33826J8455n060J4334j12663O0752l9607J12597q0259J66864
$$ 934109 933989 893361 759535 777990 772930 787264 674601 735353 695746 808343 728084 894948
6799H94948k22646p5627K0688J87696p1821q6637J7405O0672q9894J39315L2652
$$ 894948 672302 596675 617363 805059 733238 646601 664006 724678 634784 774099 806751
6788H06751K7413N4511J2693l1144P3170j19304j52575J30981J89588J23712k11051
$$ 806751 834164 888675 901368 870224 943394 824090 671515 802496 992084 1115796 904745
6777I04745j25018N1845J43729Q7709j70971K28007L07131m5354m0474j24226
$$ 904745 779727 831572 975301 1063010 892039 1120046 1427177 1381823 1341349 1217123
6767A217123J00236K13824K0517j83883J26724K08061o1069j99279L0599J30890
$$ 1217123 1317359 1531183 1551700 1367817 1494541 1702602 1641533 1442254 1472853 1603743
6757A603743j70906p5079K69099O4560O5752j99008K66115Q2953J04368p641L8596
$$ 1603743 1432837 1357758 1626857 1691417 1757169 1558161 1824276 1907229 2011597 2003956 2042552
6746B042552J41955J02760K71549K4933K51635K10951J38946J68623M3527p3795
$$ 2042552 2184507 2287267 2558816 2583749 2835384 3046335 3185281 3353904 3397431 3323636
6736C323636k3607q1485j59877j1629Q4242j33393J85485o5085j95687k6202p8567
$$ 3323636 3300029 3218544 3058667 3047038 3131280 2997887 3183372 3118287 2922600 2896398 2817831
6725B817831r6840L84540K35428n4478J05414J92367J59835J31046K46491l4916
$$ 2817831 2720991 3105531 3340959 3286481 3391895 3584262 3744097 3875143 4121634 4086718
6715D086718p1319L11021j41748R5812l3462L5670r788Q0896L5659k95165j69391
$$ 4086718 4015399 4326420 4184672 4280484 4247022 4282692 4272904 4353800 4389459 4094294 3924903
6704C924903j04957j22425l68859j04536l788n4534l8236K0972j02334R048J37756
$$ 3924903 3819946 3697521 3328662 3224126 3220338 3165804 3127568 3148540 3046206 3055254 3193010
6693C193010j00982j1199J09824m6060N1495L4039K62139l6821Q7244j4550J50357
$$ 3193010 3092028 3080829 3190653 3144593 3196088 3230127 3492266 3455445 3542689 3528139 3678496
6682C678496R0763l64339n85828j50938o6447o9381j93435j74692l27697o8289
$$ 3678496 3769259 3404920 2819092 2668154 2601707 2532326 2338891 2164199 1836502 1768213
6672A768213J39845j04595n5725q9844J9772J6814Q9007j93319k09612J89918
$$ 1768213 1908058 1803463 1747738 1657894 1677666 1694480 1783487 1590168 1380556 1570474
6662A570474J65353j07654q4215J03726m9588j00253j46448p6060J14779j99543
$$ 1570474 1735827 1628173 1543958 1647684 1598096 1497843 1351395 1275335 1390114 1190571
6652A190571r3372P4298j16316j8009j98485j73789Q9173J13928j8938j87108
$$ 1190571 1097199 1171497 1055181 1037172 838687 664898 754071 867999 849061 661953
6642F61953J37712p626Q3220J61896k78212q9444n4751q0284O628M7502L16677
$$ 661953 799665 792039 875259 1037155 758943 669499 614748 534464 541092 588594 905271
6631I05271o7227k48425j1200j14160R5262P5928N0258j41493O2169M4372L1019
$$ 905271 838044 589619 578419 464259 559521 635449 685707 544214 606383 650755 681774
6620F81774m7667j80392j1262j00480J23535j23863J30611o0683J79550J65749
$$ 681774 634107 453715 442453 341973 465508 341645 472256 411573 591123 756872
6610G56872j43434o997M4943j26158J02515o8537l7658P1682m3558j13824o2320
$$ 756872 613438 606441 651384 525226 627741 559204 521546 593228 549670 435846 373526
6599C73526J27646P3742o0497M532j01146M6568R2913P7609o7775r0341o7822
$$ 373526 501172 574914 514417 518949 417803 464371 557284 634893 567118 476777 408955
6588D08955j0819N4595l9215L5650o9587p7799J382k517P0731N5257J1760L840
$$ 408955 398136 452731 413516 449166 379579 301780 303162 300645 371376 426633 438393 442233
6576D42233m7357l9602R6420M9055p510R9726o6101M180o6428L2409r6984l1687
$$ 442233 394876 355274 451694 500749 493239 592965 526864 531044 464616 497025 400041 368354
6564C68354P4214j1710l1262M1028R5822j7803q0093k021l0166J3068p3747Q8188
$$ 368354 442568 430858 399596 440624 536446 518643 438550 436529 406363 419431 345684 433872
6552D33872J44149j09559K4617O8003p4659J48531r8994m9863r7569N6582J2839
$$ 433872 578021 468462 493079 561082 486423 634954 535960 486097 388528 445110 457949
6541D57949j5696j79530J97242K57466j45944j50419O5J53086q4773J0927J19104
$$ 457949 442253 262723 459965 717431 571487 421068 421133 574219 489446 500373 619477
6530F19477N3856j25584j67153L5460q5911k5374J78257J38187j8120L3185K7978
$$ 619477 673333 547749 380596 416056 330145 304771 483028 621215 603095 636280 664258
6519F64258Q4804k70175j58375K75077J2615J4358K6331n5365J03285j09381M6084
$$ 664258 749062 478887 320512 595589 608204 622562 648893 593528 696813 587432 633516
6508F33516r2893K9019n1656n9746J18791L172J10113n8423M0358J72951k5475
$$ 633516 540623 569642 517986 458240 577031 580203 690316 631893 672251 845202 819727
6497H19727k34461l6428j12763J31960K8856N4940N6332j75815j10128J55325
$$ 819727 585266 548838 436075 568035 596891 651831 708163 532348 422220 577545
6487E77545n1106j4779R3047Q9077m0009k8721P0100j49l9450J62292Q8879K0585
$$ 577545 526439 511660 604707 693784 653775 625054 695154 695005 655555 817847 906726 927311
6475I27311P0922j57050L2961K85423R5083j03900q8199J26839J43685K73201
$$ 927311 998233 841183 874144 1159567 1254650 1150750 1062551 1189390 1333075 1606276
6465A606276N1853R8184k26854J231r790J17045O5919k14208j6222R1667o5839
$$ 1606276 1658129 1756313 1529459 1530690 1520900 1637945 1703864 1489656 1473434 1565101 1499262
6454A499262J3225L6931J81454o1609j03449J5260k99108k1827J79436K39418
$$ 1499262 1512487 1549418 1730872 1669263 1565814 1581074 1281966 1260139 1439575 1678993
6444A678993k1164l5063J14144R6897J99168M82691J99228Q6792J77698J88516
$$ 1678993 1657829 1622766 1736910 1833807 2032975 2515666 2714894 2801686 2979384 3167900
6434C167900M10550L16646K4771n7726j08338L5619r8370p9427o6107l56445j32798
$$ 3167900 3578450 3895096 3919867 3862141 3753803 3789422 3691052 3611625 3545518 3189073 3056275
6423C056275J21890q6985J0692j10387k75777J17111L1784j26750L32897N9211
$$ 3056275 3178165 3091180 3101872 2991485 2715708 2832819 2864603 2737853 3070750 3129961
6413C129961M3290j27391J0979K00075n7685M81584L12999M49154K52562K97875
$$ 3129961 3173251 3045860 3056839 3256914 3199229 3680813 3993812 4442966 4695528 4993403
6403D993403J71890O319R3830q7128J49325o705j06331L3470j39702J06992j57474
$$ 4993403 5165293 5171612 5265442 5178314 5327639 5320934 5214603 5248073 5108371 5215363 5057889
6392E057889j78599k83908k39791q4325l77152j84216j98343j17043k29069j97264
$$ 5057889 4879290 4595382 4355591 4271266 3894114 3709898 3511555 3394512 3165443 2968179
6382B968179L9897K38677l7078m1574l2394K92125O0454J67602K19554J65677
$$ 2968179 3008076 3246753 3209675 3168101 3135707 3427832 3488286 3655888 3875442 4041119
6372D041119O4971J48880n1136K33304J22404N56L69585J05011J69017j45617
$$ 4041119 4106090 4254970 4203834 4437138 4559542 4560098 4929683 5034694 5203711 5058094
6362E058094l91052j06472l22405l74520j57196m1629j82978l76008m358J21098
$$ 5058094 4667042 4560570 4238165 3863645 3706449 3664820 3481842 3105834 3101476 3222574
6352C222574j26942J19992l3623r5899q9623j24745j19360n728q5752k05147K4136
$$ 3222574 3095632 3215624 3182001 3086102 2996479 2871734 2752374 2746646 2660894 2455747 2479883
6341B479883l0724Q2955J03329J34312n6279Q3294M2013n6789j29842K1868K34806
$$ 2479883 2449159 2532114 2635443 2769755 2713476 2796770 2838783 2781994 2652152 2674020 2908826
6330B908826p2400j23498k13065j44351O9173k12544o4145K01663r1723m5666
$$ 2908826 2836426 2712928 2499863 2355512 2424685 2212141 2147996 2349659 2257936 2212270
6320B212270k00776J95643J47894j0972l1974J48290K47535J22607J07791J19232
$$ 2212270 2011494 2207137 2355031 2344059 2312085 2460375 2707910 2830517 2938308 3057540
6310C057540K59507K92511K69892J97912Q0511K27562q138Q8889j35921m93727
$$ 3057540 3317047 3609558 3879450 4077362 4157873 4385435 4377297 4466186 4330265 3836538
6300C836538r5817j52876k41099l93745r7060j93919j76679j17308o1229j14991
$$ 3836538 3740721 3587845 3346746 2953001 2855941 2662022 2485343 2368035 2306806 2191815
6290B191815J52748N8117j03497k01840m2734K53574j28542j60679L8414J3561
$$ 2191815 2344563 2402680 2299183 2097343 2054609 2308183 2179641 2018962 2057376 2070937
6280B070937j12128j08936J98365j94888M672N4537k18726J14034L7726j15906
$$ 2070937 1958809 1849873 2048238 1853350 1858022 1912559 1693833 1807867 1845593 1729687
6270A729687K8910L5873K74800j35628J76414J28040m7826k95153P8783P4660
$$ 1729687 1758597 1794470 2069270 1933642 2110056 2238096 2190270 1895117 1973900 2048560
6260B048560M7792K63196j28525o71M18470m8444o6390J30691k74551o7147J90143
$$ 2048560 2096352 2359548 2231023 2230352 2648822 2600378 2533988 2664679 2390128 2322981 2513124
6249B513124K41522n0691J24644J92938k4636M1300J0135K6505L2668O6546K61143
$$ 2513124 2754646 2703955 2828599 3021537 2996901 3038201 3048336 3074841 3107509 3174055 3435198
6238C435198j620m2480j3427l5214q8360j36603J63385P4980M9300K38225J96866
$$ 3435198 3433578 3391098 3377671 3342457 3254097 3117494 3280879 3355859 3405159 3643384 3840250
6227C840250K02627J06871J18820k4458J95824Q8085j2621m9311k5102J82789
$$ 3840250 4042877 4149748 4268568 4244110 4439934 4528019 4515398 4466087 4440985 4623774
6217D623774J46454N3210L18147J60764J67127J50119J56264J45172K96597L4533
$$ 4623774 4770228 4823438 5141585 5302349 5469476 5619595 5775859 5921031 6217628 6252161
6207F252161J46190J26102J0446K11273J66900J09652L66890M65200M60636O14155
$$ 6252161 6398351 6524453 6534899 6746172 6913072 7022724 7389614 7854814 8315450 8929605
6197H929605O76841N07278K69039L0678k41209m76084p54648n65772o59317m70949
$$ 8929605 9606446 10113724 10382763 10413441 10172232 9696148 8941500 8375728 7716411 7245462
6187G245462m46890m22259k14230n1909j48688q5090j21989K40603P3384j1669
$$ 7245462 6798572 6376313 6162083 6110174 5961486 5876396 5754407 5995010 6068394 6056725
6177F056725j1706J55810J33424J71635J59538R2591L40545J71876O08072M36161
$$ 6056725 6045019 6200829 6334253 6505888 6665426 6758017 7098562 7270438 7878510 8314671
6167H314671K55960O86313Q62976Q31861J222662J081999J083976J477983J562920
$$ 8314671 8570631 9256944 10119920 10951781 12174443 13256442 14340418 15818401 17381321
6158A7381321J237581J039585M59485j09229o87056r66672j055150n94970m18224
$$ 17381321 18618902 19658487 20117972 20008743 19321687 18355015 17299865 16704895 16286671
6149A6286671j16483l2373K13378M73827M36448O29525K77234O7710l90432p34571
$$ 16286671 16170188 16137815 16351193 16825020 17261468 17890993 18168227 18235937 17845505 17110934
6139A7110934o57553n50086o21592k38440j57350k21948j01651n2888K52814J19639
$$ 17110934 16453381 15903295 15281703 15043263 14885913 14663965 14562314 14509426 14762240 14881879
6129A4881879l1167o0065m52428p80235n91745o16470m75124j39713k61846q1792
$$ 14881879 14850712 14790647 14338219 13557984 12966239 12349769 11874645 11734932 11473086 11391294
6119A1391294J97878L08191M41515L79243N54594L1343j62164m83777o84680m38404
$$ 11391294 11589172 11897363 12338878 12718121 13272715 13304058 13141894 12658117 11973437 11535033
6109A1535033o94557p00017l95994k54042o63424m19464n72203l72463m12493
$$ 11535033 10840476 10140459 9744465 9490423 8826999 8407535 7835332 7462869 7050376
6100G050376k80643o3193l32603n30985j95752j08794k68615k45355l04405Q1883
$$ 7050376 6769733 6706540 6373937 5842952 5647200 5538406 5269791 5024436 4720031 4801914
6090D801914R5027k33777Q796p8471n8086j46697p1438P9526j23815J09592m6864
$$ 4801914 4896941 4663164 4671960 4593489 4535403 4388706 4317268 4396794 4272979 4382571 4335707
6079D335707j22961K04215o065j80442J70311Q8155j54970j33853j83815l540
$$ 4335707 4212746 4416961 4410896 4230454 4400765 4488920 4333950 4200097 4016282 4012742
6069D012742J7251p488J32119j73768k18066q3487J63415j09301o1826q331J70781
$$ 4012742 4029993 4022505 4154624 3980856 3762790 3679303 3842718 3733417 3671591 3663260 3834041
6058C834041K06721L0700J44416J7704q2742K18104J61064J86479L00694J24226
$$ 3834041 4040762 4071462 4215878 4233582 4150840 4368944 4530008 4716487 5017181 5141407
6048E141407J04237r64K60673j8557N8551m3677l18963j15785L1452j75208j9246
$$ 5141407 5245644 5244680 5505353 5486796 5545347 5501670 5182707 5066922 5098374 4923166 4903920
6037D903920p5591O790M34l579N05027L6986k3241J74239K47507K39997K46774
$$ 4903920 4828329 4835119 4835553 4831974 5337001 5373987 5350746 5524985 5772492 6012489 6259263
6026F259263J48544J62282L17167O7163J99158q41J254K8584m1684r1252j53230
$$ 6259263 6407807 6570089 6887256 6954419 7153577 7152736 7153990 7182574 7140890 7049638 6896408
6015F896408k882q677j88238j44709j38878J13820J96315K49646K66639K15237
$$ 6896408 6893526 6884849 6696611 6551902 6413024 6526844 6723159 6972805 7239444 7454681
6005G454681L4106N46320M70013J07998L84377L20849m4036L82012M22994p7531
$$ 7454681 7488787 8035107 8505120 8613118 8997495 9318344 9274308 9656320 10079314 10001783
5995A0001783j7930K20594K40617j07932K00482J49573Q7570J26237J82159J05894
$$ 10001783 9983853 10204447 10445064 10337132 10537614 10687187 10774757 10900994 11083153 11189047
5985A1189047K01140L88107O36063N27006N88532O58372O85327L67426M34551
$$ 11189047 11390187 11778294 12414357 12941363 13529895 14188267 14873594 15241020 15675571
5976A5675571J98411Q6762L76067L93837L52717K48305K77287L70002L08925M32750
$$ 15675571 15873982 15960744 16336811 16730648 17083365 17331670 17608957 17978959 18287884 18720634
5966A8720634J26642K4410j29228Q8622L30853J19733M48469O95638R77909J091287
$$ 18720634 18847276 18871686 18742458 18831080 19161933 19281666 19730135 20425773 21403682 22494969
5956B2494969J531024J400365J458619R58345N05361K04707k27750l99330p19544
$$ 22494969 24025993 25426358 26884977 27843322 28348683 28553390 28325640 27926310 27206766
5947B7206766q16586r55749j405160j078187r25130q80131q50992j037140j024758
$$ 27206766 26390180 25434431 24029271 22951084 22025954 21145823 20294831 19257691 18232933
5938A8232933r24711p48052o32626m59177m27447l79831k83898m68790p38577
$$ 18232933 17308222 16560170 15927544 15468367 15040920 14661089 14377191 13908401 13169824
5929A3169824k19430l22241j53420m01559j77192R8124J41784J01869R0269K80154
$$ 13169824 12950394 12628153 12474733 12073174 11895982 11994106 12135890 12237759 12328028 12608182
5919A2608182L71310M80963M58972N85508M87434L44308J89050J10972J83068
$$ 12608182 12979492 13460455 13919427 14504935 14992369 15336677 15525727 15636699 15819767
5910A5819767Q5925m1593J65933K88971J72541L51412L44427L67476J082176J241938
$$ 15819767 15905692 15864099 16030032 16319003 16491544 16842956 17187383 17554859 18637035 19878973
5900A9878973J198600J346422J324713J045671K65695o61735j122458j349113
$$ 19878973 21077573 22423995 23748708 24794379 25060074 24398339 23275881 21926768
5892B1926768j556801j608169j221337j361747q04232o83553o63177l33360j6824
$$ 21926768 20369967 18761798 17540461 16178714 15374482 14690929 14027752 13694392 13677568
5883A3677568J8028k42K21667K21638L69962M10108M04567L16815O44903O23310
$$ 13677568 13695596 13695354 13917021 14138659 14508621 14918729 15323296 15640111 16285014 16908324
5873A6908324N13962N95543N30241N63824L61607r8281m05608o13593q12092q52332
$$ 16908324 17422286 18017829 18548070 19111894 19473501 19375220 18969612 18356019 17543927 16691595
5863A6691595p60192q84766j010067q58512o62113p92824q18708o27408m37273
$$ 16691595 15931403 15046637 14036570 13178058 12515945 11723121 10904413 10277005 9839732
5854I839732m60329k82517j60652q8836k63180k99266j71133p5306j87076K01807
$$ 9839732 9379403 9096886 8936234 8847398 8584218 8284952 8113819 8038513 7851437 8053244
5844H053244N3586l6203J7098k50867j40592j33482k54005q6037k62270k02985
$$ 8053244 8106830 8070627 8087725 7836858 7696266 7562784 7308779 7222742 6960472 6757487
5834F757487j50468j62285j78282j95384J00113Q006j39691m732p3210p7663L4883
$$ 6757487 6607019 6444734 6266452 6071068 6171181 6179187 6039496 6034764 5961554 5883891 5918774
5823E918774o6894N8148M288q9902K868J7411j01496k9291J45276L80370M7545
$$ 5918774 5851880 5910028 5914316 5824414 5827282 5844693 5743197 5713906 5859182 6239552 6287097
5812F287097R232J04274J49974J82545K65445N201p4120Q2k17983K0163K10805
$$ 6287097 6296329 6400603 6550577 6733122 6998567 7003768 6929648 6929730 6711747 6731910 6942715
5801F942715L56410J05983j92541l924r4401q3070J90786L89457P0765Q4953J58924
$$ 6942715 7299125 7405108 7212567 7208643 7114242 7031172 7221958 7611415 7682180 7767133 7926057
5790G926057M72431r810J34877j9710k49104k66219l05273l16455k67894k16957
$$ 7926057 8398488 8388678 8523555 8503845 8254741 7988522 7683249 7366794 7098900 6881943
5780F881943m1313j0734J4138m7966k87560P7908J55074J0525J11514K56169J40012
$$ 6881943 6840630 6829896 6844034 6796068 6508508 6586416 6741490 6752015 6863529 7119698 7259710
5769G259710K33783L17363L31971L95571J89725N28345M06064k4382j24591l04112
$$ 7259710 7493493 7810856 8142827 8538398 8728123 9256468 9662532 9638150 9513559 9209447
5759I209447l31904l37788l59282j33695J14050k79709M4472J52748m5715J19571
$$ 9209447 8877543 8539755 8180473 8046778 8160828 7881119 7925591 8078339 8032624 8152195
5749H152195J26665J19824J62300k087P9100J73057K08837Q6292K75627K22485
$$ 8152195 8278860 8398684 8560984 8558897 8637997 8811054 9019891 9106183 9381810 9604295
5739I604295J95678J44475M03815K89949N07584P48525O44200O00014N57758Q41317
$$ 9604295 9799973 9944448 10348263 10638212 11145796 11894321 12538521 13138535 13696293 14537610
5729A4537610R06001J162751J314795J722485J825806K170785K576325K289958
$$ 14537610 15443611 16606362 17921157 19643642 21469448 23640233 26216558 28506516
5721B8506516J908629J204569L03207q56302j462340j738475j641688j399398
$$ 28506516 30415145 31619714 31922921 31066619 29604279 27865804 26224116 24824718
5713B4824718j024071o65480k25623J21860L64359O39447J161063J226442J409161
$$ 24824718 23800647 23135167 22909544 23031404 23395763 24035210 25196273 26422715 27831876
5704B7831876J989415K449852K944020L519974L758135L600886K792832J581113
$$ 27831876 29821291 32271143 35215163 38735137 42493272 46094158 48886990 50468103
5696E0468103K81089p77973k008304k967319l461473l418602l313182k785896
$$ 50468103 50749192 49971219 47962915 44995596 41534123 38115521 34802339 32016443
5688C2016443k329649j898682j344826j214782o07804k96922j67757J40384K15639
$$ 32016443 29686794 27788112 26443286 25228504 24620700 24323778 24156021 24296405 24512044
5679B4512044O33831J108569J551090J808147K012759J557952M71152n49441j896218
$$ 24512044 25145875 26254444 27805534 29613681 31626440 33184392 33655544 33106103 31209885
5670C1209885k415351k390329k272381k235870j991963j890868j392275j034794
$$ 31209885 28794534 26404205 24131824 21895954 19903991 18013123 16620848 15586054
5662A5586054p05971r74528o85540n89652k95115l48703k61978l41204m63599
$$ 15586054 14880083 13905555 13220015 12630363 12335248 11986545 11724567 11383363 10919764
5653A0919764n70549l27396m91867k81333j24399j13409O6064r2388k61983j21768
$$ 10919764 10349215 10021819 9529952 9248619 9124220 9010811 9076875 8984487 8722504 8600736
5643H600736P394k51445k2451J16933K73346P7254K19571J67071J85273J53229
$$ 8600736 8608130 8356685 8334234 8451167 8724513 8801767 9021338 9188409 9373682 9526911
5633I526911L21892J33706L06787L95249R2011l44726j69975J13261l1803j9169
$$ 9526911 9848803 9982509 10289296 10684545 10776556 10431830 10261855 10375116 10343313 10324144
5623A0324144Q95j66975k94842k65012k08052n33338k52151k07952j56732j64904
$$ 10324144 10325039 10158064 9863222 9598210 9390158 8856820 8604669 8396717 8239985 8075081
5613H075081r0267q2670J53173K79133n2812L34014L55684M43111L62258O6515
$$ 8075081 7984814 7902144 8055317 8334450 8281638 8615652 8971336 9414447 9776705 9843220
5603I843220k87906n55266m48427k37121l7262k60865O0997J36787M5194J04820
$$ 9843220 9555314 9000048 8551621 8314500 8277238 8016373 8077370 8214157 8259351 8364171
5593H364171K23766K69584O04881L48526j00738k14114n30202o12292n01743n30889
$$ 8364171 8587937 8857521 9462402 9810928 9710190 9496076 8965874 8353582 7851839 7320950
5583G320950l37743m21752j64926P4789k01438j03014j75909j3479p8739J17072
$$ 7320950 6983207 6561455 6396529 6471318 6269880 6166866 5990957 5977478 5898739 6015811
5573F015811q4339M6453Q477j1139j07113Q4174O3831O0641l1655K21917J62692
$$ 6015811 5931472 5977925 5986402 5975263 5868150 5952324 6016155 6076796 6045141 6267058 6429750
5562F429750K06269M25202K84521L19833M56211M81596M28996p0563P0381j71741
$$ 6429750 6636019 7061221 7345742 7665575 8121786 8603382 9032378 8961815 9032196 8860455
5552H860455r3686p3376m28781m50993l65657k62979k27148N8161J37937q3402
$$ 8860455 8766769 8693393 8264612 7813619 7447962 7184983 6957835 7015996 7153933 7070531
5542G070531k40533N2895j44752k30762p8241j18814k26374N7826k5110Q9939
$$ 7070531 6829998 6882893 6738141 6507379 6429138 6310324 6083950 6141776 6116666 6206605
5532F206605j24508k6820J48452K45093l6185J73L55405K57772J03841J68474
$$ 6206605 6082097 6055277 6203729 6448822 6412637 6412810 6768215 7025987 7129828 7298302
5522G298302L506Q7047Q0727j75152j28750J11596J13320J22541K21852J72728
$$ 7298302 7301808 7388855 7469582 7294430 7165680 7277276 7390596 7513137 7734989 7907717
5512G907717L08282L09420K49685J0015J70909K76141M14983L93180N83475O22391
$$ 7907717 8215999 8525419 8775104 8785119 8956028 9232169 9647152 10040332 10623807 11246198
5502A1246198M99365O19922P23464O31577J146255R36482O71238M97458O50636
$$ 11246198 11745563 12365485 13088949 13720526 14866781 15803263 16474501 16971959 17622595
5493A7622595N63038J30032k39196n27817m36104m71524n41336o41198o72378
$$ 17622595 18185633 18315665 18076469 17548652 17112548 16641024 16099688 15458490 14786112
5484A4786112q07757m62446o53585m56969m97064l76303k39665k32757l01765
$$ 14786112 13978355 13515909 12862324 12405355 11908291 11531988 11292323 11059566 10757801
5475A0757801p6649j75168L6537k14661j7538L493J51236J31534J6315J55025
$$ 10757801 10681152 10505984 10542521 10327860 10310322 10313815 10465051 10596585 10612900 10767925
5465A0767925K24723M51482J4115J55117K45668L64843K81035J90802J14015L56213
$$ 10767925 10992648 11444130 11458245 11613362 11859030 12223873 12504908 12695710 12809725 13165938
5455A3165938P34947M48706M45608N45226N10529P71017Q73407Q70862O97199
$$ 13165938 13900885 14349591 14795199 15340425 15850954 16621971 17495378 18366240 19063439
5446A9063439P90173Q37034J116789J142186J365260J548762J722771J844731
$$ 19063439 19853612 20690646 21807435 22949621 24314881 25863643 27586414 29431145
5438B9431145J708982J813907J648742J806312J980490J451330J187502P32673
$$ 29431145 31140127 32954034 34602776 36409088 38389578 39840908 41028410 41761083
5430D1761083j27438n19711j027466j421027j586750j471066j547661j104594
$$ 41761083 41633645 41113934 40086468 38665441 37078691 35607625 34059964 32955370
5422C2955370j294874j134301j177127r44565o74482n53561j84608O8908P990
$$ 32955370 31660496 30526195 29349068 28404503 27730021 27176460 26991852 27060760 27068750
5413B7068750j29691k79970K7676j51278l75479L61111K81241M76307P23763O63671
$$ 27068750 26939059 26659089 26686765 26535487 26160008 26521119 26802360 27278667 28002430 28666101
5403B8666101N19399J019980J034847J192099J405132J670493J807652K309917
$$ 28666101 29185500 30205480 31240327 32432426 33837558 35508051 37315703 39625620
5395C9625620K587914K894686K906909L255002L519236L925566M286511M327078
$$ 39625620 42213534 45108220 48015129 51270131 54789367 58714933 63001444 67328522
5387F7328522M412731L922212M045593L637540K890305K431395J807345J281056
$$ 67328522 71741253 75663465 79709058 83346598 86236903 88668298 90475643 91756699
5379I1756699Q10089J59163m67930j136674j815715k199539k081556k265437k820283
$$ 91756699 92566788 92725951 92258021 91121347 89305632 87106093 85024537 82759100 79938817
5370G9938817k995224l012004l422034l175401l137486k996636k516099k103976
$$ 79938817 76943593 73931589 70509555 67334154 64196668 61200032 58683933 56579957
5362E6579957j733468j544055r31690o51028k14782j55526J30087J39411p432
$$ 56579957 54846489 53302434 52370744 51719716 51504934 51349408 51479495 51618906 51611474
5353E1611474J5093K32641J18247q9836k06964m70268r83685j562028j656271
$$ 51611474 51626567 51859208 51977455 51887619 51680655 51210387 50226702 48664674 47008403
5344D7008403j310628j718361j932980k118127k425930k366669k474864k173486
$$ 47008403 45697775 43979414 42046434 39928307 37502377 35135708 32660844 30487358
5336C0487358j887851j918101j731620j145407q81269j007328j003908p08483
$$ 30487358 28599507 26681406 24949786 23804379 22923110 21915782 20911874 20203391
5328B0203391o61677n04584j61946l21088l14884j96243k35300l80609p0705J07071
$$ 20203391 19541714 19037130 18875184 18554096 18239212 18042969 17807669 17427060 17356355 17463426
5318A7463426p7680N5129j04758k5704K11066P6465r1719J78759K27556K12386
$$ 17463426 17385746 17440875 17336117 17310413 17521479 17597944 17506225 17684984 17912540 18124926
5308A8124926N79204N27829N10361N52585L78784L11471K60649m9623j72462j52539
$$ 18124926 18704130 19231959 19742320 20294905 20673689 20985160 21245809 21196186 21023724 20871185
5298B0871185J05060j53684k30765O5323K18033N76054K38722L05217K60442N75796
$$ 20871185 20976245 20822561 20591796 20657119 20875152 21451206 21689928 21995145 22255587 22831383
5288B2831383K45385q3061l66955l87975l07581l21241n0239j39449r4429L42873
$$ 22831383 23076768 22993707 22626752 22238777 21931196 21609955 21559716 21420267 21325838 21668711
5278B1668711P83548J316043J313160M63296r94889j768200j908122j804583j266936
$$ 21668711 22452259 23768302 25081462 25544758 24549869 22781669 20873547 19068964 17802028
5269A7802028p83882m07565l12290n3808J70164l9357j52278k03926m10314o49992
$$ 17802028 17018146 16610581 16298291 16244483 16414647 16375290 16223012 16019086 15608772 14958780
5259A4958780m31435n10549j22532j82989P6465J64199L04066J43563p6931m17493
$$ 14958780 14527345 14016796 13894264 13711275 13787740 13951939 14256005 14399568 14322637 13905144
5249A3905144n16237m30839q27691n29221m98600m84895n09280m81337k67128
$$ 13905144 13388907 12958068 12130377 11601156 11102556 10617661 10108381 9627044 9359916
5240I359916j98998r3918p9833j61397j16283l1830O910j28269j32533P3296m3492
$$ 9359916 9160918 9067000 8987167 8825770 8709487 8677657 8684567 8556298 8423765 8497061 8453569
5229H453569q0390L75023K05917L05354M89012L28872J82242O40930M72976L48090
$$ 8453569 8373179 8748202 8954119 9259473 9748485 10077357 10259599 10900529 11373505 11721595
5219A1721595r1280l66840o96072n77815k26662l85244l25574j91578k84604J01422
$$ 11721595 11630315 11263475 10567403 9989588 9762926 9377682 9052108 8860530 8575926 8677348
5209H677348L2264k22975p6987l06451l43253l30859l52262k33685l97100k30555
$$ 8677348 8709612 8486637 8409650 8103199 7759946 7429087 7076825 6843140 6446040 6215485
5199F215485j04150j50398M1240j4692l24763j14200j71275l04897J04786K01991
$$ 6215485 6111335 5960937 6002177 5987485 5662722 5548522 5377247 5072350 5177136 5379127
5189E379127l7951j6698k8502k2867R7898J64916m3402J64052J62705J67519K49019
$$ 5379127 5341176 5324478 5295976 5273109 5371007 5535923 5492521 5656573 5819278 5986797 6235816
5178F235816Q5040m2632n9024L2675k32826m48315l13313j57845l48041k25107
$$ 6235816 6320856 6278224 6219200 6251875 6019049 5570734 5257421 5099576 4751535 4526428
5168D526428R6968j22841O7366j35817j64882o527k6607l8199N8693j7723j38727
$$ 4526428 4623396 4500555 4567921 4432104 4267222 4260695 4234088 4195889 4254582 4236859 4098132
5157D098132j9611p7962R542j37334O0326J7091J4362p1060Q3379j18239J34971
$$ 4098132 4078521 4000559 4010101 3872767 3933093 3950184 3964546 3893486 3976865 3858626 3993597
5146C993597o0802o5270L9127J13569J97536j64371j48762J07222J22976k7725
$$ 3993597 3932795 3867525 3906652 4020221 4217757 4053386 3904624 4011846 4134822 4107097
5136D107097j03907J61841m7293n4215j9604j6447M4436J52626p9682N355J98334
$$ 4107097 4003190 4165031 4117738 4063523 4043919 4027472 4071908 4224534 4144852 4150207 4348541
5125D348541J8649j83032q0605p9952j40201K36479j02954n4230J1593m8896J14153
$$ 4348541 4367190 4184158 4103553 4023601 3883400 4119879 4016925 3962695 3974288 3925392 4039545
5114D039545P3922K2950R0817j474l2290K98692J68717M4845K39192j11130p1942
$$ 4039545 4113467 4136417 4227234 4225760 4193470 4492162 4660879 4705724 4944916 4833786 4761844
5103D761844J35750j1162q5006j57206Q4921O5646K59276K48009l0721P6188J80842
$$ 4761844 4897594 4886432 4801426 4644220 4729141 4794787 5054063 5302072 5271351 5347539 5528381
5092E528381K74909J28978l53195m9976J74834j05274q9896o5664K10792q1568
$$ 5528381 5803290 5932268 5579073 5529097 5703931 5598657 5508761 5443097 5653889 5572321
5082E572321P497L7890L95077L12130K6372K45547N05568L37613K58669K58907
$$ 5572321 5579818 5617708 6012785 6324915 6351287 6596834 7102402 7440015 7698684 7957591
5072G957591j27695l97415l9563l6438k15596o5463L41861J45917R4114L52425
$$ 7957591 7829896 7432481 7392918 7356480 7140884 7075421 7417282 7563199 7657313 8009738
5062H009738K57254M66236J31691p9102j19943k86261K016L01314j48915k4179
$$ 8009738 8266992 8733228 8864919 8785817 8665874 8379613 8381629 8682943 8534028 8509849
5052H509849R8583J96222J57963K51597K99946M46092M66253M01418O94088M15533
$$ 8509849 8608432 8804654 8962617 9214214 9514160 9960252 10426505 10827923 11522011 11937544
5042A1937544J54932L14022l52000o27389m93016n81177n47910k66447J16722
$$ 11937544 12092476 12406498 12054498 11427109 10934093 10352916 9805006 9538559 9655281
5033I655281o6914K49738K77592L65735L22846K22467J26784j1168O8456J30561
$$ 9655281 9588367 9838105 10115697 10481432 10804278 11026745 11153529 11142361 11210817 11341378
5023A1341378K35078K88939K58959N5726K34866L01508K52683O03838O68079L44616
$$ 11341378 11576456 11865395 12124354 12180080 12414946 12716454 12969137 13572975 14241054 14585670
5013A4585670n5423M928K699l8701K3401k89429n83971p80223q28541n52131n96780
$$ 14585670 14530247 14535175 14537874 14499173 14522574 14233145 13649174 12868951 12040410 11488279 10891499
5002A0891499m87727o4823l9876p603m5447j99722J82294J69837N4126P8893K23028
$$ 10891499 10403772 10338949 10299073 10291470 10246023 10046301 10228595 10398432 10452558 10531451 10754479
4991A0754479M54069J52834M56464N49904J79377K67043K52328M20865M48839
$$ 10754479 11208548 11361382 11817846 12367750 12547127 12814170 13066498 13487363 13936202
4982A3936202L55841j06928l77244k34903o72096l74323l28063l26832k55481
$$ 13936202 14292043 14185115 13807871 13572968 12900872 12526549 12198486 11871654 11616173
4973A1616173n55587n62450m98401l77642k99886j03891k64853j07679J59711
$$ 11616173 11060586 10498136 9999735 9622093 9322207 9218316 8953463 8845784 9005495
4964I005495J46438m7181K76635M4822J11307M63724L76457N27531L78239L03410
$$ 9005495 9151933 9104752 9381387 9426209 9537516 10001240 10377697 10905228 11283467 11586877
4954A1586877M52439N26088M62041J96743J65727Q0936n94048n78583m83545n74264
$$ 11586877 12039316 12565404 13027445 13224188 13389915 13470851 12876803 12298220 11814675 11240411
4944A1240411o03462l23058r5585l02165j22624J75085j34752l3046J84813M06150
$$ 11240411 10636949 10313891 10218306 9916141 9793517 9968602 9833850 9800804 9985617 10391767
4934A0391767J23612J79862Q5137n6849j66088j63286k03145k65529k33837j33216
$$ 10391767 10515379 10695241 10780378 10723529 10557441 10394155 10191010 9925481 9691644 9558428
4924I558428j72126j24827j05297j19074M9620J31846J9019m7969n6446O805K53149
$$ 9558428 9386302 9261475 9156178 9037104 9086724 9218570 9237589 9189620 9133174 9139979 9393128
4913I393128J4757J62832R1561K90925J78644k66616k77350j67112j80080q4948
$$ 9393128 9407885 9570717 9662278 9953203 10131847 9865231 9587881 9420769 9240689 9155741
4903I155741m94k37461k45422k47599J75216J77616k5925K53383K91480J60683
$$ 9155741 9155247 8917786 8672364 8424765 8599981 8777597 8751672 9005055 9296535 9457218
4893I457218K17038K35721K50088J25423k2607p0573j66080j56069r775j97039
$$ 9457218 9674256 9909977 10160065 10285488 10262881 10192308 10026228 9870159 9860384 9663345
4883I663345k11877k04771j94102K2291k27510j01219K76199J8235j34201K07579
$$ 9663345 9451468 9246697 9052595 9074886 8847376 8746157 9022356 9040591 8906390 9113969
4873I113969K6214J43353q5543l2158k2712Q3974J09126K36676K01944L9278K15728
$$ 9113969 9140183 9283536 9197993 9165835 9143123 9227097 9336223 9572899 9774843 9814121 10029849
4862A0029849M1840j20325J09991L75571J5014L2269R6323K25635P4047M21195
$$ 10029849 10071689 9951364 10061355 10436926 10451940 10484209 10580532 10806167 10880214 11301409
4852A1301409L17588q724J79359N2253L4668Q5789P1419J89700M1922J98299J40189
$$ 11301409 11618997 11610273 11789632 11841885 11876553 11962342 12033761 12223461 12265383 12463682 12603871
4841A2603871m2208J86422J37573K21116l6643R7910K55857K41419L46879J90044
$$ 12603871 12561663 12748085 12885658 13106774 13070131 13168041 13423898 13665317 14012196 14202240
4831A4202240K76869M04664K18423M42535M97825K59527L46767N00170M71632
$$ 14202240 14479109 14883773 15102196 15544731 16042556 16302083 16648850 17149020 17620652
4822A7620652L84001K65033L37232K41809L35629L71814L75010K86212N33197
$$ 17620652 18004653 18269686 18606918 18848727 19184356 19556170 19931180 20217392 20750589
4813B0750589M70462L83116N57558O10144L81628P64342P28428P18110Q14246
$$ 20750589 21221051 21604167 22161725 22771869 23153497 23917839 24646267 25364377 26178623
4804B6178623P65608O19489P01560R00051P76867Q82237R07614O99731Q25833
$$ 26178623 26944231 27563720 28265280 29165331 29942198 30824435 31732049 32431780 33257613
4795C3257613Q16893J024229R59320Q39189R10585P94999J083811J140961J409557
$$ 33257613 34074506 35098735 36058055 36897244 37807829 38602828 39686639 40827600 42237157
4786D2237157J586103J912589K148592K584945L349951M149451N200522O637500
$$ 42237157 43823260 45735849 47884441 50469386 53819337 57968788 63169310 69806810
4778F9806810P129403N873477L957094J026053j538933k566052l048725k427522
$$ 69806810 76936213 82809690 86766784 87792837 86253904 83687852 80639127 78211605
4770G8211605j662469r58183q27920k03112J86774P18283J115063J705208J555639
$$ 78211605 76549136 75590953 74763033 74559921 74746695 75464978 76580041 78285249 79840888
4761G9840888J800230J920126K328422K610843K638591K749071K681458K458617
$$ 79840888 81641118 83561244 85889666 88500509 91139100 93888171 96569629 99028246
4753I9028246K067383K057794J643708R48164P06468M56529K25706K86122J61088
$$ 99028246 101095629 103153423 104797131 105745295 106451763 106908292 107133998 107420120 107581208
4744A07581208j64889K27477N07343L76658K01606J78900M77072K84663n3404
$$ 107581208 107416319 107643796 108151139 108527797 108729403 108908303 109385375 109670038 109616634
4735A09616634n01792p05046j191953j366315j387258j342598j206457q03752
$$ 109616634 109114842 108409796 107217843 105851528 104464270 103121672 101915215 101111463
4727A01111463k99566J58595M84291P29973J291344J650170J733889K600365L798480
$$ 101111463 100811897 100970492 101454783 102184756 103476100 105126270 106860159 109460524 113259004
4718A13259004N088169N449299M396316K384235Q82981j533022l713320m713177
$$ 113259004 118347173 123796472 128192788 130577023 131460004 129926982 126213662 121500485
4710A21500485m739960l920387k949812k373103j818110j635829j157801r54153
$$ 121500485 116760525 112840138 109890326 107517223 105699113 104063284 102905483 101951330
4702A01951330r78049n81751m99013j93240N27317M63276R02587J579223J722358
$$ 101951330 100973281 100391530 99892517 99699277 100226594 100689870 101592457 103171680 104894038
4693A04894038J896590K178596K019845J586301J452493Q30113M74091k55514
$$ 104894038 106790628 108969224 110989069 112575370 114027863 114857976 115332067 115076553
4685A15076553p68458j326928j711965k106431k313640k173760k482317k510025
$$ 115076553 114308095 112981167 111269202 109162771 106849131 104675371 102193054 99683029
4677I9683029k344851k095423k354858k604964k697935k744038k572454k770041
$$ 99683029 97338178 95242755 92887897 90282933 87584998 84840960 82268506 79498465
4669G9498465l213391k852381k752765k593318k666471k522583j933395j792806
$$ 79498465 76285074 73432693 70679928 68086610 65420139 62897556 60964161 59171355
4661E9171355j303803j174942r42891j097495j137966j241412q35902j310109
$$ 59171355 57867552 56692610 55749719 54652224 53514258 52272846 51436944 50126835
4653E0126835r74439r97381q93233q67428q28214o43836m87574o78356m67737
$$ 50126835 49152396 48155015 47261782 46394354 45566140 44922304 44434730 43756374 43288637
4644D3288637k19703n28446n44538m54528p51654n97894o79052r99897n63757
$$ 43288637 43068934 42540488 41995950 41541422 40789768 40191874 39512822 38512925 37949168
4635C7949168m59429l68674l49137m23028o04919o79895o69082n05763r25342
$$ 37949168 37489739 37121065 36771928 36348900 35743981 35064086 34395004 33889241 32963899
4626C2963899p64449n74866o91542m33772n18220l12068O8287J65878r7989J19935
$$ 32963899 32199450 31624584 30933042 30499270 29981050 29668982 29737269 29903147 29805158 29925093
4616B9925093L10784R5259K88161L15767K75268Q3142j4509k12248m08778l72747
$$ 29925093 30235877 30331136 30619297 30935064 31210332 31293474 31278965 31066717 30657939 30285192
4606C0285192k45205l67547o51683n41635j66910n18107l98445l51103j63588
$$ 30285192 30039987 29672440 29020757 28479122 28312212 27794105 27395660 27044557 26880969
4597B6880969l32742k4542r108K65081M76742O86245N61482M88619J19290J79182
$$ 26880969 26548227 26523685 26514577 26779658 27256400 27942645 28504127 28992746 29112036 29291218
4587B9291218k6385l81445l09258l46197l15969l46805o18083o15044p33006o77205
$$ 29291218 29264833 28883388 28574130 28227933 27911964 27565159 26947076 26332032 25599026 24921821
4577B4921821l26253k01426l57955k01146K4668m7598L38806J69295K01572N38225
$$ 24921821 24595568 24394142 24036187 23835041 23859709 23812111 24150917 24320212 24521784 25060009
4567B5060009j13077k00648j05422l95813l53019p70656p13045p42933r83719
$$ 25060009 24946932 24746284 24640862 24245049 23892030 23121374 22408329 21665396 20681677
4558B0681677p92737p86690o76889m63698o13487m27068m77981k46077k16389
$$ 20681677 19888940 19102250 18425361 17961663 17348176 16921108 16443127 16197050 15980661
4549A5980661m25661j96389k02809j50505k42024j85043r4237j66523K4054j68643
$$ 15980661 15555000 15358611 15155802 15005297 14763273 14578230 14483993 14317470 14341524 14172881
4539A4172881k28745k33519l42918j48746n697j14798M8014r2066j28686M8796
$$ 14172881 13944136 13710617 13367699 13218953 13213256 13098458 13146472 13054406 12925720 12974516
4529A2974516l9680j8205N9302j2473J44252J6517R337P4329m9755j70506r4111
$$ 12974516 12934836 12916631 12975933 12963460 13107712 13124229 13133566 13207895 13158140 12987634 12893523
4518A2893523k10229J26633m532J545L51897K63l34980p5862L7802J15582K91449
$$ 12893523 12683294 12809927 12805395 12806940 13158837 13159100 12824120 12748258 12786060 12901642 13193091
4507A3193091K76344J85852J69524R4952M41498J60170K52911L16118J73194n3791
$$ 13193091 13469435 13655287 13824811 13919763 14361261 14521431 14774342 15090460 15263654 15209863
4497A5209863L82999L50379J56431K51349M25938K39281L18190L37952M29187
$$ 15209863 15592862 15943241 16099672 16351021 16776959 17016240 17334430 17672382 18101569
4488A8101569J41877L97435L20171K765L49404L60802M91350L14961L61223J03657
$$ 18101569 18243446 18640881 18961052 18963817 19313221 19674023 20165373 20480334 20841557 20945214
4478B0945214J77936L55194L51449L75400M09403M59970N80119Q57826P40205
$$ 20945214 21123150 21478344 21829793 22205193 22614596 23074566 23654685 24512511 25252716
4469B5252716P99622J076102P64267O91084N11538N07842N71356N88563N29412
$$ 25252716 26052338 27128440 27892707 28583791 29095329 29603171 30174527 30763090 31292502
4460C1292502M50541P27383P42316P45923R90410J146529J077604J052017J511153
$$ 31292502 31743043 32470426 33212742 33958665 34949075 36095604 37173208 38225225 39736378
4451C9736378J398306J601264J455571J967794J953623K030085K099364K635642
$$ 39736378 41134684 42735948 44191519 46159313 48112936 50143021 52242385 54878027
4443E4878027L215898L732146L791728M361137N427305N912947O894314P912443
$$ 54878027 58093925 61826071 65617799 69978936 75406241 81319188 88213502 96125945
4435I6125945R220151J0449009J1956986J4521332J7669467K1505698K5239146
$$ 96125945 105346096 115795105 127752091 142273423 159942890 181448588 206687734
4428B06687734K8622772K8735724K3838214J2982065J91700r530654j4408461
$$ 206687734 235310506 264046230 287884444 300866509 301058209 291527555 277119094
4421B77119094j4196580j1857338j1025301j2345420j3653915j4538707j4193309
$$ 277119094 262922514 251065176 240039875 227694455 214040540 199501833 185308524
4414A85308524j2362078j0579246r814652r555287r330277r836096r276082q374075
$$ 185308524 172946446 162367200 152552548 142997261 133666984 123830888 114554806 106180731
4406A06180731p764520p027390o356212n617883n058133m471771m255209l629557
$$ 106180731 98416211 91388821 85032609 79414726 74356593 69884822 65629613 62000056
4398F2000056l384977k908200k573736k227105k175876k082847j688929j353350
$$ 62000056 58615079 55706879 53133143 50906038 48730162 46647315 44958386 43605036
4390D3605036j182420j085629j191730j570402j413758j453037j564270j461603
$$ 43605036 42422616 41336987 40145257 38574855 37161097 35708060 34143790 32682187
4382C2682187j214044j276208j428519r16367p58169p16798r03280q50559n72475
$$ 32682187 31468143 30191935 28763416 27847049 27088880 26372082 25468802 24618243 24045768
4373B4045768p75832n21491l19620n33130n88392n56981m54321l74662l72869
$$ 24045768 23269936 22748445 22428825 21895695 21307303 20750322 20296001 19921339 19548470
4364A9548470o11157l33415l71292m58552m57850l00919l42972l71214l65380
$$ 19548470 18937313 18603898 18232606 17774054 17316204 17015285 16672313 16301099 15935719
4355A5935719l41308l30990r3670k26136l99377j49217l07625k01398j10349l97473
$$ 15935719 15594411 15263421 15169751 14943615 14544238 14395021 14087396 13885998 13775649 13378176
4345A3378176j15692j33564k85605k88824j51657j37268J4508j32857k60093k32755
$$ 13378176 13262484 13128920 12843315 12554491 12402834 12265566 12280074 12147217 11887124 11654369
4335A1654369k36915o5919j82288k93162j83261J05926j82916j00852N346l07838
$$ 11654369 11417454 11351535 11169247 10876085 10692824 10798750 10615834 10514982 10520328 10212490
4325A0212490j55079l6911k37133L1714j56684j56286j66286M7687J20502l08916
$$ 10212490 10057411 10020500 9783367 9815081 9658397 9502111 9335825 9383512 9504014 9195098
4315I195098k93128K7862K26438P7248N450J5470j6969m3358l53968j10934p27
$$ 9195098 8901970 8929832 9156270 9233518 9238968 9254438 9237469 9194111 8840143 8729209 8728482
4304H728482j78795l9553N4802o263q8033k30932P8947q105P4016q0026o5999
$$ 8728482 8549687 8510134 8564936 8558673 8470640 8239708 8318655 8310550 8384566 8304540 8238541
4293H238541N6563P6446J59673l1148L3200j57000J66556J00376j0491J94942
$$ 8238541 8295104 8371550 8531223 8500075 8533275 8376275 8542831 8643207 8632716 8827658
4283H827658J8667L1868L70651K14800J16939N9886k44546j94530j32646l98216
$$ 8827658 8846325 8878193 9248844 9463644 9580583 9640469 9395923 9201393 9068747 8670531
4273H670531j60189k30537l20021L259m6458m2461j47587k46905J49309m9944
$$ 8670531 8510342 8279805 7959784 7963043 7916585 7874124 7726537 7479632 7628941 7578997
4263G578997Q859J2970m9998Q0015r0911l05491j4435k1005J48048n5421j8352
$$ 7578997 7587856 7600826 7550828 7630843 7539932 7234441 7220006 7199001 7347049 7291628 7273276
4252G273276j69333j15187N3775Q6159k2798Q6848r1079O6802K6276k47931L44200
$$ 7273276 7103943 6988756 7042531 7128690 7105892 7192740 7101661 7168463 7194739 6946808 7291008
4241G291008K02229j00539J20597J07075k95259K6492j89396J29939M00662J05537
$$ 7291008 7493237 7392698 7513295 7620370 7325111 7351603 7162207 7292146 7692808 7798345
4231G798345n7040j2051k36101N3933j18993K21191O9615k63278r2867N4969k1145
$$ 7798345 7741305 7729254 7493153 7547086 7428093 7649284 7718899 7455621 7362754 7417723 7396578
4220G396578J22104R7026p5131K5426N182j1045k9327Q9303j23256j50722L1481
$$ 7396578 7518682 7615708 7540577 7566003 7571185 7560140 7530813 7620116 7496860 7346138 7377619
4209G377619J54025J27322k25597j4233J81567J4487p2884r0830J19879K73036
$$ 7377619 7531644 7658966 7433369 7419136 7600703 7615190 7542306 7451476 7571355 7844391
4199G844391q5461J571J13267m9525K00846j8270K1250j5315l3189r5424L516
$$ 7844391 7758930 7760501 7873768 7824243 8025089 8006819 8028069 8012754 7979565 7884141 7887657
4188G887657r8392N2261K90988j44021k94320J33571L2262M6536k8150P0243P5355
$$ 7887657 7789265 7841526 8132514 7988493 7694173 7827744 7860006 7906542 7878392 7948635 8023990
4177H023990j61974N8330q1096m688J4357l4397J4483J25293j44636M7802P2117
$$ 8023990 7862016 7920346 7839250 7834562 7848919 7814522 7829005 7954298 7809662 7857464 7929581
4166G929581n6539J28320j46444J53232J40977J68056L05798O0018J8577R3195
$$ 7929581 7873042 8001362 7854918 8008150 8149127 8317183 8622981 8682999 8701576 8794771
4156H794771K47335J68917N9316q3923o6636Q613q8923j42928k0555o1394J3003
$$ 8794771 9042106 9211023 9270339 9186416 9119780 9128393 9039470 8896542 8875987 8814593 8827596
4145H827596M9431Q4027o9714J25611O4471J22700L4161r0751Q4757J79055K94127
$$ 8827596 8877027 8961054 8891340 9016951 9081422 9204122 9238283 9147532 9232289 9411344 9705471
4134I705471J83977Q5666J32781J58367J79762l0450K71895K76973J30204N38181
$$ 9705471 9889448 9975114 10107895 10266262 10446024 10415574 10687469 10964442 11094646 11632827
4124A1632827M84742L87006L60217N25800L10878L40596n6486m0290r0992j15725
$$ 11632827 12117569 12504575 12864792 13390592 13701470 14042066 13985580 13945290 13854298 13738573
4114A3738573j57698k56863j76714l09748j88560j9692l6277o3300q0561j9949
$$ 13738573 13580875 13324012 13147298 12837550 12648990 12629298 12593021 12529721 12449160 12429211
4104A2429211J76884K55780j19333R8771L07499J35910M61674J85076L12922L36239
$$ 12429211 12606095 12861875 12742542 12841313 13148812 13284722 13746396 13931472 14244394 14580633
4094A4580633K29758M96302N47568M52191M97846P62932P94181N20057N26228
$$ 14580633 14810391 15306693 15854261 16306452 16804298 17567230 18361411 18881468 19407696
4085A9407696J62728M05276J56751k81178k10759k97420k54689l31788J91799
$$ 19407696 19570424 19975700 20132451 19851273 19640514 19343094 19088405 18756617 18948416
4076A8948416n1136J66610L97006K98027M04417L10626J43424J18377M30259L12809
$$ 18948416 18897280 19063890 19460896 19758923 20163340 20473966 20617390 20735767 21166026 21478835
4066B1478835M34609M70030O09724O91575P13347J031761J012011J062189J265912
$$ 21478835 21913444 22383474 22993198 23684773 24398120 25429881 26441892 27504081 28769993
4057B8769993J393844J428462J150449Q76299Q21494N64749O29022M39081N21943
$$ 28769993 30163837 31592299 32742748 33619047 34440541 35005290 35634312 36073393 36595336
4048C6595336N25631N65223L61123M85383O85021O38910O03369N60769O33522
$$ 36595336 37120967 37686190 38047313 38532696 39217717 39856627 40459996 41020765 41654287
4039D1654287P80396O98781Q09760O85858N55760Q93580R88133N10818N72413
$$ 41654287 42434683 43133464 43943224 44629082 45184842 46078422 47066555 47577373 48149786
4030D8149786P05811Q47494M57489L91564P79286N51661N34922M37450K48893
$$ 48149786 48855597 49703091 50160580 50552144 51331430 51883091 52418013 52855463 53104356
4021E3104356J48832J16601j62472k09295j65106j87653j20649j23546O3100J34645
$$ 53104356 53253188 53369789 53207317 52998022 52832916 52645263 52524614 52401068 52464168 52598813
4011E2598813k60993j46231J9668k0857O1246R1643l3200K61331K94607L91320
$$ 52598813 52337820 52191589 52211257 52190400 52251646 52343289 52310089 52571420 52866027 53257347
4001E3257347N13221P28296N28286O69876P20933R14640Q68821J081191J281898
$$ 53257347 53770568 54498864 55027150 55697026 56417959 57332599 58201420 59282611 60564509
3992F0564509J079793J319782J379441J061955J204024J390329J556529J327069
$$ 60564509 61644302 62964084 64343525 65405480 66609504 67999833 69556362 70883431
3984G0883431J062742R91360J078283P08263N76916Q10049Q69621J066884Q56281
$$ 70883431 71946173 72937533 74015816 74724079 75300995 76111044 76980665 78047549 78903830
3975G8903830J124745J053492J054071R72583O68496O78978K89166M0758J41349
$$ 78903830 80028575 81082067 82136138 83108721 83777217 84456195 84745361 84786119 84927468
3966H4927468P2246K36590N62251M17225M39859N50308M52299J32358k58209m58207
$$ 84927468 84999714 85236304 85798555 86215780 86655639 87205947 87658246 87790604 87532395 87074188
3956H7074188o41106q87948r86671o46939q22721p24115m08637J7707J08280J61212
$$ 87074188 86433082 85545134 84558463 83911524 83088803 82364688 81956051 81973758 82082038 82243250
3946H2243250P622Q5820j77100l92542m91406n61969r6727j99100k2698K20127
$$ 82243250 82250872 82336692 82159592 81767050 81275644 80713675 80616948 80417848 80395150 80615277
3936H0615277N78189Q80403J018468R21912Q85698O46618O15135L33204j764L30305
$$ 80615277 81193466 82073869 83092337 84014249 84899947 85546565 86161700 86494904 86493140 86823445
3926H6823445M17136N11138P92101J148123J093075J192956J106826Q86346Q06271
$$ 86823445 87240581 87751719 88543820 89691943 90785018 91977974 93084800 93971146 94777417
3917I4777417L99354j59314k85866j51376l19900l23424m77527n20840m92174
$$ 94777417 95176771 95017457 94731591 94580215 94260315 93936891 93459364 92938524 92446350
3908I2446350p39481q47886p07731r37342j185438j144173j127242j024166j059519
$$ 92446350 91706869 90858983 90151252 89213910 88028472 86884299 85757057 84732891 83673372
3899H3673372j026757r15110j137105j214505j345908j375571j134491j480302
$$ 83673372 82646615 81731505 80594400 79379895 78033987 76658416 75523925 74043623
3891G4043623j737257j508840j599936j772973j492463j271848j227048j044812
$$ 74043623 72306366 70797526 69197590 67424617 65932154 64660306 63433258 62388446
3883F2388446j085705p81960n23088l49226k58699q2180J72805M57503R45159
$$ 62388446 61302741 60520781 59997693 59648467 59389768 59307588 59480393 59937896 60883055
3874F0883055J186135J637718J839408K334999K703362K744259K633797K336532
$$ 60883055 62069190 63706908 65546316 67881315 70584677 73328936 75962733 78299265
3866G8299265J813018J290612P14861J82775j30249k70765j61348J06819O2131
$$ 78299265 80112283 81402895 82117756 82300531 82170282 81899517 81738169 81844988 81907119
3857H1907119M76772R09676J132696J357737J408245J299902Q97600L82514k85397
$$ 81907119 82383891 83293567 84426263 85784000 87192245 88492147 89389747 89772261 89486864
3848H9486864j124646k208391k433380k872392l197458k924658k612385k570681
$$ 89486864 88362218 86153827 83720447 80848055 77650597 74725939 72113554 69542873
3840F9542873k126148k131347j662541r81216j269848j238267j345400j358117
$$ 69542873 67416725 65285378 63622837 62641621 61371773 60133506 58788106 57429989
3832E7429989j594304k222317k441489k601025k432337k449532k587009k073269
$$ 57429989 55835685 53613368 51171879 48570854 46138517 43688985 41101976 39028707
3824C9028707k177022j936267j638568j440722j272686j244258j046619q91588
$$ 39028707 36851685 34915418 33276850 31836128 30563442 29319184 28272565 27380977
3816B7380977o71187p00826r27168p86882o39540l87088n75062o03533n45407
$$ 27380977 26709790 26008964 25081796 24294914 23655374 23268286 22693224 22089691 21544284
3807B1544284n76648k76986n09316n06901l12833m04904k61857k67621l05893
$$ 21544284 20967636 20690650 20181334 19674433 19361600 18956696 18694839 18427218 18121325
3798A8121325k08348o2316l28940k19705k36837o3299k58454m13703k26325q1100
$$ 18121325 17912977 17850661 17521721 17302016 17065179 17001880 16743426 16329723 16103398 16022298
3788A6022298N3152k19117j40403j68507j86261j01172l9390j158k14820j45847
$$ 16022298 16075450 15856333 15715930 15547423 15361162 15259990 15220600 15219442 15004622 14858775
3778A4858775k24691k5317r0682j44875j78325j61011J78695k29763p300j902
$$ 14858775 14634084 14608767 14518085 14373210 14194885 14033874 14212569 13982806 13975506 13973604
3768A3973604R1047r8287j20279q180j65194j74718l7217J21272j5500k6582j09906
$$ 13973604 14064651 13966364 13846085 13837905 13672711 13497993 13460776 13582048 13566548 13539966 13430060
3757A3430060j40030M913j6763p4396r1909l6931J74425N0078j33393J51720J19661
$$ 13430060 13290030 13294943 13278180 13203784 13111875 13074944 13249369 13299447 13166054 13317774 13437435
3746A3437435j9850p2327J00197Q8326r3886J22152M9819j4598J30907L1255K19038
$$ 13437435 13417585 13345258 13445455 13533781 13439895 13562047 13611866 13597268 13728175 13759430 13978468
3735A3978468p967L05164k8012J4035L39290K24513o8714J03318J19667J23793
$$ 13978468 13970501 14275665 14247653 14261688 14600978 14825491 14756777 14860095 14979762 15103555
3725A5103555L09449M6064J41662K38325L21928J9617J90420K65356J91243K62317
$$ 15103555 15413004 15459068 15600730 15839055 16160983 16180600 16371020 16636376 16827619 17089936
3715A7089936K67136J96353K24265L43359L85659L82646K85699K24532K49011
$$ 17089936 17357072 17553425 17777690 18121049 18506708 18889354 19175053 19399585 19648596
3706A9648596L91348L43470M98211N37671M26192K41410P41846O91316L54310
$$ 19648596 20039944 20383414 20881625 21419296 21845488 22086898 22828744 23520060 23874370
3697B3874370N91952P59176R40493Q17083J109785J068183J219386J218750J761941
$$ 23874370 24466322 25225498 26165991 26983074 28092859 29161042 30380428 31599178 33361119
3688C3361119J545579J868171K072573K591593L105620L832185M013498L956593
$$ 33361119 34906698 36774869 38847442 41439035 44544655 48376840 52390338 56346931
3680E6346931L365500J713136J69226j693171k354821k774589k102981j745713
$$ 56346931 59712431 61425567 61594793 59901622 57546801 54772212 52669231 50923518
3672E0923518j344941p80615o25951k23997K34035M60321Q58240P30076P84580
$$ 50923518 49578577 48797962 48172011 47948014 48182049 48642370 49500610 50230686 51015266
3663E1015266J079606J311332J296415J591691J904550J883551K205686K614688
$$ 51015266 52094872 53406204 54702619 56294310 58198860 60082411 62288097 64902785
3655F4902785L072395L636172L665800L169831K084756M71990p95066j580478
$$ 64902785 67975180 71611352 75277152 78446983 80531739 81003729 80208663 78628185
3647G8628185j904454j465205j053411r09528j36253M19804K94864P70249J115714
$$ 78628185 76723731 75258526 74205115 73295587 73159334 73579138 73874002 74644251 75759965
3638G5759965J171647J479967J879975K019667J954999K093049K260858K387266
$$ 75759965 76931612 78411579 80291554 82311221 84266220 86359269 88620127 91007393
3630I1007393K250720K622812K743634K576220K586745K662493K668163K974662
$$ 91007393 93258113 95880925 98624559 101200779 103787524 106450017 109118180 112092842
3622A12092842L205255K822831K529490K684295K760045K539419K731003K330633
$$ 112092842 115298097 118120928 120650418 123334713 126094758 128634177 131365180 133695813
3614A33695813K469861K749748K207423K413814K300836K367770J975320J910010
$$ 133695813 136165674 138915422 141122845 143536659 145837495 148205265 150180585 152090595
3606A52090595J884873J246101J072484R82585N70603N83336M21207O19618M87319
$$ 152090595 153975468 155221569 156294053 157276638 157847241 158430577 158851784 159471402 159958721
3597A59958721O5409J46801J36420j06612k82547l21193m27752o84279r86757
$$ 159958721 160024130 160170931 160307351 160200739 159918192 159596999 159169247 158484968 157498211
3588A57498211j279621j448588j161247j284221j186541j087781j023002n77950
$$ 157498211 156218590 154770002 153608755 152324534 151137993 150050212 149027210 148449260
3580A48449260q06129n45389l11889k84537l24549r5216R2456j25545L8614K75493
$$ 148449260 147643131 147097742 146785853 146501316 146176767 146081551 146174007 146048462 146087076 146362569
3570A46362569K62230L51036N32907M50698Q33993R51083J226976J434376J557952
$$ 146362569 146624799 146975835 147508742 147959440 148793433 149744516 150971492 152405868 153963820
3561A53963820J683994J823971J944731J833430K173012K098269K087111K208621
$$ 153963820 155647814 157471785 159416516 161249946 163422958 165521227 167608338 169816959
3553A69816959K280386K241894K687973K957978K845500L090959L483611M066950
$$ 169816959 172097345 174339239 177027212 179985190 182830690 185921649 189405260 193472210
3545A93472210M371772N043539N564243N693463N777376N676260N258929M506137
$$ 193472210 197843982 202887521 208451764 214145227 219922603 225598863 230857792 235363929
3537B35363929L557287K714233J762261Q13309J24344m65750n72982n20967o03029
$$ 235363929 238921216 241635449 243397710 244211019 244335363 243869613 243296631 242775664 242172635
3528B42172635o01839p19722j053422j828119k420121l285175m270663n250359
$$ 242172635 241570796 240851074 239797652 237969533 235549412 232264237 227993574 222743215
3520B22743215n881835o245832o664040o466421o278710o085837n823570n131095
$$ 222743215 216861380 210615548 203951508 197485087 191206377 185120540 179296970 174165875
3512A74165875m506030m397825m256740l880801l592897l576865l240015k766847
$$ 174165875 169659845 165262020 161005280 157124479 153531582 149954717 146714702 143947855
3504A43947855k525883k334972j718565j769613j486775j251507j171874j379420
$$ 143947855 141421972 139087000 137368435 135598822 134112047 132860540 131688666 130309246
3496A30309246j386312j113684j060321j478222j621448j681265j824449k257423
$$ 130309246 128922934 127809250 126748929 125270707 123649259 121967994 120143545 117886122
3488A17886122k274025k644016k562168k599683k930391l289412l081534k999072
$$ 117886122 115612097 112968081 110405913 107806230 104875839 101586427 98504893 95505821
3480I5505821k692406k649208k651279k578099k612303k606221k538474k426219
$$ 95505821 92813415 90164207 87512928 84934829 82322526 79716305 77177831 74751612
3472G4751612k532432k430657k476023k113075j977111j855834j875489j617339
$$ 74751612 72219180 69788523 67312500 65199425 63222314 61366480 59490991 57873652
3464E7873652j196595j032901j171990o69724m51829l31153n58422k83591k92748
$$ 57873652 56677057 55644156 54472166 53802442 53350613 53019460 52461038 52177447 51884699
3455E1884699L6490j8723j34720q772K5031q5035k05365k3039J64476j65414J84275
$$ 51884699 51921189 51902466 51767746 51758974 51784005 51698970 51493605 51470566 51635042 51469628 51653903
3444E1653903L52469J62759K36772L58961K43153K64568K17040J28077j450j40318
$$ 51653903 52006372 52169131 52405903 52764864 53008017 53272585 53489625 53617702 53616252 53475934
3434E3475934O6367J33809l18935j1846k6303k56286k4671K54641P5607r2916
$$ 53475934 53542301 53676110 53357175 53345329 53319026 53062740 53038069 53292710 53368317 53275401
3424E3275401n319J8097J40748K67142L47929J68578R8402O31386P25101O23792
$$ 53275401 53270082 53288179 53428927 53696069 54043998 54212576 54310978 54942364 55667465 56291257
3414E6291257J091818J427160J766673K093180K670583L280203L398920K659766
$$ 56291257 57383075 58810235 60576908 62670088 65340671 68620874 72019794 74679560
3406G4679560J399163n75220j583090k433850k192498j715794j090209o58340
$$ 74679560 76078723 75503503 73920413 71486563 69294065 67578271 66488062 65829722
3398F5829722R1742J005138J403805K117738K149171J252678k35158j635027k879491
$$ 65829722 65921464 66926602 68330407 70448145 72597316 73849994 73614836 71979809 69100318
3389F9100318l352260l150823k724139k082453j835685j168994q90410j89043
$$ 69100318 65748058 62597235 59873096 57790643 55954958 54785964 53895554 53706511
3381E3706511J91650M6738P12274R98231J325040J297709J812029K254732K383676
$$ 53706511 53898161 53944899 54657173 55655404 56980444 58278153 60090182 62344914 64728590
3372F4728590K677330L118294L236529L651282L740294M206754M688523M673738
$$ 64728590 67405920 70524214 73760743 77412025 81152319 85359073 90047596 94721334
3364I4721334M910864M952675N263875N430973N461215N517834N329629N205507
$$ 94721334 99632198 104584873 109848748 115279721 120740936 126258770 131588399 136793906
3356A36793906N244881M391163M031722L843306L180060K246099J870815J222139
$$ 136793906 142038787 146429950 150461672 154304978 157485038 159731137 161601952 162824091
3348A62824091N90057P0145q83008j406930k144322k573564k958052l593010l992892
$$ 162824091 163414148 163484293 162601285 161194355 159050033 156476469 153518417 149925407 145932515
3339A45932515m222229m587753m689095m957642m989957n525734n296138n007352
$$ 145932515 141710286 137122533 132433438 127475796 122485839 116960105 111663967 106656615
3331A06656615m998667m814523m612218m374253m191975m014740l666936l291979
$$ 106656615 101657948 96843425 92231207 87856954 83664979 79650239 75983303 72691324
3323G2691324l265083k703608k886758k431852k026636j999292j778988j729221
$$ 72691324 69426241 66722633 63835875 61404023 59377387 57378095 55599107 53869886
3315E3869886j375782j036675j107815r46544p19493o49596n35110k55853r9570
$$ 53869886 52494104 51457429 50349614 49403070 48683577 48033981 47498871 47243018 47143448
3306D7143448J54368j40689p1955L30486K68298M89232N93739P60839R65783J152397
$$ 47143448 47297816 47157127 47085172 47415658 47683956 48173188 48766927 49527766 50493549 51645946
3296E1645946J450532R23807J37489j57054n67478o22024m05578k55511p2223
$$ 51645946 53096478 54020285 54157774 54000720 53433242 52811218 52405640 52150129 52077906
3287E2077906j94935Q2600l1609J46633K13243J13090L68188M64194K62434O75474
$$ 52077906 51882971 51965571 51933962 52080595 52293838 52406928 52775116 53239310 53501744 54177218
3277E4177218P79333O35836Q13346O63742R50954R08721J021678J082040J445133
$$ 54177218 54956551 55592387 56405733 57069475 58020429 58929150 59950828 61032868 62478001
3268F2478001J727509K275084K388665K994343L486653L089364J856079Q39975
$$ 62478001 64205510 66480594 68869259 71863602 75350255 78439619 80295698 81135673
3260H1135673Q71573J256692J991758K768584L280619L990274M781494N629046
$$ 81135673 82007246 83263938 85255696 88024280 91304899 95295173 100076667 105705713
3252A05705713O220643P173696P985867Q888146R898790J0850891J1350615J1571620
$$ 105705713 111926356 119100052 127085919 135974065 145872855 156723746 168074361 179645981
3244A79645981J1435343J0056128P667165M580293Q26080k775748n760645p963156
$$ 179645981 191081324 201137452 208804617 213384910 214210990 211435242 205674597 197711441
3236A97711441r370214r888096q876444q573862p643979p230904p225811o791459
$$ 197711441 188341227 178453131 169576687 161002825 153358846 146127942 138902131 132110672
3228A32110672o609781o161229n574656m866292m056875m036006l389507k886084
$$ 132110672 125500891 119339662 113765006 108898714 104841839 100805833 97416326 94530242
3220I4530242k647290k554742k191828j881476j913092j631372j400383j472701
$$ 94530242 91882952 89328210 87136382 85254906 83341814 81710442 80310059 78837358
3212G8837358j226050j100734j565413j301912q13770j010683j349612j326883
$$ 78837358 77611308 76510574 74945161 73643249 72829479 71818796 70469184 69142301
3204F9142301j211609j358982j551978j532811j621412j491385j451507j635443
$$ 69142301 67930692 66571710 65019732 63486921 61865509 60374124 58922617 57287174
3196E7287174j115576j034772j170369j086598j026372n60477l26567P7503P731
$$ 57287174 56171598 55136826 53966457 52879859 51853487 51293010 50966443 51043946 51051677
3187E1051677M49389R13700J566637J688241J193771R2474j310751k650881l066377
$$ 51051677 51501066 52414766 53981403 55669644 56863415 56955889 55645138 52994257 49927880
3178D9927880k871780k620622k114523j804374j491891j240140j040545p97093
$$ 49927880 47056100 44435478 42320955 40516581 39024690 37784550 36744005 35946912
3170C5946912n95826o43958o23481n44940k56348j80692k78164O5621J14196K80270
$$ 35946912 35351086 34707128 34083647 33538707 33282359 33101667 32823503 32889124 33003320 33283590
3160C3283590N26918N64983P66314J165563J360396K102858K703581L708912M586422
$$ 33283590 33810508 34375491 35141805 36307368 37667764 39770622 42474203 46183115 50769537
3151E0769537M164118K644989m19928l293246m811769m706039m163396l725036
$$ 50769537 54933655 57578644 57158716 53865470 49053701 44347662 40184266 36459230
3143C6459230l193981k069801j775642j235425j179265j292263o06729o38646
$$ 36459230 33265249 31195448 29419806 28184381 27005116 25712853 25106124 24467478
3135B4467478o32784n88204m04049k83083k12206r8301O7828J74669J65398L4915
$$ 24467478 23834694 23246490 22842441 22559358 22347152 22248851 22316679 22491348 22656746 22691661
3125B2691661L35988M23388O32353J248727J301575J920155J979656J548585L76225
$$ 22691661 23027649 23451037 24083390 25332117 26633692 28553847 30533503 32082088 32458313
3116C2458313r14810k059743k512175k260052j972663j746851j440322j142791
$$ 32458313 31543503 29483760 26971585 24711533 22738870 20992019 19551697 18408906
3108A8408906r23154m78024o89239p16444l64486k24302n64410m06648k77377
$$ 18408906 17485752 17007728 16318489 15602045 15237559 15013257 14448847 14042199 13764822
3099A3764822k35715m36855l08349j62066n1932k31039n02400p5714j31029k56059
$$ 13764822 13529107 13092252 12783903 12621837 12569905 12338866 11836466 11760752 11629723 11373664
3089A1373664k47595k05436k6770J2823q5769j21464j83976j09135j64303q280
$$ 11373664 11126069 10920633 10893863 10906686 10820917 10699453 10515477 10406342 10242039 10233759
3079A0233759j80909J0512o6128j70870o5083k22033j07740j49746M0383j18240
$$ 10233759 10052850 10063362 9997234 9826364 9761281 9539248 9431508 9281762 9322145 9203905
3069I203905j49337q4234q0196P2570J18383q2396m15625q8252J57889k05340
$$ 9203905 9054568 8970334 8890138 8962708 9081091 8998695 8583070 8494818 8652707 8447367
3059H447367k1787k12769j34926L1355j81713j02523L0039j33981r1319L9062
$$ 8447367 8425580 8212811 8077885 8109240 7927527 7825004 7855043 7721062 7629743 7668805
3049G668805J3339j97881q3781k8024j81762J05944k3583k07791r5446j18541
$$ 7668805 7682144 7484263 7400482 7372458 7190696 7296640 7273057 7065266 6969820 6851279
3039F851279j9007n2534N5682r2867p4313J61920j5936N6050l076k13908k29151
$$ 6851279 6832272 6779738 6835420 6742553 6668240 6830160 6814224 6870274 6867198 6653290 6424139
3028F424139j0951j38923P9881J67556O5193m1929m9807j32148J3517J12463p1032
$$ 6424139 6413188 6274265 6354146 6521702 6586895 6544966 6495159 6363011 6376528 6488991 6417959
3017F417959J207J04572J83680K2077j28559j67264J9128J15896j13087k7207
$$ 6417959 6419166 6523738 6707418 6729495 6600936 6433672 6452800 6568696 6455609 6428402
3007F428402J54096m499J72362j02205k3212J47999Q9431J37144n964l5719l26419
$$ 6428402 6582498 6577999 6750361 6648156 6624944 6772943 6862374 6999518 6993554 6957835 6631416
2996F631416o7009L014J73219l2507J33888r6515K1480K21623j19413P9764j71991
$$ 6631416 6564407 6567421 6740640 6708133 6842021 6745506 6766986 6988609 6869196 6948960 6776969
2985F776969J27968Q6550Q8228K59264j04828l205j32203J21675Q6443n4614K45353
$$ 6776969 6904937 6991487 7079715 7338979 7234151 7230946 7098743 7220418 7306861 7252247 7497600
2974G497600K6178k0237R8556r3140r3000P359j42470J6213n5499R6875J00637
$$ 7497600 7523778 7503541 7602097 7508957 7415957 7423316 7280846 7297059 7241560 7338435 7439072
2963G439072j63440K40559K07643O5355J201j5254J26632J50307O6921J02943
$$ 7439072 7275632 7516191 7723834 7789189 7790390 7775136 7901768 8052075 8118996 8221939
2953H221939K36842J21068J96733K95298K09555L98123J06871K15685L68375J41167
$$ 8221939 8458781 8579849 8776582 9071880 9281435 9679558 9786429 10002114 10370489 10511656
2943A0511656M88991L83221L24685K97707J63146J42123K49713L27712L64906
$$ 10511656 11000647 11383868 11708553 12006260 12169406 12311529 12561242 12888954 13253860
2934A3253860M10806N61797M24634N70860L49344K86601K88259R6792J07175J55263
$$ 13253860 13664666 14226463 14651097 15221957 15571301 15857902 16146161 16242953 16350128 16505391
2924A6505391K74883r6577J4443J67457k27998N3779P8038K18618M14223J5209
$$ 16505391 16780274 16683697 16698140 16865597 16637599 16691378 16769416 16988034 17402257 17417466
2914A7417466L65851O66489N17162P18742M54849N55139M98338N38259P47166
$$ 17417466 17783317 18449806 18966968 19685710 20140559 20695698 21194036 21732295 22479461
2905B2479461R00773J218688J419105J435916N92127l48699j327233j589920j751001
$$ 22479461 23380234 24598922 26018027 27453943 28046070 27697371 26370138 24780218 23029217
2896B3029217j484247j237523j248245r38949o82624o17926o61491l31198l88275
$$ 23029217 21544970 20307447 19059202 18120253 17437629 16819703 16158212 15827014 15438739
2887A5438739l94786j60598j00401L2033p5099j59107L39065K14794K14384l2906
$$ 15438739 15043953 14883355 14782954 14814987 14739888 14580781 14919846 15134640 15349024 15316118
2877A5316118o85K21472m7223J35967J80924l9868k48604j58568l48441p15511
$$ 15316118 15315433 15536905 15489682 15625649 15806573 15766705 15518101 15359533 15011092 14295581
2867A4295581o59138m23785p85741p50732n80476k97392m05374l36518l23241
$$ 14295581 13636443 13212658 12426917 11676185 11095709 10798317 10392943 10056425 9733184
2858I733184l97749j79969m49155j80022k91925k62730j76083l31605l48321K0534
$$ 9733184 9335435 9155466 8706311 8526289 8234364 7971634 7795551 7463946 7115625 7136159
2848G136159j61414l13972q6155j03921k04162m70590q1183M9228k85798l19273
$$ 7136159 6974745 6660773 6574618 6470697 6266535 5795945 5714762 5763990 5478192 5158919
2838E158919r8822k80708q9673j59403j80485J19299j28782j58075j13257P5512
$$ 5158919 5060097 4779389 4689716 4530313 4349828 4469127 4340345 4182270 4069013 4144525
2828D144525k54501k85736K7533R6130j45181L2801j19249N0091j78141j72779
$$ 4144525 3890024 3604288 3631821 3727951 3582770 3615571 3496322 3546413 3368272 3195493
2818C195493q0983j27492P8588k12722J28724j22516o8769k3235P7111j19573
$$ 3195493 3114510 2987018 3065606 2852884 2981608 2859092 2790323 2767088 2844199 2724626
2808B724626m5922N3404R7486Q9572j55693l24423j31063j16831K5646P0223J55
$$ 2724626 2678704 2732108 2829594 2919166 2763473 2439050 2307987 2191156 2216802 2287025 2287180
2797B287180m6698n6291j5936j29163k7646L1799Q5070j15020Q0881j21939p1251
$$ 2287180 2240482 2184191 2168255 2039092 2011446 2043245 2128315 2013295 2094176 1972237 1900986
2786A900986O8732P785p5320j03944n6300p7734J3932O970R6746n6696r8891l14463
$$ 1900986 1969718 1977503 1902183 1798239 1741939 1664205 1678137 1685107 1781853 1725157 1626266 1311803
2774A311803K28390L0438L8783j07928l6630j00052L0224L0836K7689J35989k3052
$$ 1311803 1540193 1570631 1609414 1501486 1464856 1364804 1395028 1425864 1453553 1589542 1566490
2763A566490R990j43888j71670M4764Q4212k82265K1658J750j13392J14560L04289
$$ 1566490 1576480 1432592 1260922 1305686 1389898 1107633 1129291 1131041 1017649 1132209 1436498
2752A436498j06482k42603n7863j30239Q0541q7289L5004J46292o6355R8224k253
$$ 1436498 1330016 1087413 1029550 899311 979852 892563 927567 1073859 1007504 1105728 1103475
2741A103475M6578l0063M4269p2747j81211K0134J49014n9662j0813l2612P5712
$$ 1103475 1150053 1119990 1164259 1091512 910301 930435 1079449 1019787 1008974 976362 1052074
2730A052074j11374r4687R1857M6740o2915q90K0419k8039r0505j71136K12522
$$ 1052074 940700 846013 937870 984610 921695 920805 941224 913185 822680 651544 864066
2719H64066J62204j25079n8064q2580J13202p1342o3338j26159P9233j8847M6907
$$ 864066 1026270 901191 843127 760547 873749 802407 739069 612910 692143 673296 720203
2708G20203J97981m2615k22402k37088J81476J3590N6646R9610o3890j42927L7735
$$ 720203 918184 875569 653167 416079 597555 611145 667791 767401 703511 560584 598319
2697E98319k0738j3768J86012J44344k23050k11109O4145J13494J65909j03102
$$ 598319 577581 563813 749825 894169 671119 460010 524155 637649 803558 700456
2687G00456J3830j95912o1570j16067p8323J20600J62313J23396j28634q8877
$$ 700456 714286 518374 456804 340737 262414 383014 545327 668723 540089 451212
2677D51212K19210K7583k48429m7353J9791J46929J06728o9014q5660n8026j22820
$$ 451212 670422 698005 449576 402223 422014 568943 675671 606657 520997 462971 340151
2666C40151O3167K43857M0446q8525r0807L0270M9865J77482j13332j69493J66229
$$ 340151 403318 647175 687621 599096 508289 538559 588424 765906 652574 483081 649310
2655F49310j41293n7798K10051l5381p8943j60603j64391J97285J44442m1046
$$ 649310 508017 450219 660270 624889 545946 385343 220952 418237 562679 521633
2645E21633k242N859N9068R7141j63013O4564n3922m4132Q1733n9601m1703P744
$$ 521633 519391 525250 584318 681459 518446 583010 529088 484956 566689 507088 465385 473129
2633D73129O144J6450j51447R5939J3624j39349K01514J35375j31891k09945J04208
$$ 473129 479273 495723 344276 440215 453839 314490 516004 651379 519488 309543 413751
2622D13751R4315P1228o6813p8488J01026n7572j8825Q2470k636K9955N0713j46723
$$ 413751 508066 579294 512481 433993 535019 477447 458622 541092 538456 568411 619124 472401
2610D72401j26474l3088J93010j04986j48904O0553l2618J4934J56385j17578
$$ 472401 345927 312839 505849 400863 251959 312512 279894 294828 451213 333635
2600C33635N0708j03527r324J77348j29026O3494r473j66999J75418R0286k1844
$$ 333635 384343 280816 271492 448840 319814 383308 373835 206836 382254 472540 450696
2589D50696j55476n7781k16441K51080n693r0997O4398j50318l5667J52026J38176
$$ 450696 295220 237439 20998 272078 266385 175388 239786 89468 53801 205827 344003
2578C44003j04800j93814J04922P5755P5892J6432q0179n1441j35789J98979r58
$$ 344003 239203 45389 150311 226066 301958 318390 238211 186770 50981 249960 249002
2567B49002J06752o7568k5866l8853O0873j09445o1591J05614J44179L7528j10124
$$ 249002 355754 288186 262320 223467 284340 174895 113304 218918 363097 400625 290501
2556B90501q1219K5595m2290O4440J4047N1070q4442j16970k19559M5428j3634
$$ 290501 209282 234877 192587 257027 271074 322144 237702 120732 -98827 -53399 -67033
2545f7033m7660M6268J20652K86497m6959j41592O9637P1031j31066J00045J31405
$$ -67033 -114693 -68425 52227 338724 291765 150173 219810 290841 159775 259820 391225
2534C91225r4132m3987j16716M3336n427n6424N8214J12033M3300l9680k7536
$$ 391225 297093 253106 136390 179726 174299 117875 176089 288122 331422 291742 264206
2523B64206k26725q017K10963o731l4384J2169M350n9354j71401K28863k381q5674
$$ 264206 37481 29464 240427 233696 199312 211481 215831 156477 -14924 213939 211558 125884
2511A25884j07661r1574M9742j06486O6126k6045R6241K66929p0047j47349m8862
$$ 125884 18223 -73351 -23609 -130095 -63969 -90014 6227 273156 203109 55760 6898
2500F898m1207N9303L9990p8929k27260R4420J27720J35591n355j25705k1582
$$ 6898 -34309 24994 64984 -13945 -241205 -146785 -19065 116526 111171 -14534 -36116
2489c6116j18551J6365R8095k817K12067l890P736L0436l3265L6560L16612o3241
$$ -36116 -154667 -138302 -40207 -43024 169043 165153 172889 203325 170060 206620 523232 459991
2477D59991l22665n6302Q7243m3003j60307P4207J5682r00J826j776q4407J18952
$$ 459991 137326 81024 168267 125264 -35043 39164 54846 53946 55772 53996 -30411 88541
2465H8541J4024J55299k36245J36413n2645k0133P3841j62336O7392M9031P7361
$$ 88541 102565 257864 21619 158032 105387 85254 159095 -3241 64151 113182 190543
2454A90543P5768j23241j19434Q2595L1452k8809L544J4630N5258o1265L9862
$$ 190543 266311 143070 23636 106231 137683 108874 112418 127048 182306 121041 160903
2443A60903o2092r0133K50105N4829k47311l75338J08638L96l1020J86635O8739
$$ 160903 98811 8678 258783 313612 66301 -309037 -200399 -200003 -231023 -44388 24351
2432B4351P1279J5004q7870Q938r7904R636J35270m7939O3809O6039l3849o9893
$$ 24351 95630 110634 22764 31702 -66202 -56566 78704 30765 94574 160613 126764 56871
2420E6871k4890R097P2448R5749o7859N2707j42594j79892J51663r3585j02304
$$ 56871 31981 41078 113526 209275 141416 194123 51529 -128363 23300 -70285 -172589
2409a72589j653L23197Q9626j23058m3124m7182n9003L2530k4830K8781p7103
$$ -172589 -174242 148955 238581 115523 72399 25217 -33786 -1256 -26086 2695 -74408
2398g4408J50372J54675j10553k62392j0547L8186r571l2013K08032J93762j82767
$$ -74408 75964 230639 120086 -142306 -152853 -114667 -124238 -156251 51781 245543 62776
2387F2776L0813j77601J08267K63165j06145j66284Q3428J0016k8375q2109J81106
$$ 62776 93589 -84012 24255 287420 181275 14991 98419 108435 80060 -2049 179057
2376A79057J4423j4592M3597P3770o789R5906M8999K57244j40080j17345N8682
$$ 179057 193480 178888 222485 296255 289466 385372 434371 691615 551535 434190 492872
2365D92872k62137Q4214q5207j16633o746K17596J97410p6461j65029j09155J23573
$$ 492872 230735 314949 229742 113109 106363 323959 521369 444908 279879 170724 294297
2354B94297k64727j35949J40306J34676Q3501j59134P7473O775K8024p1240j41612
$$ 294297 29570 -106379 33927 168603 252104 92970 170443 177218 205242 134002 -7610
2343g610J581J97177Q467q0273O1294k24452m836J9211k9082K0245M4845J02102
$$ -7610 -6029 191148 199615 119342 180636 -43816 -48652 -29441 -58523 -38278 6567 108669
2331A08669N6508N3180o9608k61788K87941o445n0898k15758J81896J10977l3324
$$ 108669 165177 218357 148749 -113039 174902 168457 117559 -98199 83697 194674 161350
2320A61350N5878L8967n7900k62036J70183j126j38161m4868L0315J21587R0951
$$ 161350 217228 256195 198295 -63741 106442 105316 -32845 -77713 -47398 74189 165140
2309A65140j86003Q6919N9236j20237k7597J16862j4280o5897k2153Q5627J20831
$$ 165140 -20863 66056 125292 5055 -22542 94320 80040 14143 -8010 77617 198448
2298A98448P1935k48505l5875O6252q1157l47R7929R7175K297j45427J34955r2244
$$ 198448 270383 21878 -13997 52255 -28902 -29249 68680 165855 168152 22725 157680 65436
2286F5436J20885M7149J50002m07730l189K03122j69723Q5940N913q1344P8613
$$ 65436 186321 233470 383472 -24258 -27447 175675 5952 91892 97805 16461 95074
2275I5074K95640J00090j48688j64771o0544P7572J7439j24775L4385P3176n5294
$$ 95074 390714 490804 342116 177345 116801 194373 211812 87037 121422 194598 139304
2264A39304r637l4403j62210K2792J89775K88902r5786k57297N1717P7973J29376
$$ 139304 129667 95264 -66946 -44154 145621 434523 338737 81440 133157 211130 340506
2253C40506o9448p2822R7942j23546K0975j69Q5365m8814J03544l8208j97893
$$ 340506 271058 198236 296178 172632 193607 193438 278803 229989 333533 295325 97432
2242I7432K13842J48250j84640o7629l2521p162J19583R0038M6590l14021J31573
$$ 97432 311274 459524 274884 207255 174734 167572 287155 377193 423783 109762 241335
2231B41335J94852j27591J21789o291J1025j43318j47697L8547R8947J43362l9343
$$ 241335 436187 308596 430385 424094 435119 291801 144104 182651 281598 424960 385617
2220C85617o2179O6184M6028Q2630J8686j4546o3905M9472O3204M5575Q8895j68563
$$ 385617 323438 389622 435650 518280 536966 522420 458515 507987 571191 616766 705661 537098
2208E37098P1485L1152j60744P144n2289Q4804k86069J29835K37363q9400J3220
$$ 537098 608583 639735 478991 486135 433846 518650 232581 362416 599779 510379 523599
2197E23599j9554R7888Q085K7421J20972j03561J42144l1250n8341M3856r4582
$$ 523599 504045 601933 610018 637439 758411 654850 796994 765744 707403 751259 656677
2186F56677l4603N3270J43052J53931M8010M758q767K43792o0795r2903K9719
$$ 656677 622074 675344 818396 972327 1020337 1025095 1016328 1260120 1199325 1106422 1136141
2175A136141o172L13097N9214L2308R011j18296k8016o7047J00221l8686l6589
$$ 1136141 1129969 1443066 1502280 1534588 1543599 1425303 1397287 1330240 1430461 1391775 1355186
2164A355186j22110P4052J00035J29660J79509m0962K2050K19633l1443j36330
$$ 1355186 1233076 1307128 1407163 1536823 1716332 1675370 1697420 1917053 1885610 1749280
2154A749280j0369K71254M4987P3951J68835n4173K94885J47157Q3289L6977N2209
$$ 1749280 1738911 2010165 2055152 2129103 2297938 2243765 2538650 2685807 2769096 2806073 2858282
2143B858282j04925J67167J54137M1602J24811J98150K67365J41847K72672J18221
$$ 2858282 2753357 2920524 3074661 3116263 3241074 3439224 3706589 3848436 4121108 4239329
2133D239329l7017K77132K68200K53438J38755J39958J98394L45948M78892L02529
$$ 4239329 4202312 4479444 4747644 5001082 5139837 5279795 5478189 5824137 6303029 6605558
2123F605558N37409O79084O90709Q11034Q26577Q40135Q03889Q92293J132396
$$ 6605558 7142967 7822051 8512760 9323794 10150371 10990506 11794395 12686688 13819084
2114A3819084J384230J399267K158318K312703K885762M035576N275225P259200
$$ 13819084 15203314 16602581 18760899 21073602 23959364 27994940 33270165 40529365
2106D0529365J0220777J2455800J1450977J903074p031780j0927341j1596620
$$ 40529365 50750142 63205942 74656919 76559993 69528213 58600872 47004252
2099D7004252q792212o636200n336485m058155k600975k389798j989324j155900
$$ 47004252 38212040 31575840 26239355 22181200 19580225 17190427 15201103 14045203
2091A4045203j086272m69270k81434p92189r59093r29131o11350p69123p38005
$$ 14045203 12958931 12489661 12208227 11416038 10456945 9527814 8916464 8147341 7409336
2082G409336o20650l11684j72807l34866m67874k67980l35571l83952j41166j31981
$$ 7409336 6788686 6477002 6304195 5969329 5501455 5233475 4897904 4513952 4372786 4240805
2072D240805k04769k28144j78548r2073j20417J8944r7827l04396k20958J5266
$$ 4240805 4036036 3807892 3629344 3537271 3416854 3435798 3337971 3033575 2812617 2827883
2062B827883k2939j35600j94410j92529l24360J12517J00984k36384n4266J38839
$$ 2827883 2804944 2669344 2474934 2282405 1958045 2070562 2171546 1935162 1880896 2019735
2052B019735p398N9398l2874j82076k71815J90262J45681k27713k7354k08545
$$ 2019735 2012337 2071735 2038861 1856785 1584970 1775232 1920913 1693200 1665846 1457301
2042A457301j86809j27788q2742K71749n5524k39968M5628m6633Q6913j06539
$$ 1457301 1270492 1142704 1059962 1331711 1276187 1036219 1081847 1035214 1122127 1015588
2032A015588L1402o1314O4010j11102M3488N3836p9815k63304K3259J20485j55598
$$ 1015588 1046990 985676 1049686 938584 982072 1035908 956093 692789 716048 836533 680935
2021F80935p1826n8784J86639j5520n082j44396K6807N7537j32516j9145M0148
$$ 680935 609109 550325 736964 721444 716362 571966 598773 656310 523794 504649 544797
2010E44797n9772j61448J9852N3704k09853Q1578l852J04352R6603j902o8399
$$ 544797 485025 323577 343429 397133 187280 268858 265006 369358 465961 464059 395660
1999C95660l5134j0264j3887Q415l6795M0359M1898P5269r7941J19918J9767j79421
$$ 395660 360526 350262 336375 344790 307995 348354 390252 465521 367580 487498 507265 327844
1987C27844K23352J25845P642l60061M0981N7463j43303k45308k28299K13097
$$ 327844 551196 677041 684683 324622 365603 423066 279763 34455 -193844 19253
1977A9253P4265P325L29241k0620j10723R6147P178P9244k16965j35039M0884
$$ 19253 93518 100843 430084 409464 298741 394888 402066 481310 264345 129306 170190
1966A70190K36872m0849j97517Q1585j4301O9908j42215L3856l1873J22399j8928
$$ 170190 407062 366213 168696 250281 235980 305888 163673 197529 165656 288055 269127
1955B69127q0278J7942J49865j4145r4841J198P8999M5215L561q5331k2151k35856
$$ 269127 188849 206791 356656 342511 247670 248868 327867 373082 376643 291312 269161 33305
1943C3305j49490K4442j480O5590P9653J2851j76167K2596j10866m0849j36803
$$ 33305 -116185 -91743 -93223 -27633 52020 64871 -111296 -88700 -199566 -240415 -377218
1932c77218L12963R0918J3136M4205J0903p0609q7247O9530m8308k00901J45568
$$ -377218 -64255 26663 39799 84004 94907 24298 -62949 6581 -41727 -242628 -97060
1921i7060j08009N0606p1702Q1245K23331L698k63O4567Q5585j36990j78353J2727
$$ -97060 -205069 -154463 -226165 -144920 78411 82109 81846 146413 231998 95008 -83345 -70618
1909g0618l9839O8866r1483J43630J34613j14364j5599q2230p5082Q4445j56400
$$ -70618 -110457 -41591 -133074 10556 145169 30805 15206 -67024 -142106 -57661 -214061
1898b14061P4203K0388j55157r509r487j16085J21740J88914J94166q1135j5253
$$ -214061 -139858 -119470 -274627 -284136 -293623 -409708 -287968 -99054 95112 13977 -1276
1887a276Q4600j7306M227J7819P1475N199j06664K073J9676n8472n7188N0611
$$ -1276 83324 66018 70245 88064 159539 164738 58074 60147 79823 21351 -35837 14774
1875A4774j23982Q6937J84220P1310j6986N9877k0792l53767K11775J26719J738
$$ 14774 -109208 -22271 161949 233259 216273 276150 255358 -98409 113366 240085 241823
1864B41823j05306J12p3277R0243k1451r4759J0021k9412J7525L6471l7770J28465
$$ 241823 136517 136629 63352 153595 132144 37385 47406 17994 35519 71990 34220 162685
1852A62685n6580Q0393j72302O0402n175j43771P103K50633K7545l0479j25441
$$ 162685 106105 186498 14196 74598 69423 -74348 -67245 183388 210933 180454 55013
1841E5013n3906J16128K17514l9127j61494K45342p0584J04102k5373j32857J13095
$$ 55013 1107 117235 334749 295622 134128 379470 308886 412988 387615 254758 367853
1830C67853k99962m9073K01174M7525n9238j5680j46678j56632K522m5561L7337
$$ 367853 67891 18818 219992 267517 208279 192599 45921 -110711 -108189 -153750 -116413
1819a16413j70137k8982L70570j11970P3929j3904p3033O9693L5098P0660j44634
$$ -116413 -286550 -315532 55038 -56932 16997 3093 -69940 -247 34851 105511 -39123
1808c9123J13083l2570k7020J69752j15236k07226J14279O4959O1029j13577j83217
$$ -39123 73960 41390 14370 184122 68886 -138340 -24061 40898 101927 -11650 -194867
1797a94867L6851K44286R8654j26371N1467R051j77538L9261J0926L9251j40926
$$ -194867 -158016 86270 184924 58553 110020 119071 -58467 -19206 -8280 30971 -109955
1786a09955r1965J37780J13351K724K5316M9514j27808m7012l5205O6721r3580
$$ -109955 -201920 -64140 49211 51935 77251 126765 -1043 -48055 -83260 -16539 -110119
1775a10119J8337N6622J99374k8072k41526J53220j11014q9214q406k5646J57786
$$ -110119 -91782 -35160 164214 136142 -105384 47836 -63178 -152392 -160798 -186444 -28658
1764b8658J48459k0706p1867O0480k0727l2048m9880q9240J91749M1070r8961
$$ -28658 119801 99095 27228 87708 66981 34933 -14947 -104187 87562 128632 29671
1753B9671K96q4252k8249n676n1550Q8207k44322L52597J6617k2193J21678Q0899
$$ 29671 29967 -54285 -82534 -88210 -139760 -51553 -295875 56722 73339 51146 172824 253723
1741B53723l7126l3944j28346j75126R2136J14141j56879q4315J37065p6759n027
$$ 253723 216597 182653 54307 -120819 -28683 85458 -71421 -155736 -18671 -95430 -100457
1730a00457J20835Q1423j35796Q4126q2605j88410K8369J20247k4057j583k98399
$$ -100457 20378 101801 -33995 50131 -32474 -220884 -192515 -72268 -96325 -97908 -396307
1719c96307P0291K84233K2966j1608k63247J94192K39349j60329n2235k29585
$$ -396307 -326016 -41783 -18817 -30425 -293672 -99480 139869 -20460 -72695 -302280
1709c02280J69409j901O7570R5587o3417j38218Q1263j51085K4763K13418Q2160
$$ -302280 -132871 -134772 -67202 28385 -35032 -173250 -91987 -243072 -218309 -4891 77269
1698G7269k21377j29625R0381m41J19225j24822J3257J29182L2077J9496M7285
$$ 77269 -144108 -273733 -183352 -183793 -64568 -189390 -176133 -46951 -14874 4622 51907
1687E1907l4248l5098J15693j31596K5662K1665j78917J68800L2960J00064l78392
$$ 51907 17659 -17439 98254 -33342 -7680 13985 -164932 3868 36828 136892 -241500
1676b41500M4066l9162M9649J01857k01224P0265L03874j68516l6213l2021n0548
$$ -241500 -197434 -236596 -186947 -85090 -286314 -216049 87825 -80691 -116904 -148925 -199473
1665a99473K8510L4412j9967L3946k60055j36655K67685R9979J23685M9812j58100
$$ -199473 -170963 -136551 -156518 -122572 -382627 -519282 -251597 -151618 -27933 21879 -136221
1654a36221k00410J32638J32494k2573J84786M005j46756j7165R9249q5807j29700
$$ -136221 -336631 -203993 -71499 -94072 90714 94719 -52037 -69202 30047 -55760 -185460
1643a85460P8665K2198k1240j43581J90797J61192p8828o6084K11554K9852l216
$$ -185460 -106795 -84597 -105837 -249418 -58621 102571 23743 -42341 169213 199065 195849
1632A95849j55839J00073m6955l1547J06085o4450k66490J60551M392k16564L1715
$$ 195849 40010 140083 93128 61581 167666 103216 -163274 -2723 1669 -214895 -183180
1621a83180K08351J6954J83978L2352o1980J6549j73204j04431j36884n4811Q7008
$$ -183180 25171 42125 226103 258455 196475 213024 39820 -64611 -201495 -256306 -169298
1610a69298M6917J17042q1944j4549J31584q6056k4254j8421o7306J38492Q3032
$$ -169298 -122381 -5339 -87283 -101832 29752 -56304 -80558 -98979 -166285 -27793 55239
1599E5239k30948m8031J77257M0536k21634K2549K6362j9368J38443J03627o7639
$$ 55239 -175709 -223740 -46483 -5947 -227581 -205032 -178670 -198038 -59595 44032 -23607
1588b3607J9704L7691j18666R7570j95j45198q3162N8042J45384q3417j21347
$$ -23607 -3903 33788 -84878 12692 12497 -132701 -215863 -157821 -12437 -95854 -217201
$$ [...]
##END NTUPLES=NMR SPECTRUM
##END=
