##TITLE=1H_EC-3302(II-32)
 CDCl3
 8 sc, 
 30.10.2023
##JCAMPDX= 6.0         $$ Bruker NMR JCAMP-DX V2.0
##DATA TYPE= NMR SPECTRUM
##DATA CLASS= NTUPLES
##ORIGIN= UXNMR, Bruker Analytische Messtechnik GmbH
##OWNER= root
$$ XWIN-NMR		Version 3.5
$$ Mon Oct 30 14:12:15 2023 Russian Standard Time (UT+4h)  she@DPX200
##.OBSERVE FREQUENCY= 200.13135
##.OBSERVE NUCLEUS= ^1H
##.ACQUISITION MODE= SIMULTANEOUS
##.ACQUISITION SCHEME= undefined
##.AVERAGES= 8
##.DIGITISER RES= 18
##SPECTROMETER/DATA SYSTEM= spect
##.PULSE SEQUENCE= zg30
##.SOLVENT NAME= CDCl3
##.SHIFT REFERENCE= (INTERNAL, CDCl3, 0, 15.7326)
##AUDIT TRAIL= $$ (NUMBER, WHEN, WHO, WHERE, WHAT)
$$ ##TITLE= Audit trail, XWIN-NMR		Version 3.5
$$ ##JCAMPDX= 5.01
$$ ##ORIGIN= Bruker BioSpin GmbH
$$ ##OWNER= she
$$ F:/spectra/data/she/nmr/H-F/1/pdata/1/auditp.txt
$$ ##AUDIT TRAIL=  $$ (NUMBER, WHEN, WHO, WHERE, WHAT)
(   1,<2023-10-30 14:11:01.71 +0400>,<she>,<DPX200>,
      <created by zg, POWCHK disabled, PULCHK disabled
       configuration hash MD5:
       00 E9 B6 7A A2 85 ED C7 34 08 36 98 17 FE 4E 26
       data hash MD5: 16K
       3B C0 25 C2 D0 C3 E3 45 90 AE C5 1D AD E9 27 90>)
(   2,<2023-10-30 14:11:04.95 +0400>,<she>,<DPX200>,
      <Start of raw data processing
       efp BC_mod = 2 LB = 0.24 FT_mod = 6 PKNL = 1 PHC0 = -23868.52 PHC1 = 16.05271 SI = 16K 
       data hash MD5: 16K
       9A 37 39 9D 96 10 18 79 1C E2 F8 6F 33 94 6B CB>)
(   3,<2023-10-30 14:11:24.85 +0400>,<she>,<DPX200>,
      <pk PHC0 = 4.465492 PHC1 = -7.400001 
       data hash MD5: 16K
       C9 73 6F 30 2C D9 64 13 88 C6 55 85 9F 21 83 89>)
(   4,<2023-10-30 14:11:28.06 +0400>,<she>,<DPX200>,
      <abs ABSG = 5 
       data hash MD5: 16K
       E7 29 5E C0 85 3D 3D 20 29 18 10 6F D5 74 41 54>)
$$ ##END=
$$ 
$$ hash MD5
$$ C5 0B 61 E9 20 2D 46 3E 99 AC 7D 33 AA C2 0D 4F
##$RELAX= 
##$RELAX= 
##$RELAX= 
##$RELAX= 
##$RELAX= 
##$RELAX= 
$$ Bruker specific parameters
$$ --------------------------
##$DU= <F:/spectra>
##$EXPNO= 1
##$NAME= <H-F>
##$PROCNO= 1
##$TYPE= <nmr>
##$USER= <she>
##$AMP= (0..31)
100 100 100 100 100 100 100 100 100 100 100 100 100 100 100 100 100 100 
100 100 100 100 100 100 100 100 100 100 100 100 100 100 
##$AQSEQ= 0
##$AQ_mod= 1
##$AUNM= <au_zg>
##$AUTOPOS= <>
##$BF1= 200.13
##$BF2= 200.13
##$BF3= 200.13
##$BF4= 200.13
##$BF5= 200.13
##$BF6= 200.13
##$BF7= 200.13
##$BF8= 200.13
##$BYTORDA= 1
##$CFDGTYP= 0
##$CFRGTYP= 5
##$CHEMSTR= <none>
##$CNST= (0..31)
1 1 145 1 1 1 1 1 1 1 1 1 1 1 1 1 1 1 1 1 1 1 1 1 1 1 1 1 1 1 1 1 
##$CPDPRG= <>
##$CPDPRG1= <>
##$CPDPRG2= <>
##$CPDPRG3= <>
##$CPDPRG4= <mlev>
##$CPDPRG5= <mlev>
##$CPDPRG6= <mlev>
##$CPDPRG7= <mlev>
##$CPDPRG8= <mlev>
##$CPDPRGB= <>
##$CPDPRGT= <>
##$D= (0..31)
0 1.2 0 0 0 0 0 0 0 0.06 0 0.03 0 0 0 0 0.0002 0 0 0 0 0 0 0 0 0 0 0 0 
0 0 0 
##$DATE= 1698660661
##$DBL= (0..7)
120 120 120 120 120 120 120 120 
##$DBP= (0..7)
150 150 150 150 150 150 150 150 
##$DBP07= 0
##$DBPNAM0= <>
##$DBPNAM1= <>
##$DBPNAM2= <>
##$DBPNAM3= <>
##$DBPNAM4= <>
$$ [...]
##$SUBNAM3= <"">
##$SUBNAM4= <"">
##$SUBNAM5= <"">
##$SUBNAM6= <"">
##$SUBNAM7= <"">
##$SUBNAM8= <"">
##$SUBNAM9= <"">
##$SW= 18.05172834244
##$SWIBOX= (0..15)
0 0 2 0 0 0 0 0 0 0 0 0 0 0 0 0 
##$SW_h= 3612.71676300578
##$TD= 16384
##$TD0= 1
##$TE= 0
##$TE2= 300
##$TE3= 300
##$TEG= 300
##$TL= (0..7)
0 120 120 120 120 120 120 120 
##$TP= (0..7)
150 150 150 150 150 150 150 150 
##$TP07= 0
##$TPNAME0= <>
##$TPNAME1= <>
##$TPNAME2= <>
##$TPNAME3= <>
##$TPNAME4= <>
##$TPNAME5= <>
##$TPNAME6= <>
##$TPNAME7= <>
##$TPOAL= (0..7)
0.5 0.5 0.5 0.5 0.5 0.5 0.5 0.5 
##$TPOFFS= (0..7)
0 0 0 0 0 0 0 0 
##$TUNHIN= 0
##$TUNHOUT= 0
##$TUNXOUT= 0
##$USERA1= <user>
##$USERA2= <user>
##$USERA3= <user>
##$USERA4= <user>
##$USERA5= <user>
##$V9= 5
##$VALIST= <valist>
##$VCLIST= <CCCCCCCCCCCCCCC>
##$VD= 0
##$VDLIST= <DDDDDDDDDDDDDDD>
##$VPLIST= <PPPPPPPPPPPPPPP>
##$VTLIST= <TTTTTTTTTTTTTTT>
##$WBST= 1024
##$WBSW= 4
##$XGAIN= (0..3)
0 0 0 0 
##$XL= 0
##$YL= 0
##$YMAX_a= 263476
##$YMIN_a= -319434
##$ZGOPTNS= <>
##$ZL1= 120
##$ZL2= 120
##$ZL3= 120
##$ZL4= 120
##$ABSF1= 15.73257
##$ABSF2= -2.31928
##$ABSG= 5
##$ABSL= 3
##$ALPHA= 0
##$AQORDER= 0
##$ASSFAC= 0
##$ASSFACI= 0
##$ASSFACX= 0
##$ASSWID= 0
##$AUNMP= <proc_1d>
##$AZFE= 0.1
##$AZFW= 0.1
##$BCFW= 0
##$BC_mod= 2
##$BYTORDP= 0
##$COROFFS= 0
##$CY= -3
##$DATMOD= 1
##$DC= 0
##$DFILT= <>
##$DTYPP= 0
##$F1P= 0
##$F2P= 0
##$FCOR= 1
##$FTSIZE= 16384
##$FT_mod= 6
##$GAMMA= 0
##$GB= 0
##$INTBC= 1
##$INTSCL= 3.70164e-10
##$ISEN= 128
##$LB= 0.24
##$LEV0= 0
##$LPBIN= 0
##$MAXI= 10000
##$MC2= 0
##$MEAN= 0
##$ME_mod= 0
##$MI= 1.114404
##$NCOEF= 0
##$NC_proc= -8
##$NLEV= 6
##$NOISF1= 3.799351
##$NOISF2= 2.8
##$NSP= 0
##$NTH_PI= 0
##$NZP= 0
##$OFFSET= 15.73257
##$PC= 1
##$PHC0= -23864.05
##$PHC1= 8.652708
##$PH_mod= 1
##$PKNL= yes
##$PPARMOD= 0
##$PSCAL= 0
##$PSIGN= 0
##$REVERSE= no
##$SF= 200.130007800692
##$SI= 16384
##$SIGF1= 3
##$SIGF2= 2
##$SINO= 5.538805
##$SIOLD= 16384
##$SREGLST= <1H.CDCl3>
##$SSB= 0
##$STSI= 16384
##$STSR= 0
##$SW_p= 3612.71676300578
##$SYMM= 0
##$S_DEV= 0
##$TDeff= 16384
##$TDoff= 0
##$TI= <>
##$TILT= no
##$TM1= 0
##$TM2= 0
##$TOPLEV= 0
##$USERP1= <user>
##$USERP2= <user>
##$USERP3= <user>
##$USERP4= <user>
##$USERP5= <user>
##$WDW= 1
##$XDIM= 16384
##$YMAX_p= 434310423
##$YMIN_p= -890561
$$ End of Bruker specific parameters
$$ ---------------------------------
##NTUPLES= NMR SPECTRUM
##VAR_NAME=  FREQUENCY,     SPECTRUM/REAL,   SPECTRUM/IMAG
##SYMBOL=    X,             R,               I
##VAR_TYPE=  INDEPENDENT,   DEPENDENT,       DEPENDENT
##VAR_FORM=  AFFN,          ASDF,            ASDF
##VAR_DIM=   16384,         16384,           16384
##UNITS=     HZ,            ARBITRARY UNITS, ARBITRARY UNITS
##FACTOR=    0.220516191357247, 1,           1
##FIRST=     3148.55929568903, 0,            0
##LAST=      -464.157467316754, 0,           0
##MIN=       -464.157467316754, -890561,     0
##MAX=       3148.55929568903, 434310423,    0
$$ Real data points
##PAGE= N=1
##DATA TABLE= (X++(R..R)), XYDATA
$$ [...]
6195A3833564j013107j009375o71178r49511j390386p18484k36425j37393j75369
$$ 13833564 12820457 11811082 11139904 10190393 8800007 8081523 7845098 7707705 7532336
6186G532336n4457j46630J00648m93757M281m3648k29444O02726j87289O4284
$$ 7532336 7477879 7331249 7431897 6938140 6942421 6898773 6669329 7272055 7084766 7149050
6176G149050r663L37345J70016K03711N28027O60987N68954M11069K70545R19110
$$ 7149050 7139387 7476732 7646748 7850459 8378486 9039473 9608427 10019496 10290041 11209151
6166A1209151J415333R96032J287625J179225J474620J163503R53852L49980o55795
$$ 11209151 12624484 13620516 14908141 16087366 17561986 18725489 19679341 20029321 19373526
6157A9373526r85422r80163p77182r03421l18270o21691o57589K06692J54961
$$ 19373526 18388104 17407941 16630759 15727338 15409068 14787377 14129788 14336480 14491441
6148A4491441N0306l96736J88702l4114k53694l5033k88468n91740k69851K8770
$$ 14491441 14541747 14145011 14333713 14299599 14045905 14010872 13722404 13130664 12860813 12889583
6138A2889583n17078j84842p6638m64481l61970n82716p31497m51736M2489m0232
$$ 12889583 12372505 12187663 12111025 11646544 11284574 10701858 9970361 9518625 9561114 9520882
6128I520882M9961k47898k50843Q5561J01885J92885n3982M85676K60409J31950
$$ 9520882 9570843 9322945 9072102 9157663 9259548 9452433 9398451 9884127 10144536 10276486
6118A0276486N579j3273k80868o9386J24087o33038L23089k62342j64326j47126
$$ 10276486 10282065 10268792 9987924 9918538 10042625 9409587 9732676 9470334 9306008 9158882
6108I158882m48086l30813j11400k37421n5529o18041m74681R7966q8504q7420
$$ 9158882 8710796 8379983 8268583 8031162 7975633 7357592 6882911 6980877 6892373 6804953
6098F804953k0849l08755j90134r2581M69934l11028l08168J79428K76046l46388
$$ 6804953 6784104 6475349 6285215 6192634 6662568 6351540 6043372 6222800 6498846 6152458
6088F152458J52811L97829J4704K58973Q6522J6339l89598l56604k19815j67295
$$ 6152458 6305269 6703098 6717802 6976775 7063297 7079636 6690038 6333434 6113619 5946324
6078E946324k93413L57590L90573j55416l06799j74094K8996K20778K55298Q121
$$ 5946324 5652911 6010501 6401074 6245658 5938859 5764765 5793761 6014539 6269837 6277958
6068F277958j20577J22640K22199l8621J81855L10518j85215Q9525K97177J35270
$$ 6277958 6157381 6280021 6502220 6463599 6645454 6955972 6770757 6860282 7157459 7292729
6058G292729o3284L03312M50868R6424k70970M33860M41647L61933L16405K29483
$$ 7292729 7229445 7532757 7983625 8080049 7809079 8242939 8684586 9046519 9362924 9592407
6048I592407n1793k14870k30540L5112k96796j28981j05886N0365k56528Q0501
$$ 9592407 9540614 9325744 9095204 9130316 8833520 8704539 8598653 8649018 8392490 8472991
6038H472991L17972L15441l7207O42136O70827K11724M86662P15211L09047L99818
$$ 8472991 8790963 9106404 9069197 9711333 10382160 10593884 11080546 11795757 12104804 12504622
6028A2504622J162131R01796P41919N578J95363m7956j77130L04460L52053n03832
$$ 12504622 13666753 14568549 15310468 15316046 15511409 15463453 15286323 15590783 15942836 15439004
6018A5439004j36524L75797k54458K65369M56488p28621m33410j41236M36706
$$ 15439004 15302480 15678277 15423819 15689188 16145676 15417055 14983645 14842409 15279115
6009A5279115N53580O40021L2909K30151Q85154M39122Q20214K28460L74067L74014
$$ 15279115 15832695 16472716 16505625 16735776 17620930 18060052 18880266 19108726 19482793 19856807
5999A9856807L44725L32469K26065N43716Q36621K50201J80380L92503O55299
$$ 19856807 20201532 20534001 20760066 21303782 22140403 22390604 22570984 22963487 23618786
5990B3618786L28996K90928N41636L89200N33797J133209J291058J300350Q07446
$$ 23618786 23947782 24238710 24780346 25169546 25703343 26836552 28127610 29427960 30235406
5981C0235406M70783N33401J33100O2321M65612N36070K17859M78822J62952P23033
$$ 30235406 30706189 31239590 31372690 31435011 31900623 32436693 32654552 33133374 33296326 34019359
5971C4019359K58495k06125p661Q3882O8677K78405P31596R01405J547424J982650
$$ 34019359 34277854 34071729 34064068 34147950 34216627 34495032 35226628 36128033 37675457 39658107
5961C9658107K627790K430917K654740K121280K173436J121798M0277m03672j075398
$$ 39658107 42285897 44716814 47371554 49492834 51666270 52788068 52828345 52424673 51349275
5952E1349275p29160j013971j242957j880302j425816j015574j344547j346300
$$ 51349275 50620115 49606144 48363187 46482885 45057069 44041495 42696948 41350648
5944D1350648j714668j656843j744388j418369r64259m36963l23827m34049o13011
$$ 41350648 39635980 37979137 36234749 34816380 33852121 33415158 33091331 32657282 32044271
5935C2044271l20143N14089L3916L89803J096472K236265K333307K523603K645616
$$ 32044271 31724128 32238217 32272133 32661936 33758408 35994673 38327980 40851583 43497199
5926D3497199Q87693j104586k171181k576935k415789k204051j604749p16871
$$ 43497199 44384892 43280306 41109125 38532190 36116401 33912350 32307601 31590730
5918C1590730r31017l29846J50020N70177P00858O97371k82472n14059j34351
$$ 31590730 30659713 30329867 30479887 31050064 31750922 32448293 32165821 31651762 31517411
5909C1517411j049318m45568l69872n82400J15930N71556R21851M92975J00136
$$ 31517411 30468093 30022525 29652653 29070253 29186183 29757739 30679590 31172565 31272701
5900C1272701J17629j079982j173786j961057j753797j826157j148730j267595
$$ 31272701 31390330 30310348 29136562 27175505 25421708 23595551 22446821 21179226
5892B1179226o36525m34528o43839k445j81005n3597M83185N09848M29520O17514
$$ 21179226 20542701 20108173 19464334 19461889 19280884 19227287 19710472 20220320 20649840 21267354
5882B1267354O60487O07275P74122N02063K18791M05530n91646l05117p93478
$$ 21267354 21927841 22535116 23309238 23811301 24030092 24435622 23843976 23538859 22745381
5873B2745381p68095l50669k46350k79401k08810m65887n47820l87165j134611
$$ 22745381 21977286 21626617 21380267 21100866 20892056 20426169 19878349 19491184 18356573
5864A8356573j137822q49251o88943q11634q23175n71619j9581k95288n57716
$$ 18356573 17218751 16369500 15680557 14868923 14045748 13474129 13454548 13159260 12601544
5855A2601544o03237j5716K66616j2771k15908L99915K19637M25191O83458K15961
$$ 12601544 11998307 11982591 12249207 12236436 12020528 12420443 12640080 13065271 13748729 13964690
5845A3964690O04275J14214m15490m79288N6278p4922m1275n89275m21548l44194
$$ 13964690 14568965 14683179 14267689 13788401 13844679 13769757 13728482 13139207 12717659 12373465
5835A2373465P5123K1432l54125l61586m32776o36600k91018p3768n9134k53352
$$ 12373465 12448588 12470020 12115895 11754309 11321533 10684933 10393915 10320147 10261013 10007661
5825A0007661o3105j21604J61376K3017m5878M94530L22734M31902M01980K52137
$$ 10007661 9944556 9822952 9984328 10007345 9961467 10455997 10778731 11210633 11612613 11864750
5815A1864750M45391P91033M85969J036751Q02829M30904O58940J146895R50816
$$ 11864750 12310141 13101174 13587143 14623894 15426723 15857627 16516567 17663462 18614278
5806A8614278J103651L02689o16136k88102n50278q00097o88681r31982n96940
$$ 18614278 19717929 20020618 19404482 19116380 18566102 17766005 17077324 16145342 15548402
5797A5548402j22986m03913m20526O51817R1096n88210q72357p02694J5350n35257
$$ 15548402 15425416 15021503 14600977 15252794 15343890 14755680 13883323 13180629 13195979 12660722
5787A2660722k35335R6605o2263J68477K14371j88540Q4528O05263M60842k28735
$$ 12660722 12425387 12521992 12459729 12628206 12842577 12654037 12738565 13343828 13804670 13575935
5777A3575935Q43916J043756J241946J167621J272135N08455K87235L75291k66424
$$ 13575935 14419851 15463607 16705553 17873174 19145309 19653764 19940999 20316290 20049866
5768B0049866o73383k46302j119267j339422q71657r02623r52731m54165j46080
$$ 20049866 19376483 19130181 18010914 16671492 15799835 14897212 13944481 13490316 13344236
5759A3344236r5091k1310p61939J29525p5125k2018J97820j46556K88143L35014
$$ 13344236 13249145 13227835 12465896 12595421 12520296 12498278 12696098 12549542 12837685 13172699
5749A3172699Q2123J72504M78985J79675M28003M67357N23303Q02136O11149L98684
$$ 13172699 13254822 13427326 13906311 14085986 14513989 14981346 15504649 16306785 16917934 17316618
5739A7316618L27197M83744O35038P30915N18715N63084Q85060J984869J393697
$$ 17316618 17643815 18127559 18762597 19493512 20012227 20575311 21460371 23445240 24838937
5730B4838937J858651K933782K710925K740424K458400J561206O66108k91581
$$ 24838937 26697588 29631370 32342295 35082719 37541119 39102325 39768433 39476852
5722C9476852j386964k112829k208125k083322j560347p97896m23333o34171m69612
$$ 39476852 38089888 35977059 33768934 31685612 30125265 29327369 28904036 28269865 27800253
5713B7800253L77394J057303Q95301J416052J542634J945143K976830L401207
$$ 27800253 28177647 29234950 30130251 31546303 33088937 35034080 38010910 41412117
5705D1412117M184244M690982N008183M542741L661789K384274m55159l087965
$$ 41412117 45596361 50287343 55295526 59838267 63500056 65884330 65429171 62341206
5697F2341206m281775m637644n175113l954951l470521k651595k307646k112093
$$ 62341206 58059431 53421787 48246674 44291723 40821202 38169607 35861961 33749868
5689C3749868j256488j204723r56785o04310j15160L6356O31167Q55556J303245
$$ 33749868 32493380 31288657 30331872 29727562 29612402 29648758 30279925 31135481 32438726
5680C2438726J831287K280785J690624J879627J660574j54368j977411l066426
$$ 32438726 34270013 36550798 38241422 40121049 41781623 41627255 39649844 36583418
5672C6583418l296350l238583k586828k502968j914157j126160j339787j237478
$$ 36583418 33287068 30048485 27461657 24958689 23044532 21918372 20578585 19341107
5664A9341107j089196j281621o99215q89248m15338q20176j051387j29648j82482
$$ 19341107 18251911 16970290 16271075 15381827 14966489 14146313 13094926 12965278 12782796
5655A2782796l00752l48157l49556l02359m65384k91359j07507N8925L780k71726
$$ 12782796 12482044 12133887 11784331 11481972 11016588 10725229 10617722 10676647 10680427 10408701
5645A0408701J3928n80075k88477K12456L76727j21116K20049J44219N05096L06021
$$ 10408701 10422629 9842554 9554077 9766533 10143260 10022144 10242193 10386412 10891508 11197529
5635A1197529j8580K21867J43760N66906m29273o18649n02342n06099n251K9943
$$ 11197529 11178949 11400816 11544576 12111482 11682209 11063560 10561218 10055119 10049868 10079811
5625A0079811l69979j54131R9313k53127m59570k25794K1295M17289J80382k11056
$$ 10079811 9709832 9555701 9655014 9401887 8942317 8716523 8737818 9155107 9335489 9124433
5615I124433j63356K05169L05615J03088K74411K44485Q43577K47662j20557k98240
$$ 9124433 8961077 9166246 9471861 9574949 9849360 10093845 10937422 11185084 11064527 10766287
5605A0766287l65800n72506m64411m70854o95996j47917N9997l55817J7722l01855
$$ 10766287 10400487 9827981 9363570 8892716 8196720 8048803 8108800 7752983 7770705 7468850
5595G468850l93134j72133l20157m480n21157K80254J43931k07011j43630J15428
$$ 7468850 7075716 6903583 6583426 6578946 6057789 6338043 6481974 6274963 6131333 6246761
5585F246761m59737K38618L60721j14299k9005k16011M80096K10731j25898J29771
$$ 6246761 5787024 6025642 6386363 6272064 6243059 6027048 6507144 6717875 6591977 6721748
5575F721748Q5428q1080l19287j08536L05825j9489l52343L98536K32142n8560
$$ 6721748 6807176 6726096 6406809 6298273 6604098 6584609 6232266 6630802 6862944 6804384
5565F804384j64821M33219K49340L83294N17870L07824O60304L03183M5124o59150
$$ 6804384 6639563 7072782 7322122 7705416 8223286 8531110 9191414 9494597 9539721 8880571
5555H880571n24720l24709n9306m48311q8555m70958k84554J88772j13852l84415
$$ 8880571 8355851 8031142 7971836 7523525 7434970 6964012 6679458 6868230 6754378 6369963
5545F369963N34286Q4890n31482J11776M14970O501j12013M397R3064j1573j55555
$$ 6369963 6904249 6989139 6457657 6569433 6984403 6990904 6878891 6883288 6976352 6964779 6809224
5534F809224K7894K16635L81882J87934K84071j037J2910r862L70131m8211n7132
$$ 6809224 6837118 7053753 7435635 7623569 7907640 7906603 7919513 7909651 8279782 8231571 8174439
5523H174439L71688N68735r4203l5741K33804L06163N39855N12760O83489l2929
$$ 8174439 8546127 9114862 9020659 8984918 9218722 9524885 10064740 10577500 11260989 11228060
5513A1228060K84903P85478J005944O99454R44365R46188J042004J275163J409284
$$ 11228060 11512963 12298441 13304385 14003839 14948204 15894392 16936396 18211559 19620843
5504A9620843O70404P25512P78256L71468l5537j9830m62735q03952m62344j067940
$$ 19620843 20291247 21016759 21795015 22166483 22130946 22111116 21648381 20844429 20382085 19314145
5494A9314145r31256o66670o85595r57586q16668p48658q75308j05304K91475
$$ 19314145 18382889 17716219 17030624 16073038 15256370 14507712 13632404 13527100 13818575
5485A3818575p79615n0176n43327q49630j4946L01460R2580j14126L0681L63477
$$ 13818575 13038960 12988784 12445457 11595827 11580881 11882341 11974921 11860795 11891476 12254953
5475A2254953N3175J87386K83998N12904K69829N21254L55627O59131P98434N25872
$$ 12254953 12308128 12495514 12779512 13292416 13562245 14083499 14439126 15098257 15896691 16422563
5465A6422563j50381J58738N37495P0022O84340P82734N18038M55672Q87598J089578
$$ 16422563 16272182 16430920 16968415 17038437 17722777 18505511 19023549 19479221 20366819 21456397
5455B1456397N13116R05412J804167J646045J856333J468546J660310J837296
$$ 21456397 21969513 22874925 24679092 26325137 28181470 29650016 31310326 33147622
5447C3147622K316836K294726K330223K382464K690747J733637J676832J630927
$$ 33147622 35464458 37759184 40089407 42471871 45162618 46896255 48573087 50204014
5439E0204014Q87496m68030l14200j078967j720054j427359k097817j946833j861290
$$ 50204014 51091510 50623480 50309280 49230313 47510259 46082900 43985083 42038250 40176960
5430D0176960j971427k218618j824227j056716j143500j159476j77275p98899
$$ 40176960 38205533 35986915 34162688 33105972 31962472 30802996 30625721 29826822
5422B9826822k64502l26972l55541J35971J3347M16372L51726N97128L46245O26665
$$ 29826822 29562320 29235348 28879807 29015778 29029125 29445497 29797223 30394351 30740596 31367261
5412C1367261R93863J047883R79603J414623J267936J505036K252789K355428
$$ 31367261 32361124 33409007 34388610 35803233 37071169 38576205 40828994 43184422
5404D3184422K135198K954323L543482L584552L809348L863239M219632M639448
$$ 43184422 45319620 48273943 51817425 55401977 59211325 63074564 67294196 71933644
5396G1933644M829735N196663N218550N279681N033565M608268M266213L812275
$$ 71933644 76763379 81960042 87178592 92458273 97491838 102100106 106366319 110178594
5388A10178594L752440L362126L424169K451570J844695P00700N23944m95442
$$ 110178594 113931034 117293160 120717329 123168899 125013594 125714294 126238238 125742796
5380A25742796j421395k142360j359717k085807l625006l359439m040660m619169
$$ 125742796 124321401 122179041 120819324 118733517 115108511 111749072 107708412 103089243
5372A03089243m113573l894377l716166l333713k557658k630022j998900k028820
$$ 103089243 98975670 95081293 91365127 88031414 85473756 82843734 80844834 78816014
5364G8816014j315514j231937j163289r56997j160204r18264j340805j515988
$$ 78816014 77500500 76268563 75105274 74148277 72988073 72069809 70729004 69213016
5356F9213016j670235k758229k802550k391106k805243l178911k429560k128859
$$ 69213016 67542781 64784552 61982002 59590896 56785653 53606742 51177182 49048323
5348D9048323k731132k518409k670778k570016k212122j655963j667117j609171
$$ 49048323 46317191 43798782 41128004 38557988 36345866 34689903 33022786 31413615
5340C1413615j858402q42966j331868j075114r04872q72086n56138j57572o57246
$$ 31413615 29555213 28712247 27380379 26305265 25400393 24528307 23972169 23814597 23157351
5331B3157351n60247k86901j38731l82522o67117K31439k1151m36667k0052j14549
$$ 23157351 22597104 22310203 22171472 21788950 21121833 21353272 21332121 20895454 20875402 20760853
5321B0760853l30260k17580k57808l77570k70836n5036r8316j81833n170M52503
$$ 20760853 20430593 20213013 19955205 19577635 19306799 19251763 19153447 18971614 18966444 19418947
5311A9418947J4257o8953L67995K92558N23616J94858J236344Q65684J61757P40930
$$ 19418947 19433204 19364251 19732246 20024804 20548420 20743278 21979622 22845306 23007063 23747993
5301B3747993K77187J77287O29558K76046J45718j31753l13600p32490q19419
$$ 23747993 24025180 24202467 24832025 25108071 25253789 25122036 24808436 24075946 23256527
5292B3256527r07096p81378m67312r16560r08331q94449o89122j167430n13760
$$ 23256527 22349431 21568053 21100741 20184181 19275850 18381401 17692279 16524849 16011089
5283A6011089k53865q63723o41390p62542o07437m22357l68981m09221J3356m88750
$$ 16011089 15757224 14893501 14252111 13489569 12882132 12459775 12090794 11681573 11694929 11206179
5273A1206179n7453r8461l79793j45912J77373l89116m32504J35120n06855k8495
$$ 11206179 11148726 11050265 10670472 10524560 10701933 10312817 9880313 10015433 9508578 9480083
5263I480083k20644P4395l09434l22304j88214j98087N1194K32540J30134k17507
$$ 9480083 9259439 9333834 9024400 8702096 8513882 8315795 8366989 8599529 8729663 8512156
5253H512156K30706k13875k98657Q759l17584j06404j44320p4185k74483l63417
$$ 8512156 8742862 8528987 8230330 8239089 7921505 7815101 7670781 7596596 7322113 6958696
5243F958696K27762K66331L8388l24087p8464K25126N8923k90021m2631l47280
$$ 6958696 7186458 7452789 7491177 7167090 7088626 7313752 7372675 7082654 7040023 6692743
5233F692743l562M79623K84373O1587k06806L75919L00764P12824L97878R19108
$$ 6692743 6689181 7168804 7453177 7514764 7307958 7683877 7984641 8697465 9095343 10014451
5223A0014451Q13695O46756N66819l46928j105991j208380n35323n07955o23746
$$ 10014451 10828146 11474902 12041721 11694793 10588802 9380422 8845099 8337144 7713398
5214G713398o40723m14577m0269K40565j58065k46574l03101L06420k60686m04563
$$ 7713398 7072675 6658098 6617829 6858394 6700329 6453755 6150654 6457074 6196388 5791825
5204E791825k67481j93842K89294l27037J69231K0616J37633l49304j68921r2588
$$ 5791825 5524344 5330502 5619796 5292759 5461990 5482606 5620239 5270935 5102014 5009426
5194E009426L0104r7956J23011m40730L05194J35217N39k05705j0907L98802L9352
$$ 5009426 5039530 4941574 5064585 4623855 4929049 5064266 5064805 4859100 4848193 5246995 5286347
5183E286347j83338l87725R8512j76871J90352O49353l15159j49867J57856l40579
$$ 5286347 5103009 4715284 4813796 4636925 4827277 5476630 5161471 5011604 5169460 4828881
5173D828881l56542j22631J2637m6385K44385r8420m2194L05485J61303j76917
$$ 4828881 4472339 4349708 4362345 4315960 4560345 4461925 4419731 4725216 4886519 4709602
5163D709602J32283J50325l63561m37164J80876m25827M70586q2563k28266J90500
$$ 4709602 4841885 4992210 4628649 4191485 4372361 3946534 4417120 4334557 4106291 4296791
5153D296791k58155j56754L08228J81039j59738k75141L33676R4136P2666J35268
$$ 4296791 4038636 3881882 4190110 4371149 4211411 3936270 4269946 4364082 4436748 4572016
5143D572016K03579p12817L3153L11886n30821K05851J80860K64738K54884L08040
$$ 4572016 4775595 4062778 4095931 4407817 3876996 4082847 4263707 4528445 4783329 5091369
5133E091369j40300j58438j2205O422J14545J55839l15957m79374r7630J37740
$$ 5091369 4951069 4792631 4780426 4786848 4901393 5057232 4741275 4261901 4164271 4302011
5123D302011j57573M37290m28874O7039M61819K05587J35601K9220j17444N7741
$$ 4302011 4144438 4581728 4152854 4219893 4681712 4887299 5022900 5052120 4934676 4992417
5113D992417J08666k03775p0356Q0266j60166K37129N2897m79116M70075k50291
$$ 4992417 5101083 4897308 4826952 4907218 4747052 4984181 5037078 4557962 5028037 4777746
5103D777746Q1365k95343k31481K92855L09222O2742J95977P284J95267L54107
$$ 4777746 4859111 4563768 4332287 4625142 4934364 4997106 5193083 5200367 5395634 5749741
5093E749741J72942J2341q8149k75248k24573O2734O20544j41243j34749J22223
$$ 5749741 5922683 5935024 5846875 5571627 5347054 5409788 6030332 5889089 5754340 5876563
5083E876563k06615K86244k45972j17209l95249L94852J55623l66549m10593j92932
$$ 5876563 5669948 5956192 5710220 5593011 5197762 5592614 5748237 5381688 4971095 4778163
5073D778163Q92795O8170n0066K55563k8504K17723L36644K7711l52785j79398
$$ 4778163 5670958 5739128 5689062 5944625 5916121 6133844 6470488 6498199 6145414 5966016
5063E966016k32492J90529J91311j2225J84448l73154J84145l57335K32270J3317
$$ 5966016 5733524 5924053 6115364 6103139 6287587 5914433 6098578 5741243 5973513 5986830
5053E986830m25825m3602k31067J62958k16716L0915j51823K72515M36373j41735
$$ 5986830 5561005 5517403 5286336 5449294 5232578 5263493 5111670 5384185 5820558 5678823
5043E678823n22694k41597K36270K12570O1193j95366L24112K82490k25455o1076
$$ 5678823 5156129 4914532 5150802 5363372 5424565 5229199 5553311 5835801 5610346 5549270
5033E549270M4985j60254n1272L6199j74620l57846N5487N17186R0830k65253
$$ 5549270 5594255 5434001 5382729 5418928 5244308 4886462 4941949 5459135 5549965 5284712
5023E284712j31572Q6370k01014N5179J00533k63012M3315N29305N04014m57708
$$ 5284712 5153140 5239510 5038496 5093675 5194208 4931196 4974511 5503816 6007830 5550122
5013E550122j75880M85857j00887l23995J53841N093l24907J30902Q7736J0508
$$ 5550122 5374242 5860099 5759212 5435217 5589058 5594151 5269244 5400146 5487882 5498390
5003E498390o85718J93660M01064j84853K27002j7959O8522L05757n4037o3612
$$ 5498390 4812672 5006332 5407396 5222543 5449545 5431586 5500108 5805865 5751828 5688216
4993E688216J0941q0675J84639M9457m29061L66239J38574l15050k58758K53892
$$ 5688216 5699157 5618482 5803121 5852578 5423517 5789756 5928330 5613280 5354522 5608414
4983E608414n3746r1929P4390R8366K14439J88172j49630m6425q520k95120J93707
$$ 5608414 5554668 5462739 5537129 5635495 5849934 6038106 5888476 5842051 5833531 5538411 5732118
4972E732118j9100k41688L1504K74879L01498l90466n7992L35672P09L65354N2966
$$ 5732118 5713018 5471330 5502834 5777713 6079211 5688745 5630753 5966425 5967134 6332488 6385454
4961F385454o74789K04314N60712k54414K83199M06810J62384J38607K81972k89079
$$ 6385454 5710665 5914979 6475691 6221277 6504476 6911286 7073670 7212277 7494249 7205170
4951G205170m48146j6156K03812j15342j10105p7806j63687j45555L04559Q0898
$$ 7205170 6757024 6740868 6944680 6829338 6719233 6641427 6477740 6332185 6636744 6717642
4941F717642l43017M77906k57404J09732M16515K36643k98726j20189J12792j44754
$$ 6717642 6374625 6852531 6595127 6704859 7121374 7358017 7059291 6939102 7051894 6907140
4931F907140K39792K24838M6801n27219l36933L8333N00776j71083J03951k21466
$$ 6907140 7146932 7371770 7418571 6891352 6554419 6592752 7093528 6922445 7026396 6804930
4921F804930K59594o2208j82744n4710j22565J64783J04983N04252J79404N9867
$$ 6804930 7064524 7002316 6819572 6764862 6642297 6807080 6912063 7416315 7595719 7655586
4911G655586J79658J30803l63121j5777K44910n44095q316L41339K06677N97802
$$ 7655586 7835244 7966047 7602926 7587149 7832059 7287964 7279648 7620987 7827664 8425466
4901H425466l63104J78026J97073j91483L9083K01253J34446O4070L13395j29629
$$ 8425466 8062362 8240388 8437461 8245978 8285061 8486314 8620760 8684830 8998225 8868596
4891H868596J69751J15304L12202j4606K60785p1496R386J92535J63422O052N18192
$$ 8868596 9038347 9153651 9465853 9451247 9712032 9640536 9649922 9842457 10005879 10011931 10530123
4880A0530123L1233j86389L5567n25084L43673O9791j36701r6798K0153J36271
$$ 10530123 10561356 10374967 10410534 9885450 10229123 10298914 10162213 10065415 10085568 10221839
4870A0221839L64350P16447L48654k68297l424L2108J29599M8878J29165R1302
$$ 10221839 10586189 11302636 11651290 11382993 11379569 11411677 11541276 11590154 11719319 11810621
4860A1810621K69609m536O1728Q97464M09281M28414k23849k86599M02082J69932
$$ 11810621 12080230 12075694 12137422 13034886 13444167 13872581 13648732 13362133 13764215 13934147
4850A3934147K04744J71849l13953j0449O23676K66200K44179l25205q7979K45458
$$ 13934147 14138891 14310740 13996787 13986338 14610014 14876214 15120393 14795188 14707209 14952667
4840A4952667L50915K65244L75655J49541K38097L77989L89258L09996k37654
$$ 14952667 15303582 15568826 15944481 16094022 16332119 16710108 17099366 17409362 17171708
4831A7171708Q22680P20109L66735J09699K52703N52927L36923K87257N04393
$$ 17171708 17994388 18714497 19081232 19190931 19443634 19996561 20333484 20620741 21125134
4822B1125134M50190M34482N33693N21672K57915N84130P82914O01248R05955
$$ 21125134 21575324 22009806 22543499 23065171 23323086 23907216 24690130 25291378 26197333
4813B6197333N28966O74801J189369Q62029Q29384R13199O57016J021899Q18871
$$ 26197333 26726299 27401100 28590469 29452498 30281882 31195081 31852097 32873996 33692867
4804C3692867J218378J220456R94700P28992P58284J058868O94120O37953J104472
$$ 33692867 34911245 36131701 37126401 37855393 38613677 39672545 40366665 41004618 42109090
4795D2109090O42051P24318J080124J180521J212772J158972J504137J900743
$$ 42109090 42751141 43475459 44555583 45736104 46948876 48107848 49611985 51512728
4787E1512728K023772J683003K016584K723684K842092K847811K901872K397736
$$ 51512728 53536500 55219503 57236087 59959771 62801863 65649674 68551546 70949282
4779G0949282K290961K333709K520857K018599K371082K510400K431153K720112
$$ 70949282 73240243 75573952 78094809 80113408 82484490 84994890 87426043 90146155
4771I0146155K378387K848821L382727L094836L488214L941663M107920M564614
$$ 90146155 92524542 95373363 98756090 101850926 105339140 109280803 113388723 117953337
4763A17953337M338188M123038L572272L625527L110564J790914J675092J478047
$$ 117953337 122291525 126414563 129986835 133612362 136722926 138513840 140188932 141666979
4755A41666979J624596J019554M66655J182192J242261J087640O11656J365699
$$ 141666979 143291575 144311129 144777784 145959976 147202237 148289877 148901533 150267232
4747A50267232J623338J160295Q07126M12621N0969j29758j005064j494879j810299
$$ 150267232 151890570 153050865 153857991 154270612 154321581 154191823 153186759 151691880 149881581
4738A49881581j923244k288591k303462j465064k034648k105280j656129j645942
$$ 149881581 147958337 145669746 143366284 141901220 139866572 137761292 136105163 134459221
4730A34459221j717727j262875j165351m13897n7044O75337J477133J855944K330724
$$ 134459221 132741494 131478619 130313268 129899371 129842327 130517664 131994797 133850741 136181465
4721A36181465K053855J642257R44465j4745n85109m79892j479576j622133j816723
$$ 136181465 138235320 139877577 140822042 140807297 140222188 139742296 138262720 136640587 134823864
4712A34823864j626236p45047j200047q78221k15226M75972M95335J143615J950743
$$ 134823864 133197628 132452581 131252534 130374313 130159087 130635059 131130394 132274009 134224752
4703A34224752J869809J837229K128220K411392K910926L030780K597018K207561
$$ 134224752 136094561 137931790 140060010 142471402 145382328 148413108 151010126 153217687
4695A53217687J420598Q04343J82673q62828j473710k656449l690390l800066
$$ 153217687 154638285 155442628 155625301 154762473 153288763 150632314 146941924 143141858
4687A43141858l310202k454296k289674k142884k320580k119856k398382k741375
$$ 143141858 139831656 137377360 135087686 132944802 130624222 128504366 126105984 123364609
4679A23364609l331771m166816m207320m084014m140672l544491l308531l027296
$$ 123364609 120032838 115866022 111658702 107574688 103434016 99889525 96580994 93553698
4671I3553698k830785k471195k203308k127029j162555j027543r04287j406731
$$ 93553698 90722913 88251718 86048410 83921381 82758826 81731283 80826996 79420265
4663G9420265j843791j579331j508807j473047j257322j455848o51482p53553
$$ 79420265 77576474 75997143 74488336 73015289 71757967 70302119 69650637 68897084
4655F8897084q09822p35089n22445n58344o45489o27319n62098o76196j103245
$$ 68897084 68087262 67352173 66829728 66271384 65625895 64998576 64436478 63760282 62657037
4646F2657037j316318j055078q26146o73687p94942l71241l86384m85336K09333
$$ 62657037 61340719 60285641 59459495 58785808 57990866 57619625 57233241 56747905 56957238
4637E6957238j84r4877m31599l65196m21071r47155j046203q86857q07421j016801
$$ 56957238 56957054 56862177 56430578 56065382 55644311 54697156 53650953 52764096 51956675 50939874
4627E0939874j023106m46791k95398k27629r4055L3354k11514K24614J35461K70903
$$ 50939874 49916768 49469977 49174579 48946950 48852895 48886249 48674735 48899349 49034810 49305713
4617D9305713J693p2190K12602K0634K17393L8372r5936K34594K03488o95437
$$ 49305713 49307406 49235216 49447818 49468452 49685845 49724217 49628281 49862875 50066363 49370926
4607D9370926j381602q11274j010202p44551o30215n67069K17316j65980O66059
$$ 49370926 47989324 47178050 46167848 45423297 44793082 44226013 44443329 44277349 44943408
4598D4943408J113168J330868J330599J339955J347187J485208J184462M74217
$$ 44943408 46056576 47387444 48718043 50057998 51405185 52890393 54074855 54549072
4590E4549072k17256r64743j530045k113399j783788k064422k236482j375086
$$ 54549072 54331816 53367073 51837028 49723629 47939841 45875419 43638937 42263851
4582D2263851j402852j040920o11878j68979K74752o72191j21538M58377P75599
$$ 42263851 40860999 39820079 39208201 39039222 39313974 38641783 38520245 38978622 39754221
4573C9754221R14420R74166N22103R06003O21268N93698m02489j093969j165374
$$ 39754221 40668641 41642807 42164910 43070913 43692181 44285879 43883390 42789421 41624047
4564D1624047j746851k192723j882208j690359k074561j326016r14572j042865
$$ 41624047 39877196 37684473 35802265 34111906 32037345 30711329 29796757 28753892
4556B8753892j286408j086274q18619l58136q56448o66456l56335k29692p43598
$$ 28753892 27467484 26381210 25562591 25204455 24348007 23681551 23325216 23095524 22351926
4547B2351926p12165j92754q19212k23373k61536m10187K66051m13028m96539
$$ 22351926 21639761 21447007 20627795 20404422 20142886 19732699 19998750 19585722 19089183
4538A9089183R1681J96451l36110n00902J6325k89931r2074m01132o0249J77173
$$ 19089183 19180864 19377315 19041205 18540303 18556628 18266697 18174623 17773491 17713242 17890415
4528A7890415m32352k66224o4565N6273l9854J10197K19955L28579j87019m23256
$$ 17890415 17458063 17191839 17127274 17183547 17143693 17253890 17473845 17802424 17615405 17192149
4518A7192149m7618P78798M0092m44834N15538M68458L08565K29730l2261k15467
$$ 17192149 17144531 17923329 17963421 17518587 18034125 18502583 18811148 19040878 19008617 18793150
4508A8793150L01049L10734j14533N62604L29965M60283P7199K27808N01969N38645
$$ 18793150 19094199 19404933 19290400 19853004 20182969 20643252 20720451 20948259 21450228 21988873
4498B1988873J1351M70796j8952P3068N01190L98969L09023N7465J09417N12671
$$ 21988873 22000224 22471020 22452068 22525136 23026326 23425295 23734318 23791783 23901200 24413871
4488B4413871P66771O84649M32611M22371Q41145P38114J601638J565242J017485
$$ 24413871 25180642 25865291 26297902 26720273 27561418 28299532 29901170 31466412 32483897
4479C2483897K232498K456055K083810J629462o9396j142084j390418j207908
$$ 32483897 34716395 37172450 39256260 40885722 40816326 39674242 38283824 37075916
4471C7075916k46018j35199o9173L32458L65145P84003K35508Q01661R39949J140636
$$ 37075916 36829898 36694699 36625526 36957984 37323129 38107132 38342640 39144301 40084250 41224886
4461D1224886J423315J725002J401724J666775K030950K043904K318660K510673
$$ 41224886 42648201 44373203 45774927 47441702 49472652 51516556 53835216 56345889
4453E6345889K521186K998108K998072L507086M121373L996667M699162N517387
$$ 56345889 58867075 61865183 64863255 68370341 72491714 76488381 81187543 86704930
4445H6704930N810896O971647Q084899R088848J0695133J3017610J4334354J8147117
$$ 86704930 92515826 99487473 107572372 116661220 127356353 140373963 154708317 172855434
4437A72855434K1687538K5605878K8931976L0072567K8813783K1615097J1041034
$$ 172855434 194542972 220148850 249080826 279153393 307967176 329582273 340623307
4430C40623307L43304m547988m096637j325926n87745l027765p967862j1845770
$$ 340623307 340966611 336418623 332321986 330996060 330408315 327380550 319412688 307566918
4422C07566918j2556432j0283185q230565q044817r994034j3182505j6121411
$$ 307566918 295010486 284727301 276496736 268451919 258457885 245275380 229153969
4415B29153969j7301231j7171917j6141203j4662434j3517691j1675883j0919040
$$ 229153969 211852738 194680821 178539618 163877184 150359493 138683610 127764570
4408A27764570r534992q095656p245371o569970n306515n403428m652596l947096
$$ 127764570 118229578 110133922 102888551 96318581 91012066 85608638 80956042 77008946
4400G7008946l757371l067955k996133k782929k562545k322517j880860j881056
$$ 77008946 73251575 70183620 67187487 64404558 61842013 59519496 57638636 55757580
4392E5757580j898610k197332j705187j406605j572866j287482j691047j096337
$$ 55757580 53858970 51661638 49956451 48549846 46976980 45689498 43998451 42902114
4384D2902114j213125j059603r98093j414692j155227j047206j356304j177329
$$ 42902114 41688989 40629386 39631293 38216601 37061374 36014168 34657864 33480535
4376C3480535r35858l44597r10058q36428o27073q25766m36111r02086o35319
$$ 33480535 32544677 32200080 31290022 30453594 29826521 29000755 28564644 27662558 27027239
4367B7027239m56955o64132q69956m17150l12378n11809l57846m66413o18143
$$ 27027239 26570284 25906152 25036196 24619046 24306668 23794859 23437013 22970600 22352457
4358B2352457k71516k42801p96564k77534j41375j52691n39064m43047m67239
$$ 22352457 22080941 21838140 21041576 20764042 20622667 20469976 19930912 19487865 19020626
4349A9020626j15013k8781n5859k38377m06155o54165o16444K476q6499m30659
$$ 19020626 18905613 18876832 18820973 18582596 18176441 17522276 16905832 16908308 16821809 16391150
4339A6391150j1853m97702q8063J08329p50820p09954K05110P6273j60640n55240
$$ 16391150 16379297 15881595 15793532 15901861 15151041 14441087 14646197 14722470 14561830 14006590
4329A4006590m2068j21122J03779m63345q49109r7484j17883N5355J84297n6285
$$ 14006590 13964522 13843400 13947179 13483834 12634725 12537241 12419358 12474713 12659010 12602725
4319A2602725n67021L07914j14564m84273K16472J10597m58803l63088n18200
$$ 12602725 12035704 12343618 12229054 11744781 11961253 12071850 11613047 11249959 10731759
4310A0731759M3742j89978K43096N1877J67379K89802l43430k3328o9721m04249
$$ 10731759 10775501 10585523 10828619 10880496 11047875 11337677 10994247 10970919 10901198 10496949
4300A0496949j88951M05642K505l17135K5831J53096k59490K48504K86954m57210
$$ 10496949 10307998 10713640 10716145 10399010 10424841 10577937 10318447 10566951 10853905 10396695
4290A0396695K9260j11621q9856J21141K37496j52271j91880M9928O7843k0704
$$ 10396695 10425955 10314334 10224478 10345619 10583115 10430844 10238964 10288892 10356735 10336031
4280A0336031l63166K23429m2927l66667L23989J5505K85869m82476k12323q6175
$$ 10336031 9972865 10196294 10153367 9786700 10110689 10126194 10412063 9929587 9717264 9631089
4270I631089j44699M77821k0905k01189J02223R497L8375Q0576o98701J33571
$$ 9631089 9486390 9964211 9943306 9742117 9844340 9853837 9892212 9972788 9274087 9407658
4260I407658J79093Q5380j2105o2708J48280K99408j13906j42881o0514J101L15995
$$ 9407658 9586751 9672131 9660026 9597318 9745598 10045006 9931100 9788219 9727705 9728806 10044801
4249A0044801j38866K67285J45269J80830k79583j2013o2590l36844j38246J19211
$$ 10044801 9905935 10173220 10318489 10499319 10219736 10207723 10145133 9808289 9670043 9789254
4239I789254k23473k42944j65522j44372L08154M94210l67807m06780K00590J81447
$$ 9789254 9565781 9322837 9157315 9012943 9321097 9815307 9447500 9040720 9241310 9422757
4229I422757l3770j3194l09876l9630L65331R869k56226J45198j83012L01188
$$ 9422757 9388987 9375793 9065917 9026287 9391618 9401487 9145261 9290459 9107447 9408635
4219I408635k00450m56235Q2365m9088n5526k59112M9644Q448N96829m03235m00340
$$ 9408635 9208185 8751950 8834315 8785227 8729701 8470589 8520233 8528681 9125510 8722275 8321935
4208H321935O0799N60167J68403o07434k38368K64073K46348j55172N38866j09934
$$ 8321935 8382734 8942901 9111304 8503870 8265502 8529575 8775923 8620751 9159617 9049683
4198I049683m01695P42022n30986j6388J48292M15430K41544j30972m50819l48474
$$ 9049683 8647988 9390010 8859024 8842636 8990928 9406358 9647902 9516930 9066111 8717637
4188H717637K78005J31976K29389k21490k00212k53871j03368J56614K23080Q196
$$ 8717637 8995642 9127618 9357007 9135517 8935305 8681434 8578066 8734680 8957760 8965956
4178H965956l62507K8692O8893Q8743j42604j56841K84972k15957K46676k28164
$$ 8965956 8603449 8632141 8701034 8789777 8647173 8490332 8775304 8559347 8806023 8577859
4168H577859K17720N1066L55722P38436O8800K40754L3878N23962J91882L72257
$$ 8577859 8795579 8846645 9202367 9940803 10009603 10250357 10284235 10808197 11000079 11372336
4158A1372336J74431k40753o39891k31247J93017k71334k3597l48340k02684o4911
$$ 11372336 11546767 11306014 10666123 10434876 10627893 10356559 10332962 9984622 9781938 9717027
4148I717027P5617K07868M08433L46609k27108K97999j69534l75917L6867N02658
$$ 9717027 9792644 10000512 10408945 10755554 10528446 10826445 10656911 10280994 10317861 10820519
4138A0820519J97916K75792M71284N96265K89875M99135O29102Q5544J10353Q36921
$$ 10820519 11018435 11294227 11765511 12361776 12651651 13150786 13779888 13865432 13975785 14812706
4128A4812706N15777O84182Q28247O49173M06560K96449M32080j29532m48327
$$ 14812706 15328483 16012665 16840912 17490085 17896645 18193094 18625174 18495642 18047315
4119A8047315l84881r7766m73478o66270p01129k15213j81615J76530J21615M5880
$$ 18047315 17662434 17564668 17091190 16424920 15723791 15508578 15326963 15503493 15625108 15670988
4109A5670988j71239K7360N11659l57995M0069O93194q5264L61187J59803P35809
$$ 15670988 15499749 15527109 16038768 15680773 15720842 16414036 16328772 16689959 16849762 17585571
4099A7585571J131217P22539P32527J042970J212463J102235J633367J159364
$$ 17585571 18716788 19439327 20171854 21214824 22427287 23529522 25162889 26322253
4091B6322253O38694J086626J315659K40303m73946l43295j087808q54838l11608
$$ 26322253 26960947 28047573 29363232 29603535 29129589 28786294 27698486 26843648 26532040
4082B6532040r96646q12999o61421o22138j33174k85712O3439k8402L655j20007
$$ 26532040 25535394 24722395 24060974 23438836 23305662 23019950 23083389 23054987 23058642 22938635
4072B2938635O9143K89668K33142Q04165R09780M35603N04807J281051J291453
$$ 22938635 23007778 23297446 23530588 24334753 25244533 25680136 26184943 27465994 28757447
4063B8757447J267779J525077J489603J414933J516156J126119R10725M09931
$$ 28757447 30025226 31550303 33039906 34454839 35970995 37097114 38007839 38417770
4055C8417770k43063k81098l06953m23887q95229l59430n13757m15817j51104
$$ 38417770 38174707 37893609 37586656 37162769 36267540 35908110 35394353 34978536 34827432
4046C4827432l52184q389m79238p27848M88388L39843J62608K69745K21210O16252
$$ 34827432 34475248 34466859 33987621 33259773 33748161 34088004 34250612 34520357 34741567 35357819
4036C5357819K77022M40703N26330P08818M21472M02646R02322Q12555J024826
$$ 35357819 35634841 36075544 36601874 37310692 37732164 38134810 39037132 39849687 40874513
4027D0874513J288414N91704l19O27929M63044j2357P82551j59026o3484R3992
$$ 40874513 42162927 42754631 42754312 43382241 43845285 43832928 44615479 44456453 44392969 44486961
4017D4486961M82715R20247K16464N84172J272679J156304Q77867J360152J331605
$$ 44486961 44969676 45889923 46106387 46690559 47963238 49119542 49997409 51357561 52689166
4008E2689166J427844J252638J973983K302363J521945J577348K238187K248152
$$ 52689166 54117010 55369648 57343631 59645994 61167939 62745287 64983474 67231626
4000F7231626K581833K369651K436966L043986K698552K549055L463024L365774
$$ 67231626 69813459 72183110 74620076 77664062 80362614 82911669 86374693 89740467
3992H9740467L378299L253122L394104L439223L954623L035015K687412K114099
$$ 89740467 93118766 96371888 99765992 103205215 107159838 110194853 112882265 114996364
3984A14996364K044862K615946K288695J933270K058512K391950J981849K395240
$$ 114996364 117041226 119657172 121945867 123879137 125937649 128329599 130311448 132706688
3976A32706688K162328K061763J666843J644726J075557N33610O54717P21692
$$ 132706688 134869016 136930779 138597622 140242348 141317905 141851515 142506232 143227924
3968A43227924K07394O86669L06492O53389O5862M99635P94539n84811q33846
$$ 143227924 143435318 144121987 144428479 145081868 145147730 145647365 146441904 145857093 145023247
3959A45023247j372643k000969k004567j801213j751906j440831j384667j618443
$$ 145023247 143650604 141649635 139645068 137843855 136091949 134651118 133266451 131648008
3951A31648008p46707n64162r26326j111574r34646j003230j660726j628395j556483
$$ 131648008 130901301 130337139 129410813 128299239 127364593 126361363 124700637 123072242 121515759
3942A21515759j379976j053977j048177k89978J45244O94104L22585J07379O61558
$$ 121515759 120135783 119081806 118033629 117743651 117888895 118582999 118905584 119012963 119674521
3933A19674521K00971l70402o08144l40498j55570k03540J44464P59545P17482
$$ 119674521 119875492 119505090 118896946 118556448 118400878 118197338 118341802 119101347 119818829
3924A19818829J169106J317313O71439Q72624M52838m25095k16153q79222j265065
$$ 119818829 120987935 122305248 122976687 123849311 124302149 123877054 123660901 122781679 121516614
3915A21516614p17877j589982o97924j094031j557994j116594j349351j687348
$$ 121516614 120798737 119208755 118510831 117416800 115858806 114742212 113392861 111705513
3907A11705513j860886j726583j721378j415585j847102j813101j534682j835343
$$ 111705513 109844627 108118044 106396666 104981081 103133979 101320878 99786196 97950853
3899I7950853k043689k180421k186103k171056j835404k278620k734553k393324
$$ 97950853 95907164 93726743 91540640 89369584 87534180 85255560 82521007 80127683
3891H0127683k770371j890770k646156k189265k255895k146221k107601j972038
$$ 80127683 77357312 75466542 72820386 70631121 68375226 66229005 64121404 62149366
3883F2149366k270437j773469j546224j455410p21993j133315j208058j073826
$$ 62149366 59878929 58105460 56559236 55103826 54381833 53248518 52040460 50966634
3875E0966634j099085l14153k36404o06474j07514k95922k71110q17292j41394
$$ 50966634 49867549 49553396 49316992 48710518 48603004 48307082 48035972 47218680 47077286
3866D7077286m46434o99519o35093n87554o01475k71359M3040j43998J65987K93689
$$ 47077286 46630852 45931333 45296240 44708686 44107211 43835852 43878892 43734894 43900881 44194570
3856D4194570J28980N38115M33026l0151n20690r78331p07748l32265p02772j269636
$$ 44194570 44323550 44861665 45294691 45264540 44743850 43765519 43057771 42725506 42022734 40753098
3846D0753098p21279j98393m91148o74142n97054m33514j57230j64684n87644
$$ 40753098 40031819 39833426 39342278 38668136 38071082 37637568 37480338 37315654 36728010
3837C6728010m92091m00381o03918j083038q53436o08870q00356p14730q09426
$$ 36728010 36235919 35835538 35231620 34148582 33295146 32686276 31885920 31171190 30361764
3828C0361764p62292j070460k48677j22209p26394m86874m09623K6845m16231
$$ 30361764 29599472 28529012 28280335 28158126 27431732 26944858 26535235 26562080 26145849
3819B6145849p38272l20694j72817o7371n0081k05988m85037m36643o06024k92481
$$ 26145849 25407577 25086883 24914066 24846695 24796614 24590626 24105589 23668946 23062922 22770441
3809B2770441K51878k32670k19367J33873l28107l18469j91855N10437j40980
$$ 22770441 23022319 22789649 22570282 22704155 22376048 22057579 21865724 22376161 22235181
3800B2235181k45920n67620r5072J88980K95533l21275r3029k90708J60826k40471
$$ 22235181 21989261 21421641 21326569 21515549 21811082 21489807 21396778 21106070 21266896 21026425
3790B1026425l14296M82087J2692m5002l49339K66167j47227r6495q3336j79066
$$ 21026425 20712129 21194216 21206908 21161906 20812567 21078734 20931507 20835012 20751676 20572610
3780B0572610k97978L57121J50917m92755M8101j60524l71913O07233K3824n53481
$$ 20572610 20274632 20631753 20782670 20289915 20338016 20177492 19805579 20412812 20436636 19883155
3770A9883155o5027m63040l16732J87819J58168K16428j16501j38989l60654j5442
$$ 19883155 19818128 19355088 19038356 19226175 19384343 19600771 19484270 19345281 18984627 18969185
3760A8969185J4110J87178K38946J85281n42667k86616K19228N34746l45768l48363
$$ 18969185 18983295 19170473 19409419 19594700 19052033 18765417 18984645 19519391 19173623 18825260
3750A8825260M15639J17959q6308l93375r9362M23774L65439k03099p6206P2010
$$ 18825260 19240899 19358858 19272550 18879175 18779813 19203587 19569026 19365927 19289721 19361731
3740A9361731O43241J34340K86842o350L12350k83190L92043J06388j16031O44384
$$ 19361731 20004972 20139312 20426154 20419804 20732154 20448964 20841007 20947395 20831364 21475748
3730B1475748L21798J80484k31952K67862L13337L97954R5081K80650L50104M15444
$$ 21475748 21797546 21978030 21746078 22013940 22327277 22725231 22820312 23100962 23451066 23866510
3720B3866510J34729Q1378n0321M71847K71677O16689J02892M8073O37496Q11344
$$ 23866510 24001239 24082617 24032296 24504143 24775820 25392509 25495401 25543474 26180970 26992314
3710B6992314K89973L92582Q2578L06180K58776P14861O72122L53142N87885R29935
$$ 26992314 27282287 27674869 27757447 28063627 28322403 29037264 29709386 30062528 30650413 31580348
3700C1580348Q11129P35310Q02082O93184R74924J165034J632077J323973J719004
$$ 31580348 32391477 33126787 33928869 34622053 35596977 36762011 38394088 39718061 41437065
3691D1437065K382398K562473J907170L095903L982804M517185M425372M762248
$$ 41437065 43819463 46381936 48289106 51385009 55367813 59884998 64310370 69072618
3683F9072618L399258J628843n45779k110783k836910l077745k551419j899383
$$ 69072618 72471876 74100719 73554940 71444157 68607247 65529502 62978083 61078700
3675F1078700j043066n88014J62931J11L43955N08521P74485J406742J270630
$$ 61078700 60035634 59447620 59610551 59610662 59954617 60463138 61237623 62644365 63914995
3666F3914995J372046J311988J832643K029181K360901K803045K835980L616766
$$ 63914995 65287041 66599029 68431672 70460853 72821754 75624799 78460779 82077545
3658H2077545M097209L999391M238405L549862K062174N08057j463176k443549
$$ 82077545 86174754 90174145 94412550 97962412 100024586 100532643 99069467 96625918
3650I6625918k736050k075722j662962j447858r83601j247587n10173q57296k20323
$$ 96625918 93889868 91814146 90151184 88703326 87719725 86472138 85961965 85104669 84884346
3641H4884346M70536J97527J07549K12911M57049K27450M15867M64610J358862
$$ 84884346 85354882 85552409 85659958 85872869 86329918 86557368 86973235 87437845 88796707
3632H8796707N49020J174060J086309J120825J610257J729016K020985J977701
$$ 88796707 89345727 90519787 91606096 92726921 94337178 96066194 98087179 100064880
3624A00064880J935220K545165K695391L179461L489166L126969L445064L833198
$$ 100064880 102000100 104545265 107240656 110420117 113909283 117036252 120481316 124314514
3616A24314514M150061M750702M503778M250965M789049N003308M866762M604463
$$ 124314514 128464575 133215277 137719055 141970020 146759069 151762377 156629139 161233602
3608A61233602M886909M655821M450313M387118M840161M088332M385519M073641
$$ 161233602 166120511 170776332 175226645 179613763 184453924 188542256 192927775 197001416
3600A97001416L916406L555545L152016L174736K802506K389811J782678J331789
$$ 197001416 200917822 204473367 207625383 210800119 213602625 215992436 217775114 219106903
3592B19106903P50511N32570R93284N10151k15712l3369O84913k511R8849N66600
$$ 219106903 219857414 220389984 221383268 221893419 221677707 221644338 222329251 222326740 222425589 222992189
3582B22992189M35582R68109N59571J57836P63271Q64550Q52601J293749P79232
$$ 222992189 223427771 224395880 224955451 225113287 225876558 226741108 227593709 228887458 229666690
3573B29666690L39554J513109K162118J574953K288592K381034K284187K888827
$$ 229666690 230006244 231519353 233681471 235256424 237545016 239926050 242210237 245099064
3565B45099064L205118L732945L145247L054589L791912L642234L617705L785023
$$ 245099064 248304182 252037127 255182374 258236963 262028875 265671109 269288814 273073837
3557B73073837L983182M029367L644385M374604M535699M959163N927423P042665
$$ 273073837 277057019 281086386 284730771 289105375 293641074 298600237 304527660 311570325
3549C11570325P046920P894977R139043R245492J0305974J0671894R782846R304017
$$ 311570325 318617245 326512222 335651265 344896757 355202731 365874625 375657471 384961488
3541C84961488P982523O841411N610725M547916L680712L783411K930987K446057
$$ 384961488 392944011 399785422 405396147 409944063 413624775 417408186 420339173 422785230
3533D22785230L365876K974836K959201K205178K0102j411357l080079m893607
$$ 422785230 426151106 429125942 432085143 434290321 434310423 432899066 429818987 424925380
3525D24925380o251784q937182r826729j0501639j0346337r981104r818769r833052
$$ 424925380 418673596 409736414 399909685 389408046 379061709 369080605 359261836 349428784
3517C49428784r232184r540335r040453q835808r128094r522895r544955r102907
$$ 349428784 340196600 330656265 321615812 312780004 303651910 294129015 284584060 275481153
3509B75481153q982997q152338p223473o856870o184926n526481m935328m223133
$$ 275481153 266498156 258345818 251122345 244265475 238080549 232554068 227618740 223395607
3501B23395607m169446m139289l219259l313505k960392l953990l674130l664498
$$ 223395607 219226161 215086872 211867613 208554108 205593716 201639726 197965596 194301098
3493A94301098l642532l720581m361095m213180m391054l961800m628238m761871
$$ 194301098 190658566 186937985 182576890 178363710 173972656 170010856 165382618 160620747
3485A60620747m350219m520674m475670m020349l752006l681992m048692l795631
$$ 160620747 156270528 151749854 147274184 143253835 139501829 135819837 131771145 127975514
3477A27975514l432653l624186l369602l409895l134892k506093l189731k722990
$$ 127975514 124542861 120918675 117549073 114139178 111004286 108498193 105308462 102585472
3469A02585472j808598k054104j744196j663639j355866q04399r10172p97654
$$ 102585472 100776874 98722770 96978574 95314935 93959069 93154670 92244498 91446844
3461I1446844p13820m23269k86482p28961n53154j81470O4073o02716q05772l01481
$$ 91446844 90733024 90309755 90023273 89294312 88741158 88559688 88623761 88021045 87215273 86913792
3451H6913792j46041n6824o83558k69625J65916p8837J27303L1075k57133L04647
$$ 86913792 86767751 86710927 86027369 85757744 85923660 85844823 85972126 86003201 85746068 86050715
3441H6050715N09856k79450j91225j99768p86624l96959l56907K1084R4989j67464
$$ 86050715 86560571 86281121 86089896 85890128 85103504 84706545 84349638 84370722 84465711 84298247
3431H4298247l38611k48986k33931q7766K2044q2741j58184J16638K65109L4603
$$ 84298247 83959636 83710650 83476719 83388953 83410997 83328256 83170072 83286710 83551819 83586422
3421H3586422K95376O22960O10891P86701J340370J965801K459957L610700L716119
$$ 83586422 83881798 84504758 85115649 85902350 87242720 89208521 91668478 95279178 98995297
3412I8995297L631833K972582J491446l80062k260517l062089k213156j953511
$$ 98995297 102627130 105599712 107091158 106711096 104450579 101388490 99175334 97221823
3404I7221823j300502l93571N60337O21683J188750K482661K202822J722268L13799
$$ 97221823 95921321 95527750 96088087 96709770 97898520 100381181 102584003 104306271 104620070
3395A04620070j838915l630503m324207m400718l820814k935574k556849j486145
$$ 104620070 102781155 99150652 94826445 90425727 86604913 83669339 81112490 79626345
3387G9626345j325765o51099o16723L7012J96832L89218J721100J949588J320302
$$ 79626345 78300580 77649481 77032758 77069770 77266602 77655820 79376920 81326508 82646810
3378H2646810J824470K421639L180173L611180L421749L915462M095618M606699
$$ 82646810 84471280 86892919 90073092 93684272 97106021 101021483 105117101 109723800
3370A09723800N566269N440540N547219O215299P185861O598746O418672P060314
$$ 109723800 115290069 120730609 126277828 132493127 139678988 146277734 152696406 159756720
3362A59756720O577442O900513O371075N884985N934759N177628M458735M434342
$$ 159756720 166334162 173234675 179605750 185490735 191425494 196603122 201061857 205496199
3354B05496199L093933K547104J943860J028859m13268o74993j409381k002058
$$ 205496199 208590132 211137236 213081096 214109955 213696687 213021694 211612313 209610255
3346B09610255l066162l672729m265794m494318n777757n713192o083814o410006
$$ 209610255 206544093 202871364 198605570 194111252 188333495 182620303 176536489 170126483
3338A70126483o594050o107406o668156o405874n795298n989707n683469n942128
$$ 170126483 163532433 157425027 150756871 144350997 138555699 132565992 126882523 120940395
3330A20940395n422467n392361m323614m039056m225816l649094l270341l206363
$$ 120940395 115517928 110125567 105801953 101762897 97537081 93887987 90617646 87411283
3322H7411283l167854k728677k235672j939750j552440j175482j401520q70509
$$ 87411283 84243429 81514752 79279080 77339330 75786890 74611408 73209888 72339379
3314G2339379m01704r07554o98821k78954m67925k9398N48815l34922j92777Q6068
$$ 72339379 71937675 71030121 70331300 70052346 69584421 69555023 70103838 69768916 69576139 69662207
3304F9662207N51556O67250M86450L9294K43244R03095P51780K43197J68928L82638
$$ 69662207 70213763 70881013 71367463 71406757 71650001 72553096 73304876 73548073 73717001 74099639
3294G4099639O24580P10705P02363K66030M37236J61099P55322Q12433R60373
$$ 74099639 74724219 75434924 76137287 76403317 76840553 77001652 77756974 78569407 79529780
3285G9529780O29547N13784P03948R86835J373566P27568J240002J853738J717023
$$ 79529780 80159327 80673111 81377059 82363894 83737460 84465028 85705030 87558768 89275791
3276H9275791K189394J461526J654966J929104J955553K549872K627738K622354
$$ 89275791 91465185 92926711 94581677 96510781 98466334 101016206 103643944 106266298
3268A06266298L287197L460933L526790M571198M607052N080981N335133O364769
$$ 106266298 109553495 113014428 116541218 121112416 125719468 130800449 136135582 142500351
3260A42500351P287622Q401464R195403R659258J1000728J3024234J4327915J6230576
$$ 142500351 149787973 158189437 167384840 177044098 188044826 201069060 215396975 231627551
3252B31627551J7990074J9892024K1293025K3377022K3778547K2857654K1509236
$$ 231627551 249617625 269509649 290802674 314179696 337958243 360815897 382325133
3245C82325133J7383474J1700796N004016k231456q550005j3382403j5345308
$$ 382325133 399708607 411409403 416413419 414181963 405631958 392249555 376904247
3238C76904247j6708974j7715141j6544046j5842998j4491588j3623342j3039653
$$ 376904247 360195273 342480132 325936086 310093088 295601500 281978158 268938505
3231B68938505j1459241r964480r015166q319981p783978o686395n890410n436648
$$ 268938505 257479264 247514784 238499618 230179637 222395659 215709264 209818854 204382206
3223B04382206n028716n076479n295794n282400m903616m252710l776316l233120
$$ 204382206 199353490 194277011 188981217 183698817 178795201 174542491 170766175 167533055
3215A67533055k787778k434330k328717k033724k198882k673366k737183k935184
$$ 167533055 164745277 162310947 159982230 157948506 155749624 153076258 150339075 147403891
3207A47403891m173489l879896l818521l855506l977877l913902l840215l619413
$$ 147403891 143230402 139350506 135531985 131676479 127698602 123784700 119944485 116325072
3199A16325072k959427k824843k107973j924058r35320n66313j85852M14133o98127
$$ 116325072 113365645 110540802 108432829 106508771 105573451 105007138 104821286 105235419 104537292
3190A04537292k125722l653779m143372m599689m119742l329366l132413l028847
$$ 104537292 102411570 98757791 94614419 90014730 85894988 82565622 79433209 76404362
3182G6404362k860151j785634j955555j899158j674620j858355k325817j808536
$$ 76404362 73544211 71758577 69803022 67903864 66229244 64370889 62045072 60236536
3174F0236536j768224j768490j907681j499109r87949q80068p06249l73892o87409
$$ 60236536 58468312 56699822 54792141 53293032 52305083 51425015 50718766 50344874 49657465
3165D9657465p86052k40512P6713J32233M49898P71835q8118m18566j282749j726040
$$ 49657465 48871413 48630901 48707614 48839847 49289745 50061580 49973462 49554896 48272147 46546107
3155D6546107j423188j632227j790378k034295j646587j295851j247158j185329
$$ 46546107 45122919 43490692 41700314 39666019 38019432 36723581 35476423 34291094
3147C4291094j164265r31979j172080o58527l69066q59847p47819o26492n19585
$$ 34291094 33126829 32194850 31022770 30364243 29995177 29135330 28387511 27761019 27241434
3138B7241434n82908m98958k75477j49451l36875p42190m16382p57260k79815
$$ 27241434 26658526 26159568 25884091 25734640 25397765 24655575 24239193 23481933 23202118
3129B3202118k05543l16908m63784k77551Q6068q7279j06161l82819k32360m67074
$$ 23202118 22996575 22679667 22215883 21938332 22024400 21937121 21830960 21448141 21215781 20748707
3119B0748707k44717n90951r22127o32201K25148m46704k38697k45911m31867
$$ 20748707 20503990 19913039 18990912 18358711 18583859 18137155 17898458 17652547 17220680
3110A7220680k87171m86169M2832p75709j62761l94908m06321j4248j27384j88999
$$ 17220680 16933509 16447340 16490172 15714463 15551702 15156794 14750473 14736225 14608841 14419842
3100A4419842p6877K9896m2213r0844j94076m3640K59129l25341q2489L53966
$$ 14419842 14342965 14372861 14330648 14239804 14045728 14002088 14261217 13935876 13853387 14207353
3090A4207353O5213l60492l38973m35041k89324p9637J11426j24483k21040k40087
$$ 14207353 14272566 13912074 13573101 13138060 12848736 12769099 12880525 12756042 12535002 12294915
3080A2294915n8615j10692k49104j9698k9546p4970k99682J71982l22601J23340
$$ 12294915 12236300 12125608 11876504 11856806 11827260 11752290 11452608 11624590 11301989 11425329
3070A1425329k51430J1092K49734j00875K14912j94780k35529K54749J50999l71685
$$ 11425329 11173899 11184991 11434725 11333850 11548762 11353982 11118453 11373202 11524201 11152516
3060A1152516j73726K13653L80924l80403m89240n25749l48377k73145K21821
$$ 11152516 10978790 11192443 11573367 11192964 10703724 10177975 9829598 9556453 9778274
3051I778274J87332n44368k09725J13141J25872l4947l76836l75109J91971m59229
$$ 9778274 9965606 9421238 9211513 9324654 9450526 9415579 9038743 8663634 8855605 8396376
3041H396376j15568J16737J11093k0155q7128J43463m02290J07165P6034l49822
$$ 8396376 8280808 8397545 8508638 8488483 8401355 8544818 8142528 8249693 8325727 7975905
3031G975905L01326j32022K89730K2828k27707j0242M44014k59178j54560J10646
$$ 7975905 8277231 8145209 8434939 8457767 8230060 8219818 8663832 8404654 8250094 8360740
3021H360740o41491J26479J57345j10138R5357l25103R3575m2708q7999J77141
$$ 8360740 7719249 7845728 8003073 7892935 7988292 7663189 7756764 7714056 7626057 7803198
3011G803198M12972j75142l24213P2797l9596O46688j59570l09892P8276o1978
$$ 7803198 8216170 8041028 7716815 7789612 7750016 8396704 8237134 7927242 8005518 7943540
3001G943540o7865l69216M7425J11964l83526L57573o319n5033L0387M68173k33357
$$ 7943540 7875675 7506459 7553884 7665848 7282322 7639895 7633576 7578543 7608930 8077103 7843746
2990G843746j4361J03017J23291J76197O7478l61270o4112J95914J05528L47185
$$ 7843746 7829385 7932402 8055693 8231890 8299368 7938098 7873986 8069900 8175428 8522613
2980H522613K94079J39680k19136N87622K81450l3329k74184l96568m38223K94359
$$ 8522613 8816692 8956372 8737236 9324858 9606308 9572979 9298795 8902227 8464004 8758363
2970H758363L81610j62998j78031l4969K87677J27345j45089J21688K70747J25414
$$ 8758363 9139973 8976975 8798944 8763975 9051652 9178997 9033908 9155596 9426343 9551757
2960I551757J48449j36517L00248N4868q2473L76945Q53823M71777J6120K14332
$$ 9551757 9700206 9563689 9863937 9918805 9836332 10213277 11067100 11538877 11554997 11769329
2950A1769329N97197M35478O5594Q22674J53467N98614L88424R19056R55691R63851
$$ 11769329 12366526 12802004 12867598 13690272 13843739 14442353 14830777 15749833 16705524 17669375
2940A7669375Q12556M30807P78841J130581R57816J236800R92770N34035O64433
$$ 17669375 18481931 18912738 19691579 20822160 21779976 23016776 24009546 24543581 25208014
2931B5208014L9581K63564R4238M03994Q8785m41553K63400K98272p0564Q0703
$$ 25208014 25247595 25511159 25605397 26009391 26098176 25656623 25920023 26218295 26147731 26228434
2921B6228434P4711Q3691J78030M22240m0262O04862P79239N10462P15882J103165
$$ 26228434 26303145 26386836 26564866 26987106 26946844 27551706 28330945 28841407 29557289 30660454
2911C0660454J265496J704076J662310K501201K649503K701120K619436J434991
$$ 30660454 31925950 33630026 35292336 37793537 40443040 43144160 45763596 47198587
2903D7198587l94830k197243l171404l281170l176882k176510k392433j687631
$$ 47198587 46803757 44606514 41435110 38153940 34977058 32800548 30408115 28720484
2895B8720484j166690j629225j061681r28803p21485p20238l87737p45790m27543
$$ 28720484 27553794 25924569 24862888 23934085 23212600 22492362 22104625 21358835 20931292
2886B0931292p0249k56878j77178M65505j01629O87744L11727l08984K75796P43605
$$ 20931292 20861043 20604165 20426987 20892492 20790863 21478607 21790334 21481350 21757146 22500751
2876B2500751P40875r2746K15537J53310o21785j533955r24217n63565j011790
$$ 22500751 23241626 23148880 23364417 23517727 22895942 21361987 20437770 19874205 18862415
2867A8862415j088507j389649o71681p94251q66261p87118m43466o30390o77580
$$ 18862415 17773908 16384259 15712578 14918327 14052066 13264948 12821482 12191092 11513512
2858A1513512l73124m72623o29491q33297J41666R4925n58211l98181p6073m53519
$$ 11513512 11140388 10667765 10038274 9204977 9346643 9441568 8883357 8485176 8409103 7955584
2848G955584k65795p04338k45713j4004K00675k86197p30516p7506k25635l02891
$$ 7955584 7689789 6985451 6739738 6725734 6926409 6640212 5909696 5832190 5606555 5303664
2838E303664l301J06024k66299l19372j71642k81188j12743q6465K96564K72911
$$ 5303664 5300363 5406387 5140088 4820716 4649074 4367886 4255143 4168678 4465242 4738153
2828D738153k69352o5498l21990m78933j49179K53971j1212K58716m85398N5209
$$ 4738153 4468801 4403303 4081313 3602380 3453201 3707172 3695960 3954676 3469278 3524487
2818C524487O7236m26426Q41J79934j29935M4551m9241m27458l03488K15628O1885
$$ 3524487 3591723 3165297 3166138 3346072 3216137 3260688 3211447 2783989 2480501 2696129 2758014
2807B758014p423R8860p06121j98877L44557L68073J5264l85594j3251K69497
$$ 2758014 2750591 2849451 2143330 1944453 2289010 2657083 2672347 2286753 2273502 2542999
2797B542999j10341j53245J64676l05017n26064Q9308M67602j31965m11899m7318
$$ 2542999 2432658 2279413 2444089 2139072 1613008 1702316 2169918 2037953 1626054 1578736
2787A578736O5241L76773k13444K34810R1064l41092K12780J10060m5787k78335
$$ 1578736 1643977 2020750 1807306 2042116 2133180 1792088 2004868 2114928 2069141 1790806
2777A790806l10737j12017l2519J83341k62564j72783j4286M01784L76227k51969
$$ 1790806 1480069 1368052 1335533 1518874 1256310 1083527 1069241 1471025 1847252 1595283
2767A595283N3020j74523n57803j03330O7863K62381M422m62114N87450k36054
$$ 1595283 1648303 1473780 915977 812647 880510 1142891 1147313 685199 1272649 1036595
2757A036595j48675L98815l45362j42078K59695J2332J0355L59912l51838l08725
$$ 1036595 887920 1286735 941373 799295 1058990 1071322 1081677 1441589 1089751 781026
2747G81026L10265Q726j78858l52499L19333J24434j73557J68869J58682K42306
$$ 781026 1091291 1100017 921159 568660 887993 1012427 838870 1007739 1166421 1408727
2737A408727J14553n9288k36007k65321k62644K59312j19047J2217J47945K4129
$$ 1408727 1523280 1463992 1227985 962664 700020 959332 840285 852502 1000447 1024576
2727A024576J96357l35057k57475O6866K22772L35098j52928j91427M7648K31958
$$ 1024576 1220933 885876 628401 695267 918039 1253137 1100209 908782 956430 1188388
2717A188388k95814j27658l40897j24261P08388l12074o8241J58043N8337k04240
$$ 1188388 892574 764916 424019 299758 1008146 696072 627831 785874 844211 639971
2707F39971k01495p6009n7415J98347K20630k47394J61896J05928J18807j05303
$$ 639971 438476 362467 305052 503399 724029 476635 638531 744459 863266 757963
2697G57963p4843K15793l4638l46803j90297j39880K33953L9793L04641m6295
$$ 757963 683120 898913 864275 517472 327175 187295 421248 461041 765682 719387
2687G19387l09056Q9341K4676j26005Q7076K81295l10853J93910M7231l08556
$$ 719387 410331 499672 524348 398343 485419 766714 455861 649771 697002 388446
2677C88446k79852K66053O5557j62916R782J38022m12712J80289M75853j43350
$$ 388446 108594 374647 440204 277288 287070 425092 12380 192669 668522 525172
2667E25172m97785K24704O33582j25961r9151n1954j59910J8920J1384O24196
$$ 525172 27387 252091 885673 759712 660561 608607 448697 467617 479001 1103197
2657A103197j20328J0529j69370l00368j09676n5341K13575N7917J19349J24703
$$ 1103197 982869 993398 824028 523660 413984 358643 572218 630135 749484 874187
2647H74187m77624J99999q9765L61829j97039l06568n1281K35264p4454j88973
$$ 874187 396563 596562 506797 868626 671587 365019 313738 549002 474548 285575
2637B85575O8751o776J19693N97898k4795q89894p1648M12179K90446J34517K93152
$$ 285575 354326 347550 467243 1065141 1040346 150452 78804 490983 781429 915946 1209098
2626A209098m21983J10264l1623J3471k23434K9013J26122k25882J4976k12111
$$ 1209098 787115 897379 865756 879227 655793 684806 810928 585046 600022 387911
2616C87911m83302m4279L86080J97610n0839o0935j8080l31186K82439K85252
$$ 387911 -95391 -139670 246410 444020 393181 332246 314166 -17020 265419 550671
2606E50671K0401j07891j5598j38969j83381L69631k92847K88033O485L23850
$$ 550671 571072 463181 447583 308614 125233 494864 202017 490050 496535 820385
2596H20385J99773l42421j43544K54010j10654l68275j80243N33894J07715l48817
$$ 820385 1020158 677737 534193 788203 677549 309274 129031 662925 770640 421823
2586D21823J29735o4712J9723j6193K4292k04752o2641K89121J07590M5865L11374
$$ 421823 551558 486846 506569 490376 514668 309916 247275 536396 643986 689851 1001225
2575A001225m39031j9061K82906l10466L15285j78688k44010P126L30747l73149
$$ 1001225 562194 543133 826039 515573 830858 652170 408160 415286 746033 372884
2565C72884J67181l53466J82700l5449K4234l4485N5623K82763k64459K33817
$$ 372884 540065 186599 369299 333850 358084 323599 379222 661985 397526 631343
2555F31343l61278m72244M25195L7090k10250O4229Q6544p3613k6894J43014L37455
$$ 631343 270065 -202179 223016 260106 49856 114085 200629 127016 100122 243136 580591
2544E80591j21916p9012n8319p2101j61462n6603J15651j94148J12782L68784
$$ 580591 458675 379663 321344 249243 87781 31178 146829 -47319 65463 434247
2534D34247K74516k46759o5576R5685J79554l11657l17223o6744K2034j09244
$$ 434247 708763 462004 396428 492113 671667 360010 42787 -23957 -1923 -111167
2524a11167R7602j87231k42789L17753K55428j04196J77584n8754l1640J84480
$$ -111167 -13565 -200796 -443585 -125832 129596 25400 202984 144230 112590 297070
2514B97070n99581J05122J85960J3031M6532m53104k65324M54054P03784O3351
$$ 297070 -302511 -197389 -11429 1602 48134 -404970 -670294 -216240 487544 550895
2504E50895o56175l79120L98564N9004p4751j38469J14342O7908L49603J014j56026
$$ 550895 -105280 -484400 -85836 -26832 -101583 -240052 -125710 -57802 291801 292815 136789
2493A36789K01515j15908J97791K06983l01649k49055l17720J85054p7016j17352
$$ 136789 338304 222396 420187 627170 325521 76466 -241254 -56200 -133216 -250568
2483b50568j78576N24780N0763m76343p1843P00257j06662K49385k64679j17238
$$ -250568 -429144 95636 146399 -329944 -401787 298470 191808 441193 176514 59276
2473E9276o4222J55774K80318m5371l53219n0063n7980J93920L19202k02410J5697
$$ 59276 -4946 150828 431146 385775 32556 -17507 -75487 118433 437635 235225 250922
2462B50922p9325m47660J18133L88447l1631k5818K6441m85946L0857M03057k78731
$$ 250922 171597 -276063 -157930 230517 198886 173068 199509 -286437 -255580 147477 -131254
2451a31254J46250m4927K15581O52928n93797j08577Q7163K6684p2038j28537
$$ -131254 14996 -29931 185650 838578 244781 136204 223367 250051 178013 49476
2441D9476k9308k26972J49142j35611R3883L8383J72999K08817j32658l48988
$$ 49476 20168 -206804 -57662 -193273 -99390 -61007 111992 320809 188151 -160837
2431a60837K22892J7775J87682p3697p458m14794j19091L88652K1773J11904l18963
$$ -160837 62055 79830 267512 193815 186357 -228437 -347528 41124 62897 174801 -144162
2420a44162K31263J61145n92634K22380J26112J15742k66027n579J30938K21633
$$ -144162 87101 248246 -344388 -122008 4104 119846 -146181 -151760 -20822 200811
2410B00811l46796j54240L05139n7756j09575K3613N1592j18378J88911K45678
$$ 200811 -145985 -300225 4914 -52842 -162417 -138804 -87212 -205590 -16679 228999
2400B28999O7135j52013k01668K1852J93738K14766j8817q1434Q17J59632k65928
$$ 228999 296134 144121 -57547 -35695 158043 372809 353992 272558 273375 433007 167079
2389A67079J15844Q1987J67683l12119j76517j36420L08418q1980J98275K0817
$$ 167079 282923 364910 532593 220474 43957 -92463 215955 133975 332250 353067
2379C53067J26092l63282j08633L69713L39105J88316j07635o7589J43637K1200
$$ 353067 479159 115877 7244 376957 716062 904378 796743 729154 872791 893991
2369H93991k70072q03313k4054L62680N476k56759K64877L25609q3521P6802r9868
$$ 893991 623919 -179394 -203448 159232 164708 -92051 172826 498435 414914 491716 391848
2358C91848o6282j37363j9433l79082N63357j39607K84629R8855j31872l96381
$$ 391848 325566 188203 168770 -210312 353045 213438 498067 596922 465050 68669
2348F8669n82735M89138J5889J4081J20164J59553Q5198q5110K02089j99837j32462
$$ 68669 -514066 -24928 -9039 5042 125206 284759 369957 284847 486936 287099 154637
2337A54637k74240k78531j41006O65017J05509l6259p8489n2631m17133k62720
$$ 154637 -119603 -398134 -539140 125877 231386 195127 116638 64007 -353126 -615846
2327f15846L61699N7036j74761K52183j19284K5009J63683j52319k90344K92571
$$ -615846 -254147 -197111 -371872 -119689 -238973 -213964 -50281 -202600 -492944 -200373
2317b00373K76331J32939j7699l56620O80445N7424l97886j73421J12945k52829
$$ -200373 75958 208897 191198 -165422 515023 572447 174561 1140 114085 -138744
2307a38744o6075L84758k72502M24008K25582l69052J82916K96021m9041l78410
$$ -138744 -204819 179939 -92563 331445 557027 187975 370891 666912 617871 239461
2297B39461K28950L92822j97649k46920k19570R214R6655J71166j00501r9283
$$ 239461 468411 861233 663584 416664 197094 206308 302963 474129 373628 274345
2287B74345M41297J99308n72383J19269M9050l85355M51801q2682j7792k26086
$$ 274345 715642 914950 342567 461836 510886 125531 577332 494650 476858 250772
2277B50772l00186K29081P56073K46313p73111l58906L12815j69815K23337r2391
$$ 250772 -49414 179667 935740 1182053 408942 50036 362851 193036 416373 323982
2267C23982m849L08362k65569k91883o1223N9529k25013M43309K38884K00683
$$ 323982 319133 627495 361926 70043 8820 68349 -156664 286645 525529 726212
2257G26212j74623K81485k13582k62945Q9813L80231m25993p5478l55225J00757
$$ 726212 551589 833074 619492 356547 446360 826591 400598 325120 -30105 70652
2247G0652K6821K04666J82771P4062K0538m47287J54827L01911j1945j54790J61665
$$ 70652 97473 302139 484910 558972 579510 132223 287050 588961 577016 422226 583891
2236E83891K30984k3372R390J81303j42156Q2815K39191l38160k63755l67928
$$ 583891 814875 791503 800893 982196 840040 922855 1162046 823886 560131 192203
2226A92203O3001j8216K22575M41405j27795o2555o3283L04364K45805M12174
$$ 192203 255204 236988 459563 900968 773173 710618 647335 951699 1197504 1609678
2216A609678l60583k04519J10046Q7934j93213J23322l88805o1309K86843O0773
$$ 1609678 1249095 1044576 1154622 1242556 1049343 1172665 783860 722551 1009394 1070167
2206A070167J80235L70430o5675K09164n0462m18201k08000J7973K14946K8347
$$ 1070167 1250402 1620832 1555157 1764321 1713859 1295658 1087658 1105631 1320577 1348924
2196A348924l57824R7179j9420j10874Q1174L89798M64538M3935k35860j26473
$$ 1348924 991100 1088279 1068859 957985 1039159 1428957 1893495 1937430 1701570 1575097
2186A575097J46733L43024r4426k2858m8150k82153L42175L53078m02238N25529
$$ 1575097 1721830 2064854 1970428 1947570 1899420 1617267 1959442 2312520 1910282 2435811
2176B435811K88249j2963J90708J93849k60376m37918o7632L46276j67538J76171
$$ 2435811 2724060 2711097 2901805 3095654 2835278 2397360 2329728 2676004 2508466 2684637
2166B684637M64629L61843q1734M174j28940o7557k43371K86437P82042l84204
$$ 2684637 3149266 3511109 3429375 3433549 3304609 3237052 2993681 3280118 4062160 3677956
2156C677956k85848L93377M36025M13241J10370J68991j6992k2773M15536m06203
$$ 3677956 3392108 3785485 4221510 4634751 4745121 4914112 4897120 4874347 5289883 4883680
2146D883680N73352Q08963k28548L8051L69223L82280J89683M43442M52995J42641
$$ 4883680 5457032 6265995 6037447 6075498 6444721 6827001 7016684 7460126 7913121 8055762
2136H055762L33555L51152P11500L10168P95028P22134J112701O11647N09484
$$ 8055762 8389317 8740469 9451969 9762137 10557165 11279299 12392000 13003647 13513131
2127A3513131J516079J001957J002474J617052J823472J281022J640489J469106
$$ 13513131 15029210 16031167 17033641 18650693 20474165 21755187 23395676 24864782
2119B4864782J392139J909732K797470L749478M665705N258616O264839Q937096
$$ 24864782 26256921 28166653 30964123 34713601 39379306 44637922 50902761 59839857
2111E9839857J1590225J6060830J9847734K2071530K0868044J1723247j0298695
$$ 59839857 71430082 87490912 107338646 129410176 150278220 162001467 151702772
2104A51702772k4639234k4587743j8103177j2335722j0701217q832680o548118
$$ 151702772 127063538 102475795 84372618 72036896 61335679 52502999 45954881
2097D5954881n010941m113261k726925k267890k243978j875493j737962k228564
$$ 45954881 40943940 36830679 34103754 31835864 29591886 27716393 25978431 23749867
2089B3749867k014167j685088j763744j615352j539519q28422n08710r02617n20488
$$ 23749867 21735700 20050612 18286868 16671516 15131997 14303575 13794865 12892248 12371760
2080A2371760p77196n47791n51716l03276K323l39014k12315o25406n90702j45086
$$ 12371760 11594564 11046773 10495057 10191781 10194104 9855090 9642775 9017369 8426667 8281581
2070H281581j135n10998k67641k82851l75780M6184l67050q21572j68757j11662
$$ 8281581 8280446 7769448 7501807 7218956 6843176 6889360 6522310 5700738 5531981 5420319
2060E420319l68192J42389k90924k1144K1332m28555n8827J3394k24640m2003
$$ 5420319 5052127 5194516 4903592 4882448 4903780 4475225 4416398 4429792 4205152 4163149
2050D163149L8781l81474K98821q1296n11407n2605j01623J80252k42215j70485
$$ 4163149 4201930 3820456 4119277 4037981 3526574 3473969 3372346 3552598 3310383 3139898
2040C139898k72520L51391j93349m01490J69340m67502J70046k86659J02529L32087
$$ 3139898 2867378 3218769 3025420 2623930 2793270 2325768 2495814 2209155 2311684 2643771
2030B643771j94954k39022o5808k61738m2254L46306o05944J99439L29564r5280
$$ 2643771 2448817 2209795 2143987 1882249 1839995 2186301 1580357 1779796 2109360 2014080
2020B014080k68927J75434M8748J32808j23183p24517K66403K7927k13012J47756
$$ 2014080 1745153 1920587 1969335 2102143 1978960 1254443 1520846 1548773 1335761 1483517
2010A483517k9692r5668k648P2355K87294m76929m34637L2271r4649K57836j86544
$$ 1483517 1453825 1358157 1355509 1427864 1715158 1238229 803592 835863 741214 999050 812506
1999H12506k91812j08422K82338J91281k0805j15058J79816l9405j04874k06411
$$ 812506 520694 412272 694610 885891 865086 750028 929844 890439 785565 579154
1989E79154k62053j10209J26887M74062j91236j28912J45908j08851J53483n3074
$$ 579154 317101 206892 333779 807841 616605 487693 633601 524750 678233 625159
1979F25159j23913n5050K31434l4299L06536j71529o0206r1268j69803J46652
$$ 625159 501246 446196 677630 643331 949867 778338 718132 626864 457061 603713
1969F03713k0158j16935K09663j21691j24966N560m2191m5114n9988K96297J49477
$$ 603713 583555 466620 676283 554592 429626 435186 392995 347881 287893 584190 733667
1958G33667K3597L3088k23711m75830n9783J29554K2086L04832j00554k88707
$$ 733667 757264 790352 566641 90811 31028 160582 182668 487500 386946 98239
1948I8239M10494J33544j25452L32967j65905m54462K01697r3910J62212j94190
$$ 98239 508733 642277 516825 849792 683887 229425 431122 337212 499424 305234
1938C05234r5048J07554M34275L752k46530l6034M3146m22831k46796n8455J30885
$$ 305234 210186 317740 752015 755767 509237 473203 516349 93518 -153278 -211733 -80848
1927h0848O8108j11303M22386l08071M20417m0886m55152L9700J69739n27j52459
$$ -80848 -12740 -124043 298343 -9728 410689 369803 -85349 -45649 124090 123563 -28896
1916b8896J41492m16912O79718j41488j81289k33084j92229N41561l2429j8403
$$ -28896 112596 -304316 375402 233914 52625 -180459 -372688 168873 136444 118041
1906A18041J42712k30850K03953Q4529k04999M650n641N279j72767J08210q201
$$ 118041 260753 29903 233856 318385 113386 118036 112395 117674 -55093 53117 44916
1895D4916J37031J38167J47950N07835l22723k84638l7503j15745N2693n7645
$$ 44916 181947 320114 468064 975899 653176 368538 331035 215290 267983 210338
1885B10338J22246O6811k8299J8983k0281n63596n1394N4570K99103q1318j743
$$ 210338 332584 399395 371096 390079 369798 -193798 -245192 -190622 108481 27163 25420
1874B5420J4683j0473q63k76639Q1833j6371J64185k11778j67720J31956K46857
$$ 25420 40103 29630 28767 -247872 -166039 -182410 -18225 -230003 -397723 -265767 -18910
1863a8910j2095m22973J98595Q3367l57473j72L51155O13827j79585n3111j32040
$$ -18910 -31005 -453978 -255383 -172016 -529489 -529661 -178506 435321 255736 202625 70585
1852G0585k56572J0333m52466K23336L06521M63617M685l17248K37720M55875
$$ 70585 -185987 -175654 -628120 -404784 -98263 365354 370039 52791 290511 746386
1842G46386q0145q8119k76421L0226K76227L13813j50891r2836J16443o4325m30260
$$ 746386 666241 578122 301701 331927 608154 921967 771076 678240 794683 730358 300098
1831C00098k32867K50413q3619l03377L853L96341J33547L55501o00036m1096
$$ 300098 67231 317644 234025 -69352 -65499 330842 464389 819890 219854 178758
1821A78758J2101K8083K18725J4768J9756l38189K96870n8666m05524K03849J5989
$$ 178758 190859 218942 437667 452435 472191 134002 430872 372206 -33318 170531 186520
1810A86520n9553l80753J86060P1103M3078n85331J15745J93087r5421r970j96595
$$ 186520 126967 -253786 -67726 3377 46455 -538876 -423131 -230044 -325465 -335435 -532030
1799e32030O6538J32960J88214J52442l98509K68045M10719k5737k84358r6267
$$ -532030 -465492 -332532 -144318 8124 -390385 -122340 288379 262642 -21716 -117983
1789a17983J65117J30568L23945j0640k42264k82552J95912j05533K48389Q3615
$$ -117983 47134 177702 501647 491007 248743 -33809 162103 56570 304959 388574
1779C88574k95742j88313r6620J5428J40791J89954J49074k24799J50917R8090
$$ 388574 92832 -95481 -192101 -176673 -35882 154072 303146 78347 229264 327354
1769C27354r3727k47465m7217J71631L8826k48862M3400k83356J57349J30840
$$ 327354 233627 -13838 -61055 110576 149402 -99460 -56060 -339416 -182067 -51227
1759e1227P8275k1514j75710J60942O5956J89540m6586k64839Q3014J21982J18566
$$ -51227 27048 5534 -170176 -9234 56722 246262 199676 -65163 17851 139833 258399
1748B58399J84544p2496K6967m1403l12606K32147K18830k06871m35870o8472
$$ 258399 442943 370447 397414 356011 43405 275552 494382 287511 -148359 -216831
1738b16831M81369j83373j21244K46599k92614J51616k49504K03391R7530j64113
$$ -216831 264538 81165 -40079 206520 -86094 65522 -183982 19409 116939 -47174
1728d7174l22189L15859o0582n2663L27639k70995o4139L57444J35273k20114
$$ -47174 -369363 -53504 -114086 -166749 160890 -110105 -174244 183200 318473 98359
1718I8359j94685k28596M89073J25520k38837O5684j66361L2518L61940n1962
$$ 98359 -96326 -324922 164151 289671 50834 116518 -49843 -17325 344615 292653
1708B92653k74857J64949l50264k28956r7912N1684K25760Q9312J39847L8580
$$ 292653 17796 182745 -167519 -396475 -494387 -442703 -216943 -127631 12216 50796
1698E0796J9730l11961m6579L24628J11817n17740L26573K21940L3481j58272
$$ 50796 70526 -241435 -288014 36614 148431 -369309 -42736 179204 212685 54413
1688E4413J7839J41475l2365l92537o3564k23332L02629L30167k03809J79526
$$ 54413 72252 213727 181362 -211175 -274739 -498071 -195442 134725 -69084 110442
1678A10442k40447m04908J97802K72401o5612j09489J74397L7243k15076J30974
$$ 110442 -130005 -534913 -337111 -64710 -130322 -239811 -65414 -28171 -243247 -112273
1668a12273k9091k76461K08012j03392J70066m0479R9761K9169r316l7144n01999
$$ -112273 -141364 -417825 -209813 -313205 -143139 -183618 -83857 -54688 -64004 -101148 -603147
1657f03147k31857J94052K12239L76139l43457L45735p4256Q199n39932k2687
$$ -603147 -835004 -640952 -428713 -52574 -396031 -50296 -124552 -116353 -656285 -678972
1647f78972N30279J66754o4185j82265j01079P4492L20769l30455j26668N5642
$$ -678972 -148693 18061 -46124 -228389 -329468 -254976 65793 -264662 -391330 -335688
1637c35688n43556N50077L75303k95540L56044k21848M16724n8262j00119m04624
$$ -335688 -879244 -329167 46136 -249404 106640 -115208 301516 243254 143135 -261489
1627b61489j06059j4614k6489k04810L76932J16721q0507n039Q5202R7466q5400
$$ -261489 -367548 -382162 -408651 -613461 -236529 -119808 -200315 -205354 -120152 -22686 -108086
1616a08086j55941J25846J86836P0889j33191J34867Q8765j59970L61540K36718
$$ -108086 -264027 -138181 48655 119544 -13647 121220 209985 50015 411555 648273
1606F48273L27n57363m75071K31320O2091j55838q5120L94276J92339m26291L09584
$$ 648273 648600 91237 -383834 -152514 -90423 -246261 -331381 62895 255234 -171057 138527
1595A38527M42700p06018l15057M51947K28543p11237K53629p2675k4446M78183
$$ 138527 581227 -124791 -439848 12099 240642 -470595 -216966 -289641 -314087 164096
1585A64096l32558k19351r5760O0817J76559m6483L1271j1987K54364L4195P7737
$$ 164096 -168462 -387813 -483573 -422756 -246197 -292680 -261409 -273396 -19032 15163 92900
1574I2900l36150l04909J62431P5883O91570l33576k22824j2236m08272L25677
$$ 92900 -243250 -548159 -385728 -309845 381725 48149 -174675 -186911 -595183 -269506
1564b69506J05303j48935M2261N7137J99118k64537o4722L02642J98593K04977
$$ -269506 -164203 -313138 -270877 -213740 -14622 -279159 -343881 -41239 157354 362331
1554C62331m26182l6307l1693l74220K40260K02772n05331N4441J87671j5612
$$ 362331 -63851 -100158 -131851 -506071 -265811 -63039 -568370 -513929 -326258 -341870
1544c41870l9363r8976K24702l32104o8155L71961n2952J76219O98003j75191
$$ -341870 -381233 -480209 -255507 -587611 -655766 -283805 -336757 -160538 537465 362274
1534C62274m30396j78462J87428L08162k75603k91447K31640P8754J06787n58656
$$ 362274 -68122 -246584 -59156 249006 -26597 -318044 -86404 -7650 99137 -459519
1524d59519L74158l67961M32272N6212n0041j11541m8857Q2085j12972K87899
$$ -459519 -85361 -453322 -21050 35162 -14879 -126420 -175277 -93192 -206164 81735
1514H1735j08780m61000L5791K15435m10133M23719J49314j94044M14J49075j42892
$$ 81735 -27045 -488045 -452254 -236819 -646952 -223233 -73919 -267963 -267549 -118474 -261366
1503b61366J71018j25138Q3480p9989L50970P7136K60863l76583k30632J71551
$$ -261366 -90348 -215486 -132006 -211995 138975 216111 476974 100391 -130241 41310
1493D1310J53099j83797r4598k65070o3526J99866K52094j21739M4160K15709
$$ 41310 194409 10612 -83986 -349056 -412582 -212716 39378 -82361 -38201 177508
1483A77508j49273J65118l82689J65778l91947j49638J69953J30357J03775J94927
$$ 177508 28235 193353 -189336 -23558 -415505 -565143 -395190 -264833 -161058 33869
1473C3869O7547l32307M51948J99182j83601j80817q9925J50242l69623l44366
$$ 33869 101416 -230891 221057 420239 236638 55821 -34104 116138 -253485 -597851
1463e97851P3646O32852R5778k66790Q456R0041n9326O5996o4606J07438K37405
$$ -597851 -524205 108647 204425 -62365 -53909 36132 -23194 42802 -21804 85634 323039
1452C23039k00306k1508N1988M79740l04930j91777K40825j8306k07454m83250
$$ 323039 122733 101225 153213 632953 328023 136246 377071 358765 151311 -331939
1442c31939N7142J29354k5566O6287k23998j76358J00713j27619J32981K54625
$$ -331939 -274797 -145443 -171009 -104722 -328720 -505078 -404365 -531984 -399003 -144378
1432a44378j13905Q0345J6133O2862J75759j78522j51529R8019R8715j2881j74274
$$ -144378 -258283 -177938 -161805 -98943 76816 -101706 -253235 -155216 -56501 -69382 -243656
1421b43656m34290K95866K4705J84491K19679k7240l84666N5295K01545j52470
$$ -243656 -677946 -382080 -357375 -172884 46795 19555 -365111 -309816 -108271 -260741
1411b60741o3211K38531J63161J90618M3785m34353r4597j52765L65949j02162
$$ -260741 -323952 -85421 77740 268358 312143 -122210 -216807 -369572 -3623 -105785
1401a05785M6791K60080O3265l44452L7859P5240j36995J09406Q4526k54102j53814
$$ -105785 -58994 201086 264351 -80101 -42242 32998 -103997 5409 89935 -164167 -317981
1390c17981J61971J50315k24344L39320m1220j22482K62185j85617K67600p0148
$$ -317981 -156010 -5695 -230039 109281 68061 -54421 207764 22147 289747 219599
1380B19599J2952J52780O5411n88028l58244J68775K7895L33415P9971k08719
$$ 219599 232551 385331 450742 -137286 -495530 -326755 -298860 34555 114526 -94193
1370i4193K46692Q2506J24339m1628Q3436Q8326k65955j72181k54443J6269Q7801
$$ -94193 152499 235005 359344 317716 401152 489478 223523 51342 -203101 -186832 -99031
1359i9031N8744j83253L77449K87033j18692j01358Q9500L6874l71417m1194l01985
$$ -99031 -40287 -223540 153909 440942 322250 220892 310392 347266 -24151 -65345 -367330
1348c67330L5340J03687M22205l13859j56137J96550n2530k03169L81545N3161
$$ -367330 -331990 -228303 193902 -119957 -276094 -79544 -132074 -335243 46302 99463
1338I9463j95179M57223j08998o5581p9534m69147j70746L95536k9375J93273
$$ 99463 -95716 361507 252509 186928 107394 -361753 -532499 -136963 -166338 26935
1328B6935l68714j90550J92084J37385J27104j66950m11852N87M92906m0753j82587
$$ 26935 -341779 -532329 -340245 -202860 -75756 -242706 -654558 -653971 -161065 -201818 -384405
1317c84405l92712J78878M38398l04348o1591K31926K88611k54070J36015K4303
$$ -384405 -777117 -598239 -159841 -464189 -525780 -293854 -5243 -259313 -123298 -98995
1307i8995l6030L0289r2025l76969j69541J43425L62355l1029J50236k57680K23484
$$ -98995 -135025 -104736 -196761 -573730 -743271 -599846 -237491 -268520 -118284 -375964 -152480
1296a52480P55019l2411j54625l37426r0044q2041P788L8999J69578q6255J66265
$$ -152480 602539 570128 415503 78077 -11967 -94008 -86220 -47221 122357 36102 202367
1285B02367k63495q0696j60550r6278l9941l09014N02963J35483k81202J56612
$$ 202367 -61128 -141824 -302374 -398652 -438593 -747607 -244644 -109161 -390363 -233751
1275b33751O16158l83208o50610L82953L13542k28877N7467K34417J5613k56669
$$ -233751 382407 -801 -651411 -268458 45084 -183793 -126326 108091 123704 -132965
1265a32965k8796K02352k04799j71168K36453r2060K04425k43977j00015J74346
$$ -132965 -161761 40591 -164208 -335376 -98923 -190983 13442 -230535 -330550 -156204
1255a56204k20873K65834Q314M9642m94093J47368M40654J5630l20538J30000
$$ -156204 -377077 -111243 -102929 -53287 -547380 -400012 40642 56272 -264266 -134266
1245a34266j73243p2732r9536R5277l94336J29734O31526L76199J58458p1089
$$ -134266 -307509 -380241 -479777 -384500 -778836 -649102 -17576 358623 517081 445992
1235D45992l80663p07345L59587L76278j24978j14241L10785k63587j23278L34331
$$ 445992 65329 -642016 -282429 93849 -31129 -145370 165415 -98172 -221450 112881
1225A12881j33022j9678j63650j49941j4932M27425J24583M1205J46799n44193
$$ 112881 -20141 -39819 -203469 -353410 -368342 59083 183666 224871 371670 -172523
1215a72523k04706j67940L10684K64787J32061k18165J27905J25261j16821j01846
$$ -172523 -377229 -545169 -234485 30302 162363 -55802 72103 197364 80543 -21303
1205b1303k75734o1570M05690J40399k22649L76470l10096J8168l025l89707J9891
$$ -21303 -297037 -358607 47083 187482 -35167 341303 31207 49375 46350 -343357 -323466
1194c23466K08406J23040O7368r6389l68343N16600j06152K7665Q6196l54165
$$ -323466 -115060 7980 75348 -21041 -389384 127216 21064 48729 134925 -219240
1184b19240q4460O5551O5820n0350N3050K17553J01594p851J14533l4062j73056
$$ -219240 -303700 -238149 -172329 -222679 -169629 47924 149518 141667 256200 222138 49082
1173D9082o80342J65570K26244n1454K3912l79925K03052j55208K13604J51014
$$ 49082 -631260 -465690 -239446 -290900 -266988 -646913 -443861 -599069 -385465 -234451
1163b34451J9937J49780n857L47584r3020J55566K14541j12289l24498j80405
$$ -234451 -214514 -64734 -70591 276993 183973 339539 554080 441791 117293 -63112
1153f3112n7030L0398N3446j58562j10566M95823Q5371k99083J7012j17746N5229
$$ -63112 -120142 -89744 -36298 -194860 -305426 190397 275768 -23315 -6303 -124049 -68820
1142f8820j19366j26787J07199O1424J06420l5276l32916J88833Q41573L4296
$$ -68820 -188186 -314973 -207774 -146350 -39930 -75206 -408122 -219289 622284 656580
1132F56580l41241J27751j90074M1076n22586O5358k186J62146K30858J63552
$$ 656580 315339 443090 253016 294092 -228494 -163136 -165322 -3176 227682 391234
1122C91234j57672m9282j59397K37584m5505n02664j64215J24847K78241l68264
$$ 391234 233562 184280 24883 262467 216962 -285702 -449917 -325070 -46829 -415093
1112d15093j14460M60460K14555J28198J35579l57639o1339j70124O8607L3446
$$ -415093 -529553 -69093 145462 273660 409239 51600 -9739 -179863 -111256 -77810
1102g7810J16131L82266O2956l85481L3181m79711R1642J79755j8742J1474L22253
$$ -77810 38321 420587 483543 98062 131243 -348468 -256826 -77071 -95813 -84339 237914
1091B37914k924j58920K09986L20387k81070l758o18311K48621K52356O0797k09237
$$ 237914 234990 76070 286056 606443 325373 321615 -296696 -48075 204281 265078 55841
1080E5841j32370J14805l7773q5373l66915O22419n0730j616j92197J6967N06415
$$ 55841 -76529 38276 503 -84870 -451785 170634 119904 118288 -73909 -56942 449473
1069D49473m83475k88887K26717K53991K72370K58705j59779l38901j22659J84535
$$ 449473 -34002 -322889 -96172 157819 430189 688894 529115 190214 67555 252090
1059B52090J5979k59491j98384J04444K79985l5955m13543R5157J18422m0666
$$ 252090 268069 8578 -189806 -85362 194623 158668 -254875 -159718 -41296 -81962
1049h1962J13333J42475L48235m91445j61763J46172p7167j44534L59221j36589
$$ -81962 31371 173846 522081 30636 -131127 15045 -62122 -206656 152565 15976
1039A5976k81550M4634J52145N921n517L62173J35730l70065n00913n5706L21756
$$ 15976 -265574 -220940 -68795 -62874 -68391 293782 429512 59447 -441466 -497172 -175416
1028a75416j75253L27631j52793K20623O9179k14032J06850J59789k26152L36311
$$ -175416 -350669 -23038 -175831 44792 113971 -100061 6789 166578 -59574 276737
1018B76737k31618k74339m5071J63852K53947J14476m28479J35795j84459m33928
$$ 276737 45119 -229220 -274291 -110439 143508 257984 -170495 -34700 -219159 -653087
1008f53087N66224O6609m89543K93903L78694r1236j5325k05143j14590K23740
$$ -653087 -86863 -20254 -509797 -215894 162800 71564 56239 -148904 -263494 -39754
998c9754M86047k24320p0675J070K45300k38933r1325J24669J999l3125j13674
$$ -39754 446293 221973 151298 152368 397668 158735 67410 192079 194078 160953 47279
987D7279J49555O1072J84923n4722l0334l71636k72485L37494j52661J93139p5715
$$ 47279 196834 257906 442829 388107 357773 -13863 -286348 51146 -101515 91624 15909
976A5909K45455J71114l05749j10574J77913o4570k901l15901J16746j21244k05533
$$ 15909 261364 432478 126729 16155 194068 129498 126597 -189304 -72558 -193802 -399335
965c99335L42863J75191J90053l4156r7680O5279N3851J01457l06734j66565o2209
$$ -399335 -56472 118719 308772 274616 176936 242215 296066 397523 90789 -75776 -137985
954a37985J2657K36526J30057K0262k81304K04659L4525m31388L04005P8182l31045
$$ -137985 -125328 111198 241255 261517 -19787 184872 219397 -211991 92014 170196 -160849
943a60849K57558K80858k23861L72186j77229k75908m91984P2699K83979K56864
$$ -160849 96709 377567 153706 525892 348663 72755 -419229 -346530 -62551 194313
933A94313K34167l36670k54804L86273m4319k6118K0875j40844R7982K94736k38005
$$ 194313 428480 91810 -162994 223279 178960 152842 173717 32873 130855 425591 187586
922A87586k66205O0312j0701k00890j12293K84443M5366k50274k6173j0669N79381
$$ 187586 -78619 -18307 -29008 -229898 -342191 -57748 -12382 -262656 -288829 -299498 279883
911B79883K33893p913k05189m76899n1308k59881n98P6875P76046l99633m7332
$$ 279883 513776 505863 300674 -176225 -227533 -487414 -488012 -411137 364909 -34724 -82056
900h2056K3470j5340k4850J31567j50499K56927k53741J04781L98596k29660L403
$$ -82056 -58586 -73926 -98776 32791 -117708 139219 -114522 -9741 388855 159195 162598
889A62598k44482j18207k380p8237K82228k88314k67004k7951J63106N87793L7618
$$ 162598 -81884 -200091 -202471 -280708 1520 -286794 -553798 -581749 -418643 169150 206768
878B06768k15700n15910O36377J00983j89301J59170n05834J3844L11417k09597
$$ 206768 -8932 -524842 111535 212518 23217 182387 -323447 -309603 1814 -207783
868b07783k00862K40871k92199L51971L1216m4678k89926O5208r8920k72410N31733
$$ -207783 -408645 -167774 -459973 -108002 -76786 -121464 -411390 -346182 -445102 -717512 -185779
857a85779J21453Q5073L10898k80127j70839l7039R2014M57506l25110n3399m8720
$$ -185779 -64326 20747 331645 51518 -119321 -156360 -64346 393160 68050 14651 -34069
846c4069K71043j37874j47181O7088l5974K45728j19923N0600J38057K76956j59718
$$ -34069 236974 99100 -48081 19007 -16967 228761 108838 159438 297495 574451 414733
835D14733O8845O4865m76875M9810p0849j28342L52400k40030j91439k12016M09233
$$ 414733 483578 548443 71568 121378 50529 -77813 274587 34557 -156882 -368898 40335
824D0335K49443j82589m11432M33402K04600q6955p7256o3058j0579j95646L01595
$$ 40335 289778 107189 -304243 129159 333759 246804 169548 106490 95911 -99735 201860
813B01860L53774n02051J46753J62180L0284L5846l04583J18780j33126J05260
$$ 201860 555634 53583 200336 362516 392800 428646 124063 242843 109717 214977
803B14977j92875j80092m16779P12391J54478k35510J51679J68468l8823l38812
$$ 214977 22102 -157990 -574769 137622 292100 56590 208269 376737 337914 -898
793h98p3488O2534k06164P384j21901P9038j15191K68946R8746P5956j45608l0358
$$ -898 -74386 -11852 -218016 -210632 -332533 -253495 -368686 -99740 -994 74962 -70646 -101004
781a01004j38287K27517k252l83687l75015O82632O8238J10144Q1395R3713j64630
$$ -101004 -239291 -11774 -14026 -397713 -772728 -90096 -21858 88286 169681 263394 98764
770I8764K1004k93507P552j87694M17841J30765p24416L92332K08576j67617k76858
$$ 98764 119768 -173739 -166187 -353881 63960 194725 -529691 -137359 71217 -96400 -373258
759c73258Q9825J21683N352j82271J64350L9115L2375R7162L12385m11526r8017
$$ -373258 -283433 -161750 -156398 -338669 -174319 -135204 -102829 -5667 306718 -104808 -202825
748b02825j83931J15049l70323M27210O16993j56099o02392K91564P5980j04487
$$ -202825 -386756 -271707 -642030 -214820 402173 246074 -356318 -64754 11226 -93261
738i3261O3741r949K55262K4941j50013j10683K03567n8913o6507l09929m8836
$$ -93261 -29520 -39469 215793 240734 90721 -19962 183605 124692 58185 -251744 -300580
727c00580J35019J50392m5614l65079P8035M38523J28724J1530R2591k74710k37980
$$ -300580 -165561 -15169 -60783 -425862 -347827 90696 219420 230950 323541 48831 -189149
716a89149J68027J99799k8900l38350M00747L12709n69611J39719K21505j4952
$$ -189149 -21122 178677 149777 -188573 212174 524883 -44728 94991 316496 301544
706C01544l37498l2470M98290K58625k07068Q5488n20221l50336J33117J68854
$$ 301544 -35954 -68424 429866 688491 481423 566911 46690 -303646 -170529 -1675
696a675K67725L38672n31529k60655K27511o5016j74343k67175M4517J77965J94192
$$ -1675 266050 604722 73193 -187462 40049 -24967 -199310 -466485 -421968 -244003 -49811
685d9811n5103M5331j02293M9410j814J47070M24337k55449l46367J96485O7244
$$ -49811 -104914 -59583 -161876 -112466 -114280 32790 457127 201678 -144689 51796 119040
674A19040j88842K35814P6580j40123o3248J27141k06206j83179N0718L64801
$$ 119040 -69802 166012 242592 102469 39221 166362 -39844 -223023 -172305 192496
664A92496K14000q24947J21931J30544P1568J73o8540q7607n5049L4977J01466
$$ 192496 406496 -418451 -296520 -165976 -94408 -94235 -162775 -250382 -305431 -270454 -168988
653a68988K75354j86379K17363K720r6565k18847r2454K6868o1895K87136j67133
$$ -168988 106366 -80013 137350 140070 43505 -175342 -267796 -240928 -302823 -15687 -182820
$$ [...]
##END NTUPLES=NMR SPECTRUM
##END=
