##TITLE=1H_EC-3302(II-3)
 CDCl3
 8 sc, 
 27.10.2023
##JCAMPDX= 6.0         $$ Bruker NMR JCAMP-DX V2.0
##DATA TYPE= NMR SPECTRUM
##DATA CLASS= NTUPLES
##ORIGIN= UXNMR, Bruker Analytische Messtechnik GmbH
##OWNER= root
$$ XWIN-NMR		Version 3.5
$$ Fri Oct 27 15:29:27 2023 Russian Standard Time (UT+4h)  she@DPX200
##.OBSERVE FREQUENCY= 200.13135
##.OBSERVE NUCLEUS= ^1H
##.ACQUISITION MODE= SIMULTANEOUS
##.ACQUISITION SCHEME= undefined
##.AVERAGES= 8
##.DIGITISER RES= 18
##SPECTROMETER/DATA SYSTEM= spect
##.PULSE SEQUENCE= zg30
##.SOLVENT NAME= CDCl3
##.SHIFT REFERENCE= (INTERNAL, CDCl3, 0, 15.7601)
##AUDIT TRAIL= $$ (NUMBER, WHEN, WHO, WHERE, WHAT)
$$ ##TITLE= Audit trail, XWIN-NMR		Version 3.5
$$ ##JCAMPDX= 5.01
$$ ##ORIGIN= Bruker BioSpin GmbH
$$ ##OWNER= she
$$ F:/spectra/data/she/nmr/H-F/1/pdata/1/auditp.txt
$$ ##AUDIT TRAIL=  $$ (NUMBER, WHEN, WHO, WHERE, WHAT)
(   1,<2023-10-27 15:27:42.43 +0400>,<she>,<DPX200>,
      <created by zg, POWCHK disabled, PULCHK disabled
       configuration hash MD5:
       00 E9 B6 7A A2 85 ED C7 34 08 36 98 17 FE 4E 26
       data hash MD5: 16K
       F8 DC 84 8C FB 35 AD EB 88 15 33 5D 32 35 14 D7>)
(   2,<2023-10-27 15:27:44.75 +0400>,<she>,<DPX200>,
      <Start of raw data processing
       efp BC_mod = 2 LB = 0.24 FT_mod = 6 PKNL = 1 PHC0 = -23507.24 PHC1 = 10.65272 SI = 16K 
       data hash MD5: 16K
       E8 3B CF B0 F8 A5 C2 65 0A 6A 67 16 4D 4E 63 00>)
(   3,<2023-10-27 15:28:32.60 +0400>,<she>,<DPX200>,
      <pk PHC0 = -8.70892 PHC1 = 17 
       data hash MD5: 16K
       27 59 5D D3 C7 B2 14 9F CE 2C E9 D7 46 65 07 D9>)
(   4,<2023-10-27 15:28:36.06 +0400>,<she>,<DPX200>,
      <abs ABSG = 5 
       data hash MD5: 16K
       D3 A4 3B DB 7B 5A 0B CE AB 1B EE 14 F8 D8 6B 4E>)
$$ ##END=
$$ 
$$ hash MD5
$$ 9C 28 D0 B2 6F 81 24 32 02 E5 80 83 D2 B1 10 78
##$RELAX= 
##$RELAX= 
##$RELAX= 
##$RELAX= 
##$RELAX= 
##$RELAX= 
$$ Bruker specific parameters
$$ --------------------------
##$DU= <F:/spectra>
##$EXPNO= 1
##$NAME= <H-F>
##$PROCNO= 1
##$TYPE= <nmr>
##$USER= <she>
##$AMP= (0..31)
100 100 100 100 100 100 100 100 100 100 100 100 100 100 100 100 100 100 
100 100 100 100 100 100 100 100 100 100 100 100 100 100 
##$AQSEQ= 0
##$AQ_mod= 1
##$AUNM= <au_zg>
##$AUTOPOS= <>
##$BF1= 200.13
##$BF2= 200.13
##$BF3= 200.13
##$BF4= 200.13
##$BF5= 200.13
##$BF6= 200.13
##$BF7= 200.13
##$BF8= 200.13
##$BYTORDA= 1
##$CFDGTYP= 0
##$CFRGTYP= 5
##$CHEMSTR= <none>
##$CNST= (0..31)
1 1 145 1 1 1 1 1 1 1 1 1 1 1 1 1 1 1 1 1 1 1 1 1 1 1 1 1 1 1 1 1 
##$CPDPRG= <>
##$CPDPRG1= <>
##$CPDPRG2= <>
##$CPDPRG3= <>
##$CPDPRG4= <mlev>
##$CPDPRG5= <mlev>
##$CPDPRG6= <mlev>
##$CPDPRG7= <mlev>
##$CPDPRG8= <mlev>
##$CPDPRGB= <>
##$CPDPRGT= <>
##$D= (0..31)
0 1.2 0 0 0 0 0 0 0 0.06 0 0.03 0 0 0 0 0.0002 0 0 0 0 0 0 0 0 0 0 0 0 
0 0 0 
##$DATE= 1698406061
##$DBL= (0..7)
120 120 120 120 120 120 120 120 
##$DBP= (0..7)
150 150 150 150 150 150 150 150 
##$DBP07= 0
##$DBPNAM0= <>
##$DBPNAM1= <>
##$DBPNAM2= <>
##$DBPNAM3= <>
##$DBPNAM4= <>
$$ [...]
##$SUBNAM3= <"">
##$SUBNAM4= <"">
##$SUBNAM5= <"">
##$SUBNAM6= <"">
##$SUBNAM7= <"">
##$SUBNAM8= <"">
##$SUBNAM9= <"">
##$SW= 18.05172834244
##$SWIBOX= (0..15)
0 0 2 0 0 0 0 0 0 0 0 0 0 0 0 0 
##$SW_h= 3612.71676300578
##$TD= 16384
##$TD0= 1
##$TE= 0
##$TE2= 300
##$TE3= 300
##$TEG= 300
##$TL= (0..7)
0 120 120 120 120 120 120 120 
##$TP= (0..7)
150 150 150 150 150 150 150 150 
##$TP07= 0
##$TPNAME0= <>
##$TPNAME1= <>
##$TPNAME2= <>
##$TPNAME3= <>
##$TPNAME4= <>
##$TPNAME5= <>
##$TPNAME6= <>
##$TPNAME7= <>
##$TPOAL= (0..7)
0.5 0.5 0.5 0.5 0.5 0.5 0.5 0.5 
##$TPOFFS= (0..7)
0 0 0 0 0 0 0 0 
##$TUNHIN= 0
##$TUNHOUT= 0
##$TUNXOUT= 0
##$USERA1= <user>
##$USERA2= <user>
##$USERA3= <user>
##$USERA4= <user>
##$USERA5= <user>
##$V9= 5
##$VALIST= <valist>
##$VCLIST= <CCCCCCCCCCCCCCC>
##$VD= 0
##$VDLIST= <DDDDDDDDDDDDDDD>
##$VPLIST= <PPPPPPPPPPPPPPP>
##$VTLIST= <TTTTTTTTTTTTTTT>
##$WBST= 1024
##$WBSW= 4
##$XGAIN= (0..3)
0 0 0 0 
##$XL= 0
##$YL= 0
##$YMAX_a= 398702
##$YMIN_a= -520283
##$ZGOPTNS= <>
##$ZL1= 120
##$ZL2= 120
##$ZL3= 120
##$ZL4= 120
##$ABSF1= 15.73256
##$ABSF2= -2.319289
##$ABSG= 5
##$ABSL= 3
##$ALPHA= 0
##$AQORDER= 0
##$ASSFAC= 0
##$ASSFACI= 0
##$ASSFACX= 0
##$ASSWID= 0
##$AUNMP= <proc_1d>
##$AZFE= 0.1
##$AZFW= 0.1
##$BCFW= 0
##$BC_mod= 2
##$BYTORDP= 0
##$COROFFS= 0
##$CY= -3
##$DATMOD= 1
##$DC= 0
##$DFILT= <>
##$DTYPP= 0
##$F1P= 0
##$F2P= 0
##$FCOR= 1
##$FTSIZE= 16384
##$FT_mod= 6
##$GAMMA= 0
##$GB= 0
##$INTBC= 1
##$INTSCL= 3.70164e-10
##$ISEN= 128
##$LB= 0.24
##$LEV0= 0
##$LPBIN= 0
##$MAXI= 10000
##$MC2= 0
##$MEAN= 0
##$ME_mod= 0
##$MI= 1.114404
##$NCOEF= 0
##$NC_proc= -7
##$NLEV= 6
##$NOISF1= 3.799351
##$NOISF2= 2.8
##$NSP= 0
##$NTH_PI= 0
##$NZP= 0
##$OFFSET= 15.76011
##$PC= 1
##$PHC0= -23515.95
##$PHC1= 27.65272
##$PH_mod= 1
##$PKNL= yes
##$PPARMOD= 0
##$PSCAL= 0
##$PSIGN= 0
##$REVERSE= no
##$SF= 200.130002286296
##$SI= 16384
##$SIGF1= 3
##$SIGF2= 2
##$SINO= 5.538805
##$SIOLD= 16384
##$SREGLST= <1H.CDCl3>
##$SSB= 0
##$STSI= 16384
##$STSR= 0
##$SW_p= 3612.71676300578
##$SYMM= 0
##$S_DEV= 0
##$TDeff= 16384
##$TDoff= 0
##$TI= <>
##$TILT= no
##$TM1= 0
##$TM2= 0
##$TOPLEV= 0
##$USERP1= <user>
##$USERP2= <user>
##$USERP3= <user>
##$USERP4= <user>
##$USERP5= <user>
##$WDW= 1
##$XDIM= 16384
##$YMAX_p= 432149963
##$YMIN_p= -2332270
$$ End of Bruker specific parameters
$$ ---------------------------------
##NTUPLES= NMR SPECTRUM
##VAR_NAME=  FREQUENCY,     SPECTRUM/REAL,   SPECTRUM/IMAG
##SYMBOL=    X,             R,               I
##VAR_TYPE=  INDEPENDENT,   DEPENDENT,       DEPENDENT
##VAR_FORM=  AFFN,          ASDF,            ASDF
##VAR_DIM=   16384,         16384,           16384
##UNITS=     HZ,            ARBITRARY UNITS, ARBITRARY UNITS
##FACTOR=    0.220516191357247, 1,           1
##FIRST=     3154.07083060511, 0,            0
##LAST=      -458.645932400674, 0,           0
##MIN=       -458.645932400674, -2332270,    0
##MAX=       3154.07083060511, 432149963,    0
$$ Real data points
##PAGE= N=1
##DATA TABLE= (X++(R..R)), XYDATA
$$ [...]
11592e89181O27759K11159o01337k25116N06154k94037J15017k55006J65672R7637
11582b41279l5832m94431n44793Q34810q91141k2196J197114Q74323m75746L00232
11572E01061Q44360n30723j146240l47551L08744O77878N22911J11735j2928m13776
11562E15471o8541q74321N16263J145044n24273r49758n64852O28990O25684N28095
11552I77802p82260k06812N7749m07702q7489M00104J319648n34215j013379l43378
11542f19932m2122l48661J6181Q57026M0666M8373J77150n32389K89575P21555
11532F07422O32661n37029m36106o92996M09369J28148n4459j4957K21672K30751
11522D94476J83687j88693q43739P0424j72031o41921m58206J099547j2303J70514
$$ plain form
11592 -589181 38578 249737 -351600 -576716 -70562 -364599 -249582 -504588 -338916 -241279
11582 -241279 -277111 -771542 -1316335 -481525 -1372666 -1394862 -197748 676575 200829 501061
11572 501061 1345421 814698 -331542 -679093 -370349 307529 830440 942175 929247 515471
11562 515471 446930 -427391 88872 1233916 709643 -240115 -804967 -175977 449707 977802
11552 977802 195542 -11270 46479 -361223 -448712 -48608 1271040 736825 -276554 -619932
11542 -619932 -662054 -1010715 -994534 -137508 -96842 -48469 128681 -403708 -114133 607422
11532 607422 1240083 703054 266948 -426048 -16679 111469 57010 42053 263725 494476
11522 494476 678163 489470 -354269 -283845 -455876 -1097797 -1556003 -456456 -468759 -298245
11512b98245q16991o71892J038943L05238J025795m24212O8389J33442l67701
11503g234L7510j99127P41373M6553j064175k18728O97857k52421J52961P62031
11493F96600J3137j501081q63247J019566L85835K18594R02338P2865m71386M22909
11483H96130K84121k73877K3805l95102K94498n10190k42563N01950n04857j80612
11473a06697M21046k95591n26337j38977J174226q66067N40749J34104p89140
11464d52684N38757N99142l09856M39693M6258m9270J5576j55322k1422o12433
11454C8439J43308L11524l42817j04623M36411n58641k13450L11926j8075n44497
11444e40495N62774m26363m59066J03738J10910N30049K89762q55657L07480M74971
$$ plain form
11512 -298245 -1115236 -1787128 -748185 -442947 582848 158636 227025 360467 -7234
11503 -7234 30276 -168851 572522 619075 -445100 -663828 34029 -218392 -65431 696600
11493 696600 709737 -791344 -1654591 -635025 -249190 -30596 871742 944607 473221 896130
11483 896130 1180251 906374 930179 535077 829575 319385 76822 578772 73915 -106697
11473 -106697 314349 18758 -507579 -646556 527670 -338397 202352 336456 -452684
11464 -452684 86073 685215 375359 815052 861310 812040 827616 672294 650872 38439
11454 38439 181747 493271 150454 45831 482242 -76399 -289849 22077 4002 -540495
11444 -540495 22279 -404084 -863150 -759412 -648502 -118453 171309 -684348 -376868 98103
11434I8103L66747K0280o47020L94703L7148j82144K1681k59236l3238K74655
11424I1679k35197m28643M40867P61492p62906p14739N57958m67003m09623N70392
11414e95723l56442O10037p0229M94957M60175n00775m83984l5980k10751r18942
11404a607657J80190P81925Q66742r0158O2430r587P02077k12953J97417k82649
11394E87777k05546O44123m16202n64762l4712j7621n8432k05115K90606j74226
11384a54110k89486k75179L40970O92239p94633j60333L55523J58331j07072l56074
11374e89824J50189j93289J89671N27795l98386r60852l5249l77150J71573L50168
11364a165354N96227J86387M49065M75705j11625r32575M64604M83939k1613j05290
$$ plain form
11434 98103 464850 485130 -161890 232813 269961 87817 109498 -149738 -182976 91679
11424 91679 -143518 -572161 -131294 630198 -132708 -847447 -289489 -756492 -1166115 -595723
11414 -595723 -952165 -342128 -412357 82600 542775 42000 -441984 -477964 -688715 -1607657
11404 -1607657 -1427467 -645542 221200 131042 193472 183885 885962 673009 870426 587777
11394 587777 382231 1026354 610152 45390 10678 -6943 -65375 -270490 20116 -154110
11384 -154110 -443596 -718775 -377805 314434 -480199 -640532 -285009 -126678 -233750 -589824
11374 -589824 -439635 -632924 -443253 84542 -313844 -1274696 -1309945 -1687095 -1515522 -1165354
11364 -1165354 -569127 -382740 66325 542030 430405 -502170 -37566 446373 424760 319470
11354C19470q70147L47857K07566q01193k56011Q91739j004520o0088N85303k88281
11344i28305K84517O07486j51084o25715N86298N18325K32343J38486r16036K83649
11334B9964q8758N38722l44041o53912J36661K37835k54158n67894J039139k36348
11324a62790k27176K68484o05835j22511M18569n3527k01028O89314K87269J04936
11314C95705p84113K66282K42463q92237j29485P98953L83035j239193j07740
11305a066330O47868m19832L65097j06054n09704J174619O82837J0843J7334n62816
11295B33862n8495p57440l7375J52707O74924k68814l43052O7017L91139L84389
11285D38862M88304j107130o76737O51255j55057K4432j33317k40118j01671J36329
$$ plain form
11354 319470 -550677 -202820 4746 -796447 -1052458 -160719 -1165239 -1225327 -640024 -928305
11344 -928305 -643788 -36302 -187386 -813101 -226803 291522 523865 662351 -253685 29964
11334 29964 -58794 479928 135887 -518025 -381364 -143529 -397687 -965581 73558 -162790
11324 -162790 -389966 -121482 -727317 -849828 -431259 -484786 -685814 3500 290769 395705
11314 395705 -388408 -122126 120337 -771900 -901385 -102432 280603 -958590 -1066330
11305 -1066330 -418462 -838294 -473197 -579251 -1088955 85664 768501 779344 796678 233862
11295 233862 175367 -582073 -619448 -466741 208183 -60631 -403683 -336666 54473 438862
11285 438862 927166 -179964 -856701 -205446 -360503 -336071 -469388 -709506 -811177 -674848
11275f74848J47418M20192L43722N3294k95500M55802l34214l61159l97016k6651
11265f68960J24683K01997O44719O34141K4395o56075m75566n0626j43832l69269
11255g34393p30700p8748J197298O26429l53280K81837Q4764m60324j40727j63092
11245d70936k87210N71967n59423M50778L08677J64126k01018l82628J16212m74461
11235g63916N31397O77236m00406L71762m32493O45064J68726j508766J18600
11226e92796J227053r22412J56595N2275l78461l75478J437093M76665o24960
11217D55574Q2227j65776Q77244o30573k8039j946175P42117Q74024L02841n93034
11207b9570j43093M5393j91324L16477M16271l2456N78313k57091L6358O0622
$$ plain form
11275 -674848 -527430 -107238 236484 289778 -5722 450080 115866 -245293 -642309 -668960
11265 -668960 -544277 -342280 302439 936580 960975 304900 -170666 -221292 -365124 -734393
11255 -734393 -1465093 -1543841 -346543 279886 -73394 208443 293207 -167117 -307844 -470936
11245 -470936 -758146 -186179 -745602 -294824 13853 177979 -23039 -405667 -289455 -763916
11235 -763916 -232519 444717 44311 416073 -16420 628644 797370 -711396 -592796
11226 -592796 634257 -288155 -131560 -79285 -457746 -833224 603869 1080534 455574
11217 455574 537801 372025 1249269 618696 590657 -1355518 -613401 260623 563464 -29570
11207 -29570 -172663 -127270 -318594 -2117 414154 381698 960011 702920 739278 799900
11197G99900m79161M76396n18844m34711J9946n56621j2191K40804k14817L78590
11187c00709l9871Q61738j40543L74724K77429n19425L7249N95039q80284k6832
11177B38515R45232J38164n01364o80059l9668k60535Q09218J79857q28929K45900
11167B46331p72294N37749N98004l53462K3849J46642J31955q64848O95840L74001
11157G63767k25776k58382M08542J11221o24018n42991r91488J2948Q96470O00837
11147A51130O9462l51853j32044J13455Q8410N37506o39988K48849J63296p64110
11137e15887N77679Q05169L0120o67472K20081P4170l93634J37239K7020j475454
11127a180969L81983J345186K22036p11563p83304J37897M47173L90472j78815
$$ plain form
11197 799900 320739 797135 278291 -156420 -136474 -693095 -705286 -464482 -679299 -300709
11187 -300709 -340580 521158 380615 755339 1032768 513343 550592 1145631 265347 238515
11177 238515 1183747 1321911 820547 140488 100820 -159715 649503 829360 431 246331
11167 246331 -525963 11786 609790 256328 280177 426819 558774 -306074 389766 763767
11157 763767 537991 279609 688151 799372 175354 -367637 -1359125 -1346177 -449707 151130
11147 151130 220592 -131261 -263305 -149850 -61440 476066 -163922 84927 248223 -515887
11137 -515887 61792 866961 897081 229609 449690 523860 130226 267465 294485 -1180969
11127 -1180969 -798986 546200 768236 56673 -726631 -588734 -141561 248911 70096
11118G0096q74721L19780J80379K97340k95424K94811m8159J13779k95720n59224
11108g97063Q10909P02445J07743p38715l8270K95911M57273r17438l01088m28635
11098h46928J6804J049171n9346o13244K95740n1415k15006J76238L15406j41422
11088g4002L26386p27922M03451M51079q21038K0668p7868J004347o22790l0294
11078a47983O69567M57083j023711n59630Q44140n49821N2237L18653J56261J22194
11068C38990P14860n97546o23132K50860k7940m47566n6850O72261P8308j89773
11058A12472k96922K82574p41324o84631M21795M76407j25106M41956m52015k71869
11048h36663M30539L71002Q67104o20790r7740J10074j83604k64910M86420m7408
$$ plain form
11118 70096 -804625 -484845 -304466 -7126 -302550 -7739 -55898 57881 -237839 -797063
11108 -797063 13846 716291 824034 85319 47049 342960 800233 -117205 -418293 -846928
11098 -846928 -830124 219047 159701 -453543 -157803 -209218 -424224 -247986 67420 -74002
11088 -74002 252384 -475538 -72087 378992 -442046 -421378 -499246 505101 -117689 -147983
11078 -147983 521584 978667 -45044 -604674 239466 -310355 -258118 60535 216796 338990
11068 338990 1053850 456304 -166828 84032 56092 -391474 -448324 223937 302245 112472
11058 112472 -184450 98124 -643200 -1327831 -906036 -429629 -554735 -112779 -564794 -836663
11048 -836663 -406124 -35122 831982 211192 113452 223526 39922 -224988 261432 214024
11038B14024l29490j02730m14130r39545L18322Q04701N59945M53886j34850k23898
11028B06235J062750n01078k56002p53999k14340M33193J99103m8371l75568M52635
11018B04558m8398q53356n26665N36546N26981M00189n38609J5547P03682N54761
11008I75236k49944o77459j57522N95279L34055J38455k66361j64221J9908O42033
10998A189459q21122o96433N40309o34275j73058R9299o65941M67591J91225M09860
10988i3086p15880M46145L66191L42544O68738l47970l79989m1142N91488j157104
10978c20065n11130K65797j70604M7946O34480M60453P6394j33794m28690L93419
10968C14206o50465k46644J179488k1483n17381N6289J05083q0998K4645o56566
$$ plain form
11038 214024 -115466 -218196 -632326 -1571871 -1253549 -448848 111097 564983 430133 206235
11028 206235 1268985 767907 511905 -242094 -456434 -23241 175862 127491 -248077 204558
11018 204558 156160 -697196 -1223861 -687315 -160334 239855 -298754 -283207 420475 975236
11008 975236 725292 47833 -109689 485590 819645 958100 691739 527518 547426 1189459
10998 1189459 368337 -328096 212213 -422062 -595120 -495821 -1161762 -694171 -502946 -93086
10988 -93086 -808966 -362821 3370 345914 1014652 666682 286693 245551 837039 -320065
10978 -320065 -831195 -565398 -736002 -688056 -53576 406877 483271 349477 -79213 314206
10968 314206 -336259 -582903 596585 575102 57721 114010 219093 138095 162740 -493826
10958d93826L05391n3076J291828J05798p7366l99422j68558j91262n79248Q26594
10948E66853l68283k20963m34537N77433j47399N83435q24073K93381P28183L5612
10938G89642o81915p04113j92580L04439L96399M21737O9696O34409j85892p2397
10928G79425n28599n48428k03300q18927J029953J75471P62591n60225K03805
10919B91766m35613O1890K52061l00769K44320k28629N86377o77286J568770M8595
10909A411482o44731l52375l05836O17049l35670k46708p3993P3463J25280J30905
10899C98866K30087o40310p72258L73543P13906N81277K8523O40941r78450j18843
10889D57282o93267k50287M0008N01809p3790J25454M06504L51350j98579l02393
$$ plain form
10958 -493826 -188435 -241511 1050317 1156115 1078749 679327 510769 319507 -259741 566853
10948 566853 198570 -22393 -456930 120503 -26896 556539 -267534 25847 754030 789642
10938 789642 107727 -596386 -788966 -484527 -88128 333609 403305 1037714 851822 779425
10928 779425 250826 -297602 -500902 -1319829 -289876 -114405 648186 87961 291766
10919 291766 -143847 -81957 170104 -130665 113655 -114974 471403 -205883 1362887 1411482
10909 1411482 766751 414376 108540 725589 389919 143211 69218 142681 267961 398866
10899 398866 628953 -11357 -783615 -410072 303834 885111 913634 1554575 576125 457282
10889 457282 -235985 -486272 -446264 55545 -18245 107209 513713 865063 666484 364091
10879C64091l89686M19565n23738m12648J00498m03867l84292O29371J42682K04700
10869b53324j31529K01565M83821m53008O23656l76362n28131N32976N98155m62879
10859B34940J23764N0208p16943l35672N73542l39128J12680J164310P8986o63173
10849B83514n66406J90110L76053Q29649j1622q71660O4292K01151p45651l57718
10839f08288L47933n08127j6543N46751M17814j714735N19742O3751j53954P42678
10829c62978O77659N38394n37740J13253l75403m5312J48812l73898J021773j2459
10819G92101l16796K69825J12569m45507O60464q1017n53984r41974L9608k70318
10809g35029l06494J181236M02927M38221K0507m42611q56565M53069j95331J34768
$$ plain form
10879 364091 -25595 393970 -129768 -542416 -441918 -845785 -1230077 -600706 -458024 -253324
10869 -253324 -384853 -183288 300533 -152475 471181 94819 -433312 99664 697819 234940
10859 234940 358704 408912 -308031 -643703 -70161 -409289 -296609 867701 946687 283514
10849 283514 -282892 -92782 283271 1112920 1101298 229638 293930 495081 -250570 -608288
10839 -608288 -260355 -768482 -785025 -238274 179540 -1535195 -1015453 -951702 -1105656 -362978
10829 -362978 314681 853075 315335 428588 53185 7873 156685 -217213 804560 792101
10819 792101 475305 745130 857699 412192 1072656 991639 437655 -504319 -464711 -735029
10809 -735029 -1041523 139713 542640 980861 1001368 558757 -297808 155261 -40070 94698
10799I4698L23554R25305n32622k4333o76142L1991J99869r12N80720K94427K93324
10788A509879n15149K81776n76083M0760K84527P06014l95372o038R2337m02048
10778A020603J92280L83822o00656p64745p37702M04296M12791l43344N6241j18769
10768i5183P71554J494527m40374p50481L41611m31312m11167K59824J06932K29297
10758A075228J40581l93799n81273m72961J014157L73520m16314Q00175m3219
10749A496095l74621l80192l53400P77316n13000P92195k12776l2902N98781K99876
10739B097372m35922j479507m12067J444941Q01386J9435m15001Q9840K09681
10730A920158o00791K42023k97664J55984M35632k46835O68798j42348p068J57153
$$ plain form
10799 94698 418252 1343557 810935 786602 110460 142451 342320 341408 922128 1216555 1509879
10788 1509879 994730 1276506 700423 741183 1025710 1731724 1336352 1330314 1422651 1020603
10778 1020603 1212883 1596705 996049 231304 -506398 -102102 310689 -32655 23586 -95183
10768 -95183 676371 2170898 1730524 980043 1321654 890342 479175 738999 845931 1075228
10758 1075228 1215809 822010 240737 -232224 781933 1155453 739139 1539314 1496095
10749 1496095 1121474 741282 387882 1165198 652198 1444393 1231617 1198715 1797496 2097372
10739 2097372 1661450 181943 -230124 1214817 2016203 2035638 1620637 1710477 1920158
10730 1920158 1319367 1561390 1263726 1419710 1855342 1608507 2277305 2134957 2127889 2285042
10720B285042l62720R25231j09899n22458r6461L82966j22894m7128L11907J14866
10710B758452j85039J05254J96486M84821K75031L81130J69136N22672r47173
10701C760770J11279O03391j15577k62571O91145M47806m73992Q31510N47328
10692F141089L10487k28805L17975j12500O20362r357j23154J00579K24026P23097
10682G963799J83846j41126k1788j03924J22294k12033j22832q33866L38222J01540
10672G274132K24097R5756j443040j88279R39412j19817n01766O36589J07118
10663G024202m86627k34543j22689j183300k44957O95169o29163O52490P44492
10654F215074K60644p83644r003J216296j58654o23451n22874j08375K57518m74066
$$ plain form
10720 2285042 1922322 2847553 2737654 2215196 2118735 2501701 2378807 2331679 2643586 2758452
10710 2758452 2573413 2678667 2875153 3359974 3635005 4016135 4185271 4707943 3760770
10701 3760770 3872049 4475440 4359863 4097292 4788437 5236243 4762251 5593761 6141089
10692 6141089 6451576 6222771 6540746 6428246 7048608 7039251 6916097 7016676 7240702 7963799
10682 7963799 8147645 8006519 7984731 7880807 8003101 7791068 7668236 6834370 7172592 7274132
10672 7274132 7498229 7593985 6150945 5962666 6902078 6782261 6280495 6917084 7024202
10663 7024202 6537575 6303032 6180343 4997043 4752086 5447255 4818092 5470582 6215074
10654 6215074 6475718 5692074 5683071 6899367 6740713 6117262 5594388 5486013 5743531 5269465
10644E269465j255251l28843J98365N63830J08454J39562n30874j25507q65836
10635C173365K9921R55200O2043p67775j085760L89185L62063J51334l85727r01598
10625A982251J73447l4138N79196Q43585k02519p97096m09633m7228J92967j150144
10615A130688Q30358J1498o11914k08901r935Q14959l30584k35650l59768M88081
10605A518832j7505m84765p06656R1799K55092l00386o02814n51913O67079K57724
10595A26487K5004p16175k30560R90744K23136R0980k49875L804L80561L54385
10585I98491k98871J89986Q39360J49506r44821j262868n74782N36266K47889
10576a19844k81785P19894J014706j21943j61710n95370j59930J2705J06229M19885
$$ plain form
10644 5269465 4014214 3685371 3883736 4447566 4556020 4695582 4164708 4039201 3173365
10635 3173365 3203286 4158486 4220529 3452754 2366994 2756179 3118242 3269576 2883849 1982251
10625 1982251 2155698 2121560 2700756 3544341 3341822 2544726 2135093 2087865 2280832 1130688
10615 1130688 1961046 1972544 1360630 1151729 1141794 1956753 1626169 1390519 1030751 1518832
10605 1518832 1501327 1016562 309906 401705 656797 356411 -246403 -798316 -131237 126487
10595 126487 151491 -564684 -795244 195500 418636 509616 259741 263545 644106 998491
10585 998491 699620 889606 1728966 1878472 933651 -329217 -903999 -367733 -119844
10576 -119844 -401629 318265 1332971 1211028 1049318 453948 294018 306723 412952 832837
10566H32837o26617J24073L85406l39113n60427j42512K9173M9451K00823N53490
10556E06584k98989M8413J94644j090119J69589K05641M38459p12326p58706M13251
10546h83559J090252k3122j94603P69279J4283m45232j1708Q3119o47476O0239
10536a88528J03202n11004N1436J390948l98223o99036J54705K30868O4796k85398
10526h6234J80490L17714m15560k36766l30701j40455M70446O64482L51313l72711
10516D02018k3484j44867Q99988K1707o18711K551N71203M2962p69931l84149
10506g13K97891q9888j08394j038426O49326J206067k25779r90635n83037J110855
10496B27267L8798n71659J43229O73392k98037J20164L21011o95427l64648K20771
$$ plain form
10566 832837 206220 330293 715699 376586 -183841 -326353 -297180 -247729 -46906 506584
10556 506584 207595 256008 450652 -639467 -469878 -264237 174222 -538104 -1296810 -883559
10546 -883559 206693 183571 -11032 758247 772530 327298 315590 398709 -248767 -188528
10536 -188528 -85326 -596330 -544894 846054 447831 -251205 -96500 134368 199164 -86234
10526 -86234 94256 411970 -3590 -240356 -571057 -711512 -241066 423416 774729 402018
10516 402018 378534 233667 1133655 1155362 536651 539202 1110405 1153367 383436 -713
10506 -713 297178 207290 98896 -939530 -290204 915863 690084 -300551 -883588 227267
10496 227267 266065 -305594 -162365 511027 212990 333154 654165 -41262 -405910 -185139
10486a85139k94999k1586l21998J50198l00337l11408J011714R8201j135961k15589
10476a526904R703N32784M19784L23094M93267L30004N7973n33185L27609k67778
10466A66351r8959o75614L5852L91386N75236o09470J6448n50986j26450N13200
10456c63006Q04097N4131p94198P65026k28522n33243r47307L57610Q73738n43273
10446e54947o18698N93249J070735N02604j225631J93446L72785R58863q25902
10437D66504J06682L20803k808q90150o6306R8284r20786m55031k25730Q34478
10427g34060J40470K68665J172681K67903k16874r04789L85922n02107L8036m22414
10417e06567n24454k15621N37233J047462j46903L46131j170652L60834j30622
$$ plain form
10486 -185139 -480138 -501724 -823722 -673524 -973861 -1285269 -273555 -175354 -1311315 -1526904
10476 -1526904 -1517201 -984417 -564633 -241539 251728 581732 639705 106520 434129 166351
10466 166351 67392 -608222 -572370 -180984 394252 -215218 -198770 -749756 -876206 -363006
10456 -363006 441091 495222 -298976 466050 237528 -295715 -1243022 -885412 -11674 -554947
10446 -554947 -1173645 -580396 490339 992943 -232688 -39242 333543 1292406 466504
10437 466504 573186 893989 891181 1031 -65275 33009 -887777 -1342808 -1568538 -734060
10427 -734060 -593590 -324925 847756 1115659 898785 -6004 379918 -122189 -84153 -506567
10417 -506567 -1031021 -1246642 -709409 338053 191150 537281 -633371 -272537 -403159
10408d03159O0990N509L8619j86854n5492l37730R9508j75926J69650K09313m9979
10397f25551R16394L78554o40788J68970J68503m50094r71037N57521L71180l86474
10387e12822j45778M73712r8511p29142o19644l28549J491N15610J122535J128949
10377H07851M73272m15769l54156O15949j52556O5079p01504p04729m61981j28726
10367i57270J28741L0487K37462k44860N2691K60175M68318M5205o96402l34427
10357a009880O10066j78669L20694m099k06279j29218L37568J49270r03153K55400
10347g58300K1483L86215L67175j86014j74560j73389J74149j36595o36991M36383
10337f80444Q54848K27934k07526N7768Q7441j37704K94543j177356L13210K92440
$$ plain form
10408 -403159 -342169 -336660 -298041 -484895 -540387 -878117 -778609 -954535 -784885 -575572 -625551
10397 -625551 290843 669397 28609 197579 366082 -84012 -1055049 -497528 -126348 -512822
10387 -512822 -658600 -184888 -283399 -1012541 -1632185 -1960734 -1959243 -1443633 -321098 807851
10377 807851 1281123 865354 511198 1127147 974591 1039670 338166 -366563 -828544 -957270
10367 -957270 -828529 -798042 -560580 -805440 -752749 -492574 -24256 20949 -675453 -1009880
10357 -1009880 -399814 -578483 -257789 -261888 -468167 -597385 -259817 -110547 -1013700 -758300
10347 -758300 -736817 -350602 16573 -169441 -344001 -517390 -343241 -479836 -1116827 -680444
10337 -680444 174404 402338 194812 252580 340021 202317 496860 -680496 -367286 -74846
10327g4846l84854R8361K98785o1737K76815J85386l41132j165804M53876K87977
10317d27173m62096J38914L95611m71666q82812J0964K80458l21466J24400R38930
10307f75936L60356J20779N38080J93197k66629K84944o25840N12407j43164r81753
10297f83559n6438K70055M21673m37472J15631J13564q75554l92543O87010M38184
10287c99449m65814K93602M74118M39536o46580j14872j05471L39065J27288m29911
10277d88488R6445l28037K59799j92404o67295Q68224R63724o88851N4968R53395
10267H31480j32533j212773k03242R85667J20820j342388K64278R50526k57551
10258D284j027068R32457p95113k73850K38761m08599q5098K38519P32984o05763
$$ plain form
10327 -74846 -459700 -361339 -62554 -124291 152524 337910 -3222 -1169026 -715150 -427173
10317 -427173 -889269 -750355 -354744 -826410 -1709222 -1698258 -1417800 -1739266 -1614866 -675936
10307 -675936 -315580 -194801 343279 536476 269847 554791 -71049 441358 298194 -683559
10297 -683559 -739997 -469942 -48269 -485741 -370110 -256546 -1132100 -1524643 -837633 -399449
10287 -399449 -865263 -571661 -97543 341993 -304587 -419459 -524930 -185865 -58577 -488488
10277 -488488 -392043 -720080 -460281 -652685 -1319980 -451756 511968 -176883 -121915 831480
10267 831480 698947 -513826 -717068 268599 389419 -952969 -688691 261835 4284
10258 4284 -1022784 -90327 -885440 -1159290 -920529 -1329128 -1414226 -1175707 -442723 -1048486
10248a048486n00543Q31882P13747J86473n73797j22813N97398p18190j65607
10239g99936M70829K26176O4581n84657m90031L16757Q33381J25315p28056j76739
10229g42380R45368K56983K35597r33825k73415P20659p69353P07103q8675m97644
10219d39582Q0792O31800p59284K15923P51334N62825j557029k22023K65214J011617
10209E41587J83078m76548k65467m47802j29841P7390M63021j92346o09374l77395
10199a233697R33389P35125n38027q02766L15016l57598k09723J12200R98168
10190d7913M10966p9252j138786l00670K65510J70813k94497M82761J044086k13347
10180B99671n48212n87006M15989Q0830N30820K04158j184135k01734K70373j8818
$$ plain form
10248 -1048486 -1549029 -717147 -3400 183073 -390724 -513537 83861 -634329 -799936
10239 -799936 -329107 -102931 -38350 -623007 -1113038 -796281 37100 162415 -565641 -742380
10229 -742380 202988 459971 695568 -238257 -511672 208987 -560366 146737 58062 -439582
10219 -439582 -358790 273010 -486274 -270351 480983 1043808 -513221 -735244 -470030 541587
10209 541587 724665 248117 -17350 -465152 -594993 -517603 -54582 -246928 -856302 -1233697
10199 -1233697 -300308 434817 -103210 -905976 -590960 -948558 -1158281 -1046081 -47913
10190 -47913 363053 283801 -854985 -1155655 -890145 -719332 -1013829 -531068 513018 299671
10180 299671 -248541 -835547 -419558 -338728 192092 396250 -787885 -989619 -719246 -738064
10170g38064M32897J55532j88883m61120J89220P71787J98423n0330m28170O562
10160a12146J89337N35120j80309q69684N96375J82657n02437p87549j14050L7828
10150a024858L90118k90350K89428j14408o9620K3953l87814K88499k206L99463
10140d97795N22511K64572n99283J05725L74166P4364o67650J84368O35276J22511
10130E18765j526127j28675O66757M99537k05394j095954j18148Q91873Q70224
10121C72858r72824n1153K87058O1501p2640M3246q13403k52178L52326N20874
10111e24335M94365p52601N44493R61823j29678j10243k14232p33866m83186p32197
10101a679657O44136J21153J02770j17283Q15893M3888L9890q22775N20055K24696
$$ plain form
10170 -738064 -305167 -149635 -338518 -799638 -610418 161369 359792 309462 -118708 -112146
10160 -112146 77191 612311 432002 -437682 158693 341350 -161087 -948636 -1062686 -1024858
10150 -1024858 -634740 -925090 -635662 -750070 -819690 -795737 -1183551 -895052 -897258 -497795
10140 -497795 24716 289288 -309995 -204270 169896 244260 -423390 -239022 396254 518765
10130 518765 -1007362 -1136037 -469280 30257 -175137 -1271091 -1389239 -497366 372858
10121 372858 -599966 -651119 -364061 -302560 -375200 -331954 -1145357 -1397535 -1045209 -524335
10111 -524335 -29970 -782571 -238078 723745 594067 483824 269592 -464274 -947460 -1679657
10101 -1679657 -1035521 -914368 -811598 -928881 -112988 -69100 -29210 -851985 -331930 -107234
10091a07234o01713m83947q7005R61564p5504R6963N97247k14565l63607N91757
10081C13956L78554Q98794q13494j025298J21720l24692k57867O57946l70817
10072d21198k81002r06757N64323Q33193K70891p76805K09308O77231J075j06252
10062F4007K09380l24020q6539M5203K42518K10427o81033P3970M51469k87059
10052h1677m08036j80599o14837M67460J61398L28744O38044J06715Q9948j60751
10042C46409q18846k03846J019009k2336o7046j64225n34628l61315N89405M005
10032b13414k70383J81910m43215R4380O0657O89269P45729m62722n2682q3788
10022B45741N98709j50349p45378l3496r19266M69597M55967j79857m70051P2543
$$ plain form
10091 -107234 -708947 -1192894 -1279899 -318335 -393839 -296876 300371 85806 -277801 313956
10081 313956 692510 1591304 777810 -247488 -125768 -450460 -708327 -50381 -421198
10072 -421198 -702200 -1608957 -1044634 -211441 59450 -717355 -508047 169184 170259 64007
10062 64007 273387 -50633 -137172 -91969 150549 360976 -320057 -246087 205382 -81677
10052 -81677 -489713 -670312 -1285149 -817689 -656291 -327547 310497 417212 507160 346409
10042 346409 -472437 -676283 342726 320390 253344 89119 -445509 -806824 -217419 -213414
10032 -213414 -483797 -301887 -745102 -650722 -590065 99204 844933 382211 329529 245741
10022 245741 844450 694101 -51277 -84773 -1004039 -534442 -78475 -258332 -728383 -655840
10012f55840J24456M52891m04152o55807J22132N48102k17609Q7616J066153m06304
10002F1638j61851K51392j10926M99477j29421J15490o32785j353264n5201M152
9992a511299o30883R44867k6048j20933N09252K44127K1473p19926L65258L55222
9982e68890K27447K11698O83589p01416K89330k50338M13117j46209L52026M67921
9972I78275l33214n11527q64502Q28437L87765n48555q85092K27021K37829Q6706
9962c96857j61073n4115O17699l87222o77193k60504j57063L24016R49723n27773
9952g30362l42410O99148K47474p49890M48667M61141j74575n10951M96942J44476
9942a0340r09790L91937r43k37799M63224R11545J08423j86292o50871k63704
$$ plain form
10012 -655840 -531384 -78493 -482645 -1138452 -1016320 -468218 -685827 -598211 467942 61638
10002 61638 -100213 151179 40253 539730 410309 525799 -106986 -1460250 -1515451 -1511299
9992 -1511299 -2142182 -1197315 -1223363 -1344296 -835044 -590917 -569444 -1289370 -924112 -568890
9982 -568890 -341443 -129745 553844 -147572 141758 -108580 304537 158328 510354 978275
9972 978275 645061 133534 -730968 97469 485234 -63321 -948413 -721392 -483563 -396857
9962 -396857 -557930 -612045 5654 -381568 -1058761 -1319265 -1476328 -1152312 -202589 -730362
9952 -730362 -1072772 -373624 -126150 -876040 -427373 33768 -140807 -651758 -154816 -10340
9942 -10340 -920130 -528193 -529136 -766935 -303711 607834 716257 529965 -120906 -384610
9932c84610O2356J47371r09494N74363J164081j70521k2685m2083J9391K78090
9922G16259j234109N6604J56886j10854M93756N23561o70734k19131L34120j0415
9912C5943N05059L63841q86702l96006M70682k18173N0862l02343q07069K79418
9902i04488K43252j76205J57703l9327M54560O1382l45190n16098p04054N24758
9892a243707K38899k5346P76934J500960K89638r54065l0277L34629m36702j173988
9882g23025k18116N49374k33609k95042j63148M34053K05981K07566k35974j45192
9872f17132O67687p38799j18033l33429r8603O03530L46342M07190p46138K40458
9862c86927o73725n17487O18196K75085P1168j329701M22924N55093O19657M07894
$$ plain form
9932 -384610 -322254 -174883 -1084377 -510014 654067 483546 460861 418778 438169 716259
9922 716259 -517850 -461246 -304360 -415214 78542 602103 -68631 -287762 46358 35943
9912 35943 541002 904843 18141 -377865 92817 -125356 -74494 -376837 -1183906 -904488
9902 -904488 -661236 -837441 -679738 -719065 -264505 -203123 -548313 -1064411 -1768465 -1243707
9892 -1243707 -1004808 -1030154 -253220 1247740 1537378 583313 553036 887665 450963 -723025
9882 -723025 -941141 -391767 -625376 -920418 -1083566 -649513 -443532 -235966 -471940 -617132
9872 -617132 50555 -688244 -806277 -1139706 -1238309 -634779 -288437 118753 -627385 -386927
9862 -386927 -1060652 -1578139 -959943 -684858 -613690 -1943391 -1520467 -965374 -345717 62177
9852F2177j17999q28469J03112L38661J279818j6448j002557r04362R60280O42490
9842E16703p89197M9856L6408l58434N62096P02017k43025O8054L36770p49372
9832A31876l65081N3630p79739P30427l55810l83728M66073J4257q20759r1589
9822a400443O8338O33226M92112j25594n53031N37455R75558r03205q94301l10537
9812a480422N41662N85537m49763k50365P44805p13588j98369o9336J93785k31549
9802a327603j13736K61056K47750L3035j31308M31056R46820J59946k43663p43809
9792d80456j317739O83977O91128Q4046n46879P91217J446802l77237j011273
9783c6414o26318k43443L28763l97100O99802N72492M18791m26730o8796Q62891
$$ plain form
9852 62177 -55822 -884291 -781179 -442518 837300 820852 -181705 -1086067 -125787 516703
9842 516703 -272494 -222638 -186230 -544664 17432 719449 476424 544478 881248 131876
9832 131876 -233205 -179575 -959314 -228887 -584697 -968425 -502352 -488095 -1308854 -1400443
9822 -1400443 -1332105 -698879 -206767 -332361 -885392 -347937 627621 -275584 -1169885 -1480422
9812 -1480422 -938760 -353223 -802986 -1053351 -308546 -1022134 -1220503 -1289839 -1096054 -1327603
9802 -1327603 -1441339 -1180283 -932533 -899498 -1030806 -599750 347070 507016 263353 -480456
9792 -480456 -1798195 -1114218 -423090 -339044 -885923 -94706 1352096 974859 -36414
9783 -36414 -662732 -906175 -577412 -974512 -274710 297782 716573 289843 221047 1083938
9773A083938j134682J98808l98236j12702J24085Q42476K4841r51927Q3454M70463
9763B30518k99064j226834j11005J18978M86436p19046J22288K08305P69135K08448
9753b11841j114951j36618J290546j44914k35810m7156J7116m80577J89842L63743
9743e10620N96763K61509o7386m04720k27044R54512k48467m10678q27154K19531
9733f63754j61279j58143K10152K8053N14186J63416L28438j62568k31649P7915
9723e5233j65056r8965m6255M92015q8517m19185J28615q4315q15915P14288M16148
9712b2375j101908J67392M34246L68562p3449K18850o83448l0987K21505J85306
9702c16306J094609K29358Q6631o06823n78881L4443J80670k41195J87273K51782
$$ plain form
9773 1083938 -50744 148064 -250172 -362874 -238789 603687 628528 -323399 -239945 230518
9763 230518 -68546 -1295380 -1406385 -1287407 -800971 -1520017 -1397729 -1189424 -420289 -211841
9753 -211841 -1326792 -1463410 -172864 -317778 -553588 -600744 -583628 -1064205 -874363 -510620
9743 -510620 86143 347652 280266 -124454 -351498 603014 354547 -56131 -883285 -663754
9733 -663754 -825033 -983176 -773024 -744971 -230785 -67369 261069 98501 -133148 -55233
9723 -55233 -220289 -319254 -365509 126506 37989 -381196 -252581 -336896 -1152811 -438523 -22375
9712 -22375 -1124283 -956891 -522645 -154083 -227532 -8682 -692130 -723117 -501612 -316306
9702 -316306 778303 1007661 1094292 487469 -91412 -56969 123701 -117494 69779 321561
9692C21561m86130n06260J040639o05061n34295J85235j03514K60316L13321O08867
9682D94679P15228k55476o82572l41272q13605R67619M39589O40387N8082p74912
9672D47747K0659o60397q02480p4982M10300Q42175m24062J21044o4368n37420
9662g21784N54623O33655p06994j63367l9631l36809o88492J36559R91495k63740
9652f04485L6782J69317j69844l04408P58609J76973K11122n35585L60632l81569
9642b82456K30565j94363n89318N30998n55625K26076J21988L23723L71295q8927
9632I3956k34309n63667L87295N60696O8986J99992J55118p35403m81372n15860
9622a064568M9766M68772R37726k52626K26851o83131Q9696J086847n45464j20292
$$ plain form
9692 321561 -164569 -670829 369810 -235251 -769546 -584311 -687825 -427509 -114188 494679
9682 494679 1209907 954431 271859 -69413 -883018 84601 524190 1164577 1222659 447747
9672 447747 468406 -191991 -994471 -1069453 -659153 183022 -241040 -119996 -184364 -721784
9662 -721784 -167161 466494 -240500 -403867 -443498 -780307 -1468799 -1332240 -340745 -604485
9652 -604485 -567703 -398386 -568230 -872638 -114029 62944 274066 -261519 99113 -282456
9642 -282456 -51891 -246254 -835572 -304574 -860199 -634123 -512135 -188412 182883 93956
9632 93956 -140353 -704020 -316725 243971 312957 512949 668067 -67336 -548708 -1064568
9622 -1064568 -1014802 -546030 391696 139070 365921 -317210 -227514 859333 313869 193577
9612A93577M95040j085338q08768K40222O20129M37545o41323l900L79739n28054
9602g01131P26219K04717q76795o05267M86001J612640n36541j73772K06286l00250
9592D2107m33710j82902m12453J16174P65093l26968K53983M38809L26559O8327
9582F55019q3241R5169K67443p35810j378289O44045n49513K97189L27823l48936
9572h09101O69055P46035o05797o25905L20440K92737l81465j2079j39336O40269
9562I4853L15075r08977m30964J092354j17275l53961k40898Q53684P2868N2202
9552D28961K98666m29639j030508J08103M03865J48733l38641K64591O66038q72918
9542c52749M32742K55402l29023j392937j63484L55083J26185j27741K56925M23556
$$ plain form
9612 193577 688617 -396721 -1205489 -965267 -345138 92407 -548916 -552816 -173077 -701131
9602 -701131 25088 229805 -646990 -1252257 -766256 846384 309843 136071 342357 42107
9592 42107 -391603 -574505 -986958 -870784 -105691 -432659 -178676 260133 586692 655019
9582 655019 571778 666947 934390 198580 -1179709 -535664 -1085177 -787988 -460165 -809101
9572 -809101 -140046 605989 192 -625713 -305273 -12536 -394001 -406080 -545416 94853
9562 94853 409928 -499049 -930013 162341 45066 -308895 -549793 303891 376759 428961
9552 428961 727627 297988 -732520 -624417 -220552 -71819 -410460 -145869 520169 -352749
9542 -352749 79993 335395 6372 -1386565 -1550049 -1194966 -1068781 -1196522 -939597 -516041
9532e16041o1574k84715o5947R24749Q5399K48730J49191L14398L01687J10419
9522A206296l7771j052976p24300j50098j38279m93403L60373L85074j2022K6846
9512f30260L77951K0594N37054r809p12032n48562M00070M71045l45513M74651
9502C5189k85856P11315J67801j142172J05633O03113l42171k65523j84618J76787
9492d20502l85719j22873O75403J28676R3616K77514O67379l87250K03085P74301
9482A503630o49885k77643k50475m46403M53464L66390p58264j809548J024845
9473h43889L43513K75495o46874M10487M8456k36368M09034O616N59060N31792
9463H57322N43936o27021n86496j4216R3602j114449j03120J130652n89638k13496
$$ plain form
9532 -516041 -577615 -862330 -928277 -3528 81871 330601 479792 794190 1095877 1206296
9522 1206296 1168525 115549 -608751 -758849 -897128 -1390531 -1030158 -645084 -657106 -630260
9512 -630260 -252309 -231715 305339 295530 -416502 -965064 -564994 -93949 -439462 35189
9502 35189 -250667 460648 628449 -513723 -408090 195023 -147148 -412671 -597289 -420502
9492 -420502 -806221 -929094 -253691 -125015 -31399 246115 913494 526244 729329 1503630
9482 1503630 853745 576102 325627 -120776 332688 699078 -59186 -1868734 -843889
9473 -843889 -500376 -224881 -871755 -461268 -412812 -649180 -240146 -233530 325530 857322
9463 857322 1401258 774237 187741 173525 267127 -847322 -950442 180210 -409428 -622924
9453f22924N67331j4737o8307j11129P72384o93121j27759P60347M29521K36127
9443A127733J14753K29659K50924L80807P2433k1347k3908Q0465j45254p73000
9433A293265N6404L93027q8187j63063J40606r2697q92923L57588O73913r29217
9423G48716r72124M76129M73515M56572J61030k51813K09647N99574j166408j151611
9413d16773j82211N053O30365L04378o32430q61319j50892Q40567M58783k30510
9403b34989R46188L96020L37580j72373m59406K27611R819J52714j82662K74847
9393A295349l40460J05476J61309P4532l12701J078504m7334p02410l2520l32408
9383I47337J92644m7592O64691k86019J36310l59782j67189l35759K65005J41434
$$ plain form
9453 -622924 -55593 -70330 -138637 -249766 522618 -170503 -298262 462085 891606 1127733
9443 1127733 1242486 1472145 1723069 2103876 2176309 2154962 2131054 2211519 2066265 1293265
9433 1293265 1349669 1742696 1654509 1491446 1632052 1539355 646432 1004020 1677933 748716
9423 748716 -223408 252721 726236 1182808 1343838 1092025 1301672 1901246 734838 -416773
9413 -416773 -598984 -593931 36434 340812 -291618 -1152937 -1303829 -463262 -4479 -234989
9403 -234989 711199 1107219 1444799 1272426 813020 1040631 1050450 1203164 1020502 1295349
9393 1295349 954889 1060365 1221674 1296206 983505 2062009 2014675 1312265 1279745 947337
9383 947337 1139981 1092389 1757080 1471061 1607371 1247589 1080400 744641 1009646 1151080
9373A151080m38639o64428j73913q64724J20096R54756N45988l76010K9402m5071
9363B38537m25289j10053p5419r20232J083594N19950m19284K81356l05366q22530
9353i54736p816L31820m03411J115509j32973m56592o5389J82579j78891j03940
9343f73840j57889N34357N36373J18843o81967m82956J28804p4063L14152j99843
9333f38029p41456J043236R99899q44005j49066K09536p42115j178502J04415
9324a936087J120415L51123O98214m28432N16384n92011K27051o5565L34731n87438
9314c61615k43882M99265Q209J47791o65678l76761q833J653875q18641l96546
9304e62816J017758m54841k12269O69354M48087o09300k17886M1617M1439O91558
$$ plain form
9373 1151080 712441 48013 -125900 -990624 -870528 84228 630216 254206 283608 238537
9363 238537 -186752 -296805 -372224 -1292456 -208862 311088 -108196 173160 -132206 -954736
9353 -954736 -962552 -630732 -1034143 81366 -51607 -508199 -573588 -391009 -569900 -673840
9343 -673840 -831729 -297372 239001 357844 -324123 -807079 -678275 -752338 -438186 -638029
9333 -638029 -1379485 -336249 663650 -180355 -329421 -119885 -862000 -2040502 -1936087
9324 -1936087 -815672 -464549 233665 -194767 321617 -270394 -43343 -108908 225823 -361615
9314 -361615 -605497 -106232 -98023 49768 -615910 -992671 -1001504 652371 -166270 -562816
9304 -562816 454942 101 -212168 457186 905273 295973 78087 119704 161143 852701
9294H52701j06958p79927l65972O66879o504o55244p72560O39750l4998N50474
9284a2359J60387j33996o15625K42782J228999J57133j20702K09309o05067m43299
9274F7562O30680N0310k08261l9824m30728K27976m66730M86895p99750M09931
9264g1939K75629K57285R7346r91930O02133q8717J61575m29593n85596M25701
9254c48106J81546K74433L07230K16108L70991m88666n3486r63345L16913Q74041
9244F87659p89366m90259L25277M71741Q75640k3630k2190j23954j6502m12895
9234D81521l68715J46177j63874O945K78104o54817N86424K74750l55456o15734
9224c84675K15177P31676K57551Q6458k03571j13270O75717J126592L6304J13244
$$ plain form
9294 852701 745743 -34184 -400156 266723 260219 -395025 -1167585 -527835 -562833 -12359
9284 -12359 148028 14032 -601593 -358811 870188 1027321 906619 1115928 510861 67562
9274 67562 698242 748552 540291 500467 69739 297715 -169015 317880 -481870 -71939
9264 -71939 203690 460975 558321 -433609 168524 79807 241382 -188211 -773807 -348106
9254 -348106 -166560 107873 415103 631211 1002202 513536 460050 -503295 -186382 687659
9244 687659 -101707 -591966 -266689 205052 1080692 1057062 1034872 910918 894416 481521
9234 481521 112806 258983 95109 102054 380158 -274659 311765 586515 231059 -384675
9224 -384675 -169498 562178 819729 906187 702616 589346 1265063 2391655 2427959 2541203
9214B541203m44145k84061p26142o06656L39152m13393J76013K36745l21545J53321
9204F50492M00022k27334O41722J18382l98837K71802K87461P45262k29801J11692
9194B370863M78542m80892j098818N7986R59318k38708o21578j056366m80975
9185a10628O04126O50427l54785M83656M78576l9384K30372N79368N35850O78681
9175C736259J18268L57531n95102m70815J05435K93755L1776p79534j20312k97521
9165B379740J54410j22303m55973o78445L08818M75967m3144L02649n75553l9820
9155A706346O29591K97433q16671k02488P55946Q18082n29124j708493J15964
9146A066586R64323j031803o30398L38757P57401P83626n08585m29113o40497
$$ plain form
9214 2541203 2097058 1812997 1086855 480199 819351 405958 581971 818716 497171 650492
9204 650492 1050514 823180 1464902 1583284 1184447 1456249 1743710 2488972 2259171 2370863
9194 2370863 2849405 2368513 1269695 1327681 2286999 2048291 1426713 370347 -110628
9185 -110628 493498 1143925 789140 1272796 1751372 1711988 1942360 2521728 3057578 3736259
9175 3736259 3854527 4212058 3616956 3146141 3251576 3545331 3577107 2797573 2677261 2379740
9165 2379740 2534150 2411847 1955874 1277429 1586247 2062214 2019070 2321719 1746166 1706346
9155 1706346 2335937 2633370 1816699 1614211 2370157 3188239 2659115 950622 1066586
9146 1066586 2030909 999106 368708 707465 1464866 2248492 1739907 1310794 670297
9137F70297J027372K36228j148590r33423O31037N9658J156504M5831p86434m64771
9127D93709J387417l37952p88735K55765M54922l40713l92675O18013j65515l10958
9117H73278l30020l11109k5968n09036O06956J278042m25956K95927J36850j53431
9107A435533o72240P1773k69044J20841P17023j98993p54656P70O07301P99155
9097A857463K75745p54621K85054K74220l07671k2870J33769m45392n68829M17089
9087A143957L25981L12942N2261r16897j26960P38642j63170k05765m07800k13942
9077E39249j30287O83180N16589j75264M16836o48452k55842K9456P9285k11661
9067H43089N08049L11325J02671r0214j292406k18173L87981m4095M8963M77575
$$ plain form
9137 670297 1697669 1933897 785307 -148116 482921 542579 1699083 1744914 958480 493709
9127 493709 1881126 1543174 754439 1010204 1465126 1124413 731738 1349751 1184236 873278
9117 873278 543258 232149 206181 -302855 304101 1582143 1156187 1452114 1588964 1435533
9107 1435533 763293 835066 566022 686863 1403886 1204893 450237 451007 1058308 1857463
9097 1857463 2133208 1378587 1663641 1937861 1630190 1607320 1741089 1295697 726868 1143957
9087 1143957 1469938 1782880 1835141 918244 791284 1529926 1366756 1160991 753191 539249
9077 539249 408962 1092142 1608731 1433467 1850303 1201851 946009 975465 1054750 843089
9067 843089 1351138 1662463 1765134 1674920 382514 164341 552322 508227 557190 1034765
9057A034765m2883Q23492Q16560L8949j31807n40738k44034N5791l43552m68052
9047I98491J86012M49387r57030n29936j65287Q40152Q77773M20700j21390l87688
9037A611184m26463k62222q7481K80040l82990n10676K07699N42332L07032n73587
9027G04868Q38323l55704j074345J99530j83374J9742k43499l41874N05769M64838
9017E34274j45925P62034M54504n02152k78939l4508Q37361J88501j474571q40638
9007e00059N05215R07020j53970o94999P17060N10511l38754J35488m17927j67569
8997E02016L21230L36654N95742l11106l47453J34678k94408j94237n21823L43037
8987E64330L72451m86048O51371q38347Q72392j13248l54703O07604m94692M04329
$$ plain form
9057 1034765 991882 1815374 2631934 2670883 2539076 1998338 1754304 1810095 1466543 998491
9047 998491 1184503 1633890 676860 146924 -18363 821789 1699562 2120262 1998872 1611184
9037 1611184 1184721 922499 835018 1115058 732068 221392 429091 971423 1278455 704868
9027 704868 1543191 1187487 113142 312672 129298 149040 -94459 -436333 69436 534274
9017 534274 388349 1150383 1604887 1102735 823796 789288 1626649 1815150 340579 -500059
9007 -500059 5156 912176 758206 63207 780267 1290778 952024 1087512 669585 502016
8997 502016 823246 1159900 1755642 1444536 1097083 1231761 937353 743116 221293 564330
8987 564330 936781 450733 1102104 263757 1136149 1022901 668198 1275802 781110 1185439
8977A185439K87628m20252N47994O11812l21207j047799K60346P31197m49346
8968A385812m39604Q82922l82834q0414J285631p4681m58966p05835j87194M2830
8958A267667J431259M21932k83222p27145j49217m24294R6532L06807j97173L56299
8948B099445M70483M6674n52981K27999k78335n63845J18265J29692R22283J17363
8938B737043N49161J42326o49958j03722r61780Q8113o90862N89199J103580n39309
8928B263791O9157M97051k00445j95317R48129L43495p39246l78953M23492l5323
8918B995831N45795o91531j292467p5039O72531K58569N30569J137150M89089
8909D570497p9539J11093k62718k31832j8064p33138P08196R56851l9688P10973
$$ plain form
8977 1185439 1473067 1052815 1600809 2212621 1891414 843615 1103961 1835158 1385812
8968 1385812 946208 1829130 1446296 1365882 2651513 2576832 2117866 1412031 1224837 1267667
8958 1267667 2698926 3120858 2837636 2110491 1961274 1536980 1633512 1940319 1743146 2099445
8948 2099445 2569928 2616602 2063621 2291620 2013285 1449440 1567705 1697397 2619680 2737043
8938 2737043 3286204 3428530 2778572 2674850 1713070 1801183 1110321 1699520 2803100 2263791
8928 2263791 2332948 2829999 2629554 2434237 3382366 3725861 2986615 2607662 3031154 2995831
8918 2995831 3541626 2850095 1557628 1482589 2155120 2413689 2944258 4081408 4570497
8909 4570497 4490958 4602051 4339333 4107501 4089437 3356299 4064495 5021346 4981658 5692631
8899E692631N78945n35092j023397L38270Q92901p41780j05651J127105N94086
8890F818018j07877q17463m45276K3919m20759L84398j09081Q55627M66546o20355
8880F027697N7864L45705q6548P25781K35847K3173N86326J65485n19867P49802
8870H311265M33157o74010k13692N54989R98872n41382J72256k32819l67414n80139
8860G861083J449484J65520j178316L06019p1596j01583O0922O71123j94264P36926
8850I705318K58288j86838l96053K48508O2664K58902M49962k30416j681590O87486
8840I176231p08451q72352O02303O49689J02795K63109Q85557O42756N04205p88042
8830A0457800m76969k67579o2040k29704P78814m10344n77500p18458j70150k66157
$$ plain form
8899 5692631 6271576 5736484 4713087 5051357 5944258 5202478 5096827 6223932 6818018
8890 6818018 6710141 5892678 5447402 5471321 5050562 5434960 5325879 6181506 6648052 6027697
8880 6027697 6085561 6431266 6344718 7070499 7306346 7329519 7915845 8081330 7561463 8311265
8870 8311265 8744422 8070412 7856720 8411709 9410581 8869199 9041455 8808636 8441222 7861083
8860 7861083 9310567 9476087 8297771 8603790 8532194 8430611 8491533 9162656 8968392 9705318
8850 9705318 9963606 9776768 9380715 9629223 9691887 9950789 10400751 10170335 8488745 9176231
8840 9176231 8467780 7595428 8197731 8847420 8950215 9213324 10098881 10741637 11245842 10457800
8830 10457800 9980831 9713252 9651212 9421508 10200322 9789978 9212478 8494020 8323870 8057713
8820H057713P43534m87068N5123r2374l60038K08057M96588O59337M97853Q67680
8810A0646405j87460k5602n57977N44560n13825p606M3668J14633P87215n38527
8800A0305484K67705M12868l99196p02474P64882J162198J39828M84861N16056
8791A2952212N12381M45604J35778p49998r66735P42645K61145m86691j63198
8782A2683143N23333k81559K25263N29826j63455K45156o4792N26062O47851K18507
8772A5089335P16643Q7475q9748l30331J32696J041741K06233J26002m45024P65385
8762A7300407J174180K68069M031K53903N12409M27691Q08641M275J150989j5594
8752B1889001K20662M03437Q23966J01359K19827J255801Q19495J082631J24631
$$ plain form
8820 8057713 8801247 8314179 8369302 8276928 7916890 8124947 8621535 9280872 9778725 10646405
8810 10646405 10458945 10433343 9875366 10419926 9906101 9898495 9942163 10056796 10844011 10305484
8800 10305484 10573189 10986057 10586861 9884387 10649269 11811467 11951295 12436156 12952212
8791 12952212 13464593 13910197 14045975 13295977 12329242 13071887 13333032 12846341 12683143
8782 12683143 13206476 12924917 13150180 13680006 13516551 13761707 13696915 14222977 14870828 15089335
8772 15089335 15805978 15893453 15803705 15473374 15606070 16647811 16854044 16980046 16535022 17300407
8762 17300407 18474587 18742656 18746687 19000590 19512999 19940690 20749331 20753606 21904595 21889001
8752 21889001 22109663 22513100 23337066 23438425 23658252 24914053 25733548 26816179 26940810
8743B6940810N79967J223140P47267J481195K062883K027065J801240K493712
8735C9357279L334168K702122P24893O55563m161n45601q74549k92568K17586
8726D5274732p76509k11432N48347J430664J976163J900609K231429J443396K847091
8717E6664490L645691L179706M272112N259900N136509P014347P574837Q200830
8709A00948422Q031126Q930871J2425342J7597345K6959146M1850869O1483654
8702B78226775Q4070350O8140922J711916o0312042q5965246o1789582l9759869
8695A84323224k8007464k0376806j7145788j3766372j1647726j0000028p386740
8688G5992300m743353m968223m524689m705817l629844l213624k145909j318564
$$ plain form
8743 26940810 27520777 28743917 29491184 30972379 33035262 35062327 36863567 39357279
8735 39357279 42691447 45393569 46118462 46774025 46769864 46224263 45349714 45057146 45274732
8726 45274732 44498223 44286791 44835138 46265802 48241965 50142574 52374003 53817399 56664490
8717 56664490 60310181 63489887 67761999 73021899 78158408 85172755 92747592 100948422
8709 100948422 108979548 117910419 130335761 147933106 174892252 216743121 278226775
8702 278226775 362297125 430438047 432149963 371837921 285872675 224083093 184323224
8695 184323224 156315760 135938954 118793166 105026794 93379068 83379040 75992300
8688 75992300 71248947 66280724 61756035 57050218 53420374 50206750 48060841 46742277
8680D6742277j226069m57942N65898J076698L36900j78926l23392j240870k061962
8671D3232612j251637k565144k234496j597872j688232k167130j732831j827532
8663B8167738j314471j197735j274726k23014j98828M44464l61439Q34501k58508
8654B4617982j5650O60959J017045M91143r18364m71507q07337j202694r03684
8645B2467893j192375j854089j34624P9907l52549r40639J44339J047665M83338
8636A9748866k18130J088932J04137J02K50236j31871O61076m53487m90888j064010
8626A9494963j569115o56069L29666m15880n99149p66025n8282M1496m54295j132322
8616A4214988m24893L7982m69867m77506O85934k00000R65653J35938M75113M11360
$$ plain form
8680 46742277 45516208 45058266 45624164 46700862 47037762 46858836 46535444 45294574 43232612
8671 43232612 41980975 39415831 37181335 35583463 33895231 31728101 29995270 28167738
8663 28167738 26853267 25655532 24380806 24157792 23958964 24403428 24041989 24876490 24617982
8654 24617982 24602332 25263291 26280336 26771479 25853115 25381608 24574271 23371577 22467893
8645 22467893 21275518 19421429 19286805 19366712 19014163 18073524 18217863 19265528 19748866
8636 19748866 19530736 20619668 20723805 20723907 20974143 20842272 21503348 21049861 20558973 19494963
8626 19494963 17925848 17269779 17599445 17183565 16584416 15818391 15760109 15801605 15347310 14214988
8616 14214988 13790095 13828077 13358210 12880704 13566638 13366638 14332291 14468229 14943342 15354702
8606A5354702Q20867K386P10514J355267J395697O39909p43787o79579K14492
8597A9070468j624634r48016J66891J0087j003667q9860k85431K92130J039501
8588A6627469M3031j74045p18470L58494J183866O02097J077707J856942q8633
8579B0768458p28176j398123m3408j469678o07158j501894j681342k49685r4956
8570A2994038J09270J199236L86640N56127M96459L8274J569002J704714N52702
8561A9606462M10811m22469j442806j807089m87804l16286q79320j66121m27479
8552A4067899J39407K38932l50464P6662J15781K64421R88173L75859J079094
8543A6995764R21749J189031n9966j99408m21526j583905j429890n53230r17402
$$ plain form
8606 15354702 16175569 16177955 16888469 18243736 19639433 20279342 19535555 18855976 19070468
8597 19070468 17445834 16497818 16664709 16674796 15671129 15581269 15295838 15587968 16627469
8588 16627469 16670500 16496455 15777985 16136479 17320345 17922442 19000149 20857091 20768458
8579 20768458 20040282 18642159 18598751 17129073 16521915 15020021 13338679 13088994 12994038
8570 12994038 13103308 14302544 14689184 15245311 15741770 15780044 17349046 19053760 19606462
8561 19606462 20017273 19594804 18151998 16344909 15857105 15540819 14661499 14495378 14067899
8552 14067899 14207306 14446238 14095774 14172436 14288217 14552638 15540811 15916670 16995764
8543 16995764 17917513 19106544 19046578 18847170 18425644 16841739 15411849 14858619 13941217
8534A3941217j643126j371369l90481N43568q26911M67329l70734k17903n63226
8525I568364o70632n52005k72607P1464o880n5376P76410J950443O87182j09861
8515A1386502n8132K23984K42391N5847o01506J74259J088977O42416L38099J12150
8505A3604987Q60074J90444J55051P6566Q06342J312074J372025P71552J111415
8496B0260530J244190J009167N72753q51226N79196J561616K51280l37267n82797
8487B3707442m81005M73096M54186p9582j47968l81924Q5457p12026n50614L32075
8477B2699137n21190k58774m89967j156805K54408K277182L83954M0599P25305
8468B3953849M62978p694j14701N40607J675991N87374J460292J526575J757040
$$ plain form
8534 13941217 12298091 10926722 10536241 11079809 10252898 10720227 10349493 10131590 9568364
8525 9568364 8897732 8345727 8073120 8144584 8137704 8082328 8858738 10809181 11496363 11386502
8515 11386502 11328370 11552354 11794745 11850592 11249086 11423345 12512322 13154738 13492837 13604987
8505 13604987 14465061 14655505 14810556 14887122 15693464 17005538 18377563 19149115 20260530
8496 20260530 21504720 22513887 23086640 22235414 22814610 24376226 24627506 24290239 23707442
8487 23707442 23226437 23699533 24153719 24074137 23926169 23544245 23629702 22917676 22367062 22699137
8477 22699137 22177947 21919173 21429206 20272401 20526809 22803991 23187945 23228544 23953849
8468 23953849 24416827 24409133 24294432 24835039 26511030 27098404 28558696 30085271 31842311
8459C1842311J250316K580822J795652J560012J720581K240400J504089J177213
8451D5671396J518978O25670Q8224R74049n38984j138198L45739q798Q13963j82629
8441D8169410l90773j433912j884428j955325r33930k161185k648470k311447
8433C4449940j776902k139281j608908j015860j221594r40766m23302M61633j53675
8424B5631285J40308J290305P40216n31921M49673J132054K4658k60512R96100
8415B9612166Q77726K22798J073981K059975J389184J30436L15692j287744O58956
8406C5053170N98891N05456j6267J055174P22391J86205j84555j454886l561324
8397C2904255j917063n06688j140927j050333j294734k75743j045188q55494K86602
$$ plain form
8459 31842311 33092627 35673449 37469101 39029113 40749694 42990094 44494183 45671396
8451 45671396 47190374 47816044 47904268 48878317 48339333 47201135 47546874 47538076 48352039 48169410
8441 48169410 47778637 46344725 44460297 42504972 41571042 39409857 36761387 34449940
8433 34449940 32673038 30533757 28924849 27908989 26687395 25746629 25323327 25784960 25631285
8424 25631285 25771593 27061898 27802114 27270193 27719866 28851920 28876578 28616066 29612166
8415 29612166 30489892 30712690 31786671 33846646 35235830 35366266 35681958 34394214 35053170
8406 35053170 35652061 36157517 36141250 37196424 37918815 38105020 37920465 36465579 32904255
8397 32904255 30987192 30480504 29339577 28289244 26994510 26718767 25673579 24818085 25104687
8388B5104687L85738j168753p75953p07972n38851l50595K62444q77822L23040
8379B1655963j047241j90137N37007N1175M0424K12520J889546L02303R0379J293606
8369B4835545J358073J7237j313924l46213o33947j76282N10940n11209j15956
8360B3624264N33734K41308N30470P16047J6978N87019K46010n90744k96897m14133
8350B5194056N03376P65100Q45121J453027J807227J133842j59923P33384j27750
8341C2147460j902150p39747P3994K87044k16841K30766K210864P63794k98697
8332C2556487k06893J408029P00069k34177P83215N36331J16537j88092n79464
8323C4892042j565197k00766q72272Q17543O02431J85849J617176k3371Q73082
$$ plain form
8388 25104687 25490425 24321672 23545719 22837747 22298896 21948301 22210745 21332923 21655963
8379 21655963 20608722 20418585 20955592 21006767 21047191 21259711 23149257 23451560 23541939 24835545
8369 24835545 26193618 26210855 24896931 24550718 23916771 23740489 24251429 23740220 23624264
8360 23624264 24157998 24399306 24929776 25645823 25662801 26249820 26495830 25905086 25608189 25194056
8350 25194056 25697432 26462532 27307653 28760680 30567907 31701749 31541826 32275210 32147460
8341 32147460 30245310 29505563 29579557 29866601 29649760 29880526 32091390 32855184 32556487
8332 32556487 32349594 33757623 34457692 34223515 35006730 35543061 35659598 35471506 34892042
8323 34892042 33326845 33126079 32253807 33071350 33673781 33859630 35476806 35453435 36326517
8314C6326517m38338n92289m02597o50807q6792j09547J293709O34901M09291
8305C6384048J7125R89401J047490q94546j690331q90254j249169j014656J15767
8296C2814875m33571O7938J08004Q48290q10478j478792k80657j392387m41471
8287B9001751N29135n26090M1280q32875O5811n70926q82022r47884q49032j27637
8277B4901511n05384L88015p8168L8697j99000r14276p71631j88765p03942m91328
8267B1475729K78622l08405J37081J445735J134415r47303m25208k1508m11077
8258B2358081p32116J44191o4416n66623k54045q4904p68939m81796Q73550q04842
8248A9618141r58516n63177l62001m25549O89605o10280j868452m70282Q0846
$$ plain form
8314 36326517 35888179 35295890 34893293 34242486 34155694 34046147 35339856 35974757 36384048
8305 36384048 36401173 37390574 38438064 37543518 35853187 34962933 33713764 32699108 32814875
8296 32814875 32381304 32449242 32557246 33405536 32595058 31116266 30835609 29443222 29001751
8287 29001751 29530886 29004796 29046076 28213201 28279012 27708086 26826064 25878180 25029148 24901511
8277 24901511 24396127 24784142 24705974 24744671 24545671 23631395 22859764 22670999 21967057 21475729
8267 21475729 21754351 21445946 21583027 23028762 24163177 23215874 22790666 22769158 22358081
8258 22358081 21625965 21770156 21705740 21139117 20885072 20800168 20031229 19549433 20422983 19618141
8248 19618141 18659625 18096448 17734447 17308898 17998503 17388223 15519771 15049489 15130335
8239A5130335j031717r62768p23280k24163k80041o19985L48478N47634r69168
8230A1215325L39665m16570M58802N31552j5757K37237J055280J249229m38630
8221A4216133R47683j11441j05063j93499p50473o7174R04158L59928q53465R52106
8211A5298893k76562j134707l87218n25717J65215K45549n06328J36917P22651
8202A3738693r97111m40088o78105k14078k345693M89897k17700O12218K24726
8193A0172759L749415o022569q382427L983025M90728R84961j359089N05186M51163
8184D573152n54830k18702P30816N29214p91324R71684O95266N46696l76981L48041
8174F453032R41961M21172j006418j339981n58146M67346O68214j222140r72010
$$ plain form
8239 15130335 14098618 13135850 12412570 12188407 11908366 11288381 11636859 12184493 11215325
8230 11215325 11554990 11138420 11597222 12128774 12113017 12350254 13405534 14654763 14216133
8221 14216133 15163816 15052375 14947312 14753813 14003340 13936166 14840324 15200252 14346787 15298893
8211 15298893 15022331 13887624 13500406 12974689 13139904 13385453 12879125 13016042 13738693
8202 13738693 12741582 12301494 11623389 11409311 9063618 9553515 9335815 9948033 10172759
8193 10172759 13922174 7899605 -482822 3500203 3990931 4975892 3616803 4121989 4573152
8184 4573152 4018322 3799620 4530436 5059650 4268326 5240010 5935276 6481972 6104991 6453032
8174 6453032 7394993 7816165 6809747 5469766 4911620 5378966 6047180 4825040 3853030
8165C853030O40548M39585m87683J97728K03488J47265n64531p76699l77906r1085
8155C183740K48910o13933l86780R7175l34608n95360r48014M73032l2819n15767
8145E75576j88270k31170J07423Q40492o5302P9800m43742K21493K19494n40882
8135E74912n2513j46161K57919J81788P75046O26047q93759N4232M75184o91684
8125A161011o51361J88O6801K26646M7935J78287M48621n63276j75032K87539
8115A027359n9743q80098O90581l19631q29835j58145K18215Q54325j24743j012654
8105e94369K15013J363923l89212r74845m06451J013010L87271o03122P1685K65682
8095C48585K21234m78001L11419L78259m85130R7802k0862m78321J00574Q33492
$$ plain form
8165 3853030 4493578 4933163 4445480 4643208 4846696 4993961 4429430 3652731 3274825 3183740
8155 3183740 3432650 2818717 2431937 2529112 2194504 1599144 651130 1124162 1091343 575576
8145 575576 387306 156136 263559 1104051 1038749 1118549 674807 896300 1115794 574912
8135 574912 522399 376238 634157 815945 1590991 2217038 1323279 1377511 1852695 1161011
8125 1161011 509650 509838 576639 803285 851220 1029507 1478128 914852 739820 1027359
8115 1027359 967616 87518 778099 458468 -371367 -529512 -311297 543028 418285 -594369
8105 -594369 -379356 984567 595355 -379490 -785941 227069 614340 11218 82903 348585
8095 348585 569819 91818 403237 781496 296366 394168 373306 -105015 -4441 829051
8085H29051m56678m3101r3026L09963K7915j726225Q91218N20445K49023K86240
8075G94825j74871m29572k51180j92119k45596L48069N89374l74941k76465K50689
8065C8213j27668J17405N19786Q3499j623483j213880J502613R82265J17453q18654
8055d22451o976M12105p11897O08240J05665k91941N23927m66408k16594J63736
8045c02594O39009n07330q10180P42012N99665j06539O183o93321r31683L66772
8035i98006J94864J267551k37584O19606J04128k47479k12925P2452M0283m3632
8025E59258O6478M33526q78896Q2437M20097q65537O17973M32207j31191K92960
8015A029312K38685q7947k09379k2527o76970N27209R99239k85672O7005l31187
$$ plain form
8085 829051 372373 329272 236246 546209 574124 -1152101 -260883 259562 508585 794825
8075 794825 619954 190382 -60798 -252917 -498513 -150444 438930 63989 -212476 38213
8065 38213 -89455 27950 547736 631235 -992248 -2206128 -703515 278750 396203 -422451
8055 -422451 -429427 -17322 -729219 -120979 -15314 -307255 216672 -249736 -466330 -302594
8045 -302594 336415 -170915 -981095 -239083 360582 254043 260226 -433095 -1364778 -998006
8035 -998006 -803142 464409 226825 846431 950559 703080 490155 562607 602890 559258
8025 559258 625736 1059262 180366 262803 682900 -182637 435336 867543 736352 1029312
8015 1029312 1267997 1180050 970671 948144 271174 798383 1797622 1511950 1578955 1247768
8005A247768p89319m28416J314578K42897m81076n76635k08919j97183j40856
7996a7161l06157K73671N6153J81842J607K95171L40497m5449k69640L47643L40881
7985A199058m84464m83934O49092J47650n24528L96200k23137n82499P7693p6523
7975I4608m5962J34902K22502O21286P1141k02476m23613r396j50979K21954m4020
7964D89947m03777p22114J30015R7520o26315n78661J1647K48753k61731N74396
7954a040320J16138l47584R05576J59562J03505O99485L12211k91083k34181L81219
7944G64528o71766N46414P5784j549014L36969O70591l00243K79313N51156q19166
7934a15434n22459P20056L16151p19325j89183m71363J86889l26923R4250k09796
$$ plain form
8005 1247768 458449 30033 1344611 1587508 1106432 529797 320878 123695 -17161
7996 -17161 -323318 -49647 6506 188348 189955 485126 825623 780174 510534 858177 1199058
7985 1199058 714594 230660 879752 1027402 502874 899074 675937 93438 171131 94608
7975 94608 48646 183548 406050 1027336 1098477 896001 472388 462992 312013 533967 489947
7964 489947 86170 -635944 -505929 -408409 -1034724 -1613385 -1601738 -1352985 -1614716 -1040320
7954 -1040320 -924182 -1271766 -366190 -206628 -103123 596362 908573 617490 383309 764528
7944 764528 92762 639176 714960 -834054 -497085 173506 -126737 152576 703732 -115434
7934 -115434 -637893 82163 398314 -321011 -510194 -981557 -794668 -1121591 -1027341 -1237137
7924a237137O99057M68433L98051n11221o68605n06699J10945L79123j20951k15860
7914a204864p132P62383j66445k25489M37762Q70060p99755o1524J72185k49717
7904d72536j34777M1127R054N16420p23124O28697k90000K48974j99101M8420
7894c26846l19488J76370q23397J081713P4714k11352K11692n54154K52924n1414
7884d89238L09990k45324P6452N31979L79433q46431N26058K29571l52711q15395
7874f95616j82187K58473m18652n38715l64907M85540O24786K90320j96738Q33820
7864I6124K44027J64267k63675j83771l8284m41579K02504M28712L18826o54985
7854a27834q13717J38604Q02819o64121k66515o3760L39875J55408M97091o60640
$$ plain form
7924 -1237137 -538080 -69647 328404 -182817 -851422 -1358121 -1247176 -868053 -989004 -1204864
7914 -1204864 -1211996 -449613 -616058 -841547 -403785 466275 -333480 -395004 -222819 -472536
7904 -472536 -607313 -566186 -557132 -40712 -763836 -135139 -425139 -176165 -375266 -326846
7894 -326846 -646334 -469964 -1293361 -211648 -136934 -348286 -136594 -690748 -437824 -489238
7884 -489238 -179248 -424572 -348120 183859 563292 -283139 242919 472490 119779 -695616
7874 -695616 -877803 -619330 -1037982 -1576697 -1941604 -1456064 -831278 -540958 -737696 96124
7864 96124 340151 504418 240743 56972 18688 -422891 -220387 208325 527151 -127834
7854 -127834 -941551 -802947 -128 -664249 -930764 -994524 -654649 -499241 -2150 -662790
7844f62790l96166o27478Q4797l10833K86712N31571Q76783K08870M95663J43917
7834F31046K5812o80456n71588R03386l98706k75576k0217M65516J130882o838
7824A203261q0380l27387M90336p90590J3937O47434k49977L09834j54427n10286
7814E51755o75077P94164K028900M48756J47265l0935r80774K90181j09643n35667
7804A928925o25252k88061M42616K55533J31794N58781N65144o71021K5658j26381
7794B197736n87060j88110j87730r30289L28813k77171o85875N85511O57991l61215
7784E52601n16536L73171k84340l61708n41940K43129k04887N43891p95272Q8770
7774i03121N69950J113961p82453k54659Q3704K80525m53650L24031J26861k78589
$$ plain form
7844 -662790 -1058956 -1686434 -1601637 -1912470 -1625758 -1094187 -217404 -8534 487129 631046
7834 631046 656858 -23598 -595186 308200 -90506 -366082 -386299 79217 1210099 1203261
7824 1203261 1122881 795494 1285830 495240 509177 1156611 906634 1216468 1062041 551755
7814 551755 -123322 670842 2699742 3148498 3295763 3264828 2284054 2574235 2464592 1928925
7804 1928925 1303673 1015612 1458228 1713761 1845555 2404336 2969480 2298459 2324117 2197736
7794 2197736 1610676 1422566 1234836 304547 633360 356189 -329686 255825 913816 552601
7784 552601 36065 409236 124896 -236812 -778752 -535623 -740510 -196619 -991891 -903121
7774 -903121 -333171 780790 -1663 -256322 -172618 107907 -345743 -21712 105149 -173440
7764a73440l73239l90899M27123N2693k68935L7112N28112M82545r0873L01511
7754E31710m46511N17989L95228J79834n15136p90035K61179O78980J01567j170831
7744b56026Q07499n07482q91827j4751Q12936r13962k33320N9586n20948J018680
7734f39615R45787K82088o38837L58749j09554j335331J146653j87800J64588
7725a3272J75962l76791n92872K6510L67597j50532j25828L09068r163r3643J62624
7714c20340N93989n0879r19836L3720J25845Q18603j23219l1047J03063M57808
7704F87707j25979n58116j55864K6117j20261l10639l25443p89432j1404P25047
7694i58267K48445J1697J37805J033929n48010q5059J22711n457n00444J348618
$$ plain form
7764 -173440 -546679 -937578 -510455 -457762 -726697 -689585 -161473 321072 230199 531710
7754 531710 85199 603188 998416 1178250 663114 -126921 134258 813238 914805 -256026
7744 -256026 551473 43991 -847836 -862587 -49651 -963613 -1196933 -1137347 -1658295 -639615
7734 -639615 306172 588260 -50577 308172 198618 -1136713 9940 -177860 -13272
7725 -13272 162690 -214101 -806973 -780463 -412866 -563398 -689226 -380158 -389321 -482964 -320340
7714 -320340 273649 222770 -697066 -663346 -537501 281102 157883 126836 229899 687707
7704 687707 561728 3612 -152252 -126135 -246396 -557035 -882478 -1671910 -1683314 -958267
7694 -958267 -709822 -698125 -560320 473609 -74401 -159460 -36749 -42206 -542650 805968
7684H05968q5745j472889j38777j98994o74675K02282R94729p0176l86161M83744
7674e40694P07556l17544K04175L50816j1292l91443J4642N62334Q43232n06049
7664I15733q99968o64561J175188m23847r49480j01463R44776k33597m4491K67013
7654a4697O34826l40468L53764o70505o59902l63793k98414O57356O07916J288919
7644A195002J05060p37819o3834m71475o79347k81764L0722N03196m39899P6203
7634g63955R81725J55388M24075o03994m06099M44138o31799n93492K21364J127722
7624C55073n01748l94369J17791M55557p53230l93038J99615l87591M92157p35773
7614a545556m53699N63299N59704L95198K33126j33418j019753J495M39533K80313
$$ plain form
7684 805968 720223 -752666 -891443 -1090437 -1765112 -1562830 -568101 -638277 -1024438 -540694
7674 -540694 166862 -150682 53493 404309 393017 1574 16216 578550 1421782 915733
7664 915733 15765 -648796 526392 102545 -846935 -948398 -3622 -237219 -281710 -14697
7654 -14697 620129 279661 633425 -37080 -696982 -1060775 -1359189 -701833 -93917 1195002
7644 1195002 1300062 562243 498409 26934 -652413 -934177 -903455 -400259 -840158 -763955
7634 -763955 217770 373158 797233 193239 -212860 231278 -400521 -994013 -772649 355073
7624 355073 -146675 -541044 -423253 32304 -720926 -1113964 -914349 -1301940 -809783 -1545556
7614 -1545556 -1999255 -1435956 -876252 -481054 -247928 -381346 -1401099 -1399604 -960071 -679758
7604f79758n94998L94077L89218N65266o29469M49837K65354Q0605M80080q09062
7594h8850N25255n58576n71899n49514J133367m8996n88773L71689N7683J5929
7584c02685o60206M33224k84520j121715L71333P22296K5442L08212j78505J87159
7574d99965K00253P88119M05574q14793l5777M27532q85608m3888R1372J78626
7564a88555l24018r3048n64555j05270j91738L84658q0237k1722J99724L39480
7554f45281J94533M70832l19301l49449M94434l87466L42789l96385j96339l90067
7544a181700M00464o6832L67267M33283o8499k28189l61325p00164j1926l0884
7534a448505O23848N54241O638k51111j33708k95550K64702m92650K01490L9265
$$ plain form
7604 -679758 -1274756 -880679 -491461 73805 -555664 -105827 159527 240132 720212 -88850
7594 -88850 436405 -122171 -694070 -1243584 -110217 -159213 -747986 -376297 -318614 -302685
7584 -302685 -962891 -529667 -814187 -1935902 -1564569 -842273 -816831 -508619 -687124 -499965
7574 -499965 -299712 488407 893981 79188 43411 470943 -414665 -458553 -367181 -188555
7564 -188555 -512573 -605621 -1170176 -1275446 -1467184 -1082526 -1162763 -1184485 -984761 -645281
7554 -645281 -450748 20084 -299217 -648666 -154232 -541698 -198909 -595294 -791633 -1181700
7544 -1181700 -781236 -848068 -480801 -47518 -116017 -344206 -705531 -1405695 -1417621 -1448505
7534 -1448505 -824657 -270416 -263778 -514889 -648597 -944147 -679445 -1172095 -970605 -931340
7524i31340p05710M01201P93168J53408o84578L40108n12959p97520L61541J27761
7514a454920l7135J187931J07331J23925K50102n92428K26478k3862L39862r96788
7504h69504j51776q274n76728Q23482P32629j65504l88689m87466J11227K64173
7494g16430j30865k52225N172N11405p08457k19269N37096O24224o6570m02798
7484h18717O05113L08288l06824O64389m07361j068723j72226L42707k16600K70908
7474g99046J03133r12212R63178R07264n45385R91390n39042m8627m9709l47610
7464b76666n01210M61593M57309l38150r4924J133185M20006m51423L32041K71820
7454A413581k2533m56662k27615K09433M52494p64586q3362K72085n91168j47321
$$ plain form
7524 -931340 -1637050 -1235849 -442681 -289273 -973851 -633743 -1146702 -1944222 -1582681 -1454920
7514 -1454920 -1492055 -304124 -196793 -72868 177234 -415194 -188716 -212578 127284 -869504
7504 -869504 -1021280 -1029554 -1606282 -782800 -50171 -215675 -604364 -1091830 -980603 -716430
7494 -716430 -847295 -1099520 -1094348 -582943 -1291400 -1510669 -973573 -349349 -415919 -818717
7484 -818717 -213604 94684 -212140 452249 44888 -1023835 -1196061 -853354 -1069954 -799046
7474 -799046 -695913 -1608125 -644947 262317 -283068 708322 169280 120653 70944 -276666
7464 -276666 -777876 -316283 141026 -197124 -292048 841137 1261143 809720 1141761 1413581
7454 1413581 1391048 934386 706771 916204 1368698 604112 520750 792835 201667 54346
7444E4346N90770O7570P42424n28074J62402j342759l435O99581j24080N62174
7434H80919j26741q5782M4209l6561k92503M44511m41697k08231J08202k14145
7424G2181Q3981J148624o48451o10125L93796K02253P49628J06943M60180m75088
7414A483922j48006m33853j66871L84123r69763n15750J64821N75118O56851l76501
7404F54091l86864K49487o10219o32240K89016O14348N76148r90824M54190L27535
7394E44668l30626m85857j91773J94436M42323M55494k66573k06446R61618Q74062
7384A991326n09562m53219O44800O00430o69574j394423q20872N3205l41093J18709
7374g80273P61162P65211P18753k68891m74483k98658j67308o14165Q62832N96909
$$ plain form
7444 54346 645116 712686 1455110 927036 1089438 -253321 -256756 442825 318745 880919
7434 880919 754178 668396 712605 676044 383541 828052 386355 178124 286326 72181
7424 72181 156162 1304786 656335 46210 440006 642259 1391887 1498830 1959010 1483922
7414 1483922 1335916 902063 735192 1119315 149552 -366198 -201377 373741 1030592 654091
7404 654091 267227 516714 -93505 -725745 -436729 177619 753767 -237057 217133 544668
7394 544668 214042 -271815 -463588 -269152 173171 628665 362092 155646 1117264 1991326
7384 1991326 1481764 1028545 1673345 2273775 1604201 209778 -611094 -557889 -898982 -780273
7374 -780273 -19111 746100 1464853 1195962 721479 422821 255513 -358652 504180 1101089
7364A101089p60021M52972J06063M78430l9507m73923j008986K11029J005417
7355A072563j70802k10192O80272M98423j31435l89448K6008l18950j94954K38568
7345A100053J84505k89039J79178k57320p21212L00572Q64463j472194L8841Q83066
7335H10913O6746R47836p60438n4638K79480p39529n45508Q7243o3428l92774
7325c64097K72809M32596O40235P27403l76527l33724K59945n11569M82911k1505
7315A208477n29131j9132M97273K69903n43379K8492k18201j59676p9688m82333
7305b7395N9723K02663j040554O3592k254q8129n79711n34257Q99300M22223O73741
7294D8942l33072N35800k74876n83792j65902k89363J65593r8418M59736j41452
$$ plain form
7364 1101089 341068 794040 900103 1378533 1339026 865103 -143883 67146 1072563
7355 1072563 901761 691569 1371841 1870264 1738829 1349381 1375389 1056439 861485 1100053
7345 1100053 1284558 995519 1174697 917377 196165 496737 1361200 -110994 -72153 810913
7335 810913 877659 1825495 1065057 1010419 1289899 550370 4862 92105 28677 -364097
7325 -364097 -91288 341308 981543 1708946 1332419 998695 1258640 747071 1229982 1208477
7315 1208477 679346 660214 1157487 1427390 884011 912503 694302 534626 454938 -27395
7305 -27395 32328 234991 -805563 -741971 -744225 -832354 -1412065 -1946322 -1047022 -624799 48942
7294 48942 -284130 251670 -23206 -606998 -772900 -1062263 -896670 -995088 -535352 -676804
7284f76804q1021J10423N76942N31068J30019J60376l75682r23731J06326Q0465
7274c61619J107085l24017p47113N60593N89345k96066q35964K95031M66487n81253
7264a27491o30388o9855J48200K73370l58606L34881l97956N25317K10651j015507
7254a107384K09442N50510r48410q24241J092337P06403r60254o70907J86426
7245a766078l27371P96700L92241M60811o09542m62667J137420n34031m02091
7236a314608O43342R02845n86140J031640n68030j48376M71420k2065o34691l21727
7226e46390M66048j18305l38017l61315M48470N47084j4171J13580l01682o01370
7216g06068J50642n88487J26157O513N87140o24446N5336Q17313O41553j35162
$$ plain form
7284 -676804 -757825 -647402 -70460 460608 590627 751003 375321 -548410 -442084 -361619
7274 -361619 745466 421449 -325664 234929 824274 528208 -307756 -12725 453762 -127491
7264 -127491 -757879 -827734 -679534 -406164 -764770 -429889 -827845 -302528 -91877 -1107384
7254 -1107384 -897942 -347432 -1295842 -2120083 -1027746 -321343 -1281597 -1952504 -1766078
7245 -1766078 -2093449 -1296749 -904508 -443697 -1053239 -1515906 -378486 -912517 -1314608
7236 -1314608 -671266 231579 -354561 677079 109049 -39327 432093 410028 -224663 -546390
7226 -546390 -80342 -198647 -536664 -897979 -449509 97575 83404 196984 -104698 -706068
7216 -706068 -555426 -1143913 -1017756 -1011243 -424103 -1048549 -993213 -175900 465653 330491
7206C30491Q7676r84686L79924P82035m14174k97441p067N33174l80107o12216
7196e82391n62841L51818m86571l58949J140595q22441q63847J075232J20061
7187i89334n78475J053875Q79928l30426j068617J69143K37335O63894J08616
7178A45939j41909j93309l68628J34953J09335n15187j60791Q29491l18873o56479
7168a135458O43887r8724K55122L93031K63086K51184K49960q63540p76891l86715
7158a205058m90535O21900q85281J048351M77925M84972p87629l5519N40679o72765
7148i02960Q4081L08865O56317N42556n44727n87458K49421M43023K05033m17936
7138C6215p81792K39798J085395L32258m79110m49947k30897K09333N751o31572
$$ plain form
7206 330491 418167 -566519 -186595 595440 181266 -116175 -123242 409932 29825 -582391
7196 -582391 -1145232 -793414 -1279985 -1638934 -498339 -1320780 -2184627 -1109395 -989334
7187 -989334 -1567809 -513934 365994 35568 -1033049 -863906 -626571 37323 145939
7178 145939 4030 -189279 -557907 -422954 -313619 -828806 -989597 -160106 -478979 -1135458
7168 -1135458 -491571 -590295 -335173 57858 320944 572128 822088 -41452 -818343 -1205058
7158 -1205058 -1695593 -1073693 -1958974 -910623 -432698 52274 -735355 -770874 -230195 -902960
7148 -902960 -818879 -510014 146303 688859 144132 -443326 -193905 249118 454151 36215
7138 36215 -745577 -505779 579616 911874 432764 -17183 -248080 -38747 -32996 -664568
7128f64568j8286l04843k24977N3304L33433m0390N394P32048K91542k35985r95571
7117a068899k55008M7896K95412m55188J67770Q63689M67531K31616o68304l07719
7107f81204Q16229R266m18299r11302j10711K80197N91362p6113n64439J9740
7097a045274M11864N97198O6710p645O66836J157250j620955q63742N21401n39107
7087f55464o28492P59139M86568M08641L26623L59224M9810l91782P30465N71557
7077B016289M6367O4859p09248q52552O5232l01310J57942j42711m33207K25662
7067A37323N44506R42397M52924m21534J029140J14123p33983q87309j15403O89200
7057A751384r41952J8446q11617j29708L90794M0834M32960q5177j95197k29810
$$ plain form
7128 -664568 -682854 -987697 -1212674 -1159370 -825937 -866327 -860933 -128885 162657 -73328 -1068899
7117 -1068899 -1323907 -1276011 -980599 -1435787 -1268017 -404328 63203 294819 -373485 -681204
7107 -681204 135025 144291 -274008 -1185310 -1296021 -1015824 -424462 -500575 -1065014 -1045274
7097 -1045274 -633410 -36212 30498 22853 689689 1846939 225984 -637758 -116357 -655464
7087 -655464 -1283956 -524817 -38249 370392 697015 1056239 1106049 714267 1444732 2016289
7077 2016289 2062656 2127515 1418267 565715 630947 329637 487579 344868 -88339 137323
7067 137323 681829 1624226 2077150 1655616 2684756 2798879 2064896 1177587 1062184 1751384
7057 1751384 809432 827878 16261 -113447 277347 318181 751141 665964 470767 240957
7047B40957j88720j05690J103919q39066q60080m08084Q79959J95649j62189Q12239
7037F68894n37608q2414K63776n83312j38099l13140l35935O11508Q02576l26423
7027B9823n02589j51521p05272L38700j7710K19549M65470j32112M99974n21889
7017d77577p98448K11992L82211Q16424r33276q4668K39151P54378k13676j200200
7007a303689O7568P09193K40719l15518j64019j38579J016268N25208j334989
6998f97838K83343Q2910O15935p2553l78641k4097R55183j95762q13020j190849
6988a435389M60521R18407l72519k01520M91194O70014r48180K70689R12347o56227
6978A09337l62202Q6380O91410l08321l12311J026384l04782l09889l58629k66453
$$ plain form
7047 240957 52237 -53453 1050466 211400 -648680 -1056764 -176805 18844 -143345 668894
7037 668894 131286 48872 312648 -270664 -408763 -721903 -1057838 -446330 356246 29823
7027 29823 -472766 -624287 -1329559 -990859 -1008569 -789020 -323550 -455662 44312 -477577
7017 -477577 -1276025 -1064033 -681822 134602 -798674 -883342 -644191 110187 -103489 -1303689
7007 -1303689 -1236121 -526928 -286209 -601727 -765746 -904325 111943 637151 -697838
6998 -697838 -414495 -331585 284350 211797 -166844 -190941 764242 568480 -244540 -1435389
6988 -1435389 -974868 -56461 -428980 -630500 -139306 530708 -417472 -146783 765564 109337
6978 109337 -252865 -166485 524925 216604 -95707 930677 625895 316006 -42623 -309076
6968c09076J16643K4639O42879O78414m77158q9077m59195L39378k12507n53385
6958b98445K8756l32952K80202N03260K94042L23527m20563N70300M6905m62777
6948E32255j47774K97322o51886o38025P63596P88351q39551m7106J51978P9152
6938B88312J57753N63819m85272k29670J093441l38973m63034n04229M70117j84605
6928C67659k41795k30657L2432j37591K76633j60415j73204L14217P6102l21972
6918a98591k31249N49785m22033K04270k28257o5344L57605L77291n29615l27213
6908e13351J170852M25389j341194J65119K40076l03618J43246Q58738J47491
6899I92748j29201J24040m07944l57077M13601k33174l48810J63888j36306L18506
$$ plain form
6968 -309076 -192433 -167794 475085 1153499 676341 587264 128069 467447 254940 -298445
6958 -298445 -269689 -602641 -322439 180821 474863 798390 377827 948127 995032 532255
6948 532255 384481 681803 29917 -608108 155488 943839 104288 57182 209160 288312
6938 288312 446065 1009884 524612 294942 1388383 1049410 586376 82147 552264 367659
6928 367659 125864 -104793 -72361 -209952 66681 -93734 -266938 47279 123381 -198591
6918 -198591 -429840 119945 -302088 -97818 -326075 -391419 -33814 343477 -186138 -513351
6908 -513351 657501 1082890 -258304 -93185 146891 -156727 -13481 845257 992748
6899 992748 863547 987587 579643 222566 636167 402993 54183 218071 81765 400271
6889D00271L48313M54011n44748p32089l71950Q23246P73118M66260K60881K30873
6879B108186p01342l4011n00970l92182l29814n53371p9106N54063L80048l76180
6869G5321Q00192k87673J14936J31790M68666M16761J9273n42432m57114l61651
6859C78069L63874P04910o28702M20987J71035L57054j57441n29834J76037o6704
6849A189285l65538j080244j42871R88464k46549M67759L25907m51934P44121
6840A428400P04383j219636j139345M34179J095992O9476J76953K05579j54404
6831A601577p26889o06613K42898K55503K2943n18322L31921P3240Q99118p75288
6821H00088J5742M75566M34759q27150m1704N42984J30287N99848L84862p3477
$$ plain form
6889 400271 748584 1202595 657847 -74242 -446192 377054 1150172 1616432 1877313 2108186
6879 2108186 1406844 1372833 871863 479681 149867 -403504 -482610 71453 451501 75321
6869 75321 875513 587840 702776 834566 1303232 1719993 1739266 1196834 739720 378069
6859 378069 741943 1446853 818151 1239138 1410173 1767227 1609786 1079952 1255989 1189285
6849 1189285 823747 -256497 -399368 589096 342547 810306 1136213 684279 1428400
6840 1428400 2132783 913147 -226198 207981 1303973 1373449 1550402 1755981 1601577
6831 1601577 874688 268075 510973 766476 789419 271097 603018 676258 1575376 800088
6821 800088 815830 1291396 1726155 899005 857301 1400285 1530572 2130420 2515282 2441805
6811B441805k58078L04165N14576m15593o67719m98494k58599P45993l01404L1619
6801A638271J28363L42656N6172j2710J218332J071717m42774l51901L21839J093727
6791E063692j05672o96906n44802L4679Q83728M42698m69305M31067o58557L37751
6781D718373K05447O22112N35525J026401J49112l52253O88508L08165j23709
6772G777681n61822m55496O07073L10348l95195K74730n4472n3474J073015k17193
6762H305195n31570J85479L14963l67443k32863K48362M005O71526J14496o8331
6752H643819L13828N43041L51263j33004l6448P09634J00153j101862k89243k53590
6742H847591J49829K40764O1673k72634N60359K62233q57342k42696M46938l79206
$$ plain form
6811 2441805 2183727 2487892 3002468 2586875 1919156 1420662 1162063 1908056 1606652 1638271
6801 1638271 1766634 2109290 2165462 2152752 3371084 4442801 4000027 3648126 3969965 5063692
6791 5063692 4958020 4261114 3716312 3750991 4634719 5077417 4608112 5039179 4380622 4718373
6781 4718373 4923820 5545932 6081457 7107858 7256970 6904717 7593225 7901390 7777681
6772 7777681 7215859 6760363 7367436 7677784 7282589 7557319 7502847 7449373 8522388 8305195
6762 8305195 7773625 7959104 8274067 7906624 7673761 7922123 7926128 8597654 8712150 8643819
6752 8643819 8957647 9500688 9851951 9718947 9682499 10392133 10492286 9390424 9101181 8847591
6742 8847591 8997420 9238184 9299857 9027223 9587582 9849815 8992473 8749777 9196715 8817509
6732H817509k24089N60994N33079N13352m91923l42411n40417p7409K60823j0543
6722H998965j47387J87895o77708m1456k8736M46123n05538Q12079m97203p01969
6712G845065m55564N51107k6090M62792J54518P88929P8001q05262l79667m39500
6702G774329K89247q22675j25690O12980J90614l26835k94405L37216j35240K48491
6692G748032k47675o84321p369q3330n4002p66167k03046l77404L16524Q04136
6682F445378m68488o28194n89364j53727n1613M78477r63277m70242J7311J01568
6672C717829j08246p49946N04796o89659k15752n79302O48121K43289m64910J71271
6662B477491m48532p91977M12565M26336o89193o98502O91097J12149P71904q37884
$$ plain form
6732 8817509 8593420 9154414 9687493 10200845 9708922 9366511 8826094 8748685 9009508 8998965
6722 8998965 8851578 9039473 8361765 8320309 8291573 8737696 8232158 9044237 8547034 7845065
6712 7845065 7389501 7940608 7914518 8377310 8531828 9320757 9398758 8593496 8213829 7774329
6702 7774329 8063576 7240901 7115211 7728191 7918805 7591970 7297565 7634781 7499541 7748032
6692 7748032 7500357 6816036 6808667 6725337 6671335 5905168 5702122 5324718 5641242 6445378
6682 6445378 5976890 5348696 4759332 4605605 4553992 5032469 4069192 3598950 3616261 3717829
6672 3717829 3609583 2859637 3364433 2674774 2459022 1879720 2527841 2771130 2306220 2477491
6662 2477491 2028959 1236982 1649547 2075883 1386690 688188 1379285 1491434 2263338 1425454
6652A425454j248958J110561O72461l24258o22040l13387J02618J94917j14956
6643H82412K77137m8997o90021o95438J291143J192092l10439n4283L50760J10477
6633B304843q89564r66l5271o66278j182859N32547R44641L30345k52063J72545
6623A257920J12168j17527K80733q1597J71553k96262L00099q51212j292077P8606
6613d37596J052811J52204o75669k13876J149713O9387n35670O06114K47039k54478
6603A159979Q65229j29833j051033j07602Q61112J16892j514878l33465j92053
6594c25652J250098L99408j36793P03721L4379m1130J0292l64160k13994r4792
6584A221377j68058o23935M42622J394827J23723o79538k51488L29497q1027o59231
$$ plain form
6652 1425454 176496 1287057 1959518 1635260 1013220 699833 802451 997368 882412
6643 882412 1159549 1110552 420531 -274907 1016236 2208328 1897889 1843606 2194366 2304843
6633 2304843 1415279 1414313 1379042 712764 -470095 62452 1007093 1337438 1085375 1257920
6623 1257920 1370088 1252561 1533294 1451697 1623250 1326988 1627087 775875 -516202 -437596
6613 -437596 615215 767419 91750 -122126 1027587 1096974 561304 1167418 1414457 1159979
6603 1159979 2025208 1895375 844342 736740 1597852 1714744 199866 -133599 -325652
6594 -325652 924446 1323854 1187061 1890782 1925161 1884031 1894323 1530163 1316169 1221377
6584 1221377 1053319 429384 872006 2266833 2390556 1711018 1459530 1789027 1708000 1048769
6574A048769l82417J17991J67677q849k02947J76444J45965K75036n2948L07934
6564A592655J055042l8978r87767o84253K15034o36364Q2821J530997j66707p9426
6554A883054Q75304o1262j10667K03350j43423m68722k99474k74063P08025k78169
6544B033953n84029p05263N83047O89503o7895l90261j011850P93129J185267
6535B525601l86590p06055M12257l4523N32842m06771k48152M0141j1401k85802
6525A431547n10167P57825J262739l04356n86377o08898Q90363o9399j132650
6516A130627J19741l34017O68382J918L6441m20446J18148j90563n84011J050088
6506A596308J018164r32757o28170O59586J5362m85439m1196O24902m48908J16455
$$ plain form
6574 1048769 666352 784343 952020 943171 740224 916668 1062633 1337669 1284721 1592655
6564 1592655 2647697 2608719 1620952 936699 1151733 515369 598190 2129187 1962480 1883054
6554 1883054 2758358 2697096 2586429 2789779 2646356 2177634 1878160 1604097 2312122 2033953
6544 2033953 1449924 744661 1327708 2017211 1949316 1559055 547205 1340334 2525601
6535 2525601 2139011 1432956 1845213 1810690 2343532 1936761 1688609 1728750 1717349 1431547
6525 1431547 921380 1679205 2941944 2637588 2051211 1442313 2332676 2263277 1130627
6516 1130627 1250368 916351 1584733 1586651 1623092 1202646 1320794 1130231 546220 1596308
6506 1596308 2614472 1681715 1053545 1713131 1728493 1243054 1201858 1826760 1377852 1494307
6496A494307o01659K76997M90345m96216n78614N32122N19052k33390n46131l05121
6486E51692l54227M97795P17444J78962m0088K54468j096509m41668J588902k60748
6476A596023r47678N27937O48380m70210P191K39410l65757j13287o689P85557
6466A900877O38532k90146k92433j44078J73652l4895p77465j25051R2275M9882
6456A191150n84071k90934J047649J12563l9799l91464k16641r8417M14287j45153
6446I99170K46794k77219l0749K67116k20170L91773j09382k76200K16454M38304
6436A645891Q10910L23395Q44027p21634l69424J88215j02748p22964o86562p0719
6426A138387J080426M18679l71690o27832p50431M35646Q69354K98705l24087
$$ plain form
6496 1494307 892648 1169645 1659990 1163774 585160 1117282 1636334 1402944 856813 551692
6486 551692 197465 695260 1412704 1591666 1551578 1806046 709537 267869 1856771 1596023
6476 1596023 648345 1176282 1824662 1354452 1361643 1601053 1235296 1122009 1115320 1900877
6466 1900877 2539409 2249263 1956830 1812752 1986404 1951509 1174044 1048993 1141268 1191150
6456 1191150 607079 316145 1363794 1476357 1436558 1045094 828453 730036 1144323 999170
6446 999170 1245964 968745 937996 1205112 984942 1376715 1267333 991133 1207587 1645891
6436 1645891 2456801 2780196 3624223 2902589 2533165 2721380 2618632 1895668 1209106 1138387
6426 1138387 2218813 2637492 2265802 1637970 887539 1323185 2192539 2491244 2167157
6417B167157J58981N14686P29417l67903j8257N9171K73460j58950Q32780j79686
6407D010856R7919J153290j4483j53952K57888M11799l6165n09417k25067J109591
6397F102259N06875n46718K18245K89131K06178M95836k3310M15905Q14810m85483
6387G993728j043093J46093N53405j51583L73099k72369o74903l6356Q5469j94489
6377F779001J03881O95404l99386k2968J35640J93008n364l8262J14945r40828
6367F615071k60403j83582N87204r29496o44842q76601N1046P45016j69343l58084
6357D575986N34536n04002j32995j12165p97291K22244J211331M34610r84714
6348D447540J98202M50753M83244r90063J359173N81495L899o99055O22120j7658
$$ plain form
6417 2167157 2326138 2840824 3570241 3202338 3184081 3243252 3516712 3357762 4190542 4010856
6407 4010856 4108775 5262065 5247582 5093630 5351518 5763317 5727152 5217735 4992668 6102259
6397 6102259 6609134 6062416 6280661 6569792 6775970 7271806 7248496 7664401 8479211 7993728
6387 7993728 6950635 7096728 7650133 7498550 7871649 7599280 6924377 6888021 6973490 6779001
6377 6779001 6882882 7578286 7178900 7155932 7291572 7484580 7479216 7440954 7555899 6615071
6367 6615071 6354668 6171086 6758290 5828794 5183952 4307351 4358397 5103413 4934070 4575986
6357 4575986 5110522 4606520 4473525 4361360 3564069 3786313 4997644 5432254 4447540
6348 4447540 4645742 5096495 5579739 4589676 5948849 6530344 6534243 5835188 6457308 6439650
6338F439650q35442p76235L39616Q76324M84098J176798j1979L02640R86765m78830
6328H503405l01991Q7010J39625P67760J292531O81153P45941Q60661L20229L62039
6318A3458363M77827M98806J378415J385917J055019L88174P26710O15214r48121
6309A9036324l38976j196072J60119M26472J62650q7056L14818J085310l29473
6300A9234116o49663m25203l25839k11815N41724o46661j166898l70915j187676
6291A4791170q52753J3034m57992q87017J01164K56497n53336n43474Q38434J91819
6281A2897546o17204M95210l23781p2780L73342l1479l33604R7871O55145M9772
6271A3190038K81042J016544O88878o05478K77942L610N49234O0920m40716n99080
$$ plain form
6338 6439650 5604208 4827973 5167589 6043913 6528011 7704809 7692830 7995470 8982235 8503405
6328 8503405 8201414 8288424 8428049 9195809 10488340 11169493 11915434 12776095 13096324 13458363
6318 13458363 13936190 14434996 15813411 17199328 18254347 18642521 19369231 19984445 19036324
6309 19036324 18697348 17501276 17661395 18087867 18250517 18163461 18478279 19563589 19234116
6300 19234116 18584453 18159250 17833411 17621596 18163320 17516659 16349761 15978846 14791170
6291 14791170 13938417 13951451 13493459 12606442 12707606 12964103 12410767 11867293 12705727 12897546
6281 12897546 12280342 12775552 12451771 12378991 12752333 12720854 12387250 12485121 13140266 13190038
6271 13190038 13471080 14487624 15176502 14571024 14848966 14852576 15401810 15462730 15022014 14422934
6261A4422934p3999l67140L41513m66636l58032M09782n27667j90574M84323Q48805
6251A4523309p07778J129985J019244M22993J546454Q57565O97843N98601J234358
6242B1322574J696517J470575J061148N08451O6774J430620J56017n77952M24558
6233B7559282J54585l24278R85590m12770j1119n1322Q08625q65336P2408P34453
6223B8650118j018583j411440Q64105J86880k47964j029586k129622o09160j753636
6214B1501112j318901j018081K45873l73796q8964j412335q49039r68855p17306
6205A4999708j838588r02591M6633N68291j1425K84143L68424J46418N5376j30232
6195A3586157k17686R14334J53773k35071J31118J94449m79501j101885J71593
$$ plain form
6261 14422934 14348935 13981795 14323308 13856672 13498640 13908422 13380755 13190181 13674504 14523309
6251 14523309 13815531 14945516 15964760 16387753 17934207 18791772 19489615 20088216 21322574
6242 21322574 23019091 24489666 25550814 26059265 26126039 27556659 27712676 27134724 27559282
6233 27559282 27713867 27389589 28375179 27962409 27951290 27899968 28708593 27843257 27915665 28650118
6223 28650118 27631535 26220095 27084200 27271080 27023116 25993530 23863908 23254748 21501112
6214 21501112 20182211 19164130 19410003 19036207 18947243 17534908 16685869 15717014 14999708
6205 14999708 13161120 12258529 12305162 12873453 12862028 13146171 13514595 13661013 13716389 13586157
6195 13586157 13368471 14282805 14436578 14201507 14332625 14527074 14047573 12945688 13117281
6186A3117281n08795o20623k56455j76763k86050k51714j78185o25164j01135
6177A0112397K85629R3791o00906N53360P56923L61578j160070k06108k06158
6168I990436o4407J098849J22940j82608O80902k60590k42932N65034M03505K42516
6158A2353645r27233j74502N26763L00382p88934N78367o21911K1972l43M06430
6148A1674636m90597n47221p2474l69252l42959n34807j072784l85418Q64842
6139H723966l40484p15293r3629N90571l48321n41121J94497P97291M35488o0150
6129H642815o03972j77735r6316K30787n26440n105M28029k46761L34638p25955
6119G253985j69094k0131k74557L10525j01696m54674j88602M30635n40920q01274
$$ plain form
6186 13117281 12608486 11987863 11731408 11554645 11268595 11016881 10838696 10213532 10112397
6177 10112397 10398026 10491817 9890911 10444271 11201194 11562772 10402702 10196594 9990436
6168 9990436 9926029 11024878 11147818 10965210 11646112 11385522 11142590 11707624 12111129 12353645
6158 12353645 11426412 11251910 11778673 12079055 11290121 11868488 11246577 11268549 11268206 11674636
6148 11674636 11184039 10636818 10564344 10195092 9852133 9317326 8244542 7859124 8723966
6139 8723966 8383482 7668189 7574560 8165131 7816810 7275689 7470186 8267477 8702965 8642815
6129 8642815 8038843 7861108 7764792 7995579 7469139 7464034 7892063 7645302 7979940 7253985
6119 7253985 7084891 7064760 6790203 7100728 6999032 6544358 6355756 6786391 6245471 5444197
6109E444197j22977O28277K87354j5665K41010P00165k93981J89406O239p4266
6099F989759m55633n53472n12390J42360M28526o8224J32439J73391j026259o56754
6089D593743O49411p61096J68383K89169J06636o58159J19677R80843j31212q27193
6079D530202j06391P15991K24936K8347L65788L45891m67273m32907p9581K73833
6069E398836M84644m77653p87831o3505J78936O34758P60449J50306r7622o76623
6059E504695j89397N22456M46512r30210k32414n31702J046804k16950o83890
6050D735904p74955M18658J758911R7788j111953j202245p1151q29154J63500
6041C185303J049938l82669M12324M49823n89335L42627P49864M4047L92930j34730
$$ plain form
6109 5444197 5321220 5949497 6236851 6221186 6462196 7162361 6868380 7057786 7064025 6989759
6099 6989759 6534126 5980654 5468264 5610624 6039150 5970926 6103365 6276756 5250497 4593743
6089 4593743 5243154 4482058 4650441 4939610 5046246 4388087 4507764 5488607 5357395 4530202
6079 4530202 4423811 5139802 5364738 5393085 5758873 6104764 5637491 5204584 5125003 5398836
6069 5398836 5883480 5405827 4617996 4554491 4733427 5368185 6128634 6278940 6181318 5504695
6059 5504695 5315298 5837754 6284266 5354056 5121642 4589940 5636744 5419794 4735904
6050 4735904 3960949 4379607 6138518 6236306 5124353 3922108 3850957 3021803 3185303
6041 3185303 4235241 3852572 4264896 4714719 4125384 4468011 5217875 5261922 5654852 5520122
6031E520122k17854P57836n57377j138171n9081O5495M50289Q69126O9565q73102
6021D886848n25460q3811l34368j70325L54268m82379K69295J07173l70260R00120
6011D551101o3461L3546k16850K56154P2602L23332L1649j252353j72870l11423
6001C251427l0135N21216K61381j78159K4109J9346O86170O92091m90962J89355
5991D945839N61983j415012K52113J328469l77752j197974M3963K18639n74984
5982C785284K1142P09416N32066l48839J199118o05215m70069n55599k92799N11122
5972D485627N37980M9903O29799j32834J52030K85061N65040j39266k23158j37362
5962F072820J37549R7325o3301J000386L84005p58508J14165o86868j026682L79285
$$ plain form
6031 5520122 5302268 6060104 5502727 4364556 4305475 4370970 4821259 5690385 5759950 4886848
6021 4886848 4361388 4277577 3943209 3772884 4127152 3644773 3914068 4021241 3650981 4551101
6011 4551101 4487640 4521186 4304336 4560490 4633092 4956424 4988073 3735720 3562850 3251427
6001 3251427 3221292 3742508 4003889 3825730 3849839 3869185 4555355 5247446 4756484 4945839
5991 4945839 5507822 4092810 4344923 5673392 5295640 4097666 4141629 4360268 3785284
5982 3785284 3806426 4515842 5047908 4699069 5898187 5292972 4822903 4267304 3974505 4485627
5972 4485627 5023607 5073510 5703309 5570475 5722505 6007566 6572606 6433340 6210182 6072820
5962 6072820 6210369 6307694 6244393 7244779 7628784 6870276 6984441 6297573 5270891 5650176
5952E650176J057989p3636q64166N63903j5223O59950K93072l77387j05374n00073
5942F289231P3616m37079J095061R33541P1799K69844N42378n88869M63194O85197
5932I397913L11786j52594j39441O44022l30669o7483L95590K20809O67885m09602
5922A0538216r30735j29194K39158L92476j65949J11426L12288K83679m945j45476
5912A0500944j327390K23757n70636n23217N94391M3888j023884k15318R9261
5903G801796J91831j08740L55931k98127Q3333J884355J383263L25921J198137
5894A2817700L62896K10150R15766P56060K280045J244722K218612K394278J624488
5885B4824717L94996j668386m16475j984982k170842k214215l76851q05632j634463
$$ plain form
5952 5650176 6708165 6634529 5770363 6334266 6319043 6978993 7272065 6894678 6789304 6289231
5942 6289231 6362847 5925768 7020829 7954370 8026169 8296013 8838391 8249522 8712716 9397913
5932 9397913 9709699 9557105 9417664 10061686 9731017 9663534 10059124 10279933 10947818 10538216
5922 10538216 9607481 9478287 9717445 10109921 9943972 10055398 10367686 10651365 10646420 10500944
5912 10500944 9173554 9397311 8826675 8303458 8897849 8941737 7917853 7702535 7801796
5903 7801796 7993627 7884887 8240818 7942691 8026024 9910379 11293642 11619563 12817700
5894 12817700 13180596 13390746 14306512 15062572 17342617 18587339 20805951 23200229 24824717
5885 24824717 25219713 23551327 23134852 21149870 18979028 16764813 16387962 15582330 13947867
5876A3947867m61182l87931o92129l68435k37103j182171j75308o16577l79319
5867I447712n16760l70507Q76579P362l22325M70909J50158l19141m48013K00753
5857I176727j85794n79352Q15549r3443N29399q70636r4553J39729n05450k48221
5847H083955K46849o43145K64755O06682J029623m44760j112334L17973j044808
$$ plain form
5876 13947867 13486685 13098754 12406625 12038190 11801087 10618916 10443608 9827031 9447712
5867 9447712 8930952 8560445 9437024 9444386 9122061 9592970 9743128 9423987 8975974 9176727
5857 9176727 8990933 8411581 9227130 9133687 9663086 8792450 8697897 8837626 8332176 8083955
5847 8083955 8330804 7687659 7952414 8559096 9588719 9143959 8031625 8349598 7304790
$$ [...]
##END NTUPLES=NMR SPECTRUM
##END=
