##TITLE=1H_EC-3302(II-2)
 CDCl3
 8 sc, 
 27.10.2023
##JCAMPDX= 6.0         $$ Bruker NMR JCAMP-DX V2.0
##DATA TYPE= NMR SPECTRUM
##DATA CLASS= NTUPLES
##ORIGIN= UXNMR, Bruker Analytische Messtechnik GmbH
##OWNER= root
$$ XWIN-NMR		Version 3.5
$$ Fri Oct 27 15:22:18 2023 Russian Standard Time (UT+4h)  she@DPX200
##.OBSERVE FREQUENCY= 200.13135
##.OBSERVE NUCLEUS= ^1H
##.ACQUISITION MODE= SIMULTANEOUS
##.ACQUISITION SCHEME= undefined
##.AVERAGES= 8
##.DIGITISER RES= 18
##SPECTROMETER/DATA SYSTEM= spect
##.PULSE SEQUENCE= zg30
##.SOLVENT NAME= CDCl3
##.SHIFT REFERENCE= (INTERNAL, CDCl3, 0, 15.7326)
##AUDIT TRAIL= $$ (NUMBER, WHEN, WHO, WHERE, WHAT)
$$ ##TITLE= Audit trail, XWIN-NMR		Version 3.5
$$ ##JCAMPDX= 5.01
$$ ##ORIGIN= Bruker BioSpin GmbH
$$ ##OWNER= she
$$ F:/spectra/data/she/nmr/H-F/1/pdata/1/auditp.txt
$$ ##AUDIT TRAIL=  $$ (NUMBER, WHEN, WHO, WHERE, WHAT)
(   1,<2023-10-27 15:21:15.07 +0400>,<she>,<DPX200>,
      <created by zg, POWCHK disabled, PULCHK disabled
       configuration hash MD5:
       00 E9 B6 7A A2 85 ED C7 34 08 36 98 17 FE 4E 26
       data hash MD5: 16K
       68 27 CF B1 05 88 27 2E C0 11 73 05 9A DE 49 C3>)
(   2,<2023-10-27 15:21:17.56 +0400>,<she>,<DPX200>,
      <Start of raw data processing
       efp BC_mod = 2 LB = 0.24 FT_mod = 6 PKNL = 1 PHC0 = -23423.07 PHC1 = 8.652719 SI = 16K 
       data hash MD5: 16K
       6A 84 79 8D 3C 3D 56 2C E1 74 7D 4A 0E 59 60 D5>)
(   3,<2023-10-27 15:21:31.70 +0400>,<she>,<DPX200>,
      <pk PHC0 = -84.17336 PHC1 = 2 
       data hash MD5: 16K
       00 A4 48 75 C1 A9 0B E0 35 FA 2B FE 89 8E C3 25>)
(   4,<2023-10-27 15:21:34.78 +0400>,<she>,<DPX200>,
      <abs ABSG = 5 
       data hash MD5: 16K
       2C 66 A5 B2 28 76 E9 D6 A4 3C 77 67 CC 38 95 D6>)
$$ ##END=
$$ 
$$ hash MD5
$$ 6F C2 30 EC B7 15 E4 CF 17 B2 B7 4D BA 5B 99 86
##$RELAX= 
##$RELAX= 
##$RELAX= 
##$RELAX= 
##$RELAX= 
##$RELAX= 
$$ Bruker specific parameters
$$ --------------------------
##$DU= <F:/spectra>
##$EXPNO= 1
##$NAME= <H-F>
##$PROCNO= 1
##$TYPE= <nmr>
##$USER= <she>
##$AMP= (0..31)
100 100 100 100 100 100 100 100 100 100 100 100 100 100 100 100 100 100 
100 100 100 100 100 100 100 100 100 100 100 100 100 100 
##$AQSEQ= 0
##$AQ_mod= 1
##$AUNM= <au_zg>
##$AUTOPOS= <>
##$BF1= 200.13
##$BF2= 200.13
##$BF3= 200.13
##$BF4= 200.13
##$BF5= 200.13
##$BF6= 200.13
##$BF7= 200.13
##$BF8= 200.13
##$BYTORDA= 1
##$CFDGTYP= 0
##$CFRGTYP= 5
##$CHEMSTR= <none>
##$CNST= (0..31)
1 1 145 1 1 1 1 1 1 1 1 1 1 1 1 1 1 1 1 1 1 1 1 1 1 1 1 1 1 1 1 1 
##$CPDPRG= <>
##$CPDPRG1= <>
##$CPDPRG2= <>
##$CPDPRG3= <>
##$CPDPRG4= <mlev>
##$CPDPRG5= <mlev>
##$CPDPRG6= <mlev>
##$CPDPRG7= <mlev>
##$CPDPRG8= <mlev>
##$CPDPRGB= <>
##$CPDPRGT= <>
##$D= (0..31)
0 1.2 0 0 0 0 0 0 0 0.06 0 0.03 0 0 0 0 0.0002 0 0 0 0 0 0 0 0 0 0 0 0 
0 0 0 
##$DATE= 1698405674
##$DBL= (0..7)
120 120 120 120 120 120 120 120 
##$DBP= (0..7)
150 150 150 150 150 150 150 150 
##$DBP07= 0
##$DBPNAM0= <>
##$DBPNAM1= <>
##$DBPNAM2= <>
##$DBPNAM3= <>
##$DBPNAM4= <>
$$ [...]
##$SUBNAM3= <"">
##$SUBNAM4= <"">
##$SUBNAM5= <"">
##$SUBNAM6= <"">
##$SUBNAM7= <"">
##$SUBNAM8= <"">
##$SUBNAM9= <"">
##$SW= 18.05172834244
##$SWIBOX= (0..15)
0 0 2 0 0 0 0 0 0 0 0 0 0 0 0 0 
##$SW_h= 3612.71676300578
##$TD= 16384
##$TD0= 1
##$TE= 0
##$TE2= 300
##$TE3= 300
##$TEG= 300
##$TL= (0..7)
0 120 120 120 120 120 120 120 
##$TP= (0..7)
150 150 150 150 150 150 150 150 
##$TP07= 0
##$TPNAME0= <>
##$TPNAME1= <>
##$TPNAME2= <>
##$TPNAME3= <>
##$TPNAME4= <>
##$TPNAME5= <>
##$TPNAME6= <>
##$TPNAME7= <>
##$TPOAL= (0..7)
0.5 0.5 0.5 0.5 0.5 0.5 0.5 0.5 
##$TPOFFS= (0..7)
0 0 0 0 0 0 0 0 
##$TUNHIN= 0
##$TUNHOUT= 0
##$TUNXOUT= 0
##$USERA1= <user>
##$USERA2= <user>
##$USERA3= <user>
##$USERA4= <user>
##$USERA5= <user>
##$V9= 5
##$VALIST= <valist>
##$VCLIST= <CCCCCCCCCCCCCCC>
##$VD= 0
##$VDLIST= <DDDDDDDDDDDDDDD>
##$VPLIST= <PPPPPPPPPPPPPPP>
##$VTLIST= <TTTTTTTTTTTTTTT>
##$WBST= 1024
##$WBSW= 4
##$XGAIN= (0..3)
0 0 0 0 
##$XL= 0
##$YL= 0
##$YMAX_a= 165533
##$YMIN_a= -204410
##$ZGOPTNS= <>
##$ZL1= 120
##$ZL2= 120
##$ZL3= 120
##$ZL4= 120
##$ABSF1= 15.72485
##$ABSF2= -2.327
##$ABSG= 5
##$ABSL= 3
##$ALPHA= 0
##$AQORDER= 0
##$ASSFAC= 0
##$ASSFACI= 0
##$ASSFACX= 0
##$ASSWID= 0
##$AUNMP= <proc_1d>
##$AZFE= 0.1
##$AZFW= 0.1
##$BCFW= 0
##$BC_mod= 2
##$BYTORDP= 0
##$COROFFS= 0
##$CY= -3
##$DATMOD= 1
##$DC= 0
##$DFILT= <>
##$DTYPP= 0
##$F1P= 0
##$F2P= 0
##$FCOR= 1
##$FTSIZE= 16384
##$FT_mod= 6
##$GAMMA= 0
##$GB= 0
##$INTBC= 1
##$INTSCL= 3.70164e-10
##$ISEN= 128
##$LB= 0.24
##$LEV0= 0
##$LPBIN= 0
##$MAXI= 10000
##$MC2= 0
##$MEAN= 0
##$ME_mod= 0
##$MI= 1.114404
##$NCOEF= 0
##$NC_proc= -8
##$NLEV= 6
##$NOISF1= 3.799351
##$NOISF2= 2.8
##$NSP= 0
##$NTH_PI= 0
##$NZP= 0
##$OFFSET= 15.73257
##$PC= 1
##$PHC0= -23507.24
##$PHC1= 10.65272
##$PH_mod= 1
##$PKNL= yes
##$PPARMOD= 0
##$PSCAL= 0
##$PSIGN= 0
##$REVERSE= no
##$SF= 200.130007799989
##$SI= 16384
##$SIGF1= 3
##$SIGF2= 2
##$SINO= 5.538805
##$SIOLD= 16384
##$SREGLST= <1H.CDCl3>
##$SSB= 0
##$STSI= 16384
##$STSR= 0
##$SW_p= 3612.71676300578
##$SYMM= 0
##$S_DEV= 0
##$TDeff= 16384
##$TDoff= 0
##$TI= <>
##$TILT= no
##$TM1= 0
##$TM2= 0
##$TOPLEV= 0
##$USERP1= <user>
##$USERP2= <user>
##$USERP3= <user>
##$USERP4= <user>
##$USERP5= <user>
##$WDW= 1
##$XDIM= 16384
##$YMAX_p= 285330575
##$YMIN_p= -2650954
$$ End of Bruker specific parameters
$$ ---------------------------------
##NTUPLES= NMR SPECTRUM
##VAR_NAME=  FREQUENCY,     SPECTRUM/REAL,   SPECTRUM/IMAG
##SYMBOL=    X,             R,               I
##VAR_TYPE=  INDEPENDENT,   DEPENDENT,       DEPENDENT
##VAR_FORM=  AFFN,          ASDF,            ASDF
##VAR_DIM=   16384,         16384,           16384
##UNITS=     HZ,            ARBITRARY UNITS, ARBITRARY UNITS
##FACTOR=    0.220516191357247, 1,           1
##FIRST=     3148.55929567797, 0,            0
##LAST=      -464.157467327814, 0,           0
##MIN=       -464.157467327814, -2650954,    0
##MAX=       3148.55929567797, 285330575,    0
$$ Real data points
##PAGE= N=1
##DATA TABLE= (X++(R..R)), XYDATA
$$ [...]
8138 1471685 902159 731326 1096983 1226108 1804160 563249 368443 1140818 619988
8129 619988 303745 1026395 848553 579097 -8516 -899840 -278519 -343315 -468086 423176
8119 423176 504589 1447103 953932 -120295 50484 667978 1112917 552529 992606 1285989
8109 1285989 1418298 192924 550308 928514 1566743 961443 708018 1260460 1039788
8100 1039788 -526152 -1071197 -233075 102837 186541 533645 882065 486510 36551 -526443
8090 -526443 -72478 -565713 -1302150 -1033520 -428801 -324152 -888581 380025 633532 1071204
8080 1071204 900419 608689 1598542 -354101 -746175 -1463341 -627639 -722945 -268646 1453334
8070 1453334 1424713 2125507 816211 554861 119639 605508 698934 1487386 1906814 1014045
8060 1014045 284085 -369852 -1039028 -667192 278399 264876 1007716 387323 -296800 63868
8050 63868 230147 -34840 120669 303571 1047425 319356 -646262 -596432 -752963 -521947
8040 -521947 -966019 -760971 126816 449126 804402 -113845 613437 208903 -122161 -230336
8030 -230336 -578767 -130692 -243469 -352642 162600 -24633 -1007383 -1262172 -925478 -484007
8020 -484007 -818050 -1089755 342214 120120 806536 181408 170318 517117 404774 450421
8010 450421 -116610 125222 307197 521150 1000613 722239 292617 -22235 -536341 -183459
8000 -183459 -102012 167865 178416 324977 -274213 -242347 -398194 -177259 606535 503901
7990 503901 851185 1151083 743419 903822 808314 226176 577190 958856 -254489 -608861
7980 -608861 -160874 776477 233048 533944 1420497 1003965 617034 -183215 -225149 475566
7970 475566 -218367 357087 771569 109931 50363 -446997 740379 928076 1850 480810
7960 480810 139356 -1098582 -1612994 -1487444 -424140 101403 684399 599130 410128 -256192
7950 -256192 -251292 -59321 -226722 -121265 -66773 562710 -906202 -726610 -1253491 -1197842
7940 -1197842 -1068812 -818551 330779 1198078 620681 -248134 242748 225431 -439315 -189699
7930 -189699 -165743 398695 620692 291336 699010 356193 -344890 -932716 -916763 -1151919
7920 -1151919 -1602696 -493479 -248791 195028 -401006 52896 440197 -647104 -249367
7911 -249367 -642032 583546 15941 -383855 -147577 -788780 -594443 -1084019 -1513592 179594
7901 179594 766288 674342 3793 35790 363501 -56669 210788 -406585 250209 -282443
7891 -282443 -1015459 -806921 -709144 -460823 -624039 -122826 -327242 -135081 199125 -476992
7881 -476992 293877 -596529 -476679 -108937 -602735 -505380 -319824 -328741 -247611 -239308 175161
7870 175161 829470 359678 1358779 287470 717123 -169376 -111607 -234496 -779903 -860926
7860 -860926 -1004867 -231066 -99145 465873 260297 466143 271088 569263 272539 -16278
7850 -16278 930322 -66728 102985 -876082 -563063 -239461 -862690 -644263 -548591 -905606
7840 -905606 -769676 -402719 -12149 88684 381253 1221330 801241 784980 -218368 -289005
7830 -289005 200215 -691502 -1093059 -1622102 -1138217 -776483 -344274 -470694 -681188 -685895
7820 -685895 -1316491 -1534395 -1439009 -625471 -1233296 -1348667 -1217663 -1207562 -1099488 -935062
7810 -935062 -655911 -591633 -1159994 -316661 835425 457858 -258479 -154149 -139381 -543977
7800 -543977 -476150 -615883 -1647125 -1196569 -1575213 -1060147 -150656 721149 1190514 1014261
7790 1014261 459061 -603045 -257597 -1025388 -840738 115910 315019 477873 -27307
7781 -27307 154716 512997 797559 -341147 703320 1036659 767171 220658 25562 806764
7771 806764 799598 -488327 91661 746036 607240 611728 803450 890616 -317668 -643982
7761 -643982 -960353 -999829 -940515 -693685 86339 725473 40411 265262 98768 -333266
7751 -333266 -925782 -1032683 -764659 -978157 -1024776 368833 461806 564152 1808048 1167555
7741 1167555 724526 510572 -227234 89555 -24026 -97123 -218499 315539 -336055 -351032
7731 -351032 -1110932 -474313 -13001 -5429 79902 -369878 508441 -704154 -249749 -348259
7721 -348259 -666104 -531218 -1683749 -1014569 -991712 70938 98047 139692 -969703 -1526119
7711 -1526119 -913114 -1284997 -412893 -615312 275408 34720 -744678 212555 9645 242074
7701 242074 275868 90712 342671 472544 671139 70249 870018 319121 703972 332799
7691 332799 -49049 -190798 -426103 -497731 -491253 282231 83633 421249 385090 -23448
7681 -23448 414012 -1214566 -1050331 -619812 -769007 -76918 142443 419626 -542774 -380297
7671 -380297 -531432 -167648 1239590 873040 755982 120699 -156038 -532294 -1370113 -73995
7661 -73995 429436 194520 258058 -45221 444551 -571087 -320359 44001 372753 714990
7651 714990 1133130 726715 -187646 -873289 -1802391 -1482764 -1677195 -752750 152912 174337
7641 174337 123325 -220759 95006 209981 -42214 -32599 -436372 -168547 -809570 -1018089
7631 -1018089 -472214 257819 -84733 571601 351496 682081 -73812 -544019 -168965 -379800
7621 -379800 -728249 -55207 153747 -91023 139093 -80899 96264 -220351 -409759 -93947
7611 -93947 -251444 -256668 159525 708814 723718 561624 -421563 -1020970 -992866 -1256670 -923490
7600 -923490 -262855 572792 338805 697638 645051 814031 638570 653848 747652 987912
7590 987912 189922 -183747 610596 625918 658978 191485 1221616 1862376 1143577 1167061
7580 1167061 1743049 1393797 124418 -740848 535104 2312988 1439936 2355954 2351825
7571 2351825 1718410 1248743 1332517 2013473 2286972 887956 268441 1095771 426030 436387
7561 436387 1554344 2802666 2145252 2253774 1192263 2054323 1156182 821129 902398
7552 902398 984859 -76936 -946864 635601 -199228 464537 -263221 -419663 -176502 -805148
7542 -805148 -1026018 -769730 -236930 -923394 -873662 -712118 -916267 30239 -729839 -281550
7532 -281550 -341736 -602442 -240159 180973 -225231 -212446 29831 230970 603149 407504
7522 407504 690768 679228 -238844 -427854 -1102640 -743530 -89506 264347 1539120 982441
7512 982441 982834 256523 -62719 -170231 -142653 -470617 -1117720 -1332015 -935574 -51930
7502 -51930 648220 708379 344984 210485 410012 -209175 -333577 183144 80467 415579
7492 415579 -1293332 -1458830 -1004683 -867024 -465999 44686 -232885 -228778 -128896 -35929
7482 -35929 -383950 -1232726 -929068 -355248 -1434420 -552688 719899 566450 348679 -660491
7472 -660491 896062 541829 -297692 395511 60549 -264916 -1779648 -1770880 -736560 -1474866
7462 -1474866 -727045 -339725 102000 -209898 -834808 -686924 517155 -810436 -1193162
7453 -1193162 -514563 -1441857 -563179 -95254 -308062 144130 -108102 -69372 -30987 -577837
7443 -577837 -202008 47666 -314358 -974551 -896862 -144350 -637154 -609683 -309302 -521097
7433 -521097 186269 -176201 121919 -311046 -276606 -166820 -425792 -208583 -489606 -699110
7423 -699110 -874018 -831564 412046 483672 836222 376728 178260 -321018 -947813 87963
7413 87963 719396 319002 -138752 -1087334 -1344358 -889331 -1048615 68701 692516 449536
7403 449536 -711719 -534171 -1216178 -302708 -995810 -782060 -383228 -1307312 -1060261 -827183
7393 -827183 -414605 -291945 -575701 -692888 -1287567 -469843 -956739 -443290 -702804 -1230565
7383 -1230565 -1359164 -440155 -448171 -1151214 -449267 234470 -176321 -1627037 -1843429 -412884
7373 -412884 377142 -805791 -481971 -133580 256473 -968860 -1450077 42042 -342607
7364 -342607 -1000224 -1173001 -904526 -968928 -1988123 -1602213 -654893 -1065383 -604363 -348305
7354 -348305 -562554 -143054 -1164988 -397585 -1051691 -755665 -599158 628313 737392
7345 737392 328389 22804 300277 501277 -60905 -439554 731268 562560 -181055 -967649
7335 -967649 -1542233 -1482793 -875821 -302347 175765 372978 -570213 -382106 -630611 -633155
7325 -633155 -626933 -29344 76605 403123 361402 166455 -245459 -494983 -1110809 -423056
7315 -423056 -362474 757723 1191028 1052826 714950 -1017403 -591033 -706005 -856716 -1788914
7305 -1788914 -594141 -908136 -1151380 -1436301 -1031943 24055 -508057 -622697 -1190210
7296 -1190210 -825290 -1124244 -857798 -344887 -77912 820086 211599 -73565 516511 112557
7286 112557 -817309 -982451 -329200 -418485 -1651120 -1342611 -1319509 169127 -605684 29956
7276 29956 698884 -396637 -79533 -1380329 -1328823 -791011 -1024427 -257082 -451174 -951694
7266 -951694 -411325 -781614 -777114 -119822 203053 -605883 -591878 -1951053 -1431655 -1352915
7256 -1352915 -823234 -283738 411752 490880 795537 456963 713333 -556505 -317143 -1653349
7246 -1653349 -1664967 -34396 -1178793 90752 -141155 342891 811876 -326276 -36034
7237 -36034 -79263 -26739 -864726 -776075 -1111212 -1273784 -1004540 -717301 -1072984 -457720
7227 -457720 520803 -505587 -1061889 -763097 -542225 16733 -114608 -863796 517053
7218 517053 -107571 -519062 -1472642 -831283 -875447 -648433 -757002 -832359 665016 492518
7208 492518 -344040 -572049 -214498 -451271 -781443 -416880 -274805 -150999 -1191135 -909232
7198 -909232 -324597 -399235 -282321 312239 608703 253961 -489548 -83678 -64829 465423
7188 465423 -382385 -422587 -20485 -1167818 -881668 -1137618 -669475 -1083659 -1436497 -1091186
7178 -1091186 -1034372 -319861 -615925 360993 140122 397208 90032 130590 1219284 285461
7168 285461 656065 243712 139970 89405 -247423 374804 841834 492433 -374281 -528660
7158 -528660 447875 345747 -424776 -255850 -547721 -78590 -608774 -310479 787538 335935
7148 335935 225889 -2666 -42014 115695 209297 -114715 -451138 -349250 987134 100961
7138 100961 -399997 -510961 -383394 -1511387 -983603 -1361825 -745195 -653373 -927537 44969
7128 44969 -479004 -577014 22927 -136717 390847 47576 -265740 -357493 -159139 -915259
7118 -915259 -844637 56811 -818297 -1613774 -945980 -1191550 -753093 -128208 -512953 354587
7108 354587 -62840 -286576 -893719 -1021938 -1777084 -961379 -875205 -648662 135384 -394461
7098 -394461 -64434 39179 946697 869626 482192 418915 298236 356187 -246956 373163
7088 373163 -34294 86623 -243185 75370 529569 -4883 -656404 -389485 -418181 305931
7078 305931 54193 215069 1118204 1428561 374593 -353100 -1174373 -112979 356971
7069 356971 310856 594767 -54815 -521747 -1139122 -923890 215394 1129683 2055188 2344666
7059 2344666 1082145 945736 -36422 -148391 -465539 -590700 -329825 -42248 -153674
7050 -153674 299357 956265 722864 1098492 301530 321464 743169 755777 1115026 409347
7040 409347 -458556 -567055 -755051 -344344 -574163 -19567 228434 448826 -688154 -32825
7030 -32825 465152 543895 627291 447091 635367 -44697 -420140 462390 1005414 766437
7020 766437 1327181 815401 1988083 1172013 1676399 1185419 500928 239552 -688369 605416
7010 605416 62870 10082 492559 -130913 170884 -47623 350340 985068 2261090 1447553
7000 1447553 1232363 1277594 807310 1196711 1511426 2322964 1720311 1429338 1627540 1381044
6990 1381044 861770 869181 1634712 1653775 932962 1836855 2405194 2643228 1948529 1487458
6980 1487458 2184593 2089299 2092928 2469358 3046023 2664404 2278016 1806964 802142 1624063
6970 1624063 1139023 843387 1696873 1549895 2811292 1833885 1980441 1615491 1760220
6961 1760220 1201094 1824584 2542404 2929601 2522751 2124838 2066770 1595926 2080643 1630957
6951 1630957 2584359 1867404 619268 217172 541298 1103218 1090149 1477628 2007878 1716846
6941 1716846 845862 1469426 1824948 2742045 2376516 1614783 2052340 1778619 1034093 1463406
6931 1463406 2003864 1897954 1672259 1089909 2277819 1679631 1659926 2242929 2663652 2273316
6921 2273316 1778333 2169137 1605411 1806319 1625350 1395597 1409702 1350309 929968 1234670
6911 1234670 1412041 1417458 1650564 1855680 1821488 2326633 1833036 1958624 2733563 2316455
6901 2316455 2650402 2483429 1905884 2502249 1824433 1702987 1894182 2142237 2400512 1277201
6891 1277201 1849360 1643465 3171429 2525683 1462940 1026155 1852600 1545469 2057839
6882 2057839 2962993 3116228 2310472 1823773 1646879 2627589 2371629 2448146 3213109 2854654
6872 2854654 1830677 1440011 1746150 2129908 2090177 1849856 1463164 1926306 956479 1040684
6862 1040684 1858138 1638306 1527347 1508098 2295140 2173184 2913954 2571708 1954690 2970272
6852 2970272 1950015 1890961 2264124 1438763 1958244 1123202 1964001 1264517 1152019 1050569
6842 1050569 1623295 1704580 663721 843195 1059551 294207 26224 989553 1714464 1824673
6832 1824673 1435404 1824282 1951091 -187475 261298 -264556 176299 869097 968870 1469794
6822 1469794 796764 1943498 1826243 2203241 2215369 817713 940114 86459 -183423
6813 -183423 -439654 105906 571380 773001 776020 682622 1743871 1622530 1534330 440136
6803 440136 465733 743606 721183 1284531 1294989 1476433 420405 159211 45591 -234124
6793 -234124 826159 1140549 2190732 853079 1166974 1343084 1011649 1133986 -790059
6784 -790059 1045739 -209467 -465748 123312 967902 2182106 1228859 1929551 1549640
6775 1549640 1671065 2241631 2058810 2096067 1308351 900753 668643 1104230 1214383 1413044
6765 1413044 1784946 1959328 1476596 1679940 1736785 1806985 1936540 1113580 1996351 1244691
6755 1244691 2399985 1719785 2905521 3412603 2789060 2578452 1934398 2976007 3473841
6746 3473841 3330063 3079103 3977869 4582799 3415194 3383163 4231157 4317083 3508718 3308738
6736 3308738 4099008 3752351 2917892 2371645 3520290 3214364 3104483 3136178 4537902
6727 4537902 4570919 4797393 4555550 4949671 4540058 4251452 4617258 4396492 5038464 4083652
6717 4083652 4530386 4662587 4522071 5397777 6051500 5077688 5291488 4815592 4681038 4493623
6707 4493623 4305218 5011742 4776712 4040997 2722130 3535616 2585436 3075134 3492889
6698 3492889 3730329 3730604 3317722 3569964 2504700 3178864 1883387 1788961 2794074 2894715
6688 2894715 3445553 3501611 4331142 4131384 3964520 3043363 3703958 3426848 2402093 2851010
6678 2851010 1714895 2729132 2077729 2429044 3594842 3744055 3807364 2936334 2017081
6669 2017081 1506283 934704 41218 1386493 1252855 1806687 2198353 1589420 1448827
6660 1448827 1937041 1371148 1487118 2190046 2508375 2298601 1168139 836085 266571
6651 266571 704896 647767 1925999 1827583 1991129 1874352 1885225 618912 981993 1784247
6641 1784247 1341373 1264618 150870 8851 1326750 613385 1007694 1665782 2362887
6632 2362887 2086314 1213675 1139164 1511173 1462092 1445647 2068962 2278478 1698765 -68270
6622 -68270 61944 394499 395760 1035228 1384850 1259107 759618 449156 1055258 1444815
6612 1444815 1915716 2190926 1912169 1564793 948253 1353071 1873614 1410661 2575424
6603 2575424 2749798 3061047 2380992 1565153 1624347 1537889 1933034 1792943 2332603 3389434
6593 3389434 1978213 1925334 798431 292224 326555 832068 1920522 2274930 2013942
6584 2013942 2211566 2566431 4144500 4038096 3412850 3797036 2693553 2530594 1751249
6575 1751249 2592962 3552153 3696155 3947240 3794351 3408263 2543375 2379486 2533240 1556724
6565 1556724 1374764 1860801 2683176 2318258 1869056 2342755 2408017 1607836 1812627 2412185
6555 2412185 2334731 1744527 2517085 2246907 1963825 1539815 1130668 1622598 980503 1454979
6545 1454979 2634337 2757522 2729475 1939310 954192 486921 242630 949449 2543559
6536 2543559 1518219 1312071 1003397 158566 1356490 1098378 1814702 2565662 2373041
6527 2373041 2015600 554574 80989 -272600 -964225 -766056 -766463 389376 1276843 1434851
6517 1434851 1798945 1358074 306805 -115401 -607908 -178641 -48140 -396828 -1120460
6508 -1120460 -275895 482958 1007437 1163510 2542630 2518122 948430 -286252 -42334
6499 -42334 469496 148649 -244700 251613 883703 207233 415723 1582055 1380261 1685436
6489 1685436 1783985 1556050 587198 567362 1224961 1234544 428194 -249047 -71915 -134450
6479 -134450 63601 212105 708682 704273 990971 1145726 1574079 1927701 2334600 1861392
6469 1861392 777498 655403 334680 89127 729088 1386963 1099558 1592224 583560
6460 583560 1294940 1496116 610972 1608146 816015 1517059 857750 1707512 831596 1307931
6450 1307931 1403596 1290303 1705800 1482277 1426737 1208443 964010 1173371 1117297 1786999
6440 1786999 2023481 2054449 2678534 2499855 3589373 2716367 3034467 4233852 3049946
6431 3049946 2438841 1921043 1666602 1463007 1324505 2979922 3740463 3425313 3213396
6422 3213396 2603064 1754458 1110083 698282 1009315 2474457 2903288 3422071 3225141
6413 3225141 3618290 3103285 3087657 3440972 4082834 4210407 3272851 2796686 2985126 3060858
6403 3060858 3203473 4418631 5097024 5552575 4828631 3904886 3913902 3502774 3214763 3025298
6393 3025298 2689109 2377134 2593770 3122876 2702727 3537412 2926640 3538080 3138953 2899591
6383 2899591 2742959 2212967 3074902 2716122 3347381 3326484 4102425 4585548 3759039 3998806
6373 3998806 3679007 4252048 4004043 4691995 4908737 4491452 3944391 3035930 2396275 1577564
6363 1577564 1334872 1892891 2725830 3200150 3332687 2616177 2508222 1787751 864361 1381717
6353 1381717 974087 1501278 1612286 1835228 2320881 2720215 2393400 2899548 2074413 1549780
6343 1549780 1870374 1312735 2599095 2375994 2880820 2103509 1948895 1979367 1857776 3051048
6333 3051048 3117116 2766555 2562733 1346754 1096016 1595047 1303097 2243454 2540923 1811237
6323 1811237 2049615 1415667 1848901 1766213 2040760 2376015 2055280 2221082 1672165 1695773
6313 1695773 2034211 1673922 1557263 1397967 961626 1001234 966147 1008103 920271 1606412
6303 1606412 1819746 2062114 1402528 1642842 1193905 1264951 1269531 1041657 1467412 1267250
6293 1267250 219077 358256 919304 914241 2346536 1794144 2025010 3011576 1497120
6284 1497120 2094229 2442577 2394056 1709041 861601 56094 7225 -518963 -147312 1245707
6274 1245707 1881330 1786644 2061017 2766096 2565578 3507490 2950685 2890341 3335518 2374682
6264 2374682 1272339 2185467 1130914 1154307 1736869 1494480 3054435 2798705 2669392
6255 2669392 2879482 3040704 2222022 2200021 2735716 1977575 3226883 2261593 2668870 2348345
6245 2348345 2376268 2693876 2876128 2121975 2575505 3077138 2792123 2877488 3234183 3137539
6235 3137539 2900034 3182015 2787740 3704507 3429680 2918255 4003427 3712225 3278431
6226 3278431 2797519 2342102 3114740 3411526 3636888 2996875 3619386 3946827 4617375 4341802
6216 4341802 4491903 4746817 5385630 4735019 4472151 4822671 4381871 4187109 4182096 5340887
6206 5340887 5484163 5495487 5912656 6052685 6230770 5372919 5909429 5803791 5964552 4655863
6196 4655863 4326965 4284135 4053870 3195681 4146479 4923832 5385611 5660574 3951007 5337544
6186 5337544 4199131 3383960 4039472 4459491 4966068 5087417 4912399 5673891 5055419
6177 5055419 5144952 5245653 6304029 6461391 6318213 7021127 8962675 9026442 9552418 10172339
6167 10172339 11897603 12862629 12780363 13409816 13650066 13023479 10991070 10336976 9939364
6158 9939364 9948664 9024365 9935130 11481442 11326260 11881271 13583630 14053723 14485155 13093804
6148 13093804 11533053 12219153 9759113 10052514 9877281 9661007 10940373 10791906 11038465
6139 11038465 11940416 12175319 11930512 11776315 11696680 10361696 9255352 8564931 6855208
6130 6855208 7527258 7323748 8249749 8323461 8146269 7388842 8078689 9046474 9077059 9382362
6120 9382362 9122707 9647561 8560306 6835734 7172186 7261099 6889122 5738872 6151577
6111 6151577 5125744 5049836 4969901 5482092 5947779 5287623 5085479 3610098 4058553 2833036
6101 2833036 2716177 2881725 3501678 3999509 2729255 3327089 3525394 4221199 3949119
6092 3949119 4217807 4890165 4213418 3871722 3690127 4362045 4542520 4080156 4515202 4686205
6082 4686205 4850932 3905313 3820063 3940678 3361704 3472467 2740587 3002021 3006094 3285906
6072 3285906 3628348 4643293 5113487 4176547 4285196 4092795 4030377 4141405 4961332 5327117
6062 5327117 4994636 5085747 5687900 6984361 6291257 5689274 6355260 5646355 5465989 5035798
6052 5035798 6188582 6808309 5827232 5494525 5191589 4987785 5707483 6014794 6428695
6043 6428695 6162543 6136545 5451163 5266636 6128383 6209114 5934218 5776731 5855388 5396020
6033 5396020 5608798 6018182 6510081 7036583 7120381 8012955 8350309 8651872 9340354 8051976
6023 8051976 8538865 7989660 9485190 10420115 10585187 9920397 9393883 7962210 7594103
6014 7594103 8330558 8489253 10088671 10427787 10012618 9781161 8941390 8664436 8478184
6005 8478184 9838342 11244182 12104832 11980789 11533579 11269698 11161698 10487504 10861880
5996 10861880 11622244 11860840 13076350 12094829 11816116 12569389 12741626 13108587 13309059
5987 13309059 13661065 14415068 14868437 14996376 15906336 16095460 15345321 15366550 15321259 15319828
5977 15319828 14709346 14712845 15063883 14303379 15009004 15105385 15122886 14395251 14086579 15014337
5967 15014337 14163766 15173401 16080452 18667790 19317739 19710027 21640517 22491448 22702545
5958 22702545 22495867 22081034 21875553 20547558 20043071 19490978 18783661 18845558 18920959 18973955
5948 18973955 18604209 17963385 17258691 17331169 16181349 15747122 16124090 16411342 17435995
5939 17435995 18003844 19343189 20454203 20863894 23191115 23724045 23557896 22385855 18724586
5930 18724586 17952448 15324277 13837239 13836056 12913411 12388433 12043459 11967586 13026959
5921 13026959 12987452 13004375 13670942 13266225 14148435 14901192 16873331 17882533 18419837
5912 18419837 19308708 18730211 18379669 18633823 18811917 19455251 19507263 18580260 17923420 16347949
5902 16347949 15112134 15178488 13833446 13571430 13185289 12915651 11469086 10695810 10271519
5893 10271519 10672289 10279132 9956608 10015352 10444599 9869811 10204943 11516632 12446415
5884 12446415 13318504 14297323 16212819 17489827 18364848 18254302 18190228 17250987 15408727
5875 15408727 15261155 13649149 13361343 12473463 11429841 11076606 9207152 9864993 8951666
5866 8951666 9046971 8756165 8711721 8945635 8148461 7986533 8074890 8184630 7811648 7549485
5856 7549485 7442932 7567973 7641243 7051360 7283456 7789690 8120448 8363815 9218824 9828537
5846 9828537 9750310 8703012 8677824 8271234 8327618 7786916 7870564 8140117 7351108 6462631
5836 6462631 7322577 7189984 7062962 7337888 7383184 7290680 7046941 5768768 6111767 5379774
5826 5379774 5915024 6292239 5995973 6968321 6773927 6746135 5801597 6831929 7240459 7468398
5816 7468398 7613152 8295443 9653410 10366593 11341077 12108540 12436860 12319123 12525977
5807 12525977 12856854 12024982 12136115 12033723 11677088 10585931 8834749 8181218 8930184
5798 8930184 9759463 8972655 9016349 8704950 8704329 8236827 7116918 8371617 7908454 8120138
5788 8120138 8245787 7980366 7730628 6567820 7734614 8667100 8892738 9551860 10101172
5779 10101172 10548739 9229564 9929732 10507799 12145981 12761193 13171320 13833729 13455207
5770 13455207 12123618 11319008 10351988 9830087 9012374 8043803 7468821 6282544 6455483
5761 6455483 6291664 6631776 7396562 7127409 7385150 6993780 6985990 7961595 7475536 7957746
5751 7957746 7446598 6826188 6825932 6449867 7061630 8023429 8608662 9377121 9811775 9431708
5741 9431708 9907960 10349971 10235794 9132683 8678966 9665754 10515412 10167893 11713456
5732 11713456 13210338 14207588 15298505 16768292 18334951 18812842 18734691 18485641 17453450
5723 17453450 15425594 13867405 13233871 12018642 10783296 10728633 11301106 11406189 11401179
5714 11401179 12187932 12835274 13812772 13550993 15273941 16156090 17042867 19040183 21390878
5705 21390878 24088789 26600553 29293778 30150005 30204534 28312359 25478299 22910886 19186036
5696 19186036 17103485 15665808 14201352 13658380 12695496 12883352 13013949 13297967 12582073
5687 12582073 11534061 13316725 12859704 12405664 12525026 13219561 14360570 15619505 16879727
5678 16879727 19811789 21216267 20259872 18590900 17005952 15114365 13470443 13024172
5670 13024172 12598012 11274169 9933128 9089701 8634738 7665199 7469023 8148188 8812083
5661 8812083 7702062 7288277 7962243 7630694 7044442 6559714 7214760 7174549 6704001 5922669
5651 5922669 6292975 6285882 5809015 5845323 6086885 7122286 7028189 7363537 7785651 7699165
5641 7699165 6754039 5716554 6714707 6664715 6788691 7473331 8496613 8990227 8785316
5632 8785316 8822286 9089486 9144980 9110646 9068892 10256796 9040940 7738488 7953730 7155561
5622 7155561 7570017 7699918 7597975 8426716 7691054 7203746 7033731 7493287 7251930 6634338
5612 6634338 6522089 6718832 6445548 6623503 7098769 7660309 8175373 7204551 7693113 7184287
5602 7184287 6794114 7391951 7632150 7467456 7899161 9129029 9897165 10704649 11203606
5593 11203606 10566807 9466775 8123479 8859067 8502021 7290642 7263388 6608783 6229565
5584 6229565 5854660 6244787 7782967 7048122 6447508 6076191 5765085 6229349 4834155
5575 4834155 6116014 6876456 6850739 6436316 5795735 5754095 6081554 6356364 7172296 8138452
5565 8138452 8385653 9493395 9774561 9729503 10361602 10003749 9595718 8121343 7458150
5556 7458150 7811948 7335631 6332270 6057316 6592335 6858958 6580157 6931017 7201557
5547 7201557 6196965 6953684 6265213 6754021 6339545 6060247 6195207 5289276 5718227
5538 5718227 5332466 6643392 6504838 6054053 6785474 6269953 5897005 5191314 6094809
5529 6094809 6515712 5998561 5561270 5691612 6066355 6049382 5986360 6355535 7527708 6847068
5519 6847068 6885293 6840343 7003613 7132353 7219583 7861747 8061667 7957620 8541719 9522741
5509 9522741 9300149 9301658 10526502 9974681 10049101 10512373 11092393 12351212 11935138 12263647
5499 12263647 12074640 11646655 10699199 9515075 10234048 10506054 10330352 9721063 9577355
5490 9577355 9288964 8497398 7768869 8504400 9847687 8473080 8778634 7601767 7413803
5481 7413803 7076341 6529838 7779187 7955850 8069718 8284829 8595034 8975692 9368876
5472 9368876 9162013 9624728 9306861 8866581 8979837 8528566 8925385 10000372 10307983
5463 10307983 10277025 11129609 11279677 11359754 11094971 11538928 12750835 12522060 12694989 12229503
5453 12229503 12803547 13964750 13861496 14752387 16076182 17938254 19380640 20202457 21446408
5444 21446408 22950708 24048958 25278119 24699618 25797144 26831355 26139948 27049660 26027612
5435 26027612 24875720 23720807 23512519 22726980 21700690 20589164 20422426 20327793 19053589
5426 19053589 19721991 19161890 19771498 18136642 18397047 19100394 19667866 20832842 21301823
5417 21301823 22535062 21903708 21869006 21514641 21327569 21677415 21906931 22318945 23171095
5408 23171095 24509589 25917983 27023686 28925456 31046119 32341326 33618210 36766108
5400 36766108 39674173 41832133 44457008 47120281 49561826 52590790 55105212 58506235
5392 58506235 61745046 64490179 66753914 68542014 69985805 71327184 73294467 74901573
5384 74901573 75352435 76341500 75664098 75496764 75170481 73640057 73532047 72024119 70059019
5375 70059019 67464294 63855777 60547191 57180345 54439098 51822664 50362937 47828933
5367 47828933 45261301 43984655 42567836 40331372 39883606 40227994 39297089 38039088 37442207
5358 37442207 36771895 35998421 34633945 33826403 33453774 32258164 29778351 28789178 28169710
5349 28169710 26839709 26072099 24562860 24120178 22543047 20972119 19943472 19661272 18345565
5340 18345565 16875731 16045004 15967438 15141536 14336988 13882706 13975763 13111538 12132309 12465647
5330 12465647 12863546 12389869 12570209 13550265 13536251 13168844 12306045 12095169 11934808 11431181
5320 11431181 11524023 11943728 12480397 12198567 12861983 14286768 14901176 14218709 14191383 15002461
5310 15002461 15300444 14926041 15277962 14782596 14849008 14613261 14957906 15463354 15117750 13314834
5300 13314834 13374368 12323839 11451943 11925074 12599058 13833018 13398854 12929936 12303585
5291 12303585 12588373 11858741 11248530 11700187 11350899 10968247 10320703 10669863 10618109 10201053
5281 10201053 10346929 9640836 9497380 8697850 7818722 8010913 9024643 8703255 9023659
5272 9023659 8570784 9197960 9978037 9644539 10830019 10523031 10247215 8916378 7923673
5263 7923673 8035797 7372703 7306547 8169933 8753051 7906926 8045628 8421627 9571973 10063389
5253 10063389 10441717 10656783 9181732 7327828 6410492 6042064 6242122 6380131 6438548
5244 6438548 6836315 7252275 6608407 7015244 6784493 7447201 6040410 6230535 6716926
5235 6716926 6185299 5581948 4592849 5693866 5619708 5346657 5992826 7515170 7732028
5226 7732028 7632159 8121181 8682194 9250231 9321542 9518044 9441018 8635211 7035381 6616719
5216 6616719 6719076 6667440 6722488 8170656 8158014 7790001 7216012 5638425 5271868 4883553
5206 4883553 4644907 4774122 4077656 4121945 3744642 3683263 3429354 4098101 4837604 4411017
5196 4411017 4645017 3840047 3523961 3018460 3036529 3018758 3984384 4323661 3866456 4004851
5186 4004851 4727461 5100413 4724211 5298082 5655255 5011710 5083467 3366051 3655028 3779955
5176 3779955 3205252 3157440 2258513 2637450 2972051 3171549 3283715 3536615 3717681 3250071
5166 3250071 2872405 3175969 3723821 3880782 3883987 3289748 3301470 2641919 3752400 3883727
5156 3883727 2750552 3549910 3769522 3885119 3504989 3851250 4233147 4210847 3592299 3373199
5146 3373199 3830939 3500809 3445859 2982970 2997099 3208713 4900958 4811073 5725667 5823107
5136 5823107 5629592 5512911 4747107 4575187 4499044 4841348 4604197 4138950 4162375 3899093
5126 3899093 5284875 4351582 3726815 3630352 4271228 4667436 5163089 5352861 5115881 6321485
5116 6321485 5252550 5162522 4696291 5563571 6397561 5951367 5554123 5352651 4996955 4825333
5106 4825333 4092997 4467109 5300814 5008218 5051798 5113360 5867149 6387470 6420089 5700291
5096 5700291 6288510 6294664 5374794 5756552 5537969 6412485 4766715 5096541 6286630 6718941
5086 6718941 7527353 7177916 7363295 6470750 6566636 7853944 8265148 8642800 8334412 8547564
5076 8547564 8536208 8364106 8012104 8485995 8392676 7023078 7312567 7420104 8161336 8875445
5066 8875445 8279219 8240627 8110431 7691575 7430043 7720636 8258304 9280910 8956184 9296107
5056 9296107 9490435 9693247 10579912 12241384 12536501 13145505 12273909 13773286 13951803
5047 13951803 14473553 15259780 14878416 14936102 12375177 11248623 11366982 10993073 10167329
5038 10167329 8784313 9423324 8988948 9759117 9995317 10534597 10651899 9752081 9922910
5029 9922910 9200507 10230730 9969480 11523161 11890393 12206785 13648365 14332252 16195032
5020 16195032 18123241 18237670 18511793 18096218 17897435 17110922 17242665 18479822 15896678
5011 15896678 14324030 11960237 12266653 11789161 9562356 10325259 9408331 9457757 8086329
5002 8086329 8116175 8069117 8248093 8618911 10203386 10376191 10142673 10459019 10226099 11179770
4992 11179770 11242672 12068782 13784285 13898889 15665552 16211955 15730066 14908240 13841455
4983 13841455 13763575 13532174 13008014 11537291 10912288 10289621 9273607 9364032 9335710 9460565
4973 9460565 9079245 8941083 8335502 8315429 8025187 8399781 8601969 7508973 8183038 8323577
4963 8323577 8175131 8761158 10010295 10796436 11500303 11637322 12208207 13654569 13036542
4954 13036542 13018955 13237889 12176039 11269746 10082995 9520940 8883521 8219120 7847064
4945 7847064 7835032 7863501 7811735 7603931 8138239 8826438 9195430 9317317 9368513 9261189
4935 9261189 8186242 7550240 7785545 7955703 8075681 8377239 8808376 9064431 8378657
4926 8378657 7974233 8249383 8495479 8465483 8713122 9011602 8533113 7999824 8336834 8358294
4916 8358294 8379213 9029947 9530163 9139690 8033793 7287692 7059031 7043667 7294967 6899739
4906 6899739 8292087 7781542 7767577 7953556 7385380 7707679 8554329 8979185 8576939 9072363
4896 9072363 8890099 9404039 8893797 8417852 8468023 8192130 7626588 7682281 7497377 7324048
4886 7324048 7036283 7521885 7720726 8180060 8469117 8794487 8772150 8388998 7947473 8421182
4876 8421182 7552365 8003881 8397797 8402007 7928403 7787831 8615326 8402421 8794784 8305352
4866 8305352 9396010 9132899 7867317 7744994 7786326 8131691 8797290 9186873 9808776
4857 9808776 9643783 8877922 9573173 9649165 9399000 9454706 9898553 10812334 10287608 9787994
4847 9787994 9805042 9591432 9500407 10172940 10578764 10760700 10511393 11328281 12832451 12182288
4837 12182288 11993851 11755780 11660625 11158678 11569978 12691817 13971780 13580272 12964354
4828 12964354 13190377 13600257 14128962 14107421 15021177 14864411 14160227 13952691 13524595 14775426
4818 14775426 15613246 17145737 18070910 18011418 17829546 17877037 18962424 19478217 19122337
4809 19122337 19566365 20393179 20984854 22036787 22553948 24902757 25347086 25186158 26130141
4800 26130141 26199065 26896196 26723156 27671652 27822620 28147050 28686191 29790344 31403076
4791 31403076 32438922 34725319 35876125 36542263 37209095 37316352 37504142 37475172 38292009
4782 38292009 39639737 40022105 40509592 42102834 43711108 44591956 46030993 47524278 48162110
4773 48162110 48763714 49686888 50274906 51178270 52359673 54737718 56531622 59221890 59881694
4764 59881694 62847119 63849878 65940912 68567576 69319150 71919064 71641190 71998187 72180550
4755 72180550 73579840 75010426 74638496 75115470 74621275 74913519 74857987 75807933 77333882
4746 77333882 77934389 78710696 78500005 78723590 77727909 77463499 77729530 76476673 75819134
4737 75819134 74807185 75033366 74163859 73561156 73166717 72399586 71365542 70349030 70031091
4728 70031091 69994218 69799926 70094217 70532052 70649387 71347199 71647975 73099896 72658111
4719 72658111 72053834 71401090 69712984 70019882 69945731 71048634 71819941 71470342 71826816
4710 71826816 71089522 71143946 70752447 70796243 70924709 72316796 73529189 74263148 75225589
4701 75225589 77220518 79370929 81233329 83000403 84137722 86204712 86049613 86303186
4693 86303186 86218774 85074599 83966763 81987067 81192003 79931025 78869805 77236604 75740046
4684 75740046 75513685 72934469 71505248 70451131 68583743 66792528 64214778 61508741
4676 61508741 58963727 56705493 54095278 52676101 50735536 49571228 48285906 46660529
4668 46660529 45093609 43740387 42742933 43024227 41527533 40596479 40323820 39736313 38999187
4659 38999187 37371431 37332335 37581301 36969206 37118865 37080536 37129867 37360512 36555093 35636485
4649 35636485 34131108 33431251 33252420 33147403 32533638 32227956 32119807 32331737 31150209
4640 31150209 31562203 32195165 32368592 32614410 31624446 32145665 31241265 31376112 30454869
4631 30454869 30053547 29088588 28108749 27905350 27341673 27105137 26169386 26342524 25978015
4622 25978015 26369712 25850750 26581521 26886627 27258563 28116686 27602500 26653893 26352111
4613 26352111 26585201 27528816 28230136 28377141 29243092 29054596 27499137 26494878 26348809
4604 26348809 25993538 24680527 24734258 24673673 24432464 24027955 24733726 26409678 26545050
4595 26545050 28738734 28848798 30194548 30875798 30955047 31953073 30843702 29393305 27947108
4586 27947108 26459677 25453755 24334367 23175622 23529099 23275166 22259379 20926667
4578 20926667 20771525 20670592 20469506 21539530 22743444 23745917 24676618 25123743 25559200
4569 25559200 25673424 24742997 25152113 25223527 24221325 23772459 22079477 20562140 19350657
4560 19350657 17469356 16880302 15633724 15277915 14876112 15422912 14773374 14462804 13600731
4551 13600731 13265973 12973303 12722836 12697749 12911544 12144366 11429766 11239218 11736710 10898630
4541 10898630 10042639 10438472 11244944 11899305 11364854 10838081 10241773 10027990 9056072
4532 9056072 10013981 9358287 10173792 10227071 10425151 10427991 10121400 10203279 10905780 10405162
4522 10405162 10975182 10491461 10141909 10419608 11433044 12202962 11614175 10809870 11423098
4513 11423098 10870007 11214571 10843236 11579698 12331552 12526946 12745549 13128976 13389084
4504 13389084 13685897 13183816 13489516 13168655 13874770 14065990 14249759 14927651 14230699
4495 14230699 15314877 14122758 14949903 15228963 15520644 15822816 15347818 16600143 16722725
4486 16722725 17613356 18396914 18304443 18600513 18755903 20811024 21185144 22507222 22120615
4477 22120615 21892998 21428619 20113733 19317238 20722981 21243222 20732328 21278025 22153318
4468 22153318 23715492 24617581 25538010 26922035 28074717 28252641 28402478 29313766 29895078
4459 29895078 29720678 29740019 30946746 32863096 34005972 35667988 38188874 38808711 39296096
4450 39296096 41700061 45220313 48614520 51197274 53406005 56616603 59588532 63443879
4442 63443879 68954854 76220301 83191479 92376286 103793438 116917856 133725724 152310768
4434 152310768 172271013 188948428 198176012 197622684 188949708 177257751 167327635 162094385
4426 162094385 159234746 155762293 150340997 145832250 141616884 140629539 141432930 142890069
4418 142890069 142802054 137901525 129298103 117537427 106038878 94471230 84760242 77743972
4410 77743972 70390473 65089602 59367127 55347455 51449664 47894255 46392667 43691968
4402 43691968 41033958 38486005 37228123 35301407 32910491 32042582 31694029 30594208
4394 30594208 29001052 26977922 25927194 24435500 22912000 22520347 22267145 21209648
4386 21209648 21145773 20198479 20150015 20069077 19396254 19461935 18303022 17591167 16924190 16509661
4376 16509661 16512803 15101993 15939499 15489292 15432480 14977422 13919898 14460741 13633795 13385350
4366 13385350 12439309 12237857 12164658 11830203 11866150 12322982 12569804 12173278 11842862 11509672
4356 11509672 11417577 9621055 9280733 10618133 9568304 9612448 9388072 9030071 9336248
4347 9336248 8257843 9242049 9388183 9198775 9020131 8167904 7914209 7912409 8516760 9087721
4337 9087721 9213186 9375024 8951205 8072555 7928193 8159123 7401603 7834799 8388197 8349975
4327 8349975 8025371 7489842 8359806 8250599 6858201 6797852 7046393 6794491 7110021 6126463
4317 6126463 6458410 6979313 7033521 7136351 6779982 7866484 7795407 7460887 6915215 6416066
4307 6416066 6700591 6095781 6749299 6739102 7072080 6839014 6759641 6953566 6538923 7831777
4297 7831777 7041401 7173321 6663861 6333503 6301672 6023483 6001707 6168860 7580647 7772000
4287 7772000 7492755 7242697 7753599 7189768 6504250 6579388 6639620 6564972 6221986 6033059
4277 6033059 6453658 6640943 5206462 5468289 5919942 6109014 6556902 5770212 6302244
4268 6302244 6044348 6078395 6652246 6393863 6982302 6826211 7634551 7311162 7058089 6745426
4258 6745426 6127115 6568355 6266350 7469957 7441250 7574189 7456265 6653878 6450826 5673975
4248 5673975 6681455 6158351 5118405 5882139 6483670 7287194 5985525 6294727 6945957
4239 6945957 6631471 6334559 6587918 7150887 7101476 6555149 6138486 6818123 6547816 6471145
4229 6471145 6644949 6765280 7233115 6226418 5276087 4712220 5340819 5634561 5614495 6185373
4219 6185373 6036750 6006440 5824775 5891084 5586605 5486395 6240496 6530374 7237932 5959162
4209 5959162 5832736 5787082 5722066 5828222 5635799 6394597 5525193 5631824 4280426 4105245
4199 4105245 4660017 5076044 6110159 6207517 6488785 6492019 5973482 5906025 5198983 5942777
4189 5942777 5376372 5653343 5982202 5629480 6261940 6195827 6929713 5986833 5794058 5349358
4179 5349358 5419919 5573261 6076890 7218654 7097108 6950524 5768104 6085426 6443317
4170 6443317 6272608 7113190 6340781 7072750 6136611 5304237 5806841 6409843 7568607
4161 7568607 8191299 8368116 9385550 9199731 7213288 7403448 6660166 6939396 7603992
4152 7603992 6966036 8443386 8196273 7976641 8507686 8431816 8694382 8156424 8229345 8238110
4142 8238110 8170281 7760619 8302644 8411511 9056709 9738437 9934294 11425392 11206362 11580741
4132 11580741 11889589 11137882 11560593 10984851 11887446 12114015 13223262 14748198 13894668
4123 13894668 13858025 13483033 14182246 13943889 12996230 13120245 12868269 12188653 11578912 11445791
4113 11445791 12442797 12252033 11855981 12361712 12525885 13815454 13922092 15327026 14192698
4104 14192698 13456928 13274069 12929019 13730703 14784988 16329519 17031496 17088644 17423885
4095 17423885 17368605 18988731 20061659 21257883 22739793 21205753 21722413 21033658 21335535
4086 21335535 20244312 20113059 20589793 20448194 19805695 20529684 20994452 20216152 20686844
4077 20686844 19465384 20406470 20157166 20525926 21660019 21305846 22041993 21922951 22369002
4068 22369002 24189006 23965201 25027280 26657351 28443841 30158783 30927709 32408917
4060 32408917 33960907 33957984 34899269 35858471 36443512 36423457 35521743 36233507 36675703 35914391
4050 35914391 35636590 36451679 36982237 37242693 37337236 38549714 39163214 39444157 39029737
4041 39029737 39499253 39344354 39580862 40608002 41683984 42700777 42530621 43442686 43416076
4032 43416076 43708422 44187175 44747453 45903696 46875279 46820835 46556788 46113640 46107602 46190732
4022 46190732 45431957 45935576 45248889 45365007 44761352 44955163 44310226 44144962 44728783
4013 44728783 44366794 45057282 46007687 46558546 45479618 44896138 46001128 45981468 47073076
4004 47073076 47642990 48874898 50164804 49679916 49576379 51170088 51540832 52773751 54901882
3995 54901882 55558247 57365214 58356921 60751886 61969457 62660896 63577670 64777676 65852574
3986 65852574 66732077 67981717 70130025 70727353 70688122 71845204 72447646 73388837 74212810
3977 74212810 74945343 76909639 76752064 77283925 78017653 78033502 78122289 78075439 78845457 79377860
3967 79377860 78966619 79840222 79896146 80509356 80613930 80983902 79972504 78720113 77755865
3958 77755865 76155010 75661682 74049585 74109522 72931360 72082303 72157078 71789289 71640575
3949 71640575 71016443 70768721 69514147 68204614 66694853 65351553 65155404 64124542 63258462
3940 63258462 63475947 63382514 62987972 63827784 62877909 62614591 63708141 62800668 62365025
3931 62365025 61738098 60606518 60345181 60225149 60152900 60423298 61052826 60135648 61047744
3922 61047744 61922698 62420278 63138929 62499368 61744079 60928699 60213785 59343519 58204127
3913 58204127 58071531 57416007 57050622 56147482 56159502 56124219 56024138 55526624 55309020 54331692
3903 54331692 52481493 50942678 49704030 50664760 49801524 49887397 49705096 48526151 48245472
3894 48245472 46075126 45844146 45147087 44314057 43708926 43278260 41799294 41843288 42145302
3885 42145302 41571173 41892374 42312162 42906295 42875547 43349466 44665903 46641005 47096143
3876 47096143 49131692 50989702 54621993 55990088 56960792 59153956 60298770 61417699
3868 61417699 61310758 61308787 61994099 61114922 60582407 60089914 60522642 61016901 62757033 63889968
3858 63889968 65758401 66749605 66107395 67906457 67145006 65809672 63657497 61571058 59866255
3849 59866255 55915715 53342821 51689023 50385394 48746403 47630279 47053711 45912714
3841 45912714 44606626 44197412 43032480 41785450 40874711 39484390 37123589 35247713
3833 35247713 34228030 33322633 31599172 30306953 29319709 27213765 25600038 24746084 24126014
3824 24126014 24238030 24375410 23520207 23035884 21525180 20781413 19891450 20171786 19572839
3815 19572839 19168539 18942822 18745898 18580499 17462095 17481779 18602625 19170324 18360432
3806 18360432 17845533 18611857 17511516 17350139 16033911 15435123 15105142 15461202 15941500
3797 15941500 15656486 16634274 16618645 16856559 15834017 15003563 14968832 15136548 16038752 15853290
3787 15853290 15835147 15479429 14948169 15147072 15267616 15441052 15296814 15339350 15013749 16280394
3777 16280394 15843490 15979623 16289094 16281159 16218745 15466343 14850608 14797496 15244591 14615717
3767 14615717 14283824 14781756 15881264 15120409 14848466 14849961 15096403 13671912 12964161
3758 12964161 13887820 13994753 14105771 14303292 16682954 15968100 15350491 14416631 14852944
3749 14852944 15702315 14696089 14616525 14972050 15489770 14696909 14750544 15462575 16076372 15479932
3739 15479932 14776936 15083930 14726315 14695678 15362905 15034173 15611443 15230236 15402133 15573009
3729 15573009 15617985 17026095 17199255 17611864 17225230 16939464 16807212 16262526 17052469
3720 17052469 16546304 17423091 17659922 17536810 18296972 17819223 18587484 18497208 19110155 18718221
3710 18718221 18983311 19230794 19315245 20152486 20084934 20856374 21825051 22249452 21537073 22421548
3700 22421548 24245686 25521683 25082739 25735456 26438639 26744507 27055541 28239232 29975894
3691 29975894 31386159 33164818 34271893 37361099 40161461 42618402 45550630 46186764
3683 46186764 45071417 43732225 41087263 39195471 38437869 37015805 37076421 37803518 38243154
3674 38243154 38966115 40076320 40625263 40486646 40832721 41693231 43671748 43649363 44749156
3665 44749156 45698972 47270047 47925673 49843380 52469543 54955307 57322961 59333129
3657 59333129 62042206 62612466 62840272 63062704 62361556 60675483 60335242 59927488 60154384
3648 60154384 61621519 62103040 63003222 64169685 65235137 67269539 68518975 69509038 70689779
3639 70689779 72547255 73006758 74825831 76968223 78854089 81737565 84202772 87048795
3631 87048795 89157435 90558640 92424852 93895797 95397834 96825795 99053397 100973135
3623 100973135 103928288 105638215 106498612 108319515 109839958 112088917 113583147 115397366
3615 115397366 117062235 118408076 120644042 121787644 123966108 126338473 128535949 128956031
3607 128956031 129280443 131277734 131362913 133116660 133446828 134660949 135633643 135386511 136324797
3598 136324797 137194425 138616784 138454287 139429127 139237559 138017324 138189789 137516786 137132711
3589 137132711 136891312 136590019 135672284 134792193 134529399 133940103 133436131 132796052 132297398
3580 132297398 132947860 132967736 132791121 133243248 133630400 133788781 134004479 134564775 134378085
3571 134378085 134626591 135046635 136132729 138363031 139206060 140636889 142031452 141846727 141595857
3562 141595857 142453823 144459971 145875111 147985136 149642219 150311310 151498327 151843673
3554 151843673 152912913 154147193 155289620 157126914 158331989 158898341 161766427 165606339
3546 165606339 168552496 171749883 175362681 178271811 181415191 184288725 185803264 187763298
3538 187763298 188947038 189342662 190060415 191705922 194214295 196649264 199086379 200513103
3530 200513103 202478273 203524506 202916235 202669081 199959074 197710518 193645526 189057155
3522 189057155 184783559 179782396 177274458 173261330 169201320 166165882 162967196 160035630
3514 160035630 155414594 150898509 146308996 141120455 135986208 130148670 125511191 120537790
3506 120537790 116809197 112595063 109657613 107209567 104670494 102723960 99734827 99135728
3498 99135728 97440571 96290630 94205314 91929521 90395246 87568551 85432368 83198074
3490 83198074 81840345 79715204 77588551 75060272 73676203 72490762 70750294 69196191
3482 69196191 67782959 65891800 63111542 60911781 59099659 58450436 56991721 55989412
3474 55989412 55270154 53255020 52566880 51366727 50107618 48972200 47592315 47441701 46525018
3465 46525018 46686904 45959765 46058070 45488589 43790944 44005187 43459456 42657610 42804725
3456 42804725 42934424 44118091 43846542 43718447 43233616 43794055 43369989 43031479 43625908
3447 43625908 43627471 43241276 42939058 43180036 42856461 43899342 43225758 44862233 43967608
3438 43967608 43946397 43541120 42480416 43252425 43169533 43389746 43219449 42286218 42386643 42626077
3428 42626077 42636103 42491369 41964207 42312738 41923148 41712618 41826142 42772055 43383684 43733071
3418 43733071 44022238 44579320 45739488 47619733 48936287 51465243 52415645 52155858 50629099
3409 50629099 48759061 47051192 45631177 45517513 45246852 46202073 46757893 47236627 47819536
3400 47819536 48827242 50142283 51186134 49998043 48598503 45928562 43412469 42071477
3392 42071477 40818612 39333517 39563349 39245958 38553920 39256295 38525091 39531522 38698801
3383 38698801 39072783 39525036 40144786 41160190 42691784 43702128 45443052 45701178 47218385
3374 47218385 49083916 49463795 50928646 52857051 55342015 58371654 61985522 65399342
3366 65399342 68488512 71229521 73302710 75260391 78209099 79991704 82945206 85764088
3358 85764088 87964446 88883442 90576091 91813286 93078033 94141518 94347928 94559566 93994552
3349 93994552 91417530 90993746 89842382 88839654 87100012 84368144 83393177 80717099
3341 80717099 77700921 74975642 73349423 69529544 66756829 63416398 61313437 59839084
3333 59839084 57481773 56830339 55116241 53156933 50783890 48732812 46525640 44967624
3325 44967624 43439099 43196745 43075455 43021773 43101571 43072533 42372056 42139026 41871939 41454200
3315 41454200 41246972 42103657 41671346 41656505 41611724 41976998 42635051 43054817 44830411 47060795
3305 47060795 47860231 48240737 49256828 50761674 53123878 55752994 57513471 56664134 55540265
3296 55540265 53172696 52435297 51847941 51782827 53256626 53126961 52570262 53374288 53902571
3287 53902571 54148143 55449647 56471481 58115772 58746529 59389293 60469070 61418240 62054687
3278 62054687 63449359 64965213 66618800 68737509 71045085 74682471 76637202 80197047
3270 80197047 83083152 87975046 93488457 95799080 95151583 93720327 93911241 95254103
3262 95254103 98089644 100395971 103921092 107972699 112479336 118116713 124632353 133056662
3254 133056662 141687246 151287352 161622186 173575746 187659109 201664329 217579877
3247 217579877 234540253 251081933 266295951 277150975 284106713 285330575 280688435
3240 280688435 271188278 259224679 247113369 234416660 222606898 210335881 196414534
3233 196414534 185022619 173925399 165919849 158691827 152259159 146719947 141307612 137111345
3225 137111345 133505517 129935792 126040316 121664282 117297515 112827308 109859774 107378745
3217 107378745 104889749 103217674 102079554 100956465 97742979 96550195 95230611 94066964
3209 94066964 92899457 91087100 89981568 87694438 85600415 83663270 82171021 80066821
3201 80066821 77873280 75924941 75476467 73771040 73541127 73975017 74280448 76827577 78583711
3192 78583711 80731383 80772771 79774218 79794231 79316046 77104042 73454193 68436120 64041889
3183 64041889 58786019 55612246 52927347 50804189 48769340 48003451 47931466 47124209 45495204
3174 45495204 44608686 44375636 44274186 42691347 42674668 42287333 42681599 43169160 43084702 43710172
3164 43710172 44895229 46515834 47715985 50255782 53533907 57209545 60378211 64338972
3156 64338972 70213203 73283108 70853364 62889408 55583975 48752666 43781061 40538056
3148 40538056 37966089 35608768 33361707 32071885 30764687 30244352 29134701 28861981
3140 28861981 28367503 28677706 28744927 28134447 27022886 26191522 25085633 24837737 24639319
3131 24639319 24558976 25106627 25742719 26935634 28696271 30532093 33146118 35888439 38734753
3122 38734753 38942274 36233870 32013746 27867792 25742987 23239463 21342966 20210023
3114 20210023 19329599 19612298 18642690 17430358 16018520 16473644 16089086 16333726 16799271
3105 16799271 16954771 16068441 15985172 14252837 13938500 13031504 12483179 12686945 12289839
3096 12289839 11862165 11828084 11919890 12038486 12037706 11829166 11390935 11040420 11303939 10584211
3086 10584211 11484954 11835502 11055634 11163792 10790437 10006425 11264504 11631373 11991218
3077 11991218 11032226 10922351 10518067 10824946 9842924 10380674 10904325 10226312 10176238 10184822
3067 10184822 9961651 9798991 9507674 9228877 9285370 9454086 9468683 9724010 9234944 9201323
3057 9201323 9141684 9362352 8690134 8772417 8638838 9300871 9986820 9401403 9993839 9452594
3047 9452594 8739158 8390928 8898524 9741593 9892857 9205037 9537304 8805761 7956515 7744638
3037 7744638 7909032 8093784 7966061 7692248 8379354 8389895 7912953 7726293 7263740 7089603
3027 7089603 7339621 7319515 7642463 7974321 7946742 8055570 7786347 7732020 7149236 8121824
3017 8121824 8705278 8540321 8726298 7868705 8384835 8141432 7659773 8461238 9784026
3008 9784026 9618961 8852940 8481483 7260600 6966430 7217701 6033330 7882590 8154328
2999 8154328 8144302 9425618 8333889 8714857 8830906 8244484 8376593 8421616 8229219 8399662
2989 8399662 7479054 7481536 7518716 7503232 7758773 7474252 8491174 9345925 8746368 9282453
2979 9282453 9130803 10157941 10504188 9716272 10674932 9609286 9485198 10154545 9456164
2970 9456164 9168436 8091800 8027762 8967710 8686331 8356928 9483860 10347239 9631222
2961 9631222 9784831 9899393 10801456 10275311 9082783 9965976 9698983 9589973 9364479
2952 9364479 9824941 10560604 10444794 11598378 12213489 12089985 12108955 12632539 13271545 13684690
2942 13684690 14099363 14554216 15286770 14742253 15449518 15570002 16207990 17655458 18445990
2933 18445990 19754213 19139111 19260753 19521484 19571799 19556153 19230134 19070719 20144247
2924 20144247 19511678 19307768 19474269 19242739 19585882 19009966 19193871 18986062 19508884
2915 19508884 20520230 20271726 21414661 21468613 21997265 23035378 23009695 25496086 28299902
2906 28299902 29869912 32702956 34154880 34361743 33149274 29997980 27366186 23629385
2898 23629385 22137866 20433746 19120921 18311218 17554273 18269714 17787948 17945779 16807769
2889 16807769 16638983 15437008 14455974 14221153 14595957 15395368 16315063 15546366 14969026
2880 14969026 15483336 15023649 15843197 16022740 17305185 18207738 18151889 17577789 16347662
2871 16347662 15386132 13932905 13687367 13566170 12478421 12586658 12662117 11285415 10114927
2862 10114927 9697326 8625582 9106589 8667815 9227289 8754486 7969496 7093190 7450737
2853 7450737 8030839 7270121 7045762 6836528 6702444 6576569 5990878 7400908 6498100
2844 6498100 5997417 5819023 5196333 5123711 4309254 4354455 4680920 3865355 3245319 3371157
2834 3371157 3920224 4373815 3636933 3375035 2487031 2586913 2265340 2078796 4324253 3721051
2824 3721051 3730789 4227518 3368494 3549628 3075446 3312385 2540149 2852009 2965517 3418359
2814 3418359 2918944 1721980 2455082 2883505 2907411 2090939 2476463 2449708 2127965 1748753
2804 1748753 1482814 1930387 1812809 1901111 1827133 1959344 1988058 2037892 3012007 2628744
2794 2628744 2211077 2091234 1470328 1549025 345753 1536831 1430862 1248512 1288349 1674728
2784 1674728 2480668 1738348 1578209 1789750 1169455 998123 700584 1278907 899742 172056
2774 172056 1063579 1322542 1433980 1786999 2207322 2377328 2283520 1502967 984348 -204646
2764 -204646 22678 925327 1135600 1806741 1645326 1499485 1844472 1293973 616546 379172
2754 379172 651004 1220227 423936 475508 510086 670542 675933 1573991 929315 659309
2744 659309 360230 910492 900417 1022979 1076805 619912 1481857 1191310 1648076 1850594
2734 1850594 1350766 1042714 425878 121982 -203868 202452 342460 907743 1318997 1025812
2724 1025812 887586 -135002 951888 806465 1077811 1137204 1577778 1755257 607258
2715 607258 370454 784775 1030563 678790 961535 695783 254162 235810 87283 -74887
2705 -74887 687038 1424745 919140 1364872 879107 1601762 526218 163205 484816 722481
2695 722481 773894 536006 1747884 1654171 1366963 818091 508787 74922 175663 452679
2685 452679 1006651 496771 687332 1060616 1023071 1051434 1492113 1978491 1918601 1204049
2675 1204049 -52985 -168528 -256797 -14795 735946 184194 997874 973112 -114654 146022
2665 146022 -369953 9773 -254242 323995 -145759 -56725 180363 430471 746632 -65978
2655 -65978 184102 149526 178512 -231405 217091 99134 -305664 -293949 -98555 193277
2645 193277 -287934 105321 298586 415038 -69766 594437 645144 -150082 -478335 -335238
2635 -335238 739105 869408 288711 372668 -14709 175198 370278 355982 608089 724802
2625 724802 193677 -386058 -345334 137175 206570 721620 294827 943079 1538486 1093813
2615 1093813 1645647 1526736 898355 395914 -534880 -380674 -267377 30603 67742 862305
2605 862305 1064525 980041 716377 190104 377054 560726 223467 -491926 -90700 26658
2595 26658 558945 -354048 67787 145314 6707 278077 104454 367636 -98987 -20738
2585 -20738 -42689 -489648 -337813 -306700 -408218 -668604 581386 1499588 2031973 974928
2575 974928 563451 743636 37659 -1098547 -821716 243022 657834 -112160 -567547
2566 -567547 -506549 -212407 85376 240327 516275 1176225 1079680 785767 -764275 -500037
2556 -500037 -350975 -1127049 -1178145 -1220326 370207 1199865 908729 1310246 1581107 926745
2546 926745 -528832 -136071 -31893 761857 959938 1017897 1551932 697607 -59659 764892
2536 764892 1167506 1321715 1374222 1535740 1351185 -446967 -598934 -965461 -1174703 -740069
2526 -740069 -456096 314905 1090048 401598 1742555 1546505 346534 -445129 -689334
2517 -689334 -746148 -1016933 -126063 -111237 368279 237852 773378 710087 569809 1665234
2507 1665234 398123 270164 76903 -623014 228358 246267 566658 886192 55909 304930
2497 304930 100275 576540 770783 1371069 1826266 850415 521965 504588 153981 -507347
2487 -507347 -907092 -1264614 -924678 -117733 -502644 -59305 -183038 24943 -82164 -633060
2477 -633060 568848 582663 1004363 977263 134354 -808181 -1258503 -1191803 -448543 -453643
2467 -453643 -1243911 -7896 47760 142291 475579 365893 764753 608388 931221 1051939
2457 1051939 786445 32192 323682 863326 -1308061 -684419 48458 -378229 -802230
2448 -802230 -1546622 -894161 -444806 437091 237187 798569 247241 -583039 122417 -466852
2438 -466852 -258127 385468 851208 165862 36273 -326594 16514 466653 -365709 160295
2428 160295 -232207 -275052 -87536 -245140 1125204 739124 411703 541709 16079 -573772
2418 -573772 -772945 -465244 -122487 -949922 -555221 101626 773341 80291 436720 997628
2408 997628 597259 -334642 455297 311546 5772 -404444 -373848 1678472 836542 -304363
2398 -304363 549907 478429 -284089 -300685 -536753 269228 -399079 -534081 194417 180196
2388 180196 487953 756343 1389393 1017293 1482868 1328050 558509 460916 -143841 711981
2378 711981 -20473 758029 103071 828046 853512 318614 1356882 121251 1249219
2369 1249219 899018 -193431 157202 -372919 -732590 -360580 -243352 -160746 1429502
2360 1429502 -95556 -875880 -727211 -637561 -232473 35715 -172252 908476 1225035
2351 1225035 922994 1659053 2217857 1931307 403456 -17300 -654957 -1242990 -190740
2342 -190740 -338906 379444 -646447 -1125279 287763 38025 524437 919151 369588
2333 369588 583418 -616602 -324757 50661 158743 50850 -134008 -296766 -193168 -590947
2323 -590947 349482 1574017 1648462 1200725 663122 1110935 476368 1331009 879815 1057041
2313 1057041 1286082 756693 461034 1095726 1273459 1270640 1941198 733805 330741 -725548
2303 -725548 -1250254 -546937 -41854 1042957 1357721 2090132 1115818 581836 1279279 -339434
2293 -339434 222492 398381 489590 30514 -1035489 -291776 421973 571056 979174 2557176
2283 2557176 1802935 701494 -757361 -470457 -480401 -784494 -418516 145439 396532 930569
2273 930569 680228 988990 535571 864701 1310364 568320 1558490 813343 1247165 1366443
2263 1366443 479815 842480 936439 725392 558661 46652 -596977 892518 194870 180924
2253 180924 129417 8661 616896 -19116 -3937 235490 1282077 1584510 503450 436599
2243 436599 477603 1133795 190140 226238 595892 620335 992321 468410 1716167 2332253
2233 2332253 1634794 1298906 1133565 491276 945765 1154923 265255 399135 -601975
2224 -601975 323827 548860 578641 1483395 1159970 1135747 204639 818153 1363555 804822
2214 804822 979722 1463864 1066037 1045785 1787191 2132026 2414294 1061488 1293343 1638894
2204 1638894 1464620 1664987 1480388 2013706 854949 996522 2328472 2650718 2863264
2195 2863264 3090844 2600207 2330657 1731674 1797646 3692994 3348192 3318598 2975140 3293972
2185 3293972 2452686 1734697 2574137 2975131 2605823 2230693 2630520 2329700 2144201 2407507
2175 2407507 3831066 3892460 3913607 3979565 3971979 3426872 3241708 2761757 4127077 4472028
2165 4472028 4301706 4767175 4900881 4474290 4208821 4164949 4966482 4860573 4509941 4929722
2155 4929722 4930049 4700097 4523781 4935780 5869241 5719744 6151920 6150416 7145424 7320646
2145 7320646 6587925 7145200 8000029 7696180 7704630 8061555 9355841 9760837 9421003 9580053
2135 9580053 10084274 10598609 10572872 11746580 12293567 12683407 13372011 13568182 15163215
2126 15163215 16047986 16678404 16712893 18315833 21151677 22739269 24219457 24382631 25704363
2117 25704363 27256317 29659322 33301320 38225736 42891110 50294097 58832509 70279560
2109 70279560 86224229 107886810 138913114 176932641 191925252 164275044 120847336
2102 120847336 88507423 70235900 57085301 47638568 39359425 34437457 31599605 27215135
2094 27215135 25281048 22581761 21509113 21424697 20177815 19504108 17704805 16701276 14564041
2085 14564041 12437170 11884336 11145844 10473468 10355572 9752734 9581025 8188939 6753140
2076 6753140 6155391 5991047 5475496 5485305 5972607 6027773 6318524 5320989 5912035 5835886
2066 5835886 4726186 4180373 3496177 3761939 3672991 3847670 4604907 4787043 4717078 3716069
2056 3716069 3696757 3447134 4166256 3643271 4185886 4156831 3674088 3196710 2101628 2723786
2046 2723786 2921309 2817099 3439089 3797005 3491178 2216731 1516432 2034087 1419606
2037 1419606 683081 683486 510458 1415627 212141 1033903 2461705 1630258 2130627 1334717
2027 1334717 1777028 1553017 -244788 -43678 800992 951638 1263010 2122781 2665373
2018 2665373 908491 214870 311362 1091325 1798532 1518530 1818764 1464530 607818 -289676
2008 -289676 761847 998661 883973 1356417 1460603 287625 -676686 -882622 -906451 -873660
1998 -873660 -64969 -94019 750764 1092064 1601497 1840837 486152 745146 895385 459411
1988 459411 279415 551677 1081906 474936 159183 1020880 1442379 1086931 329848 1038390
1978 1038390 1276622 1693922 639981 576368 742876 984722 817995 675898 1593569 1162866
1968 1162866 1163666 814103 525117 89772 -172124 1108765 331772 642521 -140315 516008
1958 516008 730049 -247039 -886880 -1144482 408062 154256 397248 1068374 1195807 535176
1948 535176 253475 949573 1139313 871453 151488 -13906 -83390 -106671 719073 1742896
1938 1742896 1606262 894215 402163 -427500 -903340 -470077 975799 1109524 1410542
1929 1410542 763372 -170878 -669814 -710549 -129131 -944637 129112 -298224 -417521 -737481
1919 -737481 -1444504 -277688 -144065 196216 648820 966195 660296 37916 -70660 -400882
1909 -400882 101090 743796 -491812 -130288 253715 557820 459913 637071 731714 897185
1899 897185 256505 240559 969461 404644 1139984 1320246 634622 99670 594961 1284866
1889 1284866 834542 498984 653450 1257839 839026 595876 600487 778107 1070554 355665
1879 355665 854712 446586 1020489 257478 448891 1043966 863928 934362 -386867 354212
1869 354212 330245 -436847 -653825 305856 1091973 741198 1365950 881057 778587 197074
1859 197074 57302 412509 353926 932716 1600637 1112302 410763 -49495 -346207 -295234
1849 -295234 -799200 -65921 487458 1553002 1537728 795329 781803 215474 -464949 -30145
1839 -30145 577054 1203782 1220616 657266 1252001 890309 1281494 1341104 1942346 1352943
1829 1352943 368285 -269712 -1165387 -1214276 -1546480 -28010 65407 181162 674144 743652
1819 743652 1397033 472242 453388 415536 -292001 -23015 -101515 62511 -313559 -650931
1809 -650931 -1232045 -1459225 -1014727 -1146313 -516583 233997 106907 349285 263701 381321
1799 381321 855909 1100762 1263473 266632 296435 -683828 -915322 -378140 -142182 1233807
1789 1233807 1782180 1886551 502835 640188 -265960 86669 -134297 -145777 220682 -90083
1779 -90083 -233727 -596405 -418267 350555 -7773 331681 928387 -63291 -62886 -347871
1769 -347871 -51738 511000 -716167 158557 422591 -161779 -778137 -839929 516258 406494
1759 406494 781194 1178116 1723971 694182 -603069 -1453788 -1521860 -765580 -1317810 -342250
1749 -342250 -702302 -425069 -1015624 -1913877 -669903 378163 319017 71903 570619 604002
1739 604002 192185 -1078972 -232951 -598842 54821 108037 -1303989 -767400 -1220840 -800399
1729 -800399 -704844 -852765 466562 95992 -630333 -1161164 30625 -50838 -805896 -491029
1719 -491029 449527 406672 -282613 -805312 -748097 -130434 -141369 -156509 -6466 -101380 339111
1708 339111 -76241 -142695 1196976 1063900 679452 -79380 561822 551051 -394491 180072
1698 180072 -19341 -135630 -62015 -96032 1090297 912801 930119 1271459 1288478 730108
1688 730108 555624 879469 159108 732578 830525 893086 -206376 83461 228817 538360
1678 538360 -484278 -16385 629874 475693 -310346 -713759 -831753 -327568 369816 8096
1668 8096 256485 209171 -1085169 -997847 -574076 -21795 -544773 53874 -361367 52489
1658 52489 -682455 -960395 980327 -554900 -360220 -1321866 -933031 -606502 -476582 70688
1648 70688 369122 473833 22846 -1322239 -2181388 -2274650 -1343662 -1361257 -1381100 -1866922
1638 -1866922 -825599 -987195 -844186 -627567 -96608 807797 -197363 196498 457858
1629 457858 -173359 -388063 -1115656 274195 145349 -6589 -544400 -1267961 -899763 -1392679
1619 -1392679 -1043776 -777934 -170488 -306236 693840 808727 1049769 1226269 808534
1610 808534 -219300 -629603 -697090 -1294116 -331422 -507620 -60438 -79800 90923 388378
1600 388378 299945 -849923 -943053 -341572 -624279 -62550 -652322 -615030 -691550 -1294445
1590 -1294445 -2377682 -1728131 -518265 353114 885907 446197 736283 364195 639798
1581 639798 190317 1095100 1313342 -196695 -372474 -1540670 -926312 -158620 -580780
1572 -580780 -73758 -1176628 -1176392 -1642873 -907164 -419667 -283064 -32137 -1031902 -1266923
1562 -1266923 -1099908 -232119 344278 485337 1174649 342684 -99059 -705026 -713343 137040
1552 137040 -433894 564699 557807 232078 -556377 38776 -741299 -323679 -408433 -445444
1542 -445444 -442 -102061 310117 1076284 1428967 1445116 912124 965906 295766 -859122
1532 -859122 -1007043 -876134 -111363 -367310 -128265 158 -183715 -52588 641383 -201340
1522 -201340 -93498 -551558 -39092 -407145 -1673222 -1050097 -268078 -255491 -327752 543647
1512 543647 224980 475486 -46400 -26305 -911374 -1611475 -1266536 -470694 37153 583404
1502 583404 761231 -48353 -902202 -760460 -1091812 -449242 151926 495919 -66149 -1142771
1492 -1142771 -1217782 -1301741 -615727 -708071 268962 -780570 -778946 -1049814 -777153 -831735
1482 -831735 -473039 -289779 -996456 -652447 -547632 641545 514972 154964 550932 -1163785
1472 -1163785 -1561138 -820363 -393854 107982 -863965 -522904 -212079 -392706 242108 275019
1462 275019 658210 135346 -534776 -445153 -1010785 -1472179 -1010279 87342 -554420 -700923
1452 -700923 -651556 177755 -696969 -1012318 52531 442290 365131 -702628 635650 994580
1442 994580 -741597 -1334667 -1190153 10175 63877 281919 735188 637727 -291560 -840471
1432 -840471 113556 -153461 -195983 -366938 221494 -515150 -1127443 -1157841 106359 -301435
1422 -301435 -619052 660334 1249888 756529 -97410 -973558 -1689182 -2058661 -2564798 -1376851
1412 -1376851 -1444140 -991111 -495267 354062 468380 1044131 655473 -26176 33946 -1354117
1402 -1354117 -1765916 -369596 -348877 998403 569482 65483 -258942 -53861 -1009518
1393 -1009518 -1081905 -354618 -1003989 -433031 -1651020 -1252850 -206636 -416970 -480707 18705
1383 18705 175952 47821 -23687 883627 53343 -24081 -111891 102861 80047 -78893 635125
1372 635125 216323 -556042 -491476 -521493 36794 93312 596144 895456 899511 366952 525602
1361 525602 607148 -1538 -199949 -917689 -289775 -756193 -362019 530206 501291 399982
1351 399982 299911 301586 -407717 -81221 -798050 -242067 305823 -513370 126220 -161177
1341 -161177 -643245 -585065 -456778 -373902 -182793 112907 57414 -335833 -885575 -599354
1331 -599354 -98089 783725 -134971 328844 403079 -509750 81898 -559784 290107 577381
1321 577381 -328115 -399945 -794902 -560876 -159087 206416 1052554 1318712 930502 746657
1311 746657 481833 -511751 -1147192 -1396568 -1402406 -751697 -168696 -157884 -764604 -269211
1301 -269211 -482759 -1329638 -626684 147947 988913 93913 580414 894842 515556 471503
1291 471503 3925 852514 -47716 -191035 261126 279362 338931 -527967 880915 -348191
1281 -348191 -65773 -222749 -430545 -25565 -642643 577843 213982 878524 241703 1034830
1271 1034830 1471549 638683 477998 -501632 -259449 -1086827 -588314 -94861 -306117 734534
1261 734534 -89200 446754 -788269 -501858 -1028836 -828466 -569265 -1103629 -218300 -481867
1251 -481867 -109926 -726298 -959242 71055 531228 295650 618877 879475 642741 -357340
1241 -357340 -500482 -1099850 -750342 -988466 -391282 -240815 -328902 -228982 -5218 11581
1231 11581 -136132 99874 39132 -165767 -29360 -412071 -404074 -404131 -624998 -302285 254477
1220 254477 -15364 -469407 -716249 -851155 -378516 -662891 -460994 27613 -34928 -371964
1210 -371964 -1166309 235245 232649 -31783 569765 868216 193109 -13178 -29895 -973416
1200 -973416 112567 -760946 -1288971 -704513 -69104 317897 -33472 232512 -593384 -1122845
1190 -1122845 -662081 261971 1405481 970350 974699 979118 -289512 -694466 304198 63531
1180 63531 -244428 -56533 29637 -257132 -746506 -213714 -493681 -569820 -149506 323675
1170 323675 404511 447512 61249 625950 137541 106051 604419 959619 -57039 69079
1160 69079 751895 33636 201687 -181583 -160773 259670 167452 -861627 -99118 36851
1150 36851 -492947 -1076468 16199 65952 431936 -433928 -629431 33239 -1184190 -1111879
1140 -1111879 60571 -142322 221527 -912332 -662101 -170701 276147 501303 1197221
1131 1197221 768790 620131 616656 -700233 -216833 -225990 -90897 -304721 -1314336 -1105141
1121 -1105141 -1213476 -1249790 -1413412 -717339 778181 176370 304233 181929 132939 -793252
1111 -793252 -1465967 -753268 -575237 -1291851 -807733 -186475 140743 -399379 -204252 731158
1101 731158 505315 -98763 -266581 -50221 -1010739 -1468108 -196596 -229372 -360703 -163687
1091 -163687 -36681 -259616 -1307240 -868603 -83937 -150415 -214969 173163 587277 335596
1081 335596 422413 -669123 -555947 -178323 -844334 622065 135513 358869 846664 -998325
1071 -998325 -1720037 -1472750 -991198 -1131222 -538186 -1031917 -909418 -1704419 -1933697 -930114
1061 -930114 -494346 -229937 -119739 279791 -1147 -179468 502365 578979 690760 536070
1051 536070 -468163 -240648 -289292 -612558 50460 536714 30073 -936347 -2017793 -1768534
1041 -1768534 -943172 -808639 -624051 -782146 -327726 -812719 -1040493 -386823 -56752 -114693
1031 -114693 -290346 -596745 -306053 374576 35582 161840 -47760 -291272 -412363 -707634
1021 -707634 -582974 -147446 354045 267042 264606 407959 249655 530128 -27817 200659
1011 200659 188620 144008 -30264 58390 282031 -35700 -1622649 -1861310 -1574532 -1978026
1001 -1978026 -1640864 -1754879 -269354 -536988 -815525 -519395 -681990 -871571 -1798729
992 -1798729 -1723320 -696552 -892375 -818479 -454155 -667076 -569908 -889075 -75906 578238
982 578238 46998 -73830 495874 579162 696807 571488 707884 671793 574843 -114439
972 -114439 -43414 146070 -29481 -757983 -1218045 -1058969 -1876010 -990051 -1734283 -749391
962 -749391 -308863 -690590 -527657 -294335 240063 -340326 -256120 -395210 -362807 -1075817
952 -1075817 -1783951 -697762 -527867 606328 20872 367258 500477 -64744 424668
943 424668 531108 2048416 893764 956429 525897 -780117 -1917638 -1340216 462540
934 462540 353654 559760 119629 317174 -659384 -1806985 -1243583 -663735 -200389 -750892
924 -750892 -628276 -852962 -1183553 -116401 -84327 262960 -118274 -579959 96999 -658679
914 -658679 -712993 -596469 198464 79414 -222518 464225 883895 1515685 1455395 1111436
904 1111436 636509 232976 -100963 94252 536414 -182471 -820635 -758545 -1014436 -1323709
894 -1323709 -1236001 -972680 -381681 -495239 -280111 127629 452673 249322 262148 -186309
884 -186309 -206844 -724437 -212865 -920863 -563266 350081 -588682 -652499 -328769 220208
874 220208 96411 -158021 291066 1029764 710466 407651 831044 939530 474977 -70486
864 -70486 241602 39913 -1049019 -416944 -709170 -730715 -896629 -619325 734476 353164
854 353164 -396406 -274883 -866483 -313313 -189974 328695 902178 644605 477996 -557403
844 -557403 169514 -347666 -770238 -22521 -251033 -552381 -198114 458180 -61168 24717
834 24717 159267 -90689 196291 -414165 529725 467807 176599 -700830 253012 913635
824 913635 655104 894505 579250 -521116 -1239358 -1449157 -387510 726167 230613
815 230613 763866 484030 -262010 -108494 -36008 -567150 -764210 -1480208 -1433594 -1131749
805 -1131749 -1433619 -810452 -527681 -150669 745677 37066 780804 -382711 -598430 -1040072
795 -1040072 -1465423 -1074786 403832 705643 456108 -137446 -533757 -1239355 -802101 -55894
785 -55894 807263 459674 -112106 -246237 -209730 -1072235 -522372 723378 -101999 -207725
775 -207725 -581896 -192888 133980 -14739 746728 854466 730687 54595 102938 56720
765 56720 -521464 -683518 -799704 -43783 523337 879738 945247 -387983 -361640 271154
755 271154 215249 130443 1155362 945825 -68368 -1134203 -1471868 506788 -148727 452547
745 452547 1517994 2107033 986643 709003 830190 1304515 296433 -552735 -278266
736 -278266 578921 242261 -675097 -171133 -177852 -589441 306366 354951 1028639 540540
726 540540 -698687 -326318 18128 -129278 1176903 1285561 1714800 1336921 818193 1452549
716 1452549 1002345 261346 -457169 107493 -98464 -440253 -602743 -238196 -446102 -1750665
706 -1750665 -1018922 -1035692 -158171 -321083 911130 1576696 2056036 932795 155387 704489
696 704489 -235763 -535531 -1297402 -217754 186917 216255 -522765 -285016 -221928 -792613
686 -792613 -534537 -273913 -182292 -154617 -296949 -371418 -829586 -569425 -386400 -106626
676 -106626 -95425 711528 968006 349358 85392 -457763 -918082 -676150 -948751 420181
666 420181 405672 880432 1129485 476396 -463038 -911273 155146 120869 87137 98762
656 98762 92536 -235714 -1626484 -1059783 -830504 -331505 120391 463947 1171698 -125050
646 -125050 274569 96631 464580 1167743 985805 1336765 1039367 735538 398621 853499
636 853499 1224588 1082439 1319514 899729 582994 528584 -301107 -475701 -638423 -453687
626 -453687 -790719 -768833 395218 291719 607106 -73139 427044 625152 -142682 741957
616 741957 998141 1079972 178255 666598 257705 -212804 -108775 361282 954404 75083
606 75083 -83761 100877 596369 30167 -134891 302431 1294838 859575 171516 189467
596 189467 13611 -139191 99508 776076 1085385 608835 143262 815393 -343252 -162075
586 -162075 168372 440643 525463 1407 882357 442131 -1020664 -1620409 -661832 -610611
576 -610611 -81228 -579456 405125 2141329 1276306 437807 179707 500720 -160517 -529821
566 -529821 992828 118516 495468 393253 -164845 359541 -245764 143695 -17212 -636114
556 -636114 -1225841 -1122165 -668146 -520709 50460 -459144 -120749 246457 863019 986352
546 986352 943744 914249 127983 -922064 -1240079 -952559 -552431 532797 783634 960382
536 960382 1318702 522382 172550 -567894 -988152 -1226433 -1544911 -530255 -848608 -430081
526 -430081 -1094660 20238 767987 1212289 1258634 679158 956909 416897 97402 57677
516 57677 306648 365897 -45158 155882 360191 500474 -227637 -886279 -839478 -760069 -893513
505 -893513 -5459 755292 341652 791515 -68660 795991 499596 -349956 310956 -631224
495 -631224 -149146 -1149882 13795 316619 982371 1036035 534830 1549450 1047546 1843652
485 1843652 1556709 491072 191584 -307072 -115828 -226671 125794 -223060 373847 889888
475 889888 -430620 836716 615957 1193775 828627 483125 542318 621327 776012 42999
465 42999 963522 536687 358341 106970 -241218 241472 46686 -41665 265767 599951
455 599951 -13507 -188465 -601317 -737656 -521939 -317925 361544 546100 1147464 1704596
445 1704596 1870425 1303633 573157 405670 -618645 -739336 -1157594 -225412 169602 465113
435 465113 60266 882294 264525 509224 -327095 -969704 168441 -1364049 -927412 -752594
425 -752594 -634830 -544377 27307 -150838 -428086 -688341 -420412 -555338 -871078 -1087748
415 -1087748 -1635982 -1645072 -2302927 -1276470 200470 119887 285343 -256657 -707340 -1408395
405 -1408395 -1324702 -1490897 -1052585 -1285693 -972047 -172107 -1411175 -803287 -319621 -238722
395 -238722 -240536 -498913 -628559 506594 -209391 -691145 -1438899 -2150203 -983913 -1211710
385 -1211710 -16150 -224876 -544493 -321327 -604746 -934054 -1560851 -735739 -475714 -519932
375 -519932 -775311 -1044146 -993468 -1109940 -1033182 -841147 435824 -171765 -453861 -1083850
365 -1083850 -1217540 -1153659 -1074473 -631203 -426805 -327104 -2154724 -2310301 -2323744 -1921695
355 -1921695 -1847862 -781301 285355 -254116 -904782 -1501874 -1088155 -1080747 -765701 -78349
345 -78349 146353 23793 -828049 -1163600 -569182 -974941 -685641 -352149 -306087 -1449640
335 -1449640 -2153786 -2419237 -2162457 -1233408 -1126026 -360793 -596394 -482190 202438 -687574
325 -687574 -556616 -1120298 -1051616 -1192430 -1921249 -1638600 -2018005 -963286 -75340 -223971
315 -223971 -272277 -11353 -188726 -941538 -826369 -713015 -270197 -1033159 -1498502 -1059956
305 -1059956 -966527 -398241 -37437 288866 298400 -625213 -713951 -540144 -147961 -204673 -203206
294 -203206 -2389 -191042 -860045 -1793643 -653429 -1069622 99889 -136399 -684374 -900324
284 -900324 -841000 -615309 -691933 -440103 -110000 -638002 -1497427 -1960735 -1110128 -1096232
274 -1096232 -823798 -659623 96733 27716 -1271676 -824890 -1618550 -1554078 -1721858 -1226693
264 -1226693 329924 224523 1165485 101272 -248622 -131826 -1039842 -769653 -497809
255 -497809 178065 -1132459 -682020 -500368 306300 -560996 -596225 538414 -849704 -1346680
245 -1346680 -1587684 -1792294 -902091 -826999 -465069 -288152 -1280882 -1159109 -1087875 -1254846
235 -1254846 -615920 -1507280 -1057709 -1139837 -1204444 -1254554 -759583 -328997 -514752 -697607
225 -697607 -410494 -141174 -1140848 -924683 -883063 -910595 -672582 -1299652 -1275632 -1646289
215 -1646289 -1694671 -1188562 -1167995 -935308 -554958 -176548 -64584 -502621 -350338 -1139991
205 -1139991 -1480044 -1017149 -1273426 -895243 -250636 762952 551175 -642907 -1404571
196 -1404571 -1328520 -1471891 -2121834 -875475 739165 219589 107424 -966770 -500680
187 -500680 -798933 -813996 -1174705 -274935 74218 -378075 -1023009 -1529651 -1269992 -1346133
177 -1346133 -1014489 -435186 -426290 -839011 -1617305 -1575286 -1307729 -1837967 -1020049 -582672
167 -582672 141893 -347839 -813027 -1519185 -1621594 -1098422 -1866782 -971920 -715446 -582386
157 -582386 -686246 -1505642 -1408444 -1404491 -1871499 -1872052 -1400561 -705983 -1235525 -873772 -558591
146 -558591 -485784 -610046 -406200 -50608 -672264 -1018962 -675864 125268 -472079 -124938
136 -124938 -759541 -546273 -991824 -579859 -502881 -353716 -572924 -1301481 -1245753 -1086982
126 -1086982 -712765 -651808 -349964 434146 -300905 -1071025 -919597 -455754 -289320 -1001738
116 -1001738 -860269 -1102097 -845029 -1203756 -934697 -669364 -1234413 -834969 -405686 -137440
106 -137440 439073 248773 705610 205293 -293990 -397041 -604371 -495458 -788635 -340185
96 -340185 -603868 -159934 543881 81206 -276913 -86534 -591805 -1165789 -1150541 -1228151
86 -1228151 -1236991 -1336631 -1499814 -518438 -483429 -1366514 -706013 -429681 -35486 -195855 -620530
75 -620530 -498515 -707941 -1406544 -1279486 -1257739 -783319 -373303 -381221 -939154 -1005863 -648121
64 -648121 -608979 -309350 -434789 252363 -143051 -527459 -979594 -1172230 -769477 -1186927
54 -1186927 -1137934 -1356963 -1763786 -1230876 -1381155 -1085781 -1276831 -954838 -1005710 -1252905
44 -1252905 -1329300 -1142029 -1143670 -733524 -558640 -832081 248824 -734135 -1247605 -1375298
34 -1375298 -2052459 -2219963 -1754590 -1509220 -581205 -291594 -103452 67273 -51901 -383099
24 -383099 -480429 -403849 -878838 -245558 -553660 -1275616 -1323124 -1447615 -1030051 -747356 -341986
13 -341986 652624 489657 -383507 -1278690 -1004035 -1539240 -1243357 -792389 -542041 -589315
3 -589315 -521397 -390318 -64603
0 -64603
$$ Imaginary data points
##PAGE= N=2
##DATA TABLE= (X++(I..I)), XYDATA
16383 -3528637 -3206002 -3355471 -3149175 -3115481 -2822642 -3473708 -3349557 -3743771 -3234108 -3422108
16373 -3422108 -3287304 -3136329 -2552243 -2838314 -2822699 -2459624 -2857645 -2226970 -3203339 -3194415
16363 -3194415 -3265583 -3372682 -2917790 -2765210 -1716992 -2158591 -2071480 -2010848 -1512406 -2133715
16353 -2133715 -2472312 -1568097 -1120558 -1299102 -1922368 -1332603 -1433242 -1543145 -2018055
16344 -2018055 -1408269 -1144338 -1715161 -1746581 -1648570 -1654172 -1330331 -1142369 -597736 -296857
16334 -296857 -864697 -1106724 -902521 -1032083 -973862 -610176 -891826 -381097 -219339 -670146
16324 -670146 -504325 -270419 -201195 -288685 -1269215 -1726479 -1786435 -1465251 -813986 -767613
16314 -767613 112846 1003415 1422739 1206053 409298 147655 -175293 10996 -49672 256332
16304 256332 279190 68561 -122732 -736420 740627 1012459 1421242 991608 745168 970580
16294 970580 126903 234465 231370 728177 613264 -448487 -225405 376908 666367 1248040
16284 1248040 1360700 310238 555929 353806 711871 1514725 1169082 1834894 912849
16275 912849 -15140 -58582 -138315 419704 711527 1466553 1514652 1942891 2071283 1754593
16265 1754593 1778922 882058 569425 504699 858228 1020385 716265 221667 -73280 481773
16255 481773 653298 766691 1651106 1345683 1254389 588998 821356 1303101 1322899 1893468
16245 1893468 1560233 1222601 250122 648306 717141 1137461 1117088 1500854 2050334 2085359
16235 2085359 1366987 1525315 1823391 1668880 1365674 1603225 1476987 802576 1322546
16226 1322546 1322442 2031168 2446886 2748450 3137283 4053172 3553879 3648433 3559575 2492494
16216 2492494 2715192 2101686 2191716 2399349 2460351 2352608 3172636 2665312 2735022 2519775
16206 2519775 2796566 2479671 2141141 2605664 1581147 1524516 2222361 2942226 3292108
16197 3292108 3222841 3667097 3089612 2599726 2788777 3644099 4006160 3406030 3652493 2288464
16187 2288464 2021831 2051645 2731323 4150854 4187131 3726431 3384947 2427010 2327764 2246927
16177 2246927 3295510 3414775 3308690 3231056 2808627 2569514 2688475 2894608 3418089
16168 3418089 3172581 3530237 3222862 2861848 2672690 2225709 2870197 2677692 2059054
16159 2059054 2742860 3212452 3415964 3561004 3303670 3531525 4171413 3773397 3828157 3683214
16149 3683214 3749232 2901629 2528357 2832507 3555957 4425358 3488106 3062520 2838279 1917803
16139 1917803 2170109 2972778 3543263 3177225 2523568 2451561 3020401 2675439 3076785 3591447
16129 3591447 3023698 3083522 1554123 2027036 2370893 2797317 3307348 3542611 2996067
16120 2996067 2985802 3070958 3094207 4441084 4475681 4180725 3736081 3141973 3240921 3659660
16110 3659660 3159232 3475560 4104514 4373718 3390809 3818530 4685717 4453478 4612113
16101 4612113 4142837 4581500 4490727 3416727 3864954 4790782 5593319 4181120 4040190
16092 4040190 4424289 4294114 4504790 3489049 4263824 3905990 3922123 3603618 3370970
16083 3370970 3431945 3409755 2922761 2779078 1986707 2948608 3373613 4407179 4571079 4514993
16073 4514993 4435292 3761344 2693440 3267685 3875507 3710768 3555613 4782952 4797436
16064 4797436 4065499 4245446 3648146 4495662 4166758 4063100 3127655 3009667 2876643
16055 2876643 3038123 2752376 3184569 3418738 4145048 3689774 3551391 4158757 3914579
16046 3914579 2981886 1993035 2620451 3539418 3286995 3680203 4700491 4659341 4185381
16037 4185381 2558091 2702149 2851257 3423479 3530457 4346824 4512585 3508839 3504742
16028 3504742 3390831 3663866 3359183 2741818 3578853 3166489 3137570 4565371 4848558
16019 4848558 5690176 5266577 4453096 4248176 4078966 3972314 4182482 4288877 4352594 3736268
16009 3736268 3876187 4373238 4136722 5001936 4646202 4106739 4367464 3674018 4047753
16000 4047753 3868919 3642284 4655595 3992162 4425031 3537343 4557892 3912240 4455586
15991 4455586 5462017 5188393 5219961 4007629 4979202 4315945 4442041 5652671 5680678
15982 5680678 5469816 4366502 3277028 3706475 3517671 4246179 4259225 4808825 4140411
15973 4140411 3287693 2952545 3227762 4070532 3437260 4424648 4808916 5236591 4761419
15964 4761419 4637912 5608594 4354597 3751596 3829257 3380580 4810626 4351857 4349827 4105645
15954 4105645 3200893 2572619 3208743 4300023 5569332 5699440 4484228 4536819 2516288
15945 2516288 2712251 2601859 4065823 4130782 3656486 4445712 4204928 4253891 4101068 4049319
15935 4049319 5696089 4667323 4338002 3129830 3700228 3461631 3747650 4536744 3818091
15926 3818091 4527075 3038636 3441120 4059393 4099523 5197269 4814652 4798329 3217029
15917 3217029 2450456 2217782 2690848 3692671 3658168 3942049 3684043 3661600 2977397 3148719
15907 3148719 4222880 3285541 3592289 3092367 3494308 3201070 3420009 4686171 3892188
15898 3892188 3149970 2860323 3191240 3243511 3191478 3691459 3845434 4028689 3855320 3468602
15888 3468602 4633138 4708219 5636409 4544159 4159532 2302270 2655635 2409010 3332902
15879 3332902 3755637 3877827 4426023 3232743 3057635 2737469 3234890 2802359 3118164
15870 3118164 3843351 3456027 3893965 3445423 3166504 3246462 3693343 3916255 4147214 4055178
15860 4055178 3783692 3759127 3100285 3280969 4048479 3420169 3488064 2879484 2567355 2745489
15850 2745489 3742162 3918999 3954875 3906135 4360152 4094477 3657149 3840080 4262850 3859577
15840 3859577 3205712 3200178 3239240 3684006 3877326 4084203 3898306 3211304 2958008 3456877
15830 3456877 3299351 4386334 4410523 4613335 4094972 4454854 4847680 5063657 5280234
15821 5280234 4861147 5099386 3853856 2437307 2776392 3281788 3181135 3168893 3152937
15812 3152937 2476917 2698606 3039220 3522601 4654888 4334949 4347515 4922664 5046899
15803 5046899 4268263 4179588 4413317 4654215 3478034 2582780 4216311 3948885 3414282
15794 3414282 3000331 3410141 4410852 2859122 3559854 3768357 3845625 2852917 1654103
15785 1654103 2919417 2658022 3783708 4673403 6033888 5892453 4222969 4273241 3238432
15776 3238432 2537620 2752661 3217079 4654647 3733699 4385069 4454711 3689606 3745098 3324407
15766 3324407 4202639 2870054 3270203 2892987 4008070 3916565 4209307 4941991 4655977
15757 4655977 4661690 3833398 4713010 3944697 4337893 4231681 4218146 3828194 3687587 3217745
15747 3217745 4300737 5430559 4524516 4260839 4434592 3800893 4130791 3893057 5364280
15738 5364280 5488939 4120722 2823576 3100110 3585990 3919728 4458636 5606247 5106308
15729 5106308 4392154 4062845 5228503 5724740 5573276 4864965 4366259 3410642 1808911
15720 1808911 3165381 3409932 3844083 4302742 3914193 4317903 4662697 5092504 5216508
15711 5216508 4650607 3612537 3378306 3059773 2187128 3709496 4052806 3882153 3707840
15702 3707840 3588845 3824778 3546823 3346130 4575906 5066420 4401683 3848690 3471203
15693 3471203 3862191 3260276 3458251 4335514 4925707 4676354 4011818 4471342 4417140 4121269
15683 4121269 4069852 4836445 4038729 3632309 3201960 3019200 3685048 2851591 3810222 4301086
15673 4301086 4235065 4742816 4776432 5518922 4966153 4689689 3737766 4622336 3564240 3979545
15663 3979545 3654637 4225148 4785621 4119943 4270931 4184814 4113909 4383129 4087744 4018849
15653 4018849 4838068 5010758 5400275 4920371 4439662 4644839 4360631 4113041 4544154
15644 4544154 4836610 4001955 3311595 3347005 3885352 2747938 4239679 5054184 5298733
15635 5298733 4862410 3728301 4228627 3252307 2592839 3166241 4594851 4534431 4275663
15626 4275663 4285704 4602660 3745632 3421473 3421290 3964369 3516355 3875698 3730694 4575172
15616 4575172 3403772 3718563 3789813 3486340 3981341 3980086 3792953 3263231 3799251 3603067
15606 3603067 3880338 3674905 3433379 3855277 3053409 3691951 3010058 2784285 3604549
15597 3604549 3241980 4412169 4037175 4804731 4368170 4134561 3765212 3411598 3931643
15588 3931643 4459386 4264697 4124519 3783780 3503725 3369255 3497567 4001315 3915164 2124470
15578 2124470 2962943 3341828 4208631 4978018 4286583 5154869 5071930 4298515 3552908 3727275
15568 3727275 4178021 3944894 2263609 2830163 3273037 3796183 4059107 4277407 5090966
15559 5090966 4280842 3703079 3559487 3682727 3640922 3304005 3434561 2819050 3086089 2598829
15549 2598829 4147065 4155251 3450385 4248976 3949344 3984532 3247383 3347584 4165489 3639151
15539 3639151 3856366 3693331 4096140 3847527 3284389 2793751 3627934 3901786 3729065
15530 3729065 4245550 3221821 2900673 2431822 2284248 2856170 2755856 3510741 4524061
15521 4524061 4421735 4789888 4832394 5345551 4864586 4067108 3947184 3581120 3439034 3085181
15511 3085181 3330918 3780816 2739823 2236452 3209477 3361762 3822859 4265402 4571811
15502 4571811 4620858 4173540 3855479 4062723 4630082 3549908 3457551 3612961 3870176 4047823
15492 4047823 3785852 4428211 4414093 4046250 4833227 5154476 4723298 3890628 3916111 4493569
15482 4493569 3832073 3139998 3714106 4303947 4604859 3915705 5097393 5071819 4118354
15473 4118354 3312425 3360751 4975362 3833988 4282778 4780308 5121641 4350533 3152390
15464 3152390 3708469 4036467 4451319 4384876 4622969 4714905 3300089 3544788 3415195 3282128
15454 3282128 4401805 5116977 5060266 4541847 3787982 4920372 4420594 3450400 3022258
15445 3022258 3761107 4139572 3551458 4178357 4175114 4497567 3788383 4057212 3576968 3701506
15435 3701506 3572827 2895145 3890047 3425189 2381933 3196231 3416085 4497952 4183276
15426 4183276 4552831 4780118 3959771 2741194 2279082 3124033 3443133 3707119 4772326
15417 4772326 4855889 4135636 3247294 2328223 2580578 3160584 3065950 4402412 4939194 4657444
15407 4657444 5078689 3801452 3617413 3844700 3278350 3774063 3244733 3458736 3484115
15398 3484115 3059354 3146441 3368817 3851125 4161419 3975369 4606072 4034261 3605830 3646206
15388 3646206 2829030 3842523 3774981 4256935 3993419 3911121 4402104 4541798 4591213 4982356
15378 4982356 4911891 4751527 4312315 4818329 5327560 5537068 5245485 4667267 4008827 4214651
15368 4214651 4254191 3417825 3433439 3240558 3981720 3494760 3638477 3352511 4236184 5081537
15358 5081537 3451035 4842692 3907043 4504508 4124217 3403344 4668341 5200061 3864068
15349 3864068 3052674 3645506 3650180 3678601 4179938 4661780 4896048 4104789 2911533 3937492
15339 3937492 4849684 4988803 5449958 4963904 3700997 3531299 3298973 4069607 5607984
15330 5607984 5779388 4664577 4385736 3951654 4082077 3220407 4337848 5072261 4582003
15321 4582003 4176543 3426611 3876162 3628336 3797529 4674821 4558449 5442621 5198640
15312 5198640 4853921 4250670 4059670 4330776 3611171 3452362 3532002 3466639 3287126 3590060
15302 3590060 4053212 4240194 4128157 3632394 3556418 3528216 3153818 3685715 3443222 3490012
15292 3490012 3260423 3254724 2957239 3456139 3927286 4721096 4227661 4062173 4749192 4166925
15282 4166925 4176064 3378309 3409841 3652705 3101191 3967811 3718438 3998209 3944523 3475957
15272 3475957 4379600 3432284 3796581 4157174 4032953 3365478 3232694 3370050 3812602
15263 3812602 4761849 4730099 5466677 5221327 3968501 3934991 3801046 4205385 4047796 4703402
15253 4703402 4266625 4138573 4316925 3295683 5349802 4064499 4282826 4050326 4266842
15244 4266842 4568687 4359403 5415131 5344390 5543198 4490761 4257707 4817700 4024738
15235 4024738 3615057 3534621 3394659 3702408 4150154 3929446 3694747 3665911 2735109 3858705
15225 3858705 3447829 3516739 4374764 3715324 3641222 3468970 3309402 3390669 3851560 4064017
15215 4064017 3621113 3616818 3997914 5183226 5304871 5568910 5214361 5059152 4986721 4508769
15205 4508769 5086217 4761944 4527109 4552082 4417993 5135339 4223239 3674301 3672192 3364120
15195 3364120 3966256 3387725 3278296 3570105 3389195 2773567 2994271 3122356 3757846
15186 3757846 3796631 4539370 3998095 4103754 3982856 3812130 3358654 3763024 4129466 3401609
15176 3401609 3528601 3282748 4741326 4587463 4335189 3770288 4191590 3842224 3627857
15167 3627857 4402065 4387580 4471438 4285924 3604749 3999776 4228413 4632825 4092101 5226468
15157 5226468 4493988 4192355 3824860 3960234 4343933 3784648 2376378 2193386 2688333
15148 2688333 2127593 4173978 3946386 4173170 4743716 3791179 2768468 3808109 3261657
15139 3261657 3635512 3304404 3947143 5489650 5632027 5212668 5256612 5339663 4046372
15130 4046372 3771428 3243179 3754637 4056100 3937008 4350626 4422374 4947883 4083907 4673695
15120 4673695 4364968 4045870 4012222 3265926 4286614 3520442 3504157 3752813 4697532 4530536
15110 4530536 4165490 4001519 3241711 3499758 2388919 3346537 3772186 2877105 3860653
15101 3860653 4225270 4206326 4498830 3866728 4050190 4847565 4627006 4564008 4359928 3948642
15091 3948642 4244671 3770348 4191366 4935153 4394594 4057507 4614116 4475880 4287065
15082 4287065 4547523 4444197 4253174 3513130 3535591 3935828 3860939 3746147 3946651 3588039
15072 3588039 3043802 2619071 2821281 2286984 2610421 2834063 2620834 3776762 3656855
15063 3656855 4305371 5675969 4498332 5239795 4373342 3549916 4476701 4537704 4769103
15054 4769103 5219074 5100028 4753342 4049725 4001286 3849509 4069663 4003801 3831981 4036485
15044 4036485 3659425 3087247 3435956 3687020 3595596 4560187 4870092 4500666 3410660
15035 3410660 3116341 3309566 4165251 4099560 4155425 4201658 4188356 3933541 4348269 3552886
15025 3552886 4758711 3783375 3569492 3616014 4002424 4623874 4633766 4869520 4787918 4211559
15015 4211559 4347197 3864628 3090392 4274421 3748024 3897995 3667471 3497840 4059168
15006 4059168 4192453 4235834 4100471 3241449 3289750 4103876 4244685 4943189 5580599 4608802
14996 4608802 4092779 2933187 3045507 3303347 3329535 4276891 4250522 4308401 3419873 3568266
14986 3568266 3917037 3601100 2988412 3678141 4328428 4981000 4844960 4353778 4013516
14977 4013516 3648921 3476266 3432894 4061553 4366188 4803707 3989360 5383440 4675013
14968 4675013 5089275 4367283 4667445 5083137 4028197 4472653 3775321 4361942 4179006
14959 4179006 3401689 4059136 4021492 4402957 4135504 5036100 4519945 4597425 4643989 4406324
14949 4406324 4677530 3423094 4013716 3558783 3917042 3831662 4272593 4275979 3982243 4466937
14939 4466937 3996467 3426820 4364194 4793353 4675741 4665140 4163570 4360133 5009294 5233780
14929 5233780 5081420 5085672 3425619 4472355 5006303 4448358 4872247 5408744 5772037
14920 5772037 4098914 3172908 3328869 4250016 3943857 3192128 3863299 3887772 3246151
14911 3246151 2837218 3997856 3743155 3843005 3947051 2559134 3308332 2072028 2246060
14902 2246060 3300923 4011109 4246133 3703293 4306642 3616834 3440697 3962982 4761803
14893 4761803 4960820 4713142 4016156 4254908 4137311 3325388 3901062 4512981 3520304
14884 3520304 3429434 3720152 3501202 4258534 4165781 4177423 4483926 4223442 2876075 3274729
14874 3274729 2940118 3880338 4208647 3659049 4004565 3926283 4211900 4058454 4056372 3525989
14864 3525989 3507277 2917744 2394026 2632268 3624773 3796202 4417912 4231702 3834685 4676770
14854 4676770 4513837 3750036 4085249 3393260 3423370 3253029 3294788 3988930 3695619 4390417
14844 4390417 3825111 3566213 3994901 4220643 4011932 3996376 3541928 4149631 3669150 4065097
14834 4065097 3931186 4043339 3460026 3109292 3759855 3940850 3990561 3393499 3900596 3896994
14824 3896994 4456385 4584885 5455275 4695353 3788655 4470575 4850557 5463648 5348132
14815 5348132 5154163 4714195 4091123 3901464 4195270 5077564 5396346 5189216 4874742
14806 4874742 4618049 5184025 4365753 4733105 4647512 4613696 4141719 3846068 3211760 3202733
14796 3202733 2950488 3236213 3678577 3438339 3654498 3683045 4525328 4505258 4937405 5583774
14786 5583774 5431034 4548943 4096732 4047301 4517100 3356061 3326655 3700442 3298848 3971551
14776 3971551 4299640 4156539 4252015 4482676 4229786 4602897 4401566 4446960 3808302 3619678
14766 3619678 4183684 3819646 5085867 4919432 5120074 4361163 3394580 3386366 3445759 3194304
14756 3194304 3087865 4412938 3624981 4030098 3776885 3595381 4222968 3568202 4527453
14747 4527453 4244530 3802211 3990566 4780298 4537703 4656086 4578712 5122637 4183423 4463539
14737 4463539 5004495 5082240 5007301 4909352 4992905 5117196 4628017 4009537 4819681 4834178
14727 4834178 5643110 5207664 4812912 4793326 3844755 3829961 2981909 2969330 3051351 3112333
14717 3112333 4012345 4572575 4771701 4416037 4099422 4353275 5143140 5066569 5917139 6389393
14707 6389393 5904802 5510371 3940183 4726919 5650982 5767704 4918835 5191453 4867648
14698 4867648 4226877 4004446 3387676 4194588 3119444 2895876 2455581 2861759 3151277
14689 3151277 3586782 4894203 5132030 4440134 4550627 4135612 4387560 3828415 3810312
14680 3810312 4141046 4119669 3304176 3345802 4579341 4941391 4863319 4947132 5003858 4952509
14670 4952509 4011090 3856460 4323948 4606968 4296932 3273089 3775204 3655311 3130549
14661 3130549 3411437 3594357 4419676 4231250 4440059 4804921 4815733 4186401 4752123 4532613
14651 4532613 4975196 4372234 4247399 5117613 4258642 3758318 3666839 3771640 3431574 4233611
14641 4233611 4862914 5044796 4905061 4609597 5168669 4978556 4422047 5000379 5998177
14632 5998177 5635496 5304490 4892410 4463288 4683402 4531918 5109791 5478132 5697854
14623 5697854 4164108 3706388 3520755 4792990 4640286 4365075 4374123 4354754 3529988 2032416
$$ [...]
##END NTUPLES=NMR SPECTRUM
##END=
