##TITLE=1H_EC-3302(23)
 CDCl3
 8 sc, 
 26.10.2023
##JCAMPDX= 6.0         $$ Bruker NMR JCAMP-DX V2.0
##DATA TYPE= NMR SPECTRUM
##DATA CLASS= NTUPLES
##ORIGIN= UXNMR, Bruker Analytische Messtechnik GmbH
##OWNER= root
$$ XWIN-NMR		Version 3.5
$$ Thu Oct 26 14:15:06 2023 Russian Standard Time (UT+4h)  she@DPX200
##.OBSERVE FREQUENCY= 200.13135
##.OBSERVE NUCLEUS= ^1H
##.ACQUISITION MODE= SIMULTANEOUS
##.ACQUISITION SCHEME= undefined
##.AVERAGES= 8
##.DIGITISER RES= 18
##SPECTROMETER/DATA SYSTEM= spect
##.PULSE SEQUENCE= zg30
##.SOLVENT NAME= CDCl3
##.SHIFT REFERENCE= (INTERNAL, CDCl3, 0, 15.7315)
##AUDIT TRAIL= $$ (NUMBER, WHEN, WHO, WHERE, WHAT)
$$ ##TITLE= Audit trail, XWIN-NMR		Version 3.5
$$ ##JCAMPDX= 5.01
$$ ##ORIGIN= Bruker BioSpin GmbH
$$ ##OWNER= she
$$ F:/spectra/data/she/nmr/H-F/1/pdata/1/auditp.txt
$$ ##AUDIT TRAIL=  $$ (NUMBER, WHEN, WHO, WHERE, WHAT)
(   1,<2023-10-26 14:13:55.62 +0400>,<she>,<DPX200>,
      <created by zg, POWCHK disabled, PULCHK disabled
       configuration hash MD5:
       00 E9 B6 7A A2 85 ED C7 34 08 36 98 17 FE 4E 26
       data hash MD5: 16K
       7B 46 C3 39 94 B8 6C 6A C0 86 6D EF C5 D1 52 3A>)
(   2,<2023-10-26 14:13:57.98 +0400>,<she>,<DPX200>,
      <Start of raw data processing
       efp BC_mod = 2 LB = 0.24 FT_mod = 6 PKNL = 1 PHC0 = -23505.99 PHC1 = 7.252718 SI = 16K 
       data hash MD5: 16K
       36 F8 B5 AB D4 25 B9 FB B9 93 BE 56 68 79 67 A5>)
(   3,<2023-10-26 14:14:13.78 +0400>,<she>,<DPX200>,
      <pk PHC0 = -11.99559 PHC1 = 14.2 
       data hash MD5: 16K
       55 E5 A7 F0 59 C1 5C 17 57 28 88 C8 A4 AD AA D9>)
(   4,<2023-10-26 14:14:17.48 +0400>,<she>,<DPX200>,
      <abs ABSG = 5 
       data hash MD5: 16K
       4F BB 17 E8 78 2A 30 76 22 38 07 0C 8E 3C B5 6A>)
$$ ##END=
$$ 
$$ hash MD5
$$ 40 34 C6 6B 44 4A 5F 98 AF 5C 90 5F FA B0 B7 7A
##$RELAX= 
##$RELAX= 
##$RELAX= 
##$RELAX= 
##$RELAX= 
##$RELAX= 
$$ Bruker specific parameters
$$ --------------------------
##$DU= <F:/spectra>
##$EXPNO= 1
##$NAME= <H-F>
##$PROCNO= 1
##$TYPE= <nmr>
##$USER= <she>
##$AMP= (0..31)
100 100 100 100 100 100 100 100 100 100 100 100 100 100 100 100 100 100 
100 100 100 100 100 100 100 100 100 100 100 100 100 100 
##$AQSEQ= 0
##$AQ_mod= 1
##$AUNM= <au_zg>
##$AUTOPOS= <>
##$BF1= 200.13
##$BF2= 200.13
##$BF3= 200.13
##$BF4= 200.13
##$BF5= 200.13
##$BF6= 200.13
##$BF7= 200.13
##$BF8= 200.13
##$BYTORDA= 1
##$CFDGTYP= 0
##$CFRGTYP= 5
##$CHEMSTR= <none>
##$CNST= (0..31)
1 1 145 1 1 1 1 1 1 1 1 1 1 1 1 1 1 1 1 1 1 1 1 1 1 1 1 1 1 1 1 1 
##$CPDPRG= <>
##$CPDPRG1= <>
##$CPDPRG2= <>
##$CPDPRG3= <>
##$CPDPRG4= <mlev>
##$CPDPRG5= <mlev>
##$CPDPRG6= <mlev>
##$CPDPRG7= <mlev>
##$CPDPRG8= <mlev>
##$CPDPRGB= <>
##$CPDPRGT= <>
##$D= (0..31)
0 1.2 0 0 0 0 0 0 0 0.06 0 0.03 0 0 0 0 0.0002 0 0 0 0 0 0 0 0 0 0 0 0 
0 0 0 
##$DATE= 1698315235
##$DBL= (0..7)
120 120 120 120 120 120 120 120 
##$DBP= (0..7)
150 150 150 150 150 150 150 150 
##$DBP07= 0
##$DBPNAM0= <>
##$DBPNAM1= <>
##$DBPNAM2= <>
##$DBPNAM3= <>
##$DBPNAM4= <>
$$ [...]
##$SUBNAM3= <"">
##$SUBNAM4= <"">
##$SUBNAM5= <"">
##$SUBNAM6= <"">
##$SUBNAM7= <"">
##$SUBNAM8= <"">
##$SUBNAM9= <"">
##$SW= 18.05172834244
##$SWIBOX= (0..15)
0 0 2 0 0 0 0 0 0 0 0 0 0 0 0 0 
##$SW_h= 3612.71676300578
##$TD= 16384
##$TD0= 1
##$TE= 0
##$TE2= 300
##$TE3= 300
##$TEG= 300
##$TL= (0..7)
0 120 120 120 120 120 120 120 
##$TP= (0..7)
150 150 150 150 150 150 150 150 
##$TP07= 0
##$TPNAME0= <>
##$TPNAME1= <>
##$TPNAME2= <>
##$TPNAME3= <>
##$TPNAME4= <>
##$TPNAME5= <>
##$TPNAME6= <>
##$TPNAME7= <>
##$TPOAL= (0..7)
0.5 0.5 0.5 0.5 0.5 0.5 0.5 0.5 
##$TPOFFS= (0..7)
0 0 0 0 0 0 0 0 
##$TUNHIN= 0
##$TUNHOUT= 0
##$TUNXOUT= 0
##$USERA1= <user>
##$USERA2= <user>
##$USERA3= <user>
##$USERA4= <user>
##$USERA5= <user>
##$V9= 5
##$VALIST= <valist>
##$VCLIST= <CCCCCCCCCCCCCCC>
##$VD= 0
##$VDLIST= <DDDDDDDDDDDDDDD>
##$VPLIST= <PPPPPPPPPPPPPPP>
##$VTLIST= <TTTTTTTTTTTTTTT>
##$WBST= 1024
##$WBSW= 4
##$XGAIN= (0..3)
0 0 0 0 
##$XL= 0
##$YL= 0
##$YMAX_a= 43037
##$YMIN_a= -56958
##$ZGOPTNS= <>
##$ZL1= 120
##$ZL2= 120
##$ZL3= 120
##$ZL4= 120
##$ABSF1= 15.73917
##$ABSF2= -2.312679
##$ABSG= 5
##$ABSL= 3
##$ALPHA= 0
##$AQORDER= 0
##$ASSFAC= 0
##$ASSFACI= 0
##$ASSFACX= 0
##$ASSWID= 0
##$AUNMP= <proc_1d>
##$AZFE= 0.1
##$AZFW= 0.1
##$BCFW= 0
##$BC_mod= 2
##$BYTORDP= 0
##$COROFFS= 0
##$CY= -3
##$DATMOD= 1
##$DC= 0
##$DFILT= <>
##$DTYPP= 0
##$F1P= 0
##$F2P= 0
##$FCOR= 1
##$FTSIZE= 16384
##$FT_mod= 6
##$GAMMA= 0
##$GB= 0
##$INTBC= 1
##$INTSCL= 3.70164e-10
##$ISEN= 128
##$LB= 0.24
##$LEV0= 0
##$LPBIN= 0
##$MAXI= 10000
##$MC2= 0
##$MEAN= 0
##$ME_mod= 0
##$MI= 1.114404
##$NCOEF= 0
##$NC_proc= -9
##$NLEV= 6
##$NOISF1= 3.799351
##$NOISF2= 2.8
##$NSP= 0
##$NTH_PI= 0
##$NZP= 0
##$OFFSET= 15.73146
##$PC= 1
##$PHC0= -23517.99
##$PHC1= 21.45272
##$PH_mod= 1
##$PKNL= yes
##$PPARMOD= 0
##$PSCAL= 0
##$PSIGN= 0
##$REVERSE= no
##$SF= 200.130008019795
##$SI= 16384
##$SIGF1= 3
##$SIGF2= 2
##$SINO= 5.538805
##$SIOLD= 16384
##$SREGLST= <1H.CDCl3>
##$SSB= 0
##$STSI= 16384
##$STSR= 0
##$SW_p= 3612.71676300578
##$SYMM= 0
##$S_DEV= 0
##$TDeff= 16384
##$TDoff= 0
##$TI= <>
##$TILT= no
##$TM1= 0
##$TM2= 0
##$TOPLEV= 0
##$USERP1= <user>
##$USERP2= <user>
##$USERP3= <user>
##$USERP4= <user>
##$USERP5= <user>
##$WDW= 1
##$XDIM= 16384
##$YMAX_p= 364313793
##$YMIN_p= -2216704
$$ End of Bruker specific parameters
$$ ---------------------------------
##NTUPLES= NMR SPECTRUM
##VAR_NAME=  FREQUENCY,     SPECTRUM/REAL,   SPECTRUM/IMAG
##SYMBOL=    X,             R,               I
##VAR_TYPE=  INDEPENDENT,   DEPENDENT,       DEPENDENT
##VAR_FORM=  AFFN,          ASDF,            ASDF
##VAR_DIM=   16384,         16384,           16384
##UNITS=     HZ,            ARBITRARY UNITS, ARBITRARY UNITS
##FACTOR=    0.220516191357247, 1,           1
##FIRST=     3148.33713943632, 0,            0
##LAST=      -464.379623569459, 0,           0
##MIN=       -464.379623569459, -2216704,    0
##MAX=       3148.33713943632, 364313793,    0
$$ Real data points
##PAGE= N=1
##DATA TABLE= (X++(R..R)), XYDATA
$$ [...]
$$ plain form
4916 7012172 6437350 6531102 6344569 5292196 5227615 6148736 6277095 6590798 7446328 6948129
4906 6948129 6400587 6620922 6347895 5966765 6764878 6385689 6684758 6793434 6521428 7349387
4896 7349387 7770521 7164485 6909772 6596319 7148134 7140812 6714187 7109979 7616675 6731684
4886 6731684 6101665 6699655 7392200 7235579 7684542 8355188 7696012 7810941 7536908 7376438
4876 7376438 7272001 8117422 7567081 7159837 7544033 7986836 7201243 7253073 7726584 7552789
4866 7552789 8081381 8682273 8151164 8711151 8511814 7926834 8488270 9074814 9219396 8445342
4856 8445342 8758480 8193436 8799371 8876978 8575843 8182986 8370144 8400393 8293175 8925369
4846 8925369 7804306 8305586 9410751 9014065 8603096 9098209 9184091 8808074 9676398
$$ packed form
4916G012172n74822R3752j86533j052373o4581R21121J28359L13703Q55530m98199
4906F948129n47542K20335k73027l81130P98113l79189K99069J08676k72006Q27959
4896G349387M21134o06036k54713l13453N51815p322m26625L95792N06696q84991
4886F731684o30019N97990O92545j56621M48963O70646o59176J14929k74033j60470
4876G376438j04437Q45421n50341m07244L84196M42803p85593N1830M73511j73795
4866G552789N28592O00892n31109N59987j99337n84980N61436N86544J44582p74054
4856H445342L13138n65044O05935P7607l01135l92857J87158L0249j07218O32194
4846H925369j121063N01280J105165l96686m10969M95113Q5882l76017Q68324
$$ plain form
4837 9676398 9478089 9382297 8946248 9401677 10132381 9679938 9163527 9276136 9884050 9899002
4827 9899002 9636404 9162099 10041824 10066153 10372379 10501969 11496430 11693562 11776802 11546691
4817 11546691 10933146 11412086 11942820 11595690 10705304 12057515 12453145 11969106 11937652
4808 11937652 12979318 13191677 12845014 12076577 12974273 13831094 13906832 13448270 13684713
4799 13684713 14615720 14709531 14415962 14707537 15678595 15986294 15789030 16411650 17551849
4790 17551849 17074492 17411590 18222183 18531094 18069874 19264084 19422407 19901713 20537018
4781 20537018 19756873 20439676 20658639 21747293 22772875 22830207 23263753 24108637 24507343
4772 24507343 25495460 26847242 26796248 27282469 27635884 28770227 30727225 31710926 31967356
$$ packed form
4837I676398j98309r5792m36049M55429P30704m52443n16411J12609O07914J4952
4827I899002k62598m74305Q79725K4329L06226J29590R94461J97132Q3240k30111
4817A1546691o13545M78940N30734l47130q90386J352211L95630m84039l1454
4808A1937652J041666K12359l46663p68437Q97696Q56821P5738m58562K36443
4799A3684713R31007R3811k93569K91575R71058L07699j97264O22620J140199
4790A7551849m77357L37098Q10593L08911m61220J194210J58323M79306O35305
4781B0537018p80145O82803K18963J088654J025582N7332M33546Q44884L98706
4772B4507343R88117J351782n0994M86221L53415J134343J956998R83701K56430
$$ plain form
4763 31967356 31939963 30533741 30798209 31768815 31981884 32782183 32454104 32104371 32301976
4754 32301976 32404921 33139990 33765565 33956227 33514409 34063066 33872141 33699045 33842018
4745 33842018 33619865 33682357 32228810 31776669 32393794 32212986 31996545 31325598 30552237
4736 30552237 31122853 31151569 31077184 31253917 31255105 30862859 31233006 31844483 32351629 32686794
4726 32686794 33392059 33422500 33180679 33011933 33390653 33481281 33692659 33452781 32663138 31556685
4716 31556685 30960063 30633944 29674183 29812122 29137283 29173651 30008030 30646487 30507741 30686396
4706 30686396 31303214 31819409 32786764 34019640 34271659 35148159 35147502 34052719 33251297 33457556
4696 33457556 32058083 30474732 30116225 29173571 28597546 28470563 27922635 27025564 25571774
$$ packed form
4763C1967356k7393j406222K64468R70606K13069Q00299l28079l49733J97605
4754C2301976J02945P35069O25575J90662m41818N48657j90925j73096J42973
4745C3842018k22153O2492j453547m52141O17125j80808k16441o70947p73361
4736C0552237N70616K8716p4385J76733J188l92246L70147O11477N07146L35165
4726C2686794P05265L0441k41821j68746L78720R0628K11378k39878p89643j106453
4716C1556685n96622l26119r59761J37939o74839L6368Q34379O38457j38746J78655
4706C0686396O16818N16195R67355J232876K52019Q76500o57j094783q01422K06259
4696C3457556j399473j583351l58507r42654n76025j26983n47928q97071j453790
$$ plain form
4687 25571774 25526668 25620440 25360908 24863174 23926485 24074050 22945443 23334364 23228342 23054540
4677 23054540 23289167 22826924 22450845 22849941 22471221 21966806 22929819 23154648 22226932
4668 22226932 22085990 22267334 22504421 21993904 23249284 23535392 23631908 24059634 22857971
4659 22857971 23044244 24095862 24165338 23992339 24039263 23589094 22200915 22103633 21968510 20905833
4649 20905833 20910084 20175940 19294762 19221831 19776702 18224367 17242353 17507575 16848945 16827898
4639 16827898 17208662 16891894 16603271 16419278 16339052 16451843 16255149 15920532 16433109 16720148
4629 16720148 16926380 17294498 17028626 17156361 16998762 16398995 16446755 16746699 16302089 16130360
4619 16130360 15381021 15462241 14769586 14088492 14187730 14006480 14223842 13970748 13238078 12878083
$$ packed form
4687B5571774m5106R3772k59532m97734r36689J47565j128607L88921j06022j73802
4677B3054540K34627m62243l76079L99096l78720n04415R63013K24829r27716
4668B2226932j40942J81344K37087n10517J255380K86108R6516M27726j201663
4659B2857971J86273J051618O9476j72999M6924m50169j388179r7282j35123j062677
4649B0905833M251p34144q81178p2931N54871j552335r82014K65222o58630k1047
4639A6827898L80764l16768k88623j83993q0226J12791j96694l34617N12577K87039
4629A6720148K06232L68118k65872J27735j57599n99767M7760K99944m44610j71729
4619A6130360p49339Q1220o92655o81094R9238j81250K17362k53094p32670l59995
$$ plain form
4609 12878083 12643307 12048470 12290809 12291450 12460752 12323520 12599183 12676640 13277958 13756048
4599 13756048 13242951 13347649 13424012 13945617 13810443 14030859 14099345 13084942 13055431 13232568
4589 13232568 12793136 13622537 13277157 12796788 13210688 13520821 13382182 13284020 12879226 12160049
4579 12160049 12150543 12735967 13223889 12598144 12855409 12775290 12467790 12499979 12613533 12741476
4569 12741476 12667096 11655299 11823267 12181804 11488747 10928857 11030043 10887717 10928454 10850459
4559 10850459 10862163 10828959 11164163 10605961 10708385 11005246 11153181 10644546 10873984 10413583
4549 10413583 10202088 9888343 9869111 10338117 10813134 10999563 11115474 11659431 10892147 11024704
4539 11024704 11741461 11329137 11397493 12267667 12057015 11952234 12224462 12276496 12313993 12429336
$$ packed form
4609A2878083k34776n94837K42339O41J69302j37232K75663P7457O01318M78090
4599A3756048n13097J04698P6363N21605j35174K20416O8486j014403k9511J77137
4589A3232568m39432Q29401l45380m80369M13900L10133j38639r8162m04794p19177
4579A2160049r506N85424M87922o25745K57265q0119l07500L2189J13554J27943
4569A2741476p4380j011797J67968L58537o93057n59890J01186j42326M0737p7995
4559A0850459J1704l3204L35204n58202J02424K96861J47935n08635K29438m60401
4549A0413583k11495l13745j9232M69006M75017J86429J15911N43957p67284J32557
4539A1024704P16757m12324O8356Q70174k10652j04781K72228N2034L7497J15343
$$ plain form
4529 12429336 12054499 11778661 11869196 11609659 11738711 12179630 12471816 14013442 13837341
4520 13837341 12814418 12517406 12442089 12675625 12503233 12029939 12658583 12751333 12647959 12964352
4510 12964352 12839777 13017842 12928716 12926852 12903340 12595246 13705338 14444732 13494079 13552655
4500 13552655 14629167 15373773 15809238 16701724 16550710 16544207 17311440 17492443 18197971 18260678
4490 18260678 18629115 19531647 21242285 22695151 25796930 28476828 29242332 26584258 23382447
4481 23382447 21449132 20399735 19642177 19200104 18667242 18162780 19160710 19589363 19484597
4472 19484597 19916231 20705045 21720256 22060145 22966964 23154019 23094997 24499552 26282313
4463 26282313 27162896 28895093 30570875 30902664 31633200 30717775 29619081 28831367 27949641
$$ packed form
4529A2429336l74837k75838R0535k59537J29052M40919K92186J541626j76101
4520A3837341j022923k97012p5317K33536j72392m73294O28644R2750j03374L16393
4510A2964352j24575J78065q9126j864k3512l08094J110092P39394r50653N8576
4500A3552655J076512P44606M35465Q92486j51014o503P67233J81003P05528O2707
4490A8260678L68437R02532J710638J452866L101779K679898P65504k658074l201811
4481B3382447j933315j049397p57558m42073n32862n04462R97930M28653j04766
4472A9484597M31634P88814J015211L39889R06819J87055n9022J404555J782761
4463B6282313Q80583J732197J675782L31789P30536r15425j098694p87714q81726
$$ plain form
4454 27949641 28467108 28862535 28911879 29972666 31036073 32009903 33114428 34312973 36105301
4445 36105301 38430324 40689062 44063131 47927870 52456395 57524539 64305259 71521065
4437 71521065 79013437 83650885 84405272 81803664 76843954 73652148 72168138 69632801
4429 69632801 66606371 62091906 57112748 52979771 48864836 46033558 44305733 43707848
4421 43707848 41925141 41778674 41485211 40643697 40995834 39352928 38126495 36445510 33079933
4412 33079933 30496343 28452912 27095825 25410733 24477527 24318775 23569239 23490031 22854093
4403 22854093 22063451 21632064 20712489 19958050 19334470 18553571 17803931 16960986 17214476
4394 17214476 17093435 16393891 16698800 16779063 16451315 16651302 16713329 15983959 16183115 16040543
$$ packed form
4454B7949641N17467L95427M9344J060787J063407R73830J104525J198545J792328
4445C6105301K325023K258738L374069L864739M528525N068144O780720P215806
4437G1521065P492372M637448P54387k601608m959710l191806j484010k535337
4429F9632801l026430m514465m979158m132977m114935k831278j727825n97885
4421D3707848j782707j46467k93463q41514L52137j642906j226433j680985l365577
4412C3079933k583590k043431j357087j685092r33206j58752p49536p9208o35938
4403B2854093p90642m31387r19575p54439o23580p80899p49640q42945K53490
4394A7214476j21041o99544L04909Q0263l27748J99987O2027p29370J99156j42572
$$ plain form
4384 16040543 15987199 15955400 15773727 15989815 16312738 16733580 17128069 16237873 16349498 16919515
4374 16919515 17263387 17303670 16750232 17245726 17914018 18850236 18934763 19171769 19004708 18687626
4364 18687626 18814636 19015110 18529903 18127400 17861708 18038748 17692173 17104368 16760362
4355 16760362 16121724 16209365 15659071 15606116 16006252 15377321 15942264 15899787 15612129 15628112
4345 15628112 16029009 16476225 16968648 17839396 17768748 17926918 18314760 18506009 18709386 18776570
4335 18776570 19871239 20988647 21653265 22737656 22942926 22482675 21873782 22043187 22441275
4326 22441275 22504416 23207010 23929759 24083485 23289783 23253250 24464077 25062513 24829153 26227912
4316 26227912 25997782 27367320 28238971 29936601 31831694 33077491 34412533 36487517
$$ packed form
4384A6040543n3344l1799j81673K16088L22923M20842L94489q90196J11625N70017
4374A6919515L43872M0283n53438M95494O68292R36218Q4527K37006j67061l17082
4364A8687626J27010K00474m85207m02503k65692J77040l46575n87805l44006
4355A6760362o38638Q7641n50294n2955M00136o28931N64943m2477k87658J5983
4345A5628112M00897M47216M92423Q70748p0648J58170L87842J91249K03377O7184
4335A8776570J094669J117408O64618J084391K05270m60251o08893J69405L98088
4326B2441275O3141P02594P22749J53726p93702l6533J210827N98436k33360J398759
4316B6227912k30130J369538Q71651J697630J895093J245797J335042K074984
$$ plain form
4308 36487517 39625399 43275830 48551477 54148118 60675175 67765268 74171155 76777960
4300 76777960 73818186 65917077 56850146 48366052 42457849 38069863 34498502 32461204
4292 32461204 30773260 28886264 26898216 26160044 25864484 25470892 25529038 24593746 24285256
4283 24285256 24000564 24582462 25370593 25544887 25216096 25956652 25823391 26369493 26661063
4274 26661063 26674602 26738021 27377228 26709852 26029232 26361263 26684262 26310905 26147997 25918861
4264 25918861 26136301 25981523 25465181 24419655 24989664 24916137 23903479 23781233 22635342
4255 22635342 21588667 21367394 20476728 19638358 19905867 19826363 19665101 19062922 19270017
4246 19270017 19549697 19327763 18979416 19175159 19031227 18933042 18851055 19148448 19178017 18617549
$$ packed form
4308C6487517L137882L650431N275647N596641O527057P090093O405887K606805
4300G6777960k959774p901109r066931q484094n908203m387986l571361k037298
4292C2461204j687944j886996j988048p38172k95560l93592N8146r35292l08490
4283B4285256k84692N81898P88131J74294l28791P40556j33261N46102K91570
4274B6661063J3539O3419O39207o67376o80620L32031L22999l73357j62908k29136
4264B5918861K17440j54778n16342j045526N70009p3527j012658j22246j145891
4255B2635342j046675k21273q90666q38370K67509p9504j61262o02179K07095
4246A9270017K79680k21934l48347J95743j43932r8185q1987K97393K9569n60468
$$ plain form
4236 18617549 18828969 19486000 18636415 18572498 18646662 17489416 16848195 16840603 16134415 16913015
4226 16913015 16527270 14621975 14809963 14143569 14334032 14366512 14245162 14228500 14484831 14621991
4216 14621991 14310556 13637930 13193156 12762493 13163896 13711279 14117311 14128354 14405143 14174277
4206 14174277 12735644 12935675 13506116 14010285 13745458 13577563 13296694 14226657 13911846
4197 13911846 12782323 11766091 11890794 12394079 13147899 12109341 11372493 11384082 10726314
4188 10726314 11324404 11628565 10338687 10318597 10735928 9996788 10059012 10427569 10805058 10461697
4178 10461697 10926820 11292934 9901534 9978371 10345828 9813144 9784982 9851508 9862083 10364368
4168 10364368 10714461 10709309 10559871 10484464 10287133 10359234 10572468 10514328 10659034 11572047
$$ packed form
4236A8617549K11420O57031q49585o3917P4164j157246o41221p592p06188P78600
4226A6913015l85745j905295J87988o66394J90463L2480j21350j6662K56331J37160
4216A4621991l11435o72626m44774m30663M01403N47383M06032J1043K76789k30866
4206A4174277j438633K00031N70441N04169k64827j67895k80869R29963l14811
4197A3911846j129523j016232J24703N03285P53820j038558p36848J1589o57768
4188A0726314N98090L04161j289878k0090M17331p39140O2224L68557L77489l43361
4178A0461697M65123L66114j391400P6837L67457n32684k8162O6526J0575N02285
4168A0364368L50093n152j49438p5407j97331P2101K13234n8140J44706R13013
$$ plain form
4158 11572047 11551308 11443056 11218689 11184234 10953035 11095374 10495765 10776807 11123724 11363327
4148 11363327 12306069 11827801 12265429 12099127 11555675 11336758 10447118 10920089 10596944
4139 10596944 9929815 9895581 9861948 10301054 10263470 9944005 10212428 11397597 11546863 11504957
4129 11504957 11349066 10835224 10461032 10860921 10957915 10595836 11456273 11988993 11674295 10827432
4119 10827432 10669822 11357512 10944648 11105323 11177589 11414156 11504489 12022039 12150423 12173093
4109 12173093 12369958 13196850 13212496 13461623 12642930 12181742 12793524 12686181 11895495 11656192
4099 11656192 12024247 13619723 13732576 13231105 13560794 13334268 14023987 14592683 14872719
4090 14872719 14267760 13675434 14892598 14684001 14126603 15424731 15804516 16094362 15983484
$$ packed form
4158A1572047k0739j08252k24367l4455k31199J42339n99609K81042L46917K39603
4148A1363327R42742m78268M37628j66302n43452k18917q89640M72971l23145
4139A0596944o67129l4234l3633M39106l7584l19465K68423J185169J49266m1906
4129A1504957j55891n13842l74192L99889R6994l62079Q60437N32720l14698q46863
4119A0827432j57610O87690m12864J60675P2266K36567R0333N17550J28384K2670
4109A2173093J96865Q26892J5646K49127q18693m61188O11782j07343p90686k39303
4099A1656192L68055J595476J12853n01471L29689k26526O89719N68696K80036
4090A4872719o04959n92326J217164k08597n57398J298128L79785K89846j10878
$$ plain form
4081 15983484 15592176 15003228 14928745 15927498 15995793 15850784 15948849 15720468 16397098 15679152
4071 15679152 15229636 15987721 15300440 15507894 16499750 16940344 16866139 16752144 16968252 17009041
4061 17009041 18053092 18362071 18424362 18131359 18110179 18684468 18602521 18765815 19225438 19574703
4051 19574703 20067574 19890841 20087185 20357853 20355130 21574498 21341089 22007636 23293703
4042 23293703 24768539 24928972 24707981 24957558 25318810 25161812 24878495 25093610 25606980
4033 25606980 26130888 26449337 27490949 27372927 27073532 26952551 27572524 28233117 28249262
4024 28249262 28653032 28941667 29083741 30053632 29652237 29901303 30450087 30240580 31347816
4015 31347816 32086725 32067539 31143758 31182512 32453365 33231701 32332177 32226734 33629173
$$ packed form
4081A5983484l91308n88948p4483R98753O8295j45009R8065k28381O76630p17946
4071A5679152m49516P58085o87281K07454R91856M40594p4205j13995K16108M0789
4061A7009041J044051L08979O2291k93003k1180N74289q1947J63294M59623L49265
4051A9574703M92871j76733J96344K70668k723J219368k33409O66547J286067
4042B3293703J474836J60433k20991K49577L61252j56998k83317K15115N13370
4033B5606980N23908L18449J041612j18022k99395j20981O19973O60593J6145
4024B8249262M03770K88635J42074R69891m01395K49066N48784k09507J107236
4015C1347816P38909j9186r23781L8754J270853P78336q99524j05443J402439
$$ plain form
4006 33629173 33799871 34429970 34612370 34902480 34803575 35034232 35456396 36290109 37386930
3997 37386930 38108008 38118272 38685255 39202114 38574365 38649749 39852185 40209777 40245370 39943518
3987 39943518 40096873 39311141 39253661 39810752 39422592 39618181 39645979 39757201 39685566 39659612
3977 39659612 38959366 38546525 38216950 37974119 38329558 37957509 38082376 38120269 37891201 38191139
3967 38191139 37809549 37900976 37711811 37919910 37461160 37188960 37490959 36589236 35851688 35332918
3957 35332918 35660591 34851723 34610805 34515897 33916956 33443948 32717471 32382976 32282600 32383735
3947 32383735 31807937 31259546 31757474 31614793 31662159 32966135 33700634 34579430 34438333
3938 34438333 34095176 33998061 34386173 34658037 35395451 35040831 35388206 35556589 36103401 36074773
$$ packed form
4006C3629173J70698O30099J82400K90110r8905K30657M22164Q33713J096821
3997C7386930P21078J0264N66983N16859o27749P5384J202436L57592L5593l01852
3987C9943518J53355p85732n7480N57091l88160J95589K7798J11222p1635k5954
3977C9659612p00246m12841l29575k42831L55439l72049J24867L7893k29068K99938
3967C8191139l81590R1427j89165K08099m58750k72200L01999r01723p37548n18770
3957C5332918L27673q08868k40918r4908n98941m73008p26477l34495j00376J01135
3947C2383735n75798n48391M97928j42681M7366J303976P34499Q78796j41097
3938C4438333l43157r7115L88112K71864P37414l54620L47375J68383N46812k8628
$$ plain form
3928 36074773 35298237 36606994 37489353 36655297 36874036 37264553 36978956 36333725 36155010
3919 36155010 35560926 34786861 35630413 35657864 34994737 33760294 33851556 33692082 32713979 32341985
3909 32341985 32556792 31873524 31662274 31393894 30838820 30464250 30080052 30115019 29648328 28382959
3899 28382959 27663670 27349451 26574682 26311153 25010596 24222118 23633227 23020853 21791596
3890 21791596 21007220 21144616 20073187 19780488 19379223 18418464 17894701 18252511 18419644
3881 18419644 17711106 17265984 17089257 16871305 16980080 16636548 16329567 16275603 16019984 15426062
3871 15426062 14314438 14523211 14465999 15167114 15047304 14779156 14527710 14712380 14422652
3862 14422652 14239093 13880033 13511454 13375733 12619219 11887345 11184977 12072837 12443220
$$ packed form
3928C6074773p76536J308757Q82359q34056K18739L90517k85597o45231j78715
3919C6155010n94084p74065Q43552K7451o63127j234443R1262j59474r78103l71994
3909C2341985K14807o83268k11250k68380n55074l74570l84198L4967m66691j265369
3899B8382959p19289l14219p74769k63529j300557p88478n88891o12374j229257
3890B1791596p84376J37396j071429k92699m01265r60759n23763L57810J67133
3881A8419644p08538m45122j76727k17952J08775l43532l06981n3964k55619n93922
3871A5426062j111624K08773n7212P01115j19810k68148k51446J84670k89728
3862A4422652j83559l59060l68579j35721p56514p31874p02368Q87860L70383
$$ plain form
3853 12443220 12733098 13313753 12986653 12355989 12595327 12554514 12533612 12476903 12750876 12565310
3843 12565310 13333533 12982263 12747149 13349524 13854107 13577749 13676149 13856951 14112592 14222473
3833 14222473 14069832 13443192 13242345 13086681 13015538 13177181 12856070 13095409 13469609 13267462
3823 13267462 12384371 12610748 13209320 13125711 12913864 12350033 11957672 12125585 11568422 11781510
3813 11781510 10937747 10436845 10163776 9771862 10534272 10558837 10107798 10223399 10298707 10241675
3803 10241675 10291262 9550964 10532638 11412999 10860938 11191734 11343189 10991191 10112682 9701338
3793 9701338 9679360 9769617 10029133 10217191 10352604 10131145 9891842 10771680 10486208 10545977
3783 10545977 11396113 10550262 10167388 9953432 9446027 9556830 10281566 10756792 11256037
$$ packed form
3853A2443220K89878N80655l27100o30664K39338m0813k0902n6709K73973j85566
3843A2565310P68223l51270k35114O02375N04583k76358R8400J80802K55641J09881
3833A4222473j52641o26640k00847j55664p1143J61643l21111K39339L74200k02147
3823A3267462q83091K26377N98572q3609k11847n63831l92361J67913n57163K13088
3813A1781510q43763n00902k73069l91914P62410K4565m51039J15601P5308n7032
3803A0241675M9587p40298R81674Q80361n52061L30796J51455l51998q78509m11344
3793I701338k1978R0257K59516J88058J35413k21459k39303Q79838k85472N9769
3783A0545977Q50136q45851l82874k13956n07405J10803P24736M75226M99245
$$ plain form
3774 11256037 10892629 10702211 10893058 10700245 9948974 9642274 10701310 10707201 10422464 9705740
3764 9705740 9496276 10203831 11090475 10515179 10776055 11408421 10716556 11012201 10611210 10522150
3754 10522150 11179364 10953137 10657204 10957121 12000971 12479523 12608214 13433070 13322429
3745 13322429 12548007 12875697 13364007 13241661 13527361 13801984 14352573 14115260 13943772
3736 13943772 14259986 14798111 14432937 13861952 14306881 14820512 15705637 15025248 15155796
3727 15155796 15560589 15995427 16346263 16594314 16484344 16347718 16826826 17027477 17124415 17410562
3717 17410562 17868333 17339635 18512991 18427219 18232604 18891954 19706571 20253620 20713856
3708 20713856 21017520 21177468 22099153 22198207 23451705 24024052 24448462 25157251 25632797
$$ packed form
3774A1256037l63408j90418J90847j92813p51271l06700J059036N891k84737p16724
3764I705740k09464P07555Q86644n75296K60876O32366o91865K95645m00991q9060
3754A0522150O57214k26227k95933K99917J043850M78552J28691Q24856j10641
3745A3322429p74422L27690M88310j22346K85700K74623N50589k37313j71488
3736A3943772L16214N38125l65174n70985M44929N13631Q85125o80389J30548
3727A5155796M04793M34838L50836K48051j09970j36626M79108K00651R6938K86147
3717A7410562M57771n28698J173356q5772j94615O59350Q14617N47049M60236
3708B0713856L03664J59948R21685R9054J253498N72347M24410P08789M75546
$$ plain form
3699 25632797 25469818 25562206 26501859 27519983 28438531 29947844 31575508 33064086 35449719
3690 35449719 37045907 38128521 38843439 38520296 37586345 36838068 35807566 35380214 34963501
3681 34963501 34959820 35417035 35151803 35511039 36056064 36570646 37187969 37847252 38573503 38370040
3671 38370040 38389042 39027688 39698819 40470375 41000858 42415822 43434125 45035844 46430142
3662 46430142 47149032 48074270 48363412 48522295 47922045 47725254 46102506 45859581 45664238
3653 45664238 45707805 45443980 44666991 45234950 45288848 45438289 45565641 46505370 46482541 46310326
3643 46310326 46578528 46363783 46528369 46609790 46628355 47373586 47666844 47039864 47772356 48544446
3633 48544446 48813070 49316162 49390570 49962368 50380335 50908787 51369600 52638246 53838216
$$ packed form
3699B5632797j62979R2388R39653J018124R18548J509313J627664J488578K385633
3690C5449719J596188J082614P14918l23143r33951p48277j030502m27352m16713
3681C4963501l681M57215k65232L59236N45025N14582O17323O59283P26251k03463
3671C8370040J9002O38646O71131P71556N30483J414964J018303J601719J394298
3662D6430142P18890R25238K89142J58883o00250j96791j622748k42925j95343
3653D5664238M3567k63825p76989N67959N3898J49441J27352R39729k2829j72215
3643D6310326K68202k14745J64586Q1421J8565P45231K93258o26980P32492P72090
3633D8544446K68624N03092P4408N71798M17967N28452M60813J268646J199970
$$ plain form
3624 53838216 53909590 54261438 55473249 55930320 56814262 57607379 59513347 60304770 60750620
3615 60750620 61986045 63139007 63920485 65320844 65770414 66543260 67963865 69392616 69899958
3606 69899958 70914737 72001716 72098816 72933052 74242536 74269500 74111919 75074433 75362097
3597 75362097 75264175 76256895 77425437 77769799 78263273 78313277 78286390 77083281 78030762 79385061
3587 79385061 79847044 79696737 79211151 78920248 78388272 78041957 78777424 78747935 79067328 78236237
3577 78236237 78577579 78380311 78713606 78921778 78956870 79145343 79337333 79730713 80490997 80617395
3567 80617395 80977620 82088222 83048701 82869219 84134995 85452999 86104454 86732255 87372855
3558 87372855 87650916 87351021 88135657 88362328 88064074 88963586 90127093 90444514 90962669
$$ packed form
3624E3838216P1374L51848J211811M57071Q83942P93117J905968P91423M45850
3615F0750620J235425J152962P81478J400359M49570P72846J420605J428751N07342
3606F9899958J014779J086979R7100Q34236J309484K6964j57581R62514K87664
3597G5362097r7922R92720J168542L44362M93474N0004k6887j203109R47481J354299
3587G9385061M61983j50307m85586k90903n31976l46315P35467k9489L19393q31091
3577G8236237L41342j97268L33295K08172L5092J88473J91990L93380P60284J26398
3567H0617395L60225J110602R60479j79482J265776J318004O51455O27801O40600
3558H7372855K78061k99895P84636K26671k98254Q99512J163507L17421N18155
$$ plain form
3549 90962669 91608678 91806672 92722759 93207536 92881710 92730530 91349901 90631493 89777271
3540 89777271 88048409 86144421 84751439 82672049 80669141 79422500 78339385 76331389
3532 76331389 74905802 73053576 71670502 70604922 69511244 66883935 64413760 62430028
3524 62430028 60403075 58638728 57141452 55004548 53336178 52274340 51308500 50773667
3516 50773667 50299184 48917618 47655078 47821070 48011866 47312751 46610102 46047249 46015009
3507 46015009 45620584 45225019 44915881 45238888 44644879 44479565 44443737 42995979 42824521
3498 42824521 42663056 41396839 41446378 41584033 40679530 39690924 38714574 38412232 37447587
3489 37447587 36940842 35717673 34604890 34161434 32263808 32601171 32689609 31892879 30653994
$$ packed form
3549I0962669O46009J97994R16087M84777l25826j51180j380629p18408q54222
3540H9777271j728862j903988j392982k079390k002908j246641j083115k007996
3532G6331389j425587j852226j383074j065580j093678k627309k470175j983732
3524F2430028k026953j764347j497276k136904j668370j061838r65840n34833
3516E0773667m74483j381566j262540J65992J90796o99115p02649n62853l2240
3507D6015009l94425l95565l09138L23007n94009j65314l5828j447758j71458
3498D2824521j61465j266217M9539J37655r04503r88606r76350l02342r64645
3489C7447587n06745j223169j112783m43456j897626L37363Q8438p96730j238885
$$ plain form
3480 30653994 29760225 29225691 28872511 28209416 26936583 26313278 25308578 24078593 24002996
3471 24002996 23358706 23084134 22263668 21653586 22164910 21779057 21693121 21147933 21320956 20387601
3461 20387601 19579434 20596391 20738769 20782722 21502337 20510140 19867382 19436569 19629661
3452 19629661 19504678 19874637 19978154 20083024 19938714 19296613 18495608 18864981 18796387 19074700
3442 19074700 19616889 20159187 20449369 19755351 19221872 18980578 19057962 19501991 19200071 18777760
3432 18777760 19633319 18923874 19222513 19731905 20324299 20464153 20844685 21082688 21461538
3423 21461538 21117817 21685693 22253288 22750692 23967058 24812535 26250034 25973105 25859604
3414 25859604 25660000 24715973 23135987 23018480 22014116 21985092 22446754 22424458 22841584
$$ packed form
3480C0653994q93769n34534l53180o63095j272833o23305j004700j229985p5597
3471B4002996o44290k74572q20466o10082N11324l85853q5936n45188J73023r33355
3461B0387601q08167J016957J42378M3953P19615r92197o42758m30813J93092
3452A9629661j24983L69959J03517J04870j44310o42101q01005L69373o8594K78313
3442A9074700N42189N42298K90182o94018n33479k41294P7384M44029l01920m22311
3432A8777760Q55559p09445K98639N09392N92394J39854L80532K38003L78850
3423B1461538l43721N67876N67595M97404J216366Q45477J437499k76929j13501
3414B5859604j99604r44027j579986j17507j004364k9024M61662k2296M17126
$$ plain form
3405 22841584 23624333 24424961 24976503 24756952 24857378 23894762 22516922 21241981 19848843
3396 19848843 18910408 18868002 18014700 17352431 18210985 17466936 16875035 17413982 17887305 17635685
3386 17635685 18537198 18195532 18200912 19195937 19420153 19849289 20396260 21208199 21928984 23187932
3376 23187932 23437221 24613642 25960079 27294370 28317053 29332530 30218832 32684586
3368 32684586 34706841 35830061 37710350 39446168 41204384 42467932 44297493 44891450
3360 44891450 45946754 46621693 47735739 49229408 49621567 50664483 50688369 50495425 49628370
3351 49628370 48332373 48186885 47532553 46389071 45190165 44718205 43654365 42995146 41581184
3342 41581184 39469149 38444644 36961818 35163078 32996988 31124973 29587412 28441706
$$ packed form
3405B2841584P82749Q00628N51542k19551J00426r62616j377840j274941j393138
3396A9848843r38435m2406q53302o62269Q58554p44049n91901N38947M73323k51620
3386A7635685R01513l41666N380R95025K24216M29136N46971Q11939P20785J258948
3376B3187932K49289J176421J346437J334291J022683J015477Q86302K465754
3368C2684586K022255J123220J880289J735818J758216J263548J829561N93957
3360D4891450J055304O74939J114046J493669L92159J042916K3886j92944q67055
3351D9628370j295997j45488o54332j143482j198906m71960j063840o59219j413962
3342D1581184k112035j024505j482826j798740k166090j872015j537561j145706
$$ plain form
3334 28441706 28193551 26698437 24948223 23853999 22853917 21021805 21275377 20837798 20782539
3325 20782539 19887230 19404905 18961253 19122625 18166709 17123646 16196415 15898054 15513855
3316 15513855 15644545 16195688 15878161 15637048 14769596 14751144 14860612 14906287 14173358 14810678
3306 14810678 14978927 14834083 14360592 14799108 14469163 14758340 14868906 14613254 14659760 14288961
3296 14288961 14452232 14516951 15467598 15486916 15803871 15651377 15223890 14659644 14763812 15203031
3286 15203031 15534756 15187992 14847506 15644646 16003976 15821302 15183799 15909961 16033487
3277 16033487 16477694 16273523 16359298 16979874 17051481 17376469 17476157 17646506 17559876 18243160
3267 18243160 18058742 17398958 17443162 18522112 18707204 18968746 20469342 20592137 21619320
$$ packed form
3334B8441706k48155j495114j750214j094224j000082j832112K53572m37579n5259
3325B0782539q95309m82325m43652J61372r55916j043063r27231k98361l84199
3316A5513855J30690N51143l17527k41113q67452j8452J09468M5675p32929O37320
3306A4810678J68249j44844m73491M38516l29945K89177J10566k55652M6506l70799
3296A4288961J63271O4719R50647J9318L16955j52494m27487n64246J04168M39219
3286A5203031L31725l46764l40486P97140L59330j82674o37503P26162J23526
3277A6033487M44207k04171Q5775O20576P1607L24988R9688J70349q6630O83284
3267A8243160j84418o59784M4204J078950J85092K61542J500596J22795J027183
$$ plain form
3258 21619320 22908379 23281265 24149047 25728084 27608642 28937869 29497201 31425927 33214275
3249 33214275 35520025 36805000 37739270 39393548 40650370 41254438 41546675 40197550 38510978
3240 38510978 37635370 35767143 33537175 31896230 30242301 28562738 27269684 25254347
3232 25254347 24192589 23421235 22174741 20791853 19786987 19211397 19589439 18352026 16756322
3223 16756322 17133566 16500813 15983893 15957792 15655000 15720474 15541873 15225849 14963431 14651718
3213 14651718 14787024 14497324 14945875 14463539 13991780 14129994 14678122 13875706 12913494
3204 12913494 12494327 12229460 11839764 11562081 11149243 10226659 10724050 10657556 10433109 9925929
3194 9925929 10358759 10844080 10330045 10679207 9973575 9382453 9313291 10107770 9780136 9667358
$$ packed form
3258B1619320J289059L72886Q67782J579037J880558J329227N59332J928726J788348
3249C3214275K305750J284975R34270J654278J256822O04068K92237j349125j686572
3240C8510978q75608j868227k229968j640945j653929j679563j293054k015337
3232B5254347j061758p71354j246494j382888j004866n75590L78042j237413j595704
3223A6756322L77244o32753n16920k6101l02792O5474j78601l16024k62418l11713
3213A4651718J35306k89700M48551m82336m71759J38214N48128q02416r62212
3204A2913494m19167k64867l89696k77683m12838r22584M97391o6494k24447n07180
3194I925929M32830M85321n14035L49162p05632n91122o9162P94479l27634j12778
$$ plain form
3184 9667358 10204199 9973041 9337730 9005691 8968907 9621531 9803736 10068359 9611018 8768492
3174 8768492 8103904 7769619 7788775 7632095 8736336 7648608 7411075 7446284 7130419 7705220
3164 7705220 7862527 7362458 7533809 6884309 6469006 6462745 7511255 7714407 7485703 6708765
3154 6708765 6995766 7069191 6568484 5996001 5701033 6158935 6092343 6507620 6476291 6243457
3144 6243457 6108474 5846588 5551591 5671973 5912194 5933131 6093941 6029621 5775693 5562289
3134 5562289 5807119 5859637 6454753 6582647 6171323 5677726 5768530 6188573 5974776 6504216
3124 6504216 5845962 6328327 5920462 5858963 5620652 5606952 6785121 6169364 6027512 6242167
3114 6242167 5422646 5164293 6257164 6251373 6514876 6081527 6252195 6298800 6580274 6654965
$$ packed form
3184I667358N36841k31158o35311l32039l6784O52624J82205K64623m57341q42526
3174H768492o64588l34285J9156j56680J104241j087728k37533L5209l15865N74801
3164G705220J57307n00069J71351o49500m15303o261J048510K03152k28704p76938
3154F708765K87001P3425n00707n72483k94968M57902o6592M15277l1329k32834
3144F243457j34983k61886k94997J20382K40221K0937J60810o4320k53928k13404
3134E562289K44830N2518N95116J27894m11324m93597R0804M20043k13797N29440
3124F504216o58254M82365m07865o1499k38311j3700J178169o15757j41852K14655
3114F242167q19521k58353J092871n791K63503m33349J70668M6605K81474P4691
$$ plain form
3104 6654965 6085485 6675680 7248817 7059305 6278457 7274920 7163031 6555717 7592188
3095 7592188 7596840 6886889 6996728 6557632 5941420 5429475 5907101 5332387 5418418 5991340
3085 5991340 5517054 5315988 5150013 5261833 5321835 5095094 5423056 6311100 6144086 5692964
3075 5692964 5901713 5527664 5741903 6397034 5298009 5753529 5380021 5859344 6007620
3066 6007620 5735351 5768783 6545021 6832058 6060236 6349857 6891203 6455063 6342585 5574390
3056 5574390 5818803 6186593 5845802 5868266 6065424 6036193 5696254 5879353 5742807 5834661
3046 5834661 6191383 6407509 6265106 6249794 5698560 6146668 5553912 6174738 6727849 6689612
3036 6689612 6749186 7358678 7187317 6891770 6930607 7175788 7487388 8193180 8203804 7766297
$$ packed form
3104F654965n69480N90195N73137j89512p80848R96463j11889o07314J036471
3095G592188M652p09951J09839m39096o16212n11945M77626n74714Q6031N72922
3085E991340m74286k01066j65975J11820O0002k26741L27962Q88044j67014m51122
3075E692964K08749l74049K14239O55131j099025M55520l73508M79323J48276
3066F007620k72269L3432P76238K87037p71822K89621N41346m36140j12478p68195
3056E574390K44413L67790l40791K2464J97158k9231l39939J83099j36546R1854
3046E834661L56722K16126j42403j5312n51234M48108n92756O20826N53111l8237
3036F689612N9574O09492j71361k95547L8837K45181L11600P05792J0624m37507
$$ plain form
3026 7766297 7793297 8039160 8004883 8325705 8587909 9544107 9262118 9327175 9683393 9502762
3016 9502762 9324380 9327852 9495716 9582812 9648977 9654069 9714625 10388969 10011956 9434852 10025297
3005 10025297 10855810 10859221 10728980 10281833 11199238 11402424 11004148 10686534 10090220 10315489
2995 10315489 10854205 11213293 10635059 11473911 12727215 13430409 12645098 13244156 13117996
2986 13117996 13361505 13844343 13604941 13248475 12837966 12115658 11456637 10674458 9923819
2977 9923819 9423173 9666247 9180973 9183253 8660640 8835945 9517984 10127499 9997317 9083823
2967 9083823 8830310 9458473 9885195 9970596 9526484 9751989 9256421 8990318 9451751 9372809
2957 9372809 8782815 9464991 9998791 9218232 9184161 8822887 8089157 9044790 9119126 8077963
$$ packed form
3026G766297K7000K45863l4277L20822K62204R56198k81989O5057L56218j80631
3016I502762j78382L472J67864Q7096O6165N092O0556O74344l77013n77104N90445
3005A0025297Q30513L411j30241m47147R17405K03186l98276l17614n96314K25269
2995A0315489N38716L59088n78234Q38852J253304P03194p85311N99058j26160
2986A3117996K43509M82838k39402l56466m10509p22308o59021p82179p50639
2977I923819n00646K43074m85274K280n22613J75305O82039O09515j30182r13494
2967I083823k53513O28163M26722Q5401m44112K25505m95568k66103M61433p8942
2957I372809n89994O82176N33800p80559l4071l61274p33730R55633P4336j041163
$$ plain form
2947 8077963 7099432 6985318 7601174 6530608 6539910 6280742 6205427 6782678 6293069 6348520
2937 6348520 6668325 6329962 6863079 6784092 7332178 7316789 7402826 6950098 7513724 7489421
2927 7489421 7031396 6693508 6460681 6876148 7655071 7179817 6669710 6487965 6536275 6116137
2917 6116137 5967507 6497252 7029232 6553705 6390575 6187118 6209742 6732970 6695897 7181922
2907 7181922 6722620 7264615 7723248 7970226 7606035 7400316 6482269 6824781 6366400 5900906
2897 5900906 5605355 5395898 5445835 5598750 5850057 5591377 5324817 5904124 5086787 5410572
2887 5410572 5692552 5159731 5782626 6711075 6712045 6188803 6110923 6265998 6898595 6697628
2877 6697628 6921988 6215322 6161818 6168230 6053526 6071392 5754878 5143024 4736906 4939193
$$ packed form
2947H077963r78531j14114O15856j070566R302k59168p5315N77251m89609N5451
2937F348520L19805l38363N33117p8987N48086j5389Q6037m52728N63626k4303
2927G489421m58025l37888k32827M15467P78923m75254n10107j81745M8310m20138
2917F116137j48630N29745N31980m75527j63130k03457K2624N23228l7073M86025
2907G181922m59302N41995M58633K46978l64191k05719r18047L42512m58381m65494
2897E900906k95551k09457M9937J52915K51307k58680k66560N79307q17337L23785
2887E410572K81980n32821O22895R28449R70n23242p7880J55075O32597k00967
2877F697628K24360p06666n3504O412j14704J7866l16514o11854m06118K02287
$$ plain form
2867 4939193 4494754 4985739 4446100 3518258 3925952 4098181 4164508 3736716 4074954 4607734
2857 4607734 5198589 4770875 4696461 4211970 3684947 3416097 3508072 3022276 2838177 3120143
2847 3120143 2625742 3062173 3629368 3390595 4143786 3615107 2781661 2959592 2815232 2543768
2837 2543768 2689914 2572648 2330273 2303504 2265769 2035984 1798009 2355214 1710320 1450726
2827 1450726 1393153 2216431 1587321 1265213 1980794 1209636 1083707 1100899 1103858 716641
2817 716641 1647195 1211527 830620 1612129 1105841 768656 246870 911271 525007 -367030
2807 -367030 -52986 484347 871378 335106 203808 824633 248279 254745 1207328 1794425
2797 1794425 1395582 818087 951972 1133676 1099378 1449531 1020222 679261 541932 1270609
$$ packed form
2867D939193m44439M90985n39639r27842M07694J72229O6327m27792L38238N32780
2857D607734N90855m27714p4414m84491n27023k68850R1975m85796j84099K81966
2847C120143m94401M36431N67195k38773P53191n28679q33446J77931j44360k71464
2837B543768J46146j17266k42375k6769l7735k29785k37975N57205o44894k59594
2827A450726n7573Q23278o29110l22108P15581p71158j25929J7192K959l87217
2817G16641R30554m35668l80907P81509n06288l37185n21786O64401l86264q92037
2807c67030L14044N37333L87031n36272j31298O20825n76354O466R52583N87097
2797A794425l98843n77495J33885J81704l4298L50153m29309l40961j37329P28677
$$ plain form
2787 1270609 1080471 143905 -257429 -3412 132380 -607802 -252879 380316 152849 -600146
2777 -600146 182127 672640 484067 267370 91607 149912 371488 1027125 363197 -281404
2767 -281404 -41126 234346 349404 1078091 611183 -661770 -662393 1886 1155641 325893
2757 325893 -556585 93600 -281393 -861428 -549049 353588 326814 -25598 -103307 -739980
2747 -739980 -48822 -11739 436531 131363 528387 134807 152417 30243 276324 379421
2737 379421 -66383 -373053 -555134 -46537 83042 775361 -39137 593882 1056828 790165
2727 790165 1047869 750283 863795 740662 441565 821889 1199341 1149806 554284 171703
2717 171703 410287 -181171 -167706 147287 70127 137789 232759 394639 107019 23593 676763
$$ packed form
2787A270609j90138r36566m01334K54017J35792p40182L54923O33195k27467p52995
2777f00146P82273M90513j88573k16697j75763N8305K21576O55637o63928o44601
2767b81404K40278K75472J15058P28687m66908j272953o23O64279J153755q29748
2757C25893q82478O50185l74993n80035L12379R02637k6774l52412p7709o36673
2747g39980O91158L7083M48270l05168L97024l93580J7610j22174K46081J03097
2737C79421m45804l06670j82081N08597J29579O92319q14498O33019M62946k66663
2727G90165K57704k97586J13512j23133k99097L80324L77452m9535n95522l82581
2717A71703K38584n91458J3465L14993p7160O7662R4970J61880k87620q3426O53170
$$ plain form
2706 676763 1126907 26761 562816 605268 -150943 -22273 -4491 -296729 -175191 -288146
2696 -288146 -595579 -740097 124567 -305070 277969 659445 -274645 -96016 293505 370001
2686 370001 1418609 863609 -154276 -592268 -1317493 -933225 -601410 -403296 208603
2677 208603 288562 -667615 -894317 -462550 13718 233093 842731 459335 93361 237598
2667 237598 -224034 -879326 55304 -574893 -724016 -1044726 -1992689 -1549303 -76779 227868
2657 227868 589545 955735 -231811 75405 330213 -235649 404172 428776 535516 554255
2647 554255 585284 1022765 756965 1262980 1170914 608572 8976 -389498 -848275 350317
2637 350317 1239492 458298 174638 126075 470595 548026 1332347 1661231 1122480 113589
$$ packed form
2706F76763M50144j100146N36055M2452p56211J28670J7782k92238J21538j12955
2696b88146l07433j44518Q64664m29637N83039L81476r34090J78629L89521P6496
2686C70001J048608n55000j017885m37992p25225L84268L31815J98114O11899
2677B08603P9959r56177k26702M31767M76268K19375O09638l83396l65974J44237
2667B37598m61632o55292R34630o30197j49123l20710r47963M43386J472524L04647
2657B27868L61677L66190j187546L07216K54808n65862O39821K4604J06740J8739
2647E54255L1029M37481k65800N06015r2066n62342n99596l98474m58777J198592
2637C50317Q89175p81194k83660m8563L44520P7431P84321L28884n38751j008891
$$ plain form
2627 113589 -13449 224691 -258226 -728492 508952 727782 -341579 86976 -422285
2618 -422285 -21304 1060789 791056 396929 868819 792778 848026 890966 1114882 694125
2608 694125 801355 541700 656306 511191 699709 501790 832514 621955 882940 622851
2598 622851 888354 946514 1157252 979067 558208 1390836 1391197 1859972 1381816 1482531
2588 1482531 1190157 1277949 1062353 712118 263854 308182 1050114 1238091 1248162 2231033
2578 2231033 2056387 1673302 1027143 1591603 1242665 913978 1462021 916540 1244555 779501
2568 779501 663413 534408 526733 -202786 -333667 578634 888008 -171179 -1206121 -231087
2558 -231087 233775 859012 1090464 1499672 1273443 1009687 1118185 819856 337113 806257
$$ packed form
2627A13589j27038K38140m82917m70266J237444K18830j069361M28555n09261
2618d22285M00981J082093k69733l94127M71890p6041N5248M2940K23916m20757
2608F94125J07230k59655J14606j45115J88518j97919L30724k10559K60985k60089
2598F22851K65503N8160K10738j78185m20859Q32628L61M68775m78156J00715
2588A482531k92374Q7792k15596l50235m48264M4328P41932J87977J0071R82871
2578B231033j74646l83085o46159N64460l48938l28687N48043n45481L28015m65054
2568G79501j16088j29005p675p29519j30881R12301L09374j059187j034942R75034
2558b31087M64862O25237K31452M09208k26229k63756J08498k98329m82743M69144
$$ plain form
2548 806257 1014934 775571 941923 1305765 600985 761217 504080 636583 160048 4575
2538 4575 545729 1085666 1855174 219656 799109 975540 403932 862401 1228694 1519100
2528 1519100 652642 137087 -367612 -568254 378915 253699 203520 -327816 211934 856877
2518 856877 -53352 -426600 -605461 818503 181775 368719 182652 -86725 90423 245568
2508 245568 51169 -6850 -2586 -390843 33626 778197 508697 68206 -176389 -618431
2498 -618431 -1282219 -1342645 -681231 -515468 -588710 -332680 708539 130306 217514 807023
2488 807023 245276 -230307 360661 200751 385928 645113 370284 -131053 -655922 -1199453
2478 -1199453 118430 92628 -38684 -82923 515924 -217724 -639002 -469850 327204 -408586
$$ packed form
2548H06257K08677k39363J66352L63842p04780J60232k57137J32503m76535j55473
2538D575N41154N39937P69508j635518N79453J76431n71608M58469L66293K90406
2528A519100q66458n15555n04699k00642R47169j25216n0179n31336N39750O44943
2518H56877r10229l73248j78861J423964o36728J86944j86067k69377J77148J55145
2508B45568j94399n8019M264l88257M24469P44571k69500m40491k44595m42042
2498f18431o63788o0426O61414J65763p3242K56030J041219n78233Q7208N89509
2488H07023n61747m75583N90968j59910J85177K59185k74829n01337n24869n43531
2478a199453J317883k5802j31312m4239N98847p33648m21278J69152P97054p35790
$$ plain form
2468 -408586 -599328 -597012 399896 533259 222010 632202 720341 569571 -497685 -337507
2458 -337507 -56152 -451416 -1016777 -621469 -195436 -209443 175467 1318119 1219363 536587
2448 536587 85560 -253739 -260056 -124654 383844 726353 1000194 516858 322254 -9407
2438 -9407 784682 585573 -422074 -268502 -338965 -131390 -646557 -461160 -36282 320805
2428 320805 -301220 173035 380361 -172659 237612 238906 -282096 509748 841019 1130309
2418 1130309 907379 488185 125091 186575 347659 940228 1054167 356394 359148 572555
2408 572555 -62761 43053 573212 441640 -218401 -245500 65276 -512328 -469593 -600447
2398 -600447 -411698 -869879 -1143757 -524079 35236 41829 -94621 -208033 -150967 614738
$$ packed form
2468d08586j90742K316R96908J33363l11249M10192Q8139j50770j067256J60178
2458c37507K81355l95264n65361L95308M26033j4007L84910J142652r8756o82776
2448E36587m51027l39299o317J35402N08498L42509K73841m83336j94604l31661
2438i407P94089j99109j007647J53572p0463K07575n15167J85397M24878L57087
2428C20805o22025M74255K07326n53020M10271J294n21002P91844L31271K89290
2418A130309k22930m19194l63094O1484J61084N92569J13939o97773K754K13407
2408E72555o35316J05814N30159j31572o60041k7099L10776n77604M2735j30854
2398f00447J88749m58181k73878O19678N59315O593j36450j13412N7066P65705
$$ plain form
2388 614738 510716 216954 164476 371713 245949 666634 327151 204968 466220 1065988
2378 1065988 362715 1098733 1600269 1724978 1622563 1388124 1481347 1334464 1464761 919807
2368 919807 791023 890585 216535 188569 124268 -134118 151842 491755 228328 435841
2358 435841 672117 163888 156271 -17222 -432103 -121649 -65125 -29237 788701 516172
2348 516172 -235907 -284669 -2849 223107 614476 1038799 922505 1141786 836148 91612
2338 91612 523280 437317 152959 401425 566667 5347 -203135 203844 102467 657129
2328 657129 804634 388826 361741 -154190 -174927 -364946 402617 735747 72445 45341
2318 45341 922076 341307 307906 -500685 -526712 653128 876817 628112 281534 724382
$$ packed form
2388F14738j04022k93762n2478K07237j25764M20685l39483j22183K61252N99768
2378A065988p03273P36018N01536J24709j02415k34439R3223j46883J30297n44954
2368I19807j28784R9562o74050k7966o4301k58386K85960L39913k63427K07513
2358D35841K36276n08229p617j73493m14881L10454N6524L5888Q17938k72529
2348E16172p52079m8762K81820K25956L91369M24323j16294K19281l05638p44536
2338I1612M31668q5963k84358K48466J65242n61320k08482M06979j01377N54662
2328F57129J47505m15808k7085n15931k0737j90019P67563L33130o63302k7104
2318D5341Q76735n80769l3401q08591k6027J179840K23689k48705l46578M42848
$$ plain form
2308 724382 368352 422100 421414 165385 731340 740218 444192 -6054 208744 576486 239770
2297 239770 89416 284344 355273 320683 143123 144240 226880 341273 281438 371847 24625
2286 24625 176925 -253121 -122834 -190443 505879 1416496 1097810 732742 -90882 325076
2276 325076 478643 242721 1123086 743528 363910 732480 1278314 406030 828251 933447
2266 933447 158296 50213 522213 897473 123789 351499 821479 791835 704658 475734
2256 475734 856030 805381 508990 1075580 644366 639293 661291 518148 931408 769223
2246 769223 886113 1538297 1916734 1979834 1488813 1557409 1540249 1035535 1161256 1179334
2236 1179334 205562 316167 1332242 1321910 1494070 993967 1176210 1747451 936788 1679648
$$ packed form
2308G24382l56030N3748o86k56029N65955Q878k96026m50246K14798L67742l36716
2297B39770j50354J94928P0929l4590j77560J117Q2640J14393n9835R0409l47222
2286B4625J52300m30046J30287o7609O96322R10617l18686l65068q23624M15958
2276C25076J53567k35922Q80365l79558l79618L68570N45834q72284M22221J05196
2266I33447p75151j08083M72000L75260p73684K27710M69980k9644q7177k28924
2256D75734L80296n0649k96391N66590m31214n073K1998j43143M13260j62185
2246G69223J16890O52184L78437O3100m91021O8596j7160n04714J25721J8078
2236A179334r73772J10605J016075j0332J72160n00103J82243N71241q10663P42860
$$ plain form
2226 1679648 2013977 1719867 2296886 2687522 2345243 2112265 2165587 1966095 1204468 1273456
2216 1273456 1904282 1357221 1597926 2603746 2293599 2645817 3472620 2909184 2659973
2207 2659973 3733216 3161118 3576077 3636768 4076407 3367874 3545755 4399824 3620626 4093443
2197 4093443 4190976 3309038 3790547 4396966 4529548 4155626 4035395 4536214 3907209 4517746
2187 4517746 4927337 4824227 4814214 5321492 5911869 5255572 4921100 5213744 5241295 6103322
2177 6103322 6130357 6214286 6498407 6558718 6744964 6117046 7509995 7434507 6986516 7258254
2167 7258254 8058731 8065009 8333043 8401770 7782990 7728314 8549211 9907094 10882811 10687662
2157 10687662 10559235 10883961 11012041 11426398 12327559 13117427 13070834 13174043 14495855
$$ packed form
2226A679648L34329k94110N77019L90636l42279k32978N3322j99492p61627O8988
2216A273456O30826n47061K40705J005820l10147L52218Q26803n63436k49211
2207B659973J073243n72098M14959O0691M39639p08533J77881Q54069p79198M72817
2197D093443R7533q81938M81509O06419J32582l73922j20231N00819o29005O10537
2187D517746M09591j03110j0013N07278N90377o56297l34472K92644K7551Q62027
2177F103322K7035Q3929K84121O0311J86246o27918J392949p5488m47991K71738
2167G258254Q00477O278K68034O8727o18780n4676Q20897J357883R75717j95149
2157A0687662j28427L24726J28080M14357R01161P89868m6593J03209J321812
$$ plain form
2148 14495855 14957735 14897170 15313296 16600080 16326692 17035858 17580654 18214049 18572283
2139 18572283 18797785 19792142 19994651 20330810 21273713 21756099 22258922 23041627 24956519
2130 24956519 26253246 27444567 29275178 30776039 33427119 35393441 38252554 41757590
2122 41757590 45754144 49672171 53597235 55856565 60477330 65694815 71492952 78342395
2114 78342395 87309657 98255704 112020951 131196144 159437007 196633494 250859032
2107 250859032 316632142 364313793 353632974 293288449 219441959 166063114 133665928
2100 133665928 109854818 91914484 77323746 66067080 57485944 52829559 49349444
2093 49349444 46510678 44929311 42658724 39560248 36742208 33421019 30485465 27592204
$$ packed form
2148A4495855M61880o0565M16126J286784k73388P09166N44796O33395L58234
2139A8572283K25502R94357K02509L36159R42903M82386N02823P82705J914892
2130B4956519J296727J191321J830611J500861K651080J966322K859113L505036
2122D1757590L996554L918027L925064K259330M620765N217485N798137O849443
2114G8342395Q967262J0946047J3765247J9175193K8240863L7196487N4225538
2107B50859032O5773110M7681651j0680819o0344525p3846490n3378845l2397186
2100A33665928k3811110j7940334j4590738j1256666q581136m656385l480115
2093D9349444k838766j581367k270587l098476k818040l321189k935554k893261
$$ plain form
2085 27592204 25687801 24173484 24295619 22678255 21725986 21059435 20176706 18722386 17497162
2076 17497162 16723635 15879920 14959756 14171011 12689303 11475967 11033373 10321617 10111970
2067 10111970 10330754 9728806 9183104 9485229 8741313 9352002 9140269 8457904 8417905 8011482
2057 8011482 7946279 7754286 6963839 6192338 5612311 6026021 5848278 5238855 5187682 5071703
2047 5071703 5018422 4836526 5205048 4366450 4344697 4916682 4932909 4591822 4115701 4065072
2037 4065072 4924143 4322512 3781506 3117729 3053387 2743448 2849552 2325328 3441942 2871655
2027 2871655 2851636 2773647 3116953 2916702 2225460 2027421 2352432 1825055 2047987 2405232
2017 2405232 2141731 1345777 398088 693093 820569 1283660 1593655 1577489 1219888 1344809
$$ packed form
2085B7592204j904403j514317J22135j617364r52269o66551q82729j454320j225224
2076A7497162p73527q43715r20164p88745j481708j213336m42594p11756k09647
2067A0111970K18784o01948n45702L02125p43916O10689k11733o82365l9999m06423
2057H011482o5203j91993p90447p71501n80027M13710j77743o09423n1173j15979
2047E071703n3281j81896L68522q38598k1753N71985J6227l41087m76121n0629
2037D065072Q59071o01631n41006o63777o4342l09939J06104n24224J116614n70287
2027B871655k0019p7989L43306k00251o91242j98039L25011n27377K22932L57245
2017B405232k63501p95954r47689K95005J27476M63091L09995j6166l57601J24921
$$ plain form
2007 1344809 932653 503194 376015 1003066 1236984 1000086 599231 915377 830228 1503893
1997 1503893 1988408 1475896 1624438 2074614 1129020 766616 1055908 1023643 1186193 1591953
1987 1591953 1823067 1652274 871541 882834 911707 821403 628711 837251 1273902 1308553
1977 1308553 187477 284919 494822 604747 480257 261614 553277 448369 256279 158283
1967 158283 483266 196700 -359467 -154029 -30912 368929 740425 409700 480657 984298
1957 984298 485259 810884 1087808 1367827 1446002 602223 -191483 14384 -30273 28666
1947 28666 263760 242687 935374 742122 1074623 1046011 654321 -171643 793807 37082
1937 37082 -124906 77573 -620303 -573236 455200 717915 178560 581158 279904 231662
$$ packed form
2007A344809m12156m29459j27179O27051K33918k36898m00855L16146q5149O73665
1997A503893M84515n12512J48542M50176r45594l62404K89292l2265J62550M05760
1987A591953K31114j70793p80733J1293K8873r0304j92692K08540M36651L4651
1977A308553j121076R7442K09903J09925j24490k18643K91663j04908j92090r7996
1967A58283L24983k86566n56167K05438J23117L99841L71496l30725P0957N03641
1957I84298m99039L25625K76924K80019P8175q43779p93706K05867m4657N8939
1947B8666K35094k1073O92687j93252L32501k8612l91690q25964R65450p56725
1937C7082j61988K02479o97876M7067J028436K62715n39355M02598l01254m8242
$$ plain form
1927 231662 308361 259582 514824 650112 848483 211167 312512 1228411 658026 -395648
1917 -395648 295724 175740 -185880 1185031 559150 345468 165943 -349175 -743343 -491210
1907 -491210 -835988 -1083832 -459626 -242383 -187577 -131718 -308534 -1014977 -499799 -105872
1897 -105872 135261 -72803 -356275 -46444 114898 -217018 -723474 50043 73851 62636
1887 62636 -18234 -61100 -650347 322947 845976 145094 -382783 -549725 -581785 -643263 -861133
1876 -861133 -564961 -603232 147217 83864 1215746 1432297 1424191 1152518 972404 96119
1866 96119 -1121071 -676709 13436 453209 242297 -67349 -2915 1069055 659340 244356
1856 244356 -107074 107314 -79171 80641 742208 481289 90180 234799 -199586 -5954
$$ packed form
1927B31662P6699m8779K55242J35288J98371o37316J01345R15899n70385j053674
1917c95648O91372j19984l61620J370911o25881k13682j79525n15118l94168K52133
1907d91210l44778k47844O24206K17243N4806N5859j76816p06443N15178L93927
1897a05872K41133k08064k83472L09831J61342l31916n06456P73517K3808j1215
1887F2636q0870m2866n89247R73294N23029p00882n27877j66942l2060o1478k17870
1876h61133K96172l8271P50449o3353J131882K16551q106k71673j80114q76285
1866I6119j217190M44362O90145M39773k10912l09646O4434J071970m09715m14984
1856B44356l51430K14388j86485J59812O61567k60919l91109J44619m34385J93632
$$ plain form
1846 -5954 854963 590585 66459 797287 892168 845346 1223729 841098 1130252 2315536
1836 2315536 1587454 1087002 593301 476071 859919 831672 351312 13195 -269019 195424
1826 195424 -103147 -41243 402932 979849 1327476 1036346 -15988 -375106 -196144 22580
1816 22580 269972 -494960 447664 1031524 118549 -193312 -658352 199186 513244 106139
1806 106139 12031 -88804 192005 -572301 1259 217794 -762915 -836516 -386303 108886
1796 108886 -1034880 -218533 -349360 315610 566988 -37794 -338101 -337228 -392532 -18101
1786 -18101 502876 121823 -481786 3029 677700 398096 577345 -230950 -479776 -751769
1776 -751769 -220555 502224 -148647 -425315 -434838 -600969 -568784 -56483 253037 -327571
$$ packed form
1846e954Q60917k64378n24126P30828R4881m6822L78383l82631K89154J185284
1836B315536p28082n00452m93701j17230L83848k8247m80360l38117k82214M64443
1826A95424k98571O1904M44175N76917L47627k91130j052334l59118J78962K18724
1816B2580K47392p64932R42624N83860r12975l11861m65040Q57538L14058m07105
1806A06139r4108j00835K80809p64306N73560K16535r80709p3601M50213M95189
1796A08886j143766Q16347j30827O64970K51378o04782l00307Q73n5304L74431
1786a8101N20977l81053o03609M84815O74671k79604J79249q08295k48826k71993
1776g51769N31214P22779o50871k76668r523j66131L2185N12301L09520n80608
$$ plain form
1766 -327571 329898 -408360 -652816 -279464 217305 72168 627392 -25448 -144280 -60493
1756 -60493 -257889 -46435 -517101 -95965 187632 -774865 -1225899 -865859 -1077139 -1130747
1746 -1130747 -635820 -435684 -270941 321850 650146 610557 -113909 162666 153884 -90648
1736 -90648 -16439 448624 456743 -84257 -176982 -590912 -202604 -280619 -250012 -452824 272736
1725 272736 885567 617376 49511 -406204 -235337 -123269 178341 19663 -758446 -19025
1715 -19025 -121906 -291628 -687230 48262 439803 305164 422540 585714 344098 279567
1705 279567 -337591 26540 652664 602672 467573 -48794 182062 -184499 -210858 -584893
1695 -584893 -748776 -1020713 -201128 -39719 1060435 424822 189330 -237489 246177 77593
$$ packed form
1766c27571O57469p38258k44456L73352M96769j45137N55224o52840j18832Q3787
1756f0493j97396K11454m70666M21136K83597r62497m51034L60040k11280n3608
1746a130747M94927K00136J64743N92791L28296l9589p24466K76575q782k44532
1736i0648P4209M65063Q119n41000r2725m13930L88308p8015L0607k02812P25560
1725B72736O12831k68191n67865m55715J70867J12068L01610j58678p78109P39421
1715a9025j02881j69722l95602P35492L91541j34639J17376J63174k41616o4531
1705B79567o17158L64131O26124m9992j35099n16367K30856l66561k6359l74035
1695e84893j63883k71937Q19585J61409J100154o35613k35492m26819M83666j68584
$$ plain form
1685 77593 -838995 -437790 -660957 -689094 -1032537 -288297 300148 243339 83368 -141850
1675 -141850 -891060 -1122625 -292679 -681768 -261731 -353983 -786653 -922970 -477512 -520080
1665 -520080 -1030075 87705 618920 7695 -261340 -475821 -1290288 -835717 -1077011 -1095661
1655 -1095661 -893594 -269352 280822 -52277 216804 -152902 -308536 -180359 142642 549639
1645 549639 -20706 172213 447044 -360973 -709774 -98392 -107908 -318579 -505651 522914
1635 522914 424161 -138458 -8811 -317634 -703738 -965368 346294 257708 -622417 -401460
1625 -401460 24408 385144 686119 101136 144692 -127933 -859247 -1105465 -244579 -98157
1615 -98157 441460 959958 155326 279306 93997 -206896 -577535 -464892 -101263 99706
$$ packed form
1685G7593r16588M01205k23167k8137l43443P44240N88445n6809j59971k25218
1675a41850p49210k31565Q29946l89089M20037r2252m32670j36317M45458m2568
1665e20080n09995J117780N31215o11225k69035k14481q14467M54571k41294j8650
1655a095661K02067O24242N50174l33099K69081l69706j55634J28177L23001M06997
1645E49639n70345J92919K74831q08017l48801O11382r516k10671j87072J028565
1635E22914r8753n62619J29647l08823l86104k61630J311662q8586q80125K20957
1625d01460M25868L60736L00975n84983M3556k72625p31314k46218Q60886J46422
1615i8157N39617N18498q04632J23980j85309l00893l70639J12643L63629K00969
$$ plain form
1605 99706 926334 218614 127078 -197499 -728966 -610288 81138 608179 555260 -120709
1595 -120709 20864 -58363 -433351 -789709 -1172990 -505252 488136 30857 -444646 -584414
1585 -584414 -56784 113830 -367313 85487 314041 726452 166630 291971 -208103 471758
1575 471758 554511 -506045 -657634 45843 439265 740121 -484 -314284 -308810 -589670
1565 -589670 -750924 -352330 -457854 -246713 175873 -298807 -422982 -270253 -409999 -278075
1555 -278075 -186880 -515075 -1003082 -1589039 -1390201 -187343 -567261 -582373 -237646 135966
1545 135966 214978 37029 -741480 -719999 -342372 244529 -101286 -140146 -722448 278615
1535 278615 572463 -321741 24401 -109872 -87951 -55431 -195073 48048 651747 96246
$$ packed form
1605I9706Q26628p07720r1536l24577n31467J18678O91426N27041n2919o75969
1595a20709J41573p9227l74988l56358l83281O67738R93388m57279m75503j39768
1585e84414N27630J70614m81143M52800K28554M12411n59822J25341n00074O79861
1575D71758Q2753j060556j51589P03477L93422L00856p40605l13800N474k80860
1565e89670j61254L98594j05524K11141M22586m74680j24175J52729j39746J31924
1555b78075R1195l28195m88007n85957J98838J202858l79918j5112L44727L73612
1545A35966P9012j77949p78509K1481L77627N86901l45815l8860n82302J001063
1535B78615K93848q94204L46142j34273K1921L2520j39642K43121O03699n55501
$$ plain form
1525 96246 457165 710762 1314289 1448793 123738 -462739 502503 -168375 -678347 -619674
1515 -619674 -314817 -440191 -432318 -920429 -117664 252762 463138 180232 -301949 -369865
1505 -369865 -638056 -813367 -844157 -1458067 -495463 181876 197730 -261088 238429 201944
1495 201944 -855182 -604526 278949 464125 277980 -352425 -459303 -424552 -29148 -622836
1485 -622836 -926456 -451315 -410849 -5143 113392 189924 -192671 151416 377413 -108846
1475 -108846 -42485 219339 443543 252719 -345940 -166405 -70076 935785 955625 -364366
1465 -364366 -297991 478027 26915 184621 -460725 -771096 76642 552572 -241785 2948
1455 2948 -46173 315047 -2840 -841597 -516764 130801 20346 30601 140106 -103804
$$ packed form
1525I6246L60919K53597O03527J34504j325055n86477R65242o70878n09972N8673
1515f19674L04857j25374P873m88111Q02765L70426K10376k82906m82181o7916
1505c69865k68191j75311l0790o13910R62604O77339J5854m58818M99517l6485
1495B01944j057126K50656Q83475J85176j86145o30405j06878L4751L95404n93688
1485f22836l03620M75141M0466M05706J18535P6532l82595L44087K25997m86259
1475a08846O6361K61824K24204j90824n98659J79535R6329J005861J9840j319991
1465c64366O6375P76018m51112J57706o45346l10371Q47738M75930p94357K44733
1455B948m9121L61220l17887q38757L24833O47565j10455J0255J09505k43910
$$ plain form
1445 -103804 535001 142409 -332383 -88387 247522 -16584 173467 -78601 -133545 230924
1435 230924 55272 150754 739081 255451 -360003 817584 567003 -425103 28798 221576
1425 221576 -606121 -435030 -88900 -603595 64475 -69306 -253221 151832 122560 -583183
1415 -583183 -421646 32633 -176384 -877104 -1270791 -722966 -821391 -62993 -225151 -705544
1405 -705544 -256195 704938 473408 51286 391160 220765 66964 -5386 5867 -213962
1395 -213962 -570753 -64575 64679 470748 1223523 1407174 -183130 -571482 -419202 -20281
1385 -20281 -18627 187079 -313652 -939450 -61003 231989 -292119 -458354 -374096 -876208
1375 -876208 -592166 -723126 -381381 -221015 34368 98096 -1024246 -215885 -847425 -680254
$$ packed form
1445a03804O38805l92592m74792K43996L35909k64106J90051k52068n4944L64469
1435B30924j75652R5482N88327m83630o15454J177587k50581r92106M53901J92778
1425B21576q27697J71091L46130n14695O68070j33781j83915M05053k9272p05743
1415e83183J61537M54279k09017p00720l93687N47825r8425P58398j62158m80393
1405g05544M49349R61133k31530m22122L39874j70395j53801p2350J1253k19829
1395b13962l56791N06178J29254M06069P52775J83651j590304l88352J52280L98921
1385b0281J654K05706n00731o25798Q78447K92992n24108j66235Q4258n02112
1375h76208K84042j30960L41745J60366K55383O3728j122342Q08361o31540J67171
$$ plain form
1365 -680254 -749002 -864411 179690 31365 314883 14611 515729 649839 649299 417866
1355 417866 -116356 111447 1149864 451862 -576138 -304766 -405417 69293 662494
1346 662494 456775 952884 836038 271740 -226575 196858 -379574 -846851 -5494 143104
1336 143104 -224694 115878 -429535 -959804 -786993 -534089 68513 236178 237213 717540
1326 717540 -28652 431938 544181 812988 606295 -87183 -1191888 -671383 -133658 174958
1316 174958 -327934 -107444 112533 -371526 239646 -655468 -1212656 -1427551 -737952 -719366
1306 -719366 -88280 -135898 -397910 -242073 578120 704753 46645 -84701 -266946 -668437
1296 -668437 447424 619400 -365255 -101846 677150 275855 734937 -30945 -347122 136942
$$ packed form
1365f80254o8748j15409J044101j48325K83518l00272N01118J34110n40k31433
1355D17866n34222K27803J038417o98002j028000K71372j00651M74710N93201
1346F62494k05719M96109j16846n64298m98315M23433n76432m67277Q41357J48598
1336A43104l67798L40572n45413n30269J72811K52904O02602J67665J035M80327
1326G17540p46192M60590J12243K68807k06693o93478j104705N20505N37725L08616
1316A74958n02892K20490K19977m84059O11172q95114n57188k14895O89599J8586
1306g19366O31086m7618k62012J55837Q20193J26633o58108j31346j82245m01491
1296f68437J115861J71976r84655K63409P78996m01295M59082p65882l16177M84064
$$ plain form
1286 136942 95585 -26739 -388257 -120872 -1156453 -1360781 -365350 370047 127411 537451
1276 537451 372204 1055337 704490 207675 -191233 32475 111079 -19736 921399 876411
1266 876411 -642204 -956066 -411498 55650 285396 -86516 -222654 -10953 -284261 -610218
1256 -610218 -239740 -546382 -188047 -471080 369825 613788 515499 -67346 -135454 119390
1246 119390 93095 141010 -414768 -254659 235311 282553 1376958 103567 110423 -1137330
1236 -1137330 -1258500 -729800 -199738 -21894 -507232 12145 -514520 -121186 -591104 68000
1226 68000 -620766 -672926 -10795 325537 -77173 329232 720985 383827 -309499 -542234
1216 -542234 -656970 -1035276 -970368 -1090241 -1364353 -908044 1077843 788097 -222327 -275001
$$ packed form
1286A36942m1357j22324l61518K67385j035581k04328R95431P35397k42636M10040
1276E37451j65247O83133l50847m96815l98908K23708P8604j30815R41135m4988
1266H76411j518615l13862N44568M67148K29746l71912j36138K11701k73308l25957
1256f10218L70478l06642L58335k83033Q40905K43963r8289n82845o8108K54844
1246A19390k6295M7915n55778J60109M89970M7242J094405j273391O856j247753
1236a137330j21170N28700N30062J77844m85338N19377n26665L93334m69918O59104
1226F8000o88766n2160O62131L36332m02710M06405L91753l37158o93326k32735
1216e42234j14736l78306O4908j19873k74112M56309J985887k89746j010424n2674
$$ plain form
1206 -275001 -160886 -46011 -338607 -1065893 -692070 -57905 576 249346 642331 173691
1196 173691 614927 206818 -891471 -697138 291568 760313 -52578 157341 517139 275142
1186 275142 694028 1239877 484672 529323 98884 164682 234113 343850 -305067 -259893
1176 -259893 346887 40990 -513076 -741481 -143379 -96994 -8431 -330234 -871311 -295945
1166 -295945 -220404 -349698 117097 172140 -154985 300840 1290466 1076035 173672 22963
1156 22963 315024 486600 132107 368850 424619 -450060 -747834 -450517 313541 1467541
1146 1467541 1665801 894808 617666 -3970 -622576 -605650 -385456 -436960 -152132 -473589
1136 -473589 -384412 -233141 164994 347504 388160 288340 174969 547309 131109 -485789
$$ packed form
1206b75001J14115J14875k92596p27286L73823O34165N8481K48770L92985m68640
1196A73691M41236m08109j098289J94333R88706M68745q12891K09919L59798k41997
1186B75142M18886N45849p55205M4651m30439O5798O9431J09737o48917M5174
1176b59893O06780l05897n54066k28405N98102M6385Q8563l21803n41077N75366
1166b95945P5541j29294M66795N5043l27125M55825R89626k14431r02363j50709
1156B2963K92061J71576l54493K36743N5769q74679k97774K97317P64058J154000
1146A467541J98260p70993k77142o21636o18606J6926K20194n1504K84828l21457
1136d73589Q9177J51271L98135J82510M0656r9820j13371L72340m16200o16898
$$ plain form
1126 -485789 -652687 -421985 158876 351057 101471 -82830 -123271 -50029 -484451 5017
1116 5017 -290346 -110286 518667 53350 31658 596069 188181 33050 303698 417752
1106 417752 369040 -434569 113150 20105 -784597 -286591 -379393 -1083691 -1068262 -807509
1096 -807509 -390781 -180966 185626 317175 -390326 -625419 -112600 -81104 -93312 -121906
1086 -121906 -485302 299318 340636 401066 649684 160764 71796 -436152 -978392 -847455
1076 -847455 -482131 -1092080 -581333 -430945 -675497 -184386 125097 -124291 -293951 -165824
1066 -165824 -626031 -647690 -146182 -518566 -510687 -712288 -127241 142301 -415575 -413884 -124932
1055 -124932 410314 110802 414608 -195838 148105 239696 135044 247883 -422349 -519367
$$ packed form
1126d85789j66898K30702N80861J92181k49586j84301m0441P3242m34422M89468
1116E017k95363J80060O28953m65317k1692N64411m07888j55131K70648J14054
1106D17752m8712q03609N47719r3045q04702M98006r2802p04298J5429K60753
1096h07509M16728K09815L66592J31549p07501k35093N12819L1496j2208k8594
1086a21906l63396P84620M1318O0430K48618m88920q8968n07948n42240J30937
1076h47455L65324o09949N10747J50388k44552M91111L09483k49388j69660J28127
1066a65824m60207k1659N01508l72384P879k01601N85047K69542n57876J691K88952
1055a24932N35246k99512L03806o10446L43943R1591j04652J12839o70232r7018
$$ plain form
1045 -519367 -353403 -867873 -386359 -236655 -205738 -379493 32215 -292171 463572 716387
1035 716387 -238029 -214051 -549922 -394298 -824051 -437953 -486146 -666245 -374085 129113
1025 129113 253024 -522607 -667390 106381 379744 44467 -55956 120316 -369880 130451
1015 130451 -319140 -309093 24497 -517318 -279239 -238080 482057 546288 599999 160751
1005 160751 7754 -171661 -405388 -466654 34459 368427 549152 1134729 1319288 908383
995 908383 881320 197045 269446 116915 -41923 -120574 -904579 322833 500404 717481
985 717481 95603 46384 29942 -62105 -298651 -1157540 -897408 -306850 -1090614 -635511
975 -635511 391417 559436 36853 -427756 138022 533420 -121152 -352836 -123190 593154
$$ packed form
1045e19367J65964n14470M81514J49704L0917j73755M11708l24386P55743K52815
1035G16387r54416K3978l35871J55624m29753L86098m8193j80099K92160N03198
1025A29113J23911p75631j44783P73771K73363l35277j00423J76272m90196N00331
1015A30451m49591J0047L33590n41815K38079M1159P20137O4231N3711m39248
1005A60751j52997j79415k33727o1266N01113L33968J80725N85577J84559m10905
995I08383k7063o84275P2401j52531j58838p8651p84005J227412J77571K17077
985G17481o21878m9219j6442r2047k36546q58889K60132N90558p83764M55103
975f35511J026928J68019n22583m64609N65778L95398o54572k31684K29646P16344
$$ plain form
965 593154 253593 101445 329264 72279 -187936 -186104 -376670 -1020716 -540000 -263606
955 -263606 -510700 -676471 -343345 -472172 -1283697 -1284234 -579255 244604 -303989 -330824 -104306
944 -104306 -401683 -386280 8726 281487 -68350 314664 661414 571321 750756 688503
934 688503 675424 674970 930620 665244 -7587 -847189 -618752 -319126 -258867 104839 427675
923 427675 262609 397917 191462 224870 -240790 281005 817515 349430 690610 -271956
913 -271956 -256977 187427 713208 462817 310275 23523 -228881 132151 550631 93707
903 93707 110696 -289309 -113155 239320 117951 -405301 -246460 78873 -147610 -420490
893 -420490 -273373 -388845 118134 -24398 -425095 -443743 -530000 -591702 221961 341196
$$ packed form
965E93154l39561j52148K27819k56985k60215J832j90566o44046M80716K76394
955b63606k47094j65771L33126j28827q11525n37P04979Q23859n48593k6835K26518
944a04306k97377J5403L95006K72761l49837L83014L46750r0093J79435o2253
934F88503j3079m54K55650k65376o72831q39602K28437K99626O0259L63706L22836
923D27675j65066J35308k06455L3408m65660N21795N36510m68085L41180r62566
913b71956J4979M44404N25781k50391j52542k86752k52404L61032M18480m56924
903I3707J6989m00005J76154L52475j21369n23252J58841L25333k26483k72880
893d20490J47117j15472N06979j42532m00697j8648q6257o1702Q13663J19235
$$ plain form
883 341196 -730038 -632530 -534313 -944356 -803523 -410108 -181403 -687518 -388954 -18539
873 -18539 -367053 -448000 -185003 -212130 203533 -290797 -325568 -725278 -1197251 -973277 -840534
862 -840534 -256903 -974908 -945259 124186 -421231 -971634 -349080 -781123 -797562 -574601
852 -574601 -356456 -399384 -116853 -586346 -491944 353601 817479 847440 495379 326384
842 326384 354516 989153 426394 247849 441692 572784 -20101 -6029 -449382 451472
832 451472 873677 -363799 -240476 549100 524494 -475922 -384217 -312864 -672766 -645955
822 -645955 617579 792484 915487 698869 34642 -521600 154489 416152 538209 907139
812 907139 497296 63859 300998 113545 18611 173547 681187 719626 733046 -280661
$$ packed form
883C41196j071234R7508R8217m10043J40833L93415K28705n06115K98564L70415
873a8539l48514q0947K62997k7127M15663m94330l4771l99710m71973K23974J32743
862h40534N83631p18005K9649J069445n45417n50403O22554m32043j6439K22961
852e74601K18145m2928K82531m69493R4402Q45545M63878K9961l52061j68995
842C26384K8132O34637n62759j78545J93843J31092n92885J4072m43353R00854
832D51472M22205j237476J23323P89576k4606j000416R1705P1353l59902K6811
822f45955J263534J74905J23003k16618o64227n56242O76089K61663J22057L68930
812I07139m09843m33437K37139j87453r4934J54936N07640L8439J3420j013707
$$ plain form
802 -280661 -302627 -79500 -453449 -658929 -713970 -647628 -321022 838257 333591 572256
792 572256 970305 418597 344243 -48233 -190435 128625 271512 456759 242603 221474
782 221474 724764 107753 -142462 7269 -191290 955826 1472179 908940 637538 516574
772 516574 81087 225358 766865 146268 341780 310737 466531 273952 339965 219048
762 219048 124947 63702 58681 674465 124249 307569 1110015 1448814 991596 19766 315836
751 315836 -174196 -369427 -104314 517524 556822 -707086 -312756 448945 127523 398808
741 398808 -122756 -207130 -361172 -596368 -342126 -53962 47045 -777649 184357 -481148
731 -481148 -408927 210308 380603 627398 -34996 -29948 440817 -107867 266848 307399 99550
$$ packed form
802b80661k1966K23127l73949k05480n5041O6342L26606J159279n04666K38665
792E72256L98049n51708p4354l92476j42202L19060J42887J85247k14156k1129
782B21474N03290o17011k50215J49731j98559J147116N16353n63239k71402j20964
772E16574m35487J44271N41507o20597J95512l1043J55794j92579O6013j20917
762B19048r4101o1245n021O15784n50216J83320Q02446L38799m57218r71830K96070
751C15836m90032j95231K65113O21838L9298j263908L94330P61701l21422K71285
741C98808n21564q4374j54042k35196K54242K88164J01007q24694R62006o65505
731d81148P2221O19235J70295K46795o62394N048M70765n48684L74715M0551k07849
$$ plain form
720 99550 -292944 -151266 158076 -311197 -268539 689004 -28141 -1276265 -557825 -62445
710 -62445 59950 -198081 75869 -47405 -47670 -905613 -1054175 -1098518 -980498 -637098 -883066
699 -883066 -138247 168654 213057 -897702 -910500 -313960 347683 944228 716881 572455
689 572455 -236584 -207005 -155278 -855981 -825454 250167 985405 553708 771497 -181236
679 -181236 93755 582542 -200425 -479916 233447 420233 593269 552560 493778 325659
669 325659 689254 1299880 852432 49244 -54954 -392446 -99028 121782 -119331 312947
659 312947 -388915 -262483 474264 300473 592974 696669 -423763 -681948 -161650 -208888
649 -208888 -237451 -35642 -176014 -296458 -259813 -508439 -793561 -529538 -242397 -257900
$$ packed form
720I9550l92494J41678L09342m69273M2658R57543p17145j248124P18440M95380
710f2445J22395k58031K73950j23274k65q57943j48562m4343J18020L43400k45968
699h83066P44819L06901M4403j110759j2798N96540O61643N96545k27347j44426
689E72455q09039K9579N1727p00703L0527J075621P35238m31697K17789r52733
679a81236K74991M88787p82967k79491P13363J86786J73036m0709n8782j68119
669C25659L63595O10626m47448q03188j04198l37492K93418K20810k41113M32278
659C12947p01862J26432P36747j73791K92501J03695j120432k58185N20298m7238
649b08888k8563K01809j40372j20444L6645k48626k85122K64023K87141j5503
$$ plain form
639 -257900 86176 -202374 -127259 -704989 -1312248 -957315 35626 285336 -165767 -34505
629 -34505 402391 878734 401142 -164645 197352 534155 569183 305552 116580 345121
619 345121 312459 434079 -562159 -341482 -86965 357623 -52097 -319896 -50846 257343
609 257343 150495 -283188 -168362 -410456 7282 171081 -367572 403439 243576 372581
599 372581 497948 712594 690659 251013 983876 321609 507444 931728 725308 643425
589 643425 816514 213635 234268 419295 131258 954045 -32637 -854643 -31452 212399
579 212399 280061 -52160 -540079 -207801 -315254 2123 19378 1273878 1073309 613591
569 613591 545956 617167 -174458 -419013 520414 923723 64824 -111156 124994 159146
$$ packed form
639b57900L44076k88550P5115n77730o07259L54933R92941K49710m51103J31262
629c4505M36896M76343m77592n65787L61997L36803L5028k63631j88972K28541
619C45121l2662J21620r96238K20677K54517M44588m09720k67799K69050L08189
609B57343j06848m33683J14826k42094M17738J63799n38653P71011j59863J29005
599C72581J25367K14646k1935m39646P32863o62267J85835M24284k06420q1883
589F43425J73089o02879K0633J85027k88037Q22787r86682q22006Q23191K43851
579B12399O7662l32221m87919L32278j07453L17377J7255J254500k00569m59718
569F13591o7635P1211p91625k44555R39427M03309q58899j75980K36150L4152
$$ plain form
559 159146 -601234 -209856 117324 -576686 422972 -71659 140118 301811 397422 -49949
549 -49949 285666 517444 -93703 275726 236516 -90072 -359197 -285199 -304418 -147227 204851
538 204851 -851248 -639120 -114830 730279 894202 587307 462249 267409 721072 1353042
528 1353042 549652 -356339 -155311 -611069 -297743 -202042 -695967 -189383 199394 311075
518 311075 497982 621408 -134002 372443 498549 -271855 45197 573588 371285 467203
508 467203 -29484 -504976 -119005 -430249 -455214 -297494 -19146 95960 480302 197637
498 197637 772564 534680 717275 376644 556994 813908 546114 225302 208602 584887
488 584887 409543 278485 -389364 -712785 -618682 390276 -190068 -390377 -488596 -204353
$$ packed form
559A59146p60380L91378L27180o94010R99658m94631K11777J61693R5611m47371
549d9949L35615K31778o11147L69429l9210l26588k69125P3998j9219J57191L52078
538B04851j056099K12128N24290Q45109J63923l06895j25058j94840M53663O31970
528A353042q03390r05991K01028m55758L13326R5701m93925N06584L88777J11681
518C11075J86907J23426p55410N06445J26106p70404L17052N28391k02303R5918
508D67203m96687m75492L85971l11244k4965J57720K78348J15106L84342k82665
498A97637N74927k37884J82595l40631J80350K56914k67794l20812j6700L76285
488E84887j75344j31058o67849l23421R4103J008958n80344k00309r8219K84243
$$ plain form
478 -204353 703606 999023 510150 -635629 -695445 214418 -883933 -761977 -750236 -591321
468 -591321 306895 169674 -661008 -617975 -274072 -462954 156999 294733 -574874 -139098
458 -139098 -458763 -618313 -563330 -442096 -626538 -561953 -816899 -799886 -227691 185881
448 185881 218834 302109 466475 278642 996910 910008 524246 241638 212122 878885 739699
437 739699 668635 462054 -396669 -38486 56309 -324397 -607627 -1131676 -238052 421691
427 421691 281790 122855 -645558 -408856 -798333 -1006264 -256917 33768 -511952 3482
417 3482 -135562 156123 101398 543895 434000 -214435 -864900 -320136 17761 -761325
407 -761325 -934383 -1601944 -1783967 -1007400 -548817 337468 266647 403996 539604 821781
$$ packed form
478b04353R07959K95417m88873j145779n9816R09863j098351J21956J1741J58915
468e91321Q98216j37221q30682M3033L43903j88882O19953J37734q69607M35776
458a39098l19665j59550N4983J21234j84442O4585k54946J7013N72195M13572
448A85881L2953Q3275J64366j87833P18268q6902l85762k82608k9516O66763j39186
437G39699p1064k06581q58723L58183R4795l80706k83230n24049Q93624O59743
427D21691j39901j58935p68413K36702l89477k07931P49347K90685n45720N15434
417C482j39044K91685n4725M42497j09895o48435o50465N44764L37897p79086
407g61325j73058o67561j82023P76567M58583Q86285p0821J37349J35608K82177
$$ plain form
397 821781 727905 676333 473389 353701 -272027 -85281 284049 635038 440219 190538
387 190538 459606 -372566 -131923 -522522 -624501 -194638 -174598 -74850 286919 -504052
377 -504052 -76329 45668 -644932 -937416 -538763 -706676 -526490 -144835 244044 14399
367 14399 -760623 -131320 27886 -59253 -251571 -214696 -993815 -1475114 -511647 -387142
357 -387142 -145415 209561 420434 173517 -229035 -292396 578241 1077646 -294978 -839642
347 -839642 -717557 -591010 -124578 -196558 -545409 -837742 -726772 -170224 -47334 -78008
337 -78008 41117 171908 264408 226553 55889 -104353 -221546 588362 313192 -2065
327 -2065 -614245 -235403 143451 -87174 574366 632770 142132 74143 -320156 -1256005 -1018157
$$ packed form
397H21781r3876n1572k02944j19688o25728J86746L69330L50989j94819k49681
387A90538K69068q32172K40643l90599j01979M29863K0040R9748L61769p90971
377e04052M27723J21997o90600k92484L98653j67913J80186L81655L88879k29645
367A4399p75022O29303J59206q7139j92318L6875p79119m81299R63467J24505
357c87142K41727L54976K10873k46917m02552o3361Q70637M99405j372624n44664
347h39642J22085J26547M66432p1980l48851k92333J10970N56548J22890l0674
337g8008J19125J30791R2500l7855j70664j60242j17193Q09908k75170l15257
327b065o12180L78842L78854k30625O61540N8404m90638o7989l94299r35849K37848
$$ plain form
316 -1018157 -889844 -176201 131183 -396545 -789057 -684912 -1144982 -892215 -183801 35824
306 35824 214386 -373004 -189208 -87349 423242 175190 -169175 -227561 -245012 80894
296 80894 -168837 250840 -99913 -444842 484237 1079830 304807 -293793 -198739 214143
286 214143 149509 -270913 -583962 193865 84881 563594 155414 -231914 -467038 6126
276 6126 -230759 -562443 -501103 -48205 250361 365811 -391207 -381011 -160377 23884 344155
265 344155 41997 -969724 -929375 -26499 15349 348519 456318 29091 -1198560 -947151
255 -947151 -647067 -695087 -1128661 -998947 -207445 112794 -443757 10415 72523 35309
245 35309 300515 587191 295090 -239006 -156315 -58196 -469655 -882698 -901067 -581196 -192741
$$ packed form
316a018157J28313P13643L07384n27728l92512J04145m60070K52767P08414K19625
306C5824J78562n87390J83796J01859N10591k48052l44365n8386j7451L25906
296H0894k49731M19677l50753l44929R29079N95593p75023n98600R5054M12882
286B14143o4634m20422l13049P77827j08984M78713m08180l87328k35124M73164
276F126k36885l31684O1340M52898K98566J15450p57018J0196K20634J84261L20271
265C44155l02158j011721M0349R02876M1848L33170J07799m27227j227651K51409
255i47151L00084m8020m33574J29714P91502L20239n56551M54172O2108l7214
245C5309K65206K86676k92101n34096Q2691R8119m11459m13043j8369L19871L88455
$$ plain form
234 -192741 208989 -137429 -124047 -130064 -401459 -264672 583640 242191 13809 -397019
224 -397019 -328560 -16150 109344 151051 78469 -261543 -456846 -464277 -1114852 -1155655 -1040971
213 -1040971 -1010333 -845955 265501 851705 -43698 -114252 448382 -6634 -358935 264642
203 264642 275795 -476974 -469517 5103 -201444 575384 276628 -210606 155861 -205774
193 -205774 -349829 -345522 -207102 -329524 -727921 -28716 -734007 -928102 -1056188 -1295583
183 -1295583 -431458 48222 -399633 -616959 -148126 170029 452533 212888 60127 -780984
173 -780984 36664 202355 -559438 -577113 -271371 498008 769039 -292760 -196773 -741788
163 -741788 -1150276 -807268 -693965 -434489 40766 -233306 -459951 -446051 -615513 -551994
$$ packed form
234a92741M01730l46418J3382o017k71395J36787Q48312l41449k28382m10828
224c97019O8459L12410J25494M1707p2582l40012j95303p431o50575m0803J14684
213a040971L0638J64378J111456N86204q95403p0554N62634m55016l52301O23577
203B64642J1153p52769P457M74620k06547P76828k98756m87234L66467l61635
193b05774j44055M307J38420j22422l98397O99205p05291j94095j28086k39395
183a295583Q64125M79680m47855k17326M68833L18155K82504k39645j52761q41111
173g80984Q17648J65691p61793j7675L05742P69379K71031j061799R5987n45015
163g41788m08488L43008J13303K59476M75255k74072k26645J3900j69462O3519
$$ plain form
153 -551994 -515959 -521527 149029 90109 -591877 -362911 179809 114864 -9533 321507 641027
142 641027 307436 172865 -915686 -827883 -1038797 -959185 200666 154197 -254730 -806079
132 -806079 -761548 -644074 17563 258597 95785 892605 412007 -292785 -226386 -607435
122 -607435 -207651 132286 139950 507172 196226 21158 -5343 -733802 -533855 264276
112 264276 138669 30754 91859 -190803 -95307 243474 -42539 -116988 284628 203890 -63424
101 -63424 -755061 -330676 103915 -17176 -225207 -200198 -348796 -570453 -727137 -66162
91 -66162 -62977 -247610 -190386 -296853 -326047 -87042 -364843 -369210 -488523 -525487 -802945
80 -802945 -563835 -535335 -473464 -970219 -1036985 -965438 -934911 -654550 -405426 -390189 -192161
$$ packed form
153e51994L6035n568O70556n8920o81986K28966N42720o4945j24397L31040L19520
142F41027l33591j34571j088551Q7803k10914P9612J159851m6469m08927n51349
132h06079M4531J17474O61637K41034j62812P96820m80598p04792O6399l81049
122f07435L99784L39937P664L67222l10946j75068k6501p28459J99947P98131
112B64276j25607j07915O1105k82662R5496L38781k86013p4449M01616q0738k67314
101f3424o91637M24385M34591j21091k08031K5009j48598k21657j56684O60975
91f6162L185j84633N7224j06467k9194K39005k77801m367j19313l6964k77458
80h02945K39110K8500O1871m96755o6766P1547L0527K80361K49124J5237J98028
$$ plain form
69 -192161 22384 -12698 43107 676359 958618 756588 551511 -45135 -521360 -590952 -715200
58 -715200 -645948 -328870 -44844 -32839 -64691 -986188 -856519 -628231 -1072938 -947459 -832125
47 -832125 20274 -469368 71427 -327275 -351287 -632668 -449942 -164836 256586 78794
37 78794 241938 -88354 -191632 -644068 -864569 -3345 115546 125569 -290145 -405509
27 -405509 -623644 -559527 -838210 -645183 554035 524288 375230 -169030 -311264 -402851
17 -402851 -176948 -213938 87418 61885 -393893 -612291 -1073017 -582868 -141287 334011
7 334011 76735 -448006 -429693 -478904 -694467 -251788 72560
0 72560
$$ packed form
69a92161K14545l5082N5805O33252K82259k02030k05077n96646m76225o9592j24248
58g15200O9252L17078K84026J2005l1852r21497J29669K28288m44707J25479J15334
47h32125Q52399m89642N40795l98702k4012k81381J82726K85106M21422j77792
37G8794J63144l30292j03278m52436k20501Q61224J18891J0023m15714j15364
27d05509k18135O4117k78683J93027J199218k9747j49058n44260j42234r1587
17d02851K25903l6990L01356k5533m55778k18398m60726M90149M41581M75298
7C34011k57276n24741J8313m9211k15563M42679L24348
0G2560
$$ Imaginary data points
##PAGE= N=2
##DATA TABLE= (X++(I..I)), XYDATA
$$ plain form
16383 -2313143 -1933784 -1439784 -1344046 -2043634 -2111470 -2176473 -2149489 -1790999 -1189671 -1020926
16373 -1020926 -1507738 -1570204 -1865370 -1798285 -1060640 -854749 -1260972 -1514618 -1513457 -2007532
16363 -2007532 -2145146 -1875844 -2042540 -2269223 -1846035 -1452858 -1574565 -2102339 -1871473
16354 -1871473 -1617543 -1765836 -1564705 -1752795 -1346400 -1191488 -1209171 -811027 -970961 -876191
16344 -876191 -881436 -587794 -632509 -998313 -950189 -1005060 -949273 -420649 -860271 -1156674 -1018395
16333 -1018395 -681639 -695906 -902352 -745938 -514178 -286212 -652515 -1126090 -746640 -404245
16323 -404245 -370715 -1085093 -1075920 -512192 -401406 37761 123180 -350935 -570122 -382512
16313 -382512 -453225 -245884 -420626 -373958 -674283 -284157 -750227 -678271 -5253 -382233
$$ packed form
16383b313143L79359M94000R5738o99588o7836o5003K6984L58490O01328J68745
16373a020926m86812o2466k95166O7085P37645K05891m06223k53646J161m94075
16363b007532j37614K69302j66696k26683M23188L93177j21707n27774K30866
16354a871473K53930j48293K01131j88090M06395J54912j7683L98144j59934R4770
16344h76191n245K93642m4715l65804M8124n4871N5787N28624m39622k96403J38279
16333a018395L36756j4267k06446J56414K31760K27966l66303m73575L79450L42395
16323d04245L3530p14378R173N63728J10786M39167Q5419m74115k19187J87610
16313c82512p0713K07341j74742M6668l00325L90126m66070P1956O73018l76980
$$ plain form
16303 -382233 208150 782914 71135 228624 273350 -54786 -54184 -132215 -111130 289545 5902
16292 5902 -436956 148196 22001 -76693 295895 16143 -65212 -214864 -324591 -377124
16282 -377124 194566 -294720 116787 572300 156170 483072 105741 251886 1184896 889104
16272 889104 1111670 1358550 770832 889656 683408 931807 880877 1406869 1811602 1793794
16262 1793794 1523412 1279155 1445598 949242 758378 96081 621992 909243 1088535
16253 1088535 866051 365560 636186 505078 615785 701885 387085 370773 1444314 1058440
16243 1058440 1220461 1162322 1022257 890618 1045271 1078788 1443167 1323806 977774 645944
16233 645944 1099727 1182728 1153582 987024 1323713 1696496 2051153 1465992 1186110 1363968
$$ packed form
16303c82233N90383N74764p11779J57489M4726l28136O02p8031K1085M00675k83643
16292E902m42858N85152j26195r8694L72588k79752q1355j49652j09727n2533
16282c77124N71690m89286M11507M55513m16130L26902l77331J46145R33010k95792
16272H89104K22566K46880n87718J18824k06248K48399n0930N25992M04733j7808
16262A793794k70382k44257J66443m96356j90864o62297N25911K87251J79292
16253A088535k22484n00491K70626j31108J10707Q6100l14800j6312J073541l85874
16243A058440J62021n8139j40065j31639J54653L3517L64379j19361l46032l31830
16233F45944M53783Q3001k9146j66558L36689L72783L54657n85161k79882J77858
$$ plain form
16223 1363968 1456777 1841392 1386877 1771560 1830121 1560447 1009561 1864455 2191767 1532046
16213 1532046 567694 579313 576978 665871 698135 1160576 1067729 1821515 2333060 1342572
16203 1342572 848320 928224 1164532 1206015 1351166 1199096 1244519 907707 876426 820640
16193 820640 663158 1567968 1923382 1825454 2321370 2639869 2218201 1673055 997501 1015235
16183 1015235 769811 835663 1715696 2317671 2146934 1654448 1798373 1812611 1207866 1616873
16173 1616873 1789453 1934187 2165749 1687399 1366643 1686592 2149875 2050895 1285687 1415740
16163 1415740 2246590 2155833 1993808 1671158 2089104 2629330 2967182 2937460 2729707 2693816
16153 2693816 1942670 2407192 2147161 1697384 1661102 1448421 1910491 2006722 2112112 2523213
$$ packed form
16223A363968R2809L84615m54515L84683N8561k69674n50886Q54894L27312o59721
16213A532046r64352J1619k335Q8893L2264M62441r2847P53786N11545r90488
16203A342572m94252P9904K36308M1483J45151j52070M5423l36812l1281n5786
16193H20640j57482R04810L55414r7928M95916L18499m21668n45146o75554J7734
16183A015235k45424O5852Q80033O01975j70737m92486J43925J4238o04745M09007
16173A616873J72580J44734K31562m78350l20756L19949M63283r8980p65208J30053
16163A415740Q30850r0757j62025l22650M17946N40226L37852k9722k07753l5891
16153B693816p51146M64522k60031m49777l6282k12681M62070R6231J05390M11101
$$ plain form
16143 2523213 2924975 2099007 1929805 1827549 1298677 1472486 2513193 2363923 2594049
16134 2594049 2830658 2594033 2004498 1482480 1225596 2156017 2110118 2278439 1656959 2033494
16124 2033494 2398054 1842962 1985392 1739998 1438755 2068997 2545674 2275001 1526042
16115 1526042 1793571 1826140 1618464 2438017 2282468 2617263 2686126 2398369 2803945 2754004
16105 2754004 2520816 2593509 1727151 2022879 2267198 2106703 1870019 1929288 1633606 2328799
16095 2328799 2016107 2463663 2082752 1980140 1822555 2628843 2538161 2510957 2682221 2191477
16085 2191477 2530115 2685007 1843375 1326095 1737421 2094647 2423658 2277128 2274269 1671561
16075 1671561 2401548 2665223 2580586 1549537 1139632 1102513 1540253 2436704 1877071 1608582
$$ packed form
16143B523213M01762q25968j69202j02256n28872J73809J040707j49270K30126
16134B594049K36609k36625n89535n22018k56884R30421m5899J68321o21480L76535
16124B033494L64560n55092J42430k45394l01243O30242M76677k70673p48959
16115A526042K67529L2569k07676Q19553j55549L34795O8863k87757M05576m9941
16105B754004k33188P2693q66358K95728K44319j60495k36684N9269k95682O95193
16095B328799l12692M47556l80911j02612j57585Q06288r0682k7204J71264m90744
16085B191477L38638J54892q41632n17280M11326L57226L29011j46530k859o02708
16075A671561P29987K63675q4637j031049m09905l7119M37740Q96451n59633k68489
$$ plain form
16065 1608582 2003307 2505233 2342652 1872743 1992999 2898822 2331225 2090234 3082012
16056 3082012 2346903 1867278 1526939 1899023 1213129 1581985 2498570 2155230 1545309
16047 1545309 1376962 1303169 2111926 3217054 2723283 2866633 3048119 2661303 2517388
16038 2517388 1290164 799736 1628087 1658485 1802077 1615433 1785659 1750820 1180960 1899287
16028 1899287 2473095 2953175 2543126 2688377 2840419 1856863 2155118 2570667 2684154
16019 2684154 2268268 2710926 3011835 1783923 2159367 2588994 1957291 2571393 2667357
16010 2667357 2120157 1913010 1808543 2428582 2385675 2400846 2831963 2872027 2466061 2208819
16000 2208819 2313748 2909555 3100491 2349728 2306663 1291128 1389790 1578078 1603774 1796821
$$ packed form
16065A608582L94725N01926j62581m69909J20256R05823n67597k40991R91778
16056C082012p35109m79625l40339L72084o85894L68856R16585l43340o09921
16047A545309j68347p3793Q08757J105128m93771J43350J81486l86816j43915
16038B517388j227224m90428Q28351L0398J43592j86644J70226l4839n69860P18327
16028A899287N73808M80080m10049J45251J52042r83556K98255M15549J13487
16019B684154m15886M42658L00909j227912L75444M29627o31703O14102R5964
16010B667357n47200k07147j04467O20039m2907J5171M31117M0064m05966k57242
16000B208819J04929N95807J90936p50763m3065j015535R8662J88288K5696J93047
$$ plain form
15990 1796821 1940552 2040398 2382373 1737038 1747623 1903333 2201259 2228552 1864528 1911181
15980 1911181 1981386 2209049 2410511 2759819 2073739 1725941 1653172 1766548 1448896 1337670
15970 1337670 1481999 1952074 1735710 1531057 1588203 2226386 2062569 1982706 2209561 1554284
15960 1554284 2090876 2374795 1417856 2015182 2205333 2541421 1772771 1942647 2576642
15951 2576642 1970319 2000353 1583938 1663137 1639788 2090401 2040519 2676136 2494143 2771780
15941 2771780 2771186 2520565 2145198 2406047 2908449 2032111 2109925 1492923 1514548 1798209
15931 1798209 1808619 2468461 2547508 2389164 2667406 1718324 2015318 1638171 1656336 2336773
15921 2336773 2291790 2873053 2650646 2471015 1775429 1992037 2281297 2290473 1548001 2016365
$$ packed form
15990A796821J43731R9846L41975o45335J0585J55710K97926K7293l64024M6653
15980A911181P0205K27663K01462L49308o86080l47798p2769J13376l17652j11226
15970A337670J44329M70075k16364k04653N7146O38183j63817p9863K26855o55277
15960A554284N36592K83919r56939N97326J90151L36088p68650J69876O33995
15951B576642o06323L0034m16415P9199k3349M50613m9882O35617j81993K77637
15941B771780n94k50621l75367K60849N02402q76338P7814o17002K1625K83661
15931A798209J0410O59842P9047j58344K78242r49082K96994l77147J8165O80437
15921B336773m4983N81263k22407j79631o95586K16608K89260R176p42472M68364
$$ plain form
15911 2016365 2841485 1923039 1842744 1953789 2173916 2282700 1591239 1995053 2576770 2599560
15901 2599560 2694920 2173176 2105667 1859427 2108615 1647386 1970632 2301295 2048195 1927247
15891 1927247 1863542 1734276 1531663 1945953 1606593 2232269 2772849 2709517 2217556 2044940
15881 2044940 1911423 2355663 2205844 1258042 1086539 1401836 1281280 907897 1240811
15872 1240811 2124342 2513755 2383940 2090385 1445584 1351145 2284024 2206573 2523417 2472324
15862 2472324 2709428 2233675 2037816 1853191 1713420 2297772 2168341 2093167 1978931 2144065
15852 2144065 1463128 1558588 2306573 2077864 1969170 2564792 2919893 2045482 1719534 1796232
15842 1796232 2201496 2352715 2072352 1261513 1553984 2009277 1715520 1937002 2094612
$$ packed form
15911B016365Q25120r18446q0295J11045K20127J08784o91461M03814N81717K2790
15901B599560R5360n21744o7509k46240K49188m61229L23246L30663k53100j20948
15891A927247o3705j29266k02613M14290l39360O25676N40580o3332m91961j72616
15881B044940j33517M44240j49819r47802j71503L15297j20556l73383L32914
15872A240811Q83531L89413j29815k93555o44801r4439R32879p7451L16844n1093
15862B472324K37104m75753j95859j84625j39771N84352j29431p5174j14236J65134
15852B144065o80937R5460P47985k28709j08694N95622L55101q74411l25948P6698
15842A796232M05264J51219k80363q10839K92471M55293k93757K21482J57610
$$ plain form
15833 2094612 2186997 2021338 2617532 2460950 2124293 1815357 1814340 986623 1511071 1390722
15823 1390722 1545269 1936983 2253242 1784702 1528028 1748223 2322971 1715806 1921382
15814 1921382 2653405 2022504 1471236 2096373 2861715 2221188 1972251 1475678 1381263 1921110
15804 1921110 2549997 1859833 1382562 2094968 1881538 2084731 2026253 1674270 1974165 2098273
15794 2098273 2085386 2242499 2192104 2841079 2349065 1634543 1855945 2618704 2172943 1051232
15784 1051232 1221819 1501710 1710050 2540277 2753639 2369472 2342151 2457560 2492024 2740178
15774 2740178 2437285 1286627 1372016 1645014 2236148 1979028 1864988 1378061 1508801
15765 1508801 1735701 2221767 2114372 2071232 1715835 1353024 543818 1128473 1381159 1672359
$$ packed form
15833B094612R2385j65659N96194j56582l36657l08936j017q27717N24448j20349
15823A390722J54547L91714L16259m68540k56674K20195N74748o07165K05576
15814A921382P32023o30901n51268O25137P65342o40527k48937m96573r4415N39847
15804A921110O28887o90164m77271P12406k13430K03193n8478l51983K99895J24108
15794B098273j2887J57113n0395O48975m92014p14522K21402P62759m45761j121711
15784A051232J70587K79891K08340Q30227K13362l84167k7321J15409L4464K48154
15774B740178l02893j150658Q5389K72998N91134k57120j14040m86927J30740
15765A508801K26900M86066j07395m3140l55397l62811q09206N84655K52686K91200
$$ plain form
15755 1672359 1909914 1815292 2241290 2177604 2405176 2408169 1899570 2437911 3027856 1961760
15745 1961760 919697 1079750 1689094 2317011 2019521 1420242 1328905 1363811 1083044 1523694
15735 1523694 2215760 2116662 1775940 1796656 2156218 2346955 1884716 1613875 1502787 1582586
15725 1582586 2256147 2340642 3113854 2815203 2140569 1981766 2452282 2272461 2810206 2697012
15715 2697012 1828098 1863059 2273323 2346855 1979603 2450228 2431890 2365783 2450949 2394346
15705 2394346 2415303 2547770 2460806 1684111 1456978 1954999 1853361 2408853 2157112 1860594
15695 1860594 2178423 2629121 2160823 1132050 2205286 1865871 1941268 2024624 2586168
15686 2586168 2362866 2180896 2604397 2591213 2738213 2531413 2603143 2218157 1996394 1656458
$$ packed form
15755A672359K37555r4622M25998o3686K27572K993n08599N38341N89945j066096
15745A961760j042063J60053O09344O27917k97490n99279r1337L4906k80767M40650
15735A523694O92066r9098l40722K0716L59562J90737m62239k70841j11088P9799
15725A582586O73561Q4495P73212k98651o74634j58803M70516j79821N37745j13194
15715B697012q68914L4961M10264P3532l67252M70625j8338o6107Q5166n6603
15705B394346K0957J32467q6964p76695k27133M98021j01638N55492k51741k96518
15695A860594L17829M50698m68298j028773J073236l39415P5397Q3356N61544
15686B586168k23302j81970M23501j3184J47000k06800P1730l84986k21763l39936
$$ plain form
15676 1656458 1525087 2641489 3113836 1845964 2139939 2849108 2520658 2481341 2578796
15667 2578796 2959767 2678335 2807803 2751361 2556805 2676019 3135351 2731177 1659869
15658 1659869 1652066 1832479 2082745 1747934 1454397 1573951 2654874 2958768 2621090 2479267
15648 2479267 2162124 2432659 2538366 2680051 2075732 2536749 2217391 2537855 2528984 2031119
15638 2031119 2014239 2263067 2680014 2609536 2692336 2339532 2521627 1853105 2730005 2936984
15628 2936984 2485509 2053035 1789552 1586843 1411546 1384295 2083024 2156299 2592406 2180761
15618 2180761 1704902 2179848 1887702 1292693 1419210 1623888 1886066 1724746 1519539
15609 1519539 1298329 1786665 2526091 2127263 2242159 1680619 2176887 1414193 905321
$$ packed form
15676A656458j31371J116402M72347j267872K93975P09169l28450l9317R7455
15667B578796L80971k81432J29468n6442j94556J19214M59332m04174j071308
15658A659869p803J80413K50266l34811k93537J19554J080923L03894l37678j41823
15648B479267l17143K70535J05707J41685o04319M61017l19358L20464q871m97865
15638B031119j6880K48828M16947p0478Q2800l52804J82095o68522Q76900K06979
15628B936984m51475m32474k63483k02709j75297k7251O98729P3275M36107m11645
15618B180761m75859M74946k92146n95009J26517K04678K62178j61320k05207
15609A519539k21210M88336P39426l98828J14896n61540M96268p62694n08872
$$ plain form
15600 905321 1515280 2262605 2545295 2536380 1884628 634216 1660695 2057394 1756172 1399696
$$ packed form
15600I05321O09959P47325K82690q915o51752j250412J026479L96699l01222l56476
$$ [...]
##END NTUPLES=NMR SPECTRUM
##END=
