##TITLE=1H_EC-3302(22)
 CDCl3
 8 sc, 
 26.10.2023
##JCAMPDX= 6.0         $$ Bruker NMR JCAMP-DX V2.0
##DATA TYPE= NMR SPECTRUM
##DATA CLASS= NTUPLES
##ORIGIN= UXNMR, Bruker Analytische Messtechnik GmbH
##OWNER= root
$$ XWIN-NMR		Version 3.5
$$ Thu Oct 26 14:07:58 2023 Russian Standard Time (UT+4h)  she@DPX200
##.OBSERVE FREQUENCY= 200.13135
##.OBSERVE NUCLEUS= ^1H
##.ACQUISITION MODE= SIMULTANEOUS
##.ACQUISITION SCHEME= undefined
##.AVERAGES= 8
##.DIGITISER RES= 18
##SPECTROMETER/DATA SYSTEM= spect
##.PULSE SEQUENCE= zg30
##.SOLVENT NAME= CDCl3
##.SHIFT REFERENCE= (INTERNAL, CDCl3, 0, 15.7392)
##AUDIT TRAIL= $$ (NUMBER, WHEN, WHO, WHERE, WHAT)
$$ ##TITLE= Audit trail, XWIN-NMR		Version 3.5
$$ ##JCAMPDX= 5.01
$$ ##ORIGIN= Bruker BioSpin GmbH
$$ ##OWNER= she
$$ F:/spectra/data/she/nmr/H-F/1/pdata/1/auditp.txt
$$ ##AUDIT TRAIL=  $$ (NUMBER, WHEN, WHO, WHERE, WHAT)
(   1,<2023-10-26 14:06:42.39 +0400>,<she>,<DPX200>,
      <created by zg, POWCHK disabled, PULCHK disabled
       configuration hash MD5:
       00 E9 B6 7A A2 85 ED C7 34 08 36 98 17 FE 4E 26
       data hash MD5: 16K
       31 3E 60 C3 99 43 C3 C1 CE 04 14 65 20 27 89 46>)
(   2,<2023-10-26 14:06:44.70 +0400>,<she>,<DPX200>,
      <Start of raw data processing
       efp BC_mod = 2 LB = 0.24 FT_mod = 6 PKNL = 1 PHC0 = -23507.12 PHC1 = 9.652719 SI = 16K 
       data hash MD5: 16K
       15 0A ED DF 7B 08 4D 98 B1 A2 43 7A FA F8 D4 43>)
(   3,<2023-10-26 14:07:10.10 +0400>,<she>,<DPX200>,
      <pk PHC0 = 1.12728 PHC1 = -2.4 
       data hash MD5: 16K
       D9 E6 5B 3D F8 C3 14 66 5A BF B7 93 57 5A 8A E5>)
(   4,<2023-10-26 14:07:13.75 +0400>,<she>,<DPX200>,
      <abs ABSG = 5 
       data hash MD5: 16K
       FF CF FA 69 E8 C3 AA 68 50 28 02 D8 F7 43 39 D6>)
$$ ##END=
$$ 
$$ hash MD5
$$ D2 E4 9B BD D8 BA EE 83 88 8A 47 D8 72 35 82 EA
##$RELAX= 
##$RELAX= 
##$RELAX= 
##$RELAX= 
##$RELAX= 
##$RELAX= 
$$ Bruker specific parameters
$$ --------------------------
##$DU= <F:/spectra>
##$EXPNO= 1
##$NAME= <H-F>
##$PROCNO= 1
##$TYPE= <nmr>
##$USER= <she>
##$AMP= (0..31)
100 100 100 100 100 100 100 100 100 100 100 100 100 100 100 100 100 100 
100 100 100 100 100 100 100 100 100 100 100 100 100 100 
##$AQSEQ= 0
##$AQ_mod= 1
##$AUNM= <au_zg>
##$AUTOPOS= <>
##$BF1= 200.13
##$BF2= 200.13
##$BF3= 200.13
##$BF4= 200.13
##$BF5= 200.13
##$BF6= 200.13
##$BF7= 200.13
##$BF8= 200.13
##$BYTORDA= 1
##$CFDGTYP= 0
##$CFRGTYP= 5
##$CHEMSTR= <none>
##$CNST= (0..31)
1 1 145 1 1 1 1 1 1 1 1 1 1 1 1 1 1 1 1 1 1 1 1 1 1 1 1 1 1 1 1 1 
##$CPDPRG= <>
##$CPDPRG1= <>
##$CPDPRG2= <>
##$CPDPRG3= <>
##$CPDPRG4= <mlev>
##$CPDPRG5= <mlev>
##$CPDPRG6= <mlev>
##$CPDPRG7= <mlev>
##$CPDPRG8= <mlev>
##$CPDPRGB= <>
##$CPDPRGT= <>
##$D= (0..31)
0 1.2 0 0 0 0 0 0 0 0.06 0 0.03 0 0 0 0 0.0002 0 0 0 0 0 0 0 0 0 0 0 0 
0 0 0 
##$DATE= 1698314801
##$DBL= (0..7)
120 120 120 120 120 120 120 120 
##$DBP= (0..7)
150 150 150 150 150 150 150 150 
##$DBP07= 0
##$DBPNAM0= <>
##$DBPNAM1= <>
##$DBPNAM2= <>
##$DBPNAM3= <>
##$DBPNAM4= <>
$$ [...]
##$SUBNAM3= <"">
##$SUBNAM4= <"">
##$SUBNAM5= <"">
##$SUBNAM6= <"">
##$SUBNAM7= <"">
##$SUBNAM8= <"">
##$SUBNAM9= <"">
##$SW= 18.05172834244
##$SWIBOX= (0..15)
0 0 2 0 0 0 0 0 0 0 0 0 0 0 0 0 
##$SW_h= 3612.71676300578
##$TD= 16384
##$TD0= 1
##$TE= 0
##$TE2= 300
##$TE3= 300
##$TEG= 300
##$TL= (0..7)
0 120 120 120 120 120 120 120 
##$TP= (0..7)
150 150 150 150 150 150 150 150 
##$TP07= 0
##$TPNAME0= <>
##$TPNAME1= <>
##$TPNAME2= <>
##$TPNAME3= <>
##$TPNAME4= <>
##$TPNAME5= <>
##$TPNAME6= <>
##$TPNAME7= <>
##$TPOAL= (0..7)
0.5 0.5 0.5 0.5 0.5 0.5 0.5 0.5 
##$TPOFFS= (0..7)
0 0 0 0 0 0 0 0 
##$TUNHIN= 0
##$TUNHOUT= 0
##$TUNXOUT= 0
##$USERA1= <user>
##$USERA2= <user>
##$USERA3= <user>
##$USERA4= <user>
##$USERA5= <user>
##$V9= 5
##$VALIST= <valist>
##$VCLIST= <CCCCCCCCCCCCCCC>
##$VD= 0
##$VDLIST= <DDDDDDDDDDDDDDD>
##$VPLIST= <PPPPPPPPPPPPPPP>
##$VTLIST= <TTTTTTTTTTTTTTT>
##$WBST= 1024
##$WBSW= 4
##$XGAIN= (0..3)
0 0 0 0 
##$XL= 0
##$YL= 0
##$YMAX_a= 471337
##$YMIN_a= -569766
##$ZGOPTNS= <>
##$ZL1= 120
##$ZL2= 120
##$ZL3= 120
##$ZL4= 120
##$ABSF1= 15.64993
##$ABSF2= -2.401917
##$ABSG= 5
##$ABSL= 3
##$ALPHA= 0
##$AQORDER= 0
##$ASSFAC= 0
##$ASSFACI= 0
##$ASSFACX= 0
##$ASSWID= 0
##$AUNMP= <proc_1d>
##$AZFE= 0.1
##$AZFW= 0.1
##$BCFW= 0
##$BC_mod= 2
##$BYTORDP= 0
##$COROFFS= 0
##$CY= -3
##$DATMOD= 1
##$DC= 0
##$DFILT= <>
##$DTYPP= 0
##$F1P= 0
##$F2P= 0
##$FCOR= 1
##$FTSIZE= 16384
##$FT_mod= 6
##$GAMMA= 0
##$GB= 0
##$INTBC= 1
##$INTSCL= 3.70164e-10
##$ISEN= 128
##$LB= 0.24
##$LEV0= 0
##$LPBIN= 0
##$MAXI= 10000
##$MC2= 0
##$MEAN= 0
##$ME_mod= 0
##$MI= 1.114404
##$NCOEF= 0
##$NC_proc= -7
##$NLEV= 6
##$NOISF1= 3.799351
##$NOISF2= 2.8
##$NSP= 0
##$NTH_PI= 0
##$NZP= 0
##$OFFSET= 15.73918
##$PC= 1
##$PHC0= -23505.99
##$PHC1= 7.252718
##$PH_mod= 1
##$PKNL= yes
##$PPARMOD= 0
##$PSCAL= 0
##$PSIGN= 0
##$REVERSE= no
##$SF= 200.130006477595
##$SI= 16384
##$SIGF1= 3
##$SIGF2= 2
##$SINO= 5.538805
##$SIOLD= 16384
##$SREGLST= <1H.CDCl3>
##$SSB= 0
##$STSI= 16384
##$STSR= 0
##$SW_p= 3612.71676300578
##$SYMM= 0
##$S_DEV= 0
##$TDeff= 16384
##$TDoff= 0
##$TI= <>
##$TILT= no
##$TM1= 0
##$TM2= 0
##$TOPLEV= 0
##$USERP1= <user>
##$USERP2= <user>
##$USERP3= <user>
##$USERP4= <user>
##$USERP5= <user>
##$WDW= 1
##$XDIM= 16384
##$YMAX_p= 397196403
##$YMIN_p= -966961
$$ End of Bruker specific parameters
$$ ---------------------------------
##NTUPLES= NMR SPECTRUM
##VAR_NAME=  FREQUENCY,     SPECTRUM/REAL,   SPECTRUM/IMAG
##SYMBOL=    X,             R,               I
##VAR_TYPE=  INDEPENDENT,   DEPENDENT,       DEPENDENT
##VAR_FORM=  AFFN,          ASDF,            ASDF
##VAR_DIM=   16384,         16384,           16384
##UNITS=     HZ,            ARBITRARY UNITS, ARBITRARY UNITS
##FACTOR=    0.220516191357247, 1,           1
##FIRST=     3149.8821175427, 0,             0
##LAST=      -462.834645463081, 0,           0
##MIN=       -462.834645463081, -966961,     0
##MAX=       3149.8821175427, 397196403,     0
$$ Real data points
##PAGE= N=1
##DATA TABLE= (X++(R..R)), XYDATA
$$ [...]
6219E773672N1621K52898K3553K33059K57979K10102L77554K58593K57423M06116
6209H102570O80744N92281M26971K69760M67230M10456L34611K86590M87606L3732
6199A2092551J16426K40942o9552P8644J36004L50789Q05565R06558J238668J732261
6189A7628856J746892J127742M08682m15932j454148j991310j881816j593962
6181A3575004j322341q36319p64267n22162m53848m93448m59865j50699r2291
6172H479764m1391k03683j46097J42911P9877J55922J92106L08307K61819P7907
6162I307442L11159L59388N32659O72803N86446Q05614J037295J084934J447180
6153A6144920J673627J957387K244595K583103K096842J340716J40887r22958
$$ y = [5773672, 5825293, 6078191, 6101744, 6334803, 6592782, 6802884, 7180438, 7439031, 7696454, 8102570, 8783314, 9375595, 9802566, 10072326, 10539556, 10950012, 11284623, 11571213, 12058819, 12092551, 12208977, 12449919, 12380367, 12459011, 12595015, 12945804, 13751369, 14657927, 15896595, 17628856, 19375748, 20503490, 20912172, 20496240, 19042092, 17050782, 15168966, 13575004, 12252663, 11416344, 10652077, 10129915, 9676067, 9182619, 8722754, 8572055, 8479764, 8438373, 8234690, 8088593, 8231504, 8311381, 8467303, 8659409, 8967716, 9229535, 9307442, 9618601, 9977989, 10510648, 11183451, 11769897, 12575511, 13612806, 14697740, 16144920, 17818547, 19775934, 22020529, 24603632, 26700474, 28041190, 28182077, 27259119]
6145B7259119j955375k248345j854919j129709j000295q29595j20216J58898J68371
6136A8447934N99093N11455K74294l195n37911n69729p12264n85426n50998m14858
6126A6458395o58907o80648m97702n63056m13979k50561l25037k30418l12445
6117A2525642l87920l37768k94541k09832j68222k48807K01146K84065K73292
6108A1637055L76766L71079O8902j5578q2626j74839l70314k12714l02454j35378
6098A1159899j38304m1117l27486n10176n06665p68505n35996k27709m30448l47224
6088G326269l34859k06898n2402n3142p8370j47209k26749n0256N1388q0839J7605
6077F164538n4486k57529n712q8093l71981J74033j12013p9062k07048J03394
$$ y = [27259119, 25303744, 23055399, 21200480, 20070771, 19070476, 18240881, 18120665, 18279563, 18447934, 19047027, 19558482, 19832776, 19829581, 19291670, 18721941, 18009677, 17424251, 16873253, 16458395, 15799488, 15118840, 14621138, 14058082, 13644103, 13393542, 13068505, 12838087, 12525642, 12137722, 11799954, 11505413, 11295581, 11127359, 10878552, 11079698, 11363763, 11637055, 12013821, 12384900, 12453802, 12438224, 12355598, 12180759, 11810445, 11597731, 11295277, 11159899, 11021595, 10980478, 10652992, 10142816, 9636151, 8867646, 8331650, 8103941, 7673493, 7326269, 6991410, 6784512, 6732110, 6678968, 6600598, 6453389, 6226640, 6176384, 6227772, 6146933, 6164538, 6110052, 5852523, 5846811, 5758718, 5386737, 5560770, 5448757, 5369695, 5162647, 5266041]
6067E266041J47516o7515p7838k36994k3431Q1956r605j23967J41454L2370m9348
6056E080639n6719j88421J09140K16972k04681K40222J30969L5402O9614J16042
6046E549179L45322J89887J01978K48223K34468L04896L18837L81119J12344k07533
6036G578720O438j28143L0262L7185r368j17065Q5005K31951J47946M55640J39433
6025H458004J23439L93878L72995L80610K87044O42783P76342M98906L74081N76574
6015A2884656K00738K97980K8621k28004l19582j38810k33536l57052l56801m7261
6005A1730949L13203N3079P2908J86791N23824K35244M75465N50299O91956P68169
5995A5601887P32177Q62780Q17812P52671R45736M93392K57140j06510J61692
$$ y = [5266041, 5413557, 5346042, 5268204, 5031210, 5007779, 5089735, 5080130, 4956163, 5097617, 5129987, 5080639, 5023920, 4835499, 4944639, 5161611, 4956930, 5197152, 5328121, 5363523, 5433137, 5549179, 5894501, 6084388, 6186366, 6434589, 6669057, 6973953, 7292790, 7673909, 7786253, 7578720, 7585158, 7457015, 7487277, 7524462, 7515094, 7398029, 7483034, 7714985, 7862931, 8318571, 8458004, 8581443, 8975321, 9348316, 9728926, 10015970, 10658753, 11435095, 11934001, 12308082, 12884656, 13085394, 13383374, 13411995, 13183991, 12864409, 12725599, 12492063, 12135011, 11778210, 11730949, 12044152, 12097231, 12170139, 12356930, 12880754, 13115998, 13591463, 14141762, 14833718, 15601887, 16334064, 17196844, 18014656, 18767327, 19713063, 20206455, 20463595, 20357085, 20518777]
5986B0518777j4311M3391J94062R7930L45410j18841N1925p273J97126M47575
5976B1755771O58449N60187N88837R73140Q34700Q80601J034449N35631P85526
5967B8607291P20817Q10355P83858J062607R02015Q20984R90392R64972R41614
5958C6604905O69104M2168k71518l73598k40460J50570P06787J174053J804522
5949D0266533K416230K849971L166138K958510K360962J814271Q12102j35318
5941E6509399o13381j224678j689024j994688j979383k049853k376733k077229
5933D2504430k096003k376198k170205k066683j717508j617066j246818q59641
5925B8354308r05027r70682j318419j282596j071839r99604m24832m38075m37841
$$ y = [20518777, 20504466, 20547857, 20741919, 20839849, 21185259, 21066418, 21118343, 21111070, 21308196, 21755771, 22414220, 22974407, 23563244, 24536384, 25371084, 26251685, 27286134, 27821765, 28607291, 29328108, 30138463, 30922321, 31984928, 32886943, 33707927, 34698319, 35663291, 36604905, 37274009, 37316177, 37044659, 36671061, 36430601, 36581171, 37287958, 38462011, 40266533, 42682763, 45532734, 48698872, 51657382, 54018344, 55832615, 56644717, 56509399, 55896018, 54671340, 52982316, 50987628, 49008245, 46958392, 44581659, 42504430, 40408427, 38032229, 35862024, 33795341, 32077833, 30460767, 29213949, 28354308, 27449281, 26478599, 25160180, 23877584, 22805745, 21806141, 21381309, 20943234, 20505393]
5916B0505393j07787K99337M09456O07582Q63148P20017J240235J763864J508286
5907B7809531R76157j85468j092731j469509j319115j151020r55176p97106n90236
5898B1225327m49299m11540l45878K22113K92571M15266R05506J228919J590642
5889B4673627J718981J883963J351327N72629q64822k280967k557097k260428
5881B2237213j980771j666871j017471q93859q52614m65154k53781q5861j13j46373
5871A4874345j05510J76467L78523J58940j70514j89130Q6467k76049p8070J00445
5861A4955914P6336N2559K48633K02838K04786N70322N22655K89560j92601o00173
5851A6330829j212703j283344j053882j057057q61869m24459m18428k50544j73590
$$ y = [20505393, 20397606, 20696943, 21106399, 21713981, 22577129, 23297146, 24537381, 26301245, 27809531, 28785688, 28600220, 27507489, 26037980, 24718865, 23567845, 22612669, 21815563, 21225327, 20776028, 20364488, 20018610, 20240723, 20533294, 20948560, 21854066, 23082985, 24673627, 26392608, 28276571, 29627898, 30200527, 29335705, 27054738, 24497641, 22237213, 20256442, 18589571, 17572100, 16678241, 15825627, 15360473, 15106692, 15020831, 15020718, 14874345, 14768835, 14945302, 15323825, 15482765, 15312251, 15123121, 15209588, 14933539, 14855469, 14955914, 15032250, 15084809, 15333442, 15536280, 15741066, 16311388, 16834043, 17123603, 16931002, 16330829, 15118126, 13834782, 12780900, 11723843, 10861974, 10437515, 10019087, 9768543, 9594953]
5842I594953n29841p9999J6901k68590N6408K08627n0535p2630P0011k9296j74944
5831H741065l29486j19914l93256j91733j99102p2617l0167j63281q873p3627
5821G159009k80237k67454K8681O9983J23582J08718J34595M1610L9643J44937
5811G303067J49702M3807o2158j7846m5131n7427R6534K57295J75993L00174K77439
5800H421449m6683J27115n2218N9888J09870k7929J47286K89864j34913k69611
5790H624118j47868m74597j12454J02545k9270P9643J75995K31611O66436N36264
5780I652423L13731O9256j62288m52205j16738j10609l94097l91284k79217o9594
5770H059378o5219n4746n0246K1262J40219L7346J990j21920J30484L83985J81136
$$ y = [9594953, 9065112, 8985113, 9002014, 8733424, 8789832, 8998459, 8947924, 8875294, 8945305, 8916009, 8741065, 8411579, 8291665, 7898409, 7706676, 7507574, 7434957, 7404790, 7241509, 7232636, 7159009, 6878772, 6611318, 6639999, 6709982, 6833564, 6942282, 7076877, 7118487, 7158130, 7303067, 7452769, 7496576, 7434418, 7416572, 7371441, 7314014, 7410548, 7667843, 7843836, 8144010, 8421449, 8374766, 8501881, 8449663, 8509551, 8619421, 8591492, 8738778, 9028642, 8893729, 8624118, 8476250, 8001653, 7889199, 7991744, 7962474, 8042117, 8218112, 8449723, 9116159, 9652423, 9966154, 10035410, 9873122, 9420917, 9304179, 9193570, 8799473, 8408189, 8128972, 8059378, 7994159, 7939413, 7889167, 7910429, 8050648, 8087994, 8089984, 7968064, 8098548, 8482533, 8663669]
5759H663669J98788L31796N64365M64388N53333K38173j15559j50699j70064k41562
5749A0336628j51149M2747j43279k6035O3771j57803p754j32973K36529q2607
5739I978075l8750L15488J71580j50860R8907J85051K56363K91898M31878L92366
5729A1931996L65966K42018K51084M79882M71625O52065P89037P37202Q20111
5720A6740986J075345J247716J262567J511676K037687K348775K572563K712301
5712C1509616K758301J712539K50969r69032j735918k060327j973295j402509
5704B8090344r78226n98405O2278M33839P98563R10924J185702J830409K577211
5695C4312639K756772L346500L157249K678794J413335M72052q3530j54255P4802
$$ y = [8663669, 8862457, 9194253, 9758618, 10223006, 10776339, 11014512, 10898953, 10748254, 10578190, 10336628, 10185479, 10228226, 10084947, 10058912, 10122683, 9964880, 9957126, 9824153, 10060682, 9978075, 9939325, 10254813, 10426393, 10275533, 10374440, 10559491, 10815854, 11107752, 11539630, 11931996, 12297962, 12539980, 12791064, 13270946, 13742571, 14394636, 15183673, 15920875, 16740986, 17816331, 19064047, 20326614, 21838290, 23875977, 26224752, 28797315, 31509616, 34267917, 35980456, 36231425, 35262393, 33526475, 31466148, 29492853, 28090344, 27112118, 26513713, 26575991, 27009830, 27808393, 28719317, 29905019, 31735428, 34312639, 37069411, 40415911, 43573160, 46251954, 47665289, 48137341, 48053811, 47899556, 47974358]
5686D7974358k99039j343576k248911k944195l495385l171546k446167k003872
5678C0021667j638985j080645p43941m68835P5331O33125P68686J407135J800995
5669C0774533K158612K105393J006714l27135j728504l084172l520270l097962
5661B4287209k590765k021341j598618j435013j088622j041542p25809q04509
5653A2980990o54383o84364m52339l27892k98105m37042m55037l94321k17407
5644I060100j40427l7238q5419j42335q5630k11620k90100l3469J14628o1049
5634H087441J53511p0487l6286p3040N0958M325K20237J96469J78550M97511K08787
5623I417976M8909j18063j78336n11355n31166j58027k56291r3722k05791j32592
$$ y = [47974358, 47675319, 46331743, 44082832, 41138637, 37643252, 34471706, 32025539, 30021667, 28382682, 27302037, 26558096, 26089261, 26164592, 26797717, 27566403, 28973538, 30774533, 32933145, 35038538, 36045252, 35718117, 33989613, 30905441, 27385171, 24287209, 21696444, 19675103, 18076485, 16641472, 15552850, 14511308, 13785499, 12980990, 12326607, 11642243, 11189904, 10862012, 10563907, 10126865, 9671828, 9277507, 9060100, 8919673, 8882435, 8797016, 8654681, 8569051, 8357431, 8067331, 8033862, 8148490, 8087441, 8240952, 8170465, 8134179, 8061139, 8112097, 8116422, 8336659, 8533128, 8711678, 9209189, 9417976, 9466885, 9348822, 9170486, 8659131, 8127965, 7969938, 7713647, 7619925, 7414134, 7281542]
5613G281542q0341L6976k00682j93283R9351L23177n9404L557J81465J51954K33297
5602G777609K82222M20343M80614J47065q7222k73040k90883n06954n38777l03322
5592G107655j44700j45779j58643j58897r8168p086j379L4442j19072o3795m3567
5581F201011j2502j89589j87046p8645O6721k9178j0534j72122j89050K4102l7967
5570E385201J13873N5165k00666P0125J25333J62340j20646j72817K38486K11582
5560E867976j6137j2060j34292K57530r7592n1347J64546J21761J32674J82314
5550F415373M5958J71908K10239J96247M68290M19889M11466N06328L14781l59039
5540H801440n84234o62138l91157k29726l7662j0159j93372j73017J39191O3136
$$ y = [7281542, 7201201, 7238177, 7037495, 6844212, 6943563, 7266740, 7207336, 7210893, 7392358, 7544312, 7777609, 8059831, 8480174, 8960788, 9107853, 9020631, 8747591, 8456708, 7949754, 7410977, 7107655, 6962955, 6817176, 6658533, 6499636, 6401468, 6394382, 6393003, 6427445, 6308373, 6244578, 6201011, 6188509, 5998920, 5811874, 5733229, 5799950, 5770772, 5760238, 5588116, 5399066, 5423168, 5385201, 5499074, 5554239, 5353573, 5423698, 5549031, 5711371, 5590725, 5417908, 5656394, 5867976, 5851839, 5839779, 5705487, 5963017, 5865425, 5814078, 5978624, 6100385, 6233059, 6415373, 6461331, 6633239, 6843478, 7039725, 7508015, 7927904, 8339370, 8845698, 9160479, 8801440, 8217206, 7555068, 7163911, 6934185, 6896523, 6886364, 6692992, 6519975, 6659166, 6722302]
5530F722302k5530J60723R5493J09014q8572Q4207J4661k5801J85773P2431N7943
5519G362644P3635k3839M36515K81244K46041l605l71048O9066L06639n0924p0558
5508H255810R4500K90259J20293K1126K09475M98745L37889M80702M31916N50688
5498A1291403N75648N43817P99135O71816O21942Q42975J208492J148891Q01272
5489A8505391O66418K76865k5287l27651m75190n70206p95015o40637p76275p14144
5479A5124269p64098m94351n22944l37028l25776l48905k23052J0066o1187J5107
5469A2072101K5810K4636r7263J06881J68017J29456J18369L61672K02027o1622
5459A3050084J66166K25766J75098J27144L67334L84853K41007M77756N83455
$$ y = [6722302, 6696772, 6857495, 6952988, 7062002, 6973430, 7057637, 7072298, 7046497, 7232270, 7304701, 7362644, 7436279, 7412440, 7848955, 8130199, 8376240, 8372635, 8001587, 8070653, 8377292, 8326368, 8255810, 8350310, 8640569, 8760862, 8781988, 8991463, 9490208, 9828097, 10308799, 10740715, 11291403, 11867051, 12410868, 13210003, 13881819, 14503761, 15346736, 16555228, 17704119, 18505391, 19171809, 19448674, 19423387, 19095736, 18620546, 18050340, 17255325, 16614688, 15838413, 15124269, 14360171, 13865820, 13342876, 13005848, 12680072, 12331167, 12108115, 12118181, 12056994, 12072101, 12097911, 12122547, 12025284, 12132165, 12300182, 12429638, 12548007, 12909679, 13111706, 13050084, 13216250, 13442016, 13617114, 13744258, 14111592, 14496445, 14737452, 15215208, 15798663]
5450A5798663P17016N89080P00820K11936O12982R07988J255443R08717Q09656
5441B2512301J018162J192738J207611J298150J308861J551311J723196J858245
5433C3670575J953860J871198K138414K037324J687995J246885Q78365J85862
5425D5670478l33030q38254j418730j621865j373380j605317j469168j649120
5417C5361614j543125j202096j127899q05825n48728m66378j47477m1662M2082
5408B9520506K85396L80562L61488J89212L12226L79299N11369O68929P47271
5399C3356258R87761J057457J273738J344974J409249J864632K266334K307036
5391D5867439K732025L326331L438355M189252M591480M595743N027243N221937
$$ y = [15798663, 16515679, 17104759, 17805579, 18017515, 18630497, 19538485, 20793928, 21702645, 22512301, 23530463, 24723201, 25930812, 27228962, 28537823, 30089134, 31812330, 33670575, 35624435, 37495633, 39634047, 41671371, 43359366, 44606251, 45484616, 45670478, 45337448, 44499194, 43080464, 41458599, 40085219, 38479902, 37010734, 35361614, 33818489, 32616393, 31488494, 30682669, 30133941, 29667563, 29520086, 29478424, 29520506, 29805902, 30186464, 30547952, 30737164, 31049390, 31428689, 31940058, 32608987, 33356258, 34344019, 35401476, 36675214, 38020188, 39429437, 41294069, 43560403, 45867439, 48599464, 51925795, 55364150, 59553402, 64144882, 68740625, 73767868, 78989805]
5383G8989805N557689O004912N740037N465355M777174L636231K891337K045259
5375A15107799J832099J162706O21897l35222j273796k196322l159626l665540
5367A08093995m098701m365735m129272m459675m510539m853214m613321m349612
5359G2713926m039422l562331k764269k043221j607300j310277o45443n34139
5351E6207524m35362j26034R9952p7139l43732n47851r27599j027394j410723
5342E1411642k177353k203576k017582j906064k085843k015509k322748k075131
5334C4607836k047197k378526j843997j838812j424262j346522r96307j120257
5326B1611956r52347q56462m83693m72575o29730m55592l14852m01476k13281
$$ y = [78989805, 84547494, 90552406, 96292443, 101757798, 106534972, 110171203, 113062540, 115107799, 116939898, 118102604, 118724501, 118389279, 117115483, 114919161, 111759535, 108093995, 103995294, 99629559, 95500287, 91040612, 86530073, 81676859, 77063538, 72713926, 68674504, 65112173, 62347904, 60304683, 58697383, 57387106, 56741663, 56207524, 55772162, 55646128, 55746080, 55668941, 55325209, 54777358, 53849759, 52822365, 51411642, 49234289, 47030713, 45013131, 43107067, 41021224, 39005715, 36682967, 34607836, 32560639, 30182113, 28338116, 26499304, 25075042, 23728520, 22732213, 21611956, 20659609, 19803147, 19319454, 18846879, 18217149, 17761557, 17446705, 17045229, 16831948]
5317A6831948o7002K56961j5701j81264P1747K2559M5361k1137j50054l4399m26166
5306A6332853j93074O6038k75193J182K3239Q2154Q540J44489L93082K40369J56709
5295A6980388L74332N44768M12991K42542M09664K66138J76687K48376K86312
5286A9942198J91723L44033R325m881l32808n96097p56461n79777o31022m85755
5276A7100478p95032p74995n60438p90217n48956m30422k18814J5814M2273l13056
5266A2726635p06428p66928n24578l76432l70862r4486J66939M2693J61392q828
5256A0249117M5970j05195J07636j76680l55973m38012M4073p598j28402k41288
5246H993648J6776o45748k47531l60369l39475m08496k65103j74585j95210m0642
$$ y = [16831948, 16764946, 17021907, 17006206, 16824942, 16896689, 16919248, 16964609, 16943472, 16793418, 16759019, 16332853, 16139779, 16205817, 15930624, 15931806, 15955045, 16037199, 16045739, 16190228, 16583310, 16823679, 16980388, 17354720, 17899488, 18312479, 18555021, 18964685, 19230823, 19407510, 19655886, 19942198, 20133921, 20477954, 20487279, 20482398, 20149590, 19553493, 18797032, 18217255, 17586233, 17100478, 16305446, 15530451, 14970013, 14179796, 13630840, 13200418, 12981604, 12997418, 13039691, 12726635, 12020207, 11253279, 10728701, 10352269, 9981407, 9886921, 10053860, 10096553, 10257945, 10249117, 10295087, 10189892, 10297528, 10120848, 9764875, 9326863, 9370936, 9363338, 9234936, 8993648, 9010424, 8364676, 8117145, 7756776, 7417301, 7008805, 6743702, 6569117, 6373907, 6333265]
5236F333265j97434N4050J05709N3040r3322o8630L20741K9406O417K5543l3219
5225F535566l13420k8274K3623r4511J81278r7645K33345M23662K42497K2602
5215G128723k49378k05094k20301k93592k58468l27908J6154m9284j5704j55589
5205E369559P4349k25956P9421j02682j52886j38953r6990J6272j52362k71939
5195D397833o8920r796J03035j9121j74644j91961n7091K57493K37710o4584L2214
5184D442168j18728J19989L65201j25079q8967N126m9935R445j42102r5084J35142
5173D457176q2670n3424m9718q7456n2212r1533J44947m1759k58351P7085j07758
5162C854327J9763J92166k35125l7742P4587M2929k05332n286j86254k03M6298
$$ y = [6333265, 6135831, 6189881, 6295590, 6348630, 6255308, 6186678, 6507419, 6536825, 6543242, 6568785, 6535566, 6222146, 6193872, 6217495, 6122984, 6304262, 6206617, 6439962, 6863624, 7106121, 7128723, 6879345, 6674251, 6453950, 6160358, 5901890, 5573982, 5590136, 5540852, 5525148, 5369559, 5443908, 5217952, 5297373, 5194691, 5041805, 4902852, 4805862, 4822134, 4669772, 4397833, 4328913, 4319117, 4422152, 4403031, 4228387, 4036426, 3979335, 4236828, 4474538, 4409954, 4442168, 4323440, 4443429, 4808630, 4683551, 4594584, 4599710, 4549775, 4559220, 4417118, 4322034, 4457176, 4374506, 4321082, 4271364, 4183908, 4131696, 4040163, 4185110, 4143351, 3885000, 3962085, 3854327, 3874090, 4066256, 3831131, 3793389, 3867976, 3910905, 3705573, 3700287, 3514033, 3513830, 3560128]
5151C560128n6035J02027o5565o9113J03480R2616p4690j75943o6114J29610j59464
5140C320937o8697J04301O8355J1654K7937L01113j31602k2086k948J18934K18301
5129C946199R0520k0856L7218j75810l05454K27683L12378J98418J50814r6347
5119D364763L1950j40485q7999j23697q1165L3761p5316M7828L1682J20063j76613
5108C944772j61982K43446P0173j38998k10251L5469J69593J58479m0772j17532
5098C952397K00235m0998j32959j05549J10824O7408P8489j37268K51593J59218
5088D403390R6932L4467R4728J64309J58639K03625J18164j00221K37588J26094
5078E537715J29920L9332J71555J32598k95605k58798k53018J04407J9600O5019
$$ y = [3560128, 3504093, 3606120, 3540555, 3471442, 3574922, 3667538, 3592848, 3416905, 3350791, 3480401, 3320937, 3252240, 3356541, 3424896, 3436550, 3464487, 3765600, 3633998, 3611912, 3608964, 3727898, 3946199, 4036719, 4015863, 4053081, 3877271, 3571817, 3799500, 4111878, 4310296, 4461110, 4364763, 4396713, 4256228, 4168229, 4044532, 3963367, 3997128, 3921812, 3969640, 4001322, 4121385, 3944772, 3782790, 4026236, 4096409, 3957411, 3747160, 3782629, 3952222, 4110701, 4069929, 3952397, 4152632, 4111634, 3978675, 3873126, 3983950, 4051358, 4129847, 3992579, 4244172, 4403390, 4500322, 4534789, 4629517, 4793826, 4952465, 5156090, 5274254, 5174033, 5411621, 5537715, 5667635, 5706967, 5878522, 6011120, 5715515, 5456717, 5203699, 5308106, 5327706, 5392725]
5068E392725k2686R568l1053n296N1218j86225p5469J89255J32069m4414J76161
5057E585853Q9489M1452J46274r3776r2614q9317J38742R5517r2130J8740K626
5046E750856j92334k84389K20123J14638K41888N3430j0864N8718j12769J30580
5036E969877k1638J25734j9490j29424J26900l4298j87587P6224J49208J2839
5026F068345J21672M1474J6160K62151K81120J16820J98260K26677K83612o0842
5016G555449o1328j20677N2485l31860m36317N8379j78518L1727J15031j99827
5006F484544k13798j48244l3889Q6677J79157o356k06076j35630J20344J4023
4996F140752j65973R2583J10023K1624J02392m0055j64958N5567j34133J16475
$$ y = [5392725, 5370039, 5379607, 5348554, 5343258, 5394476, 5208251, 5132782, 5322037, 5454106, 5409692, 5585853, 5675342, 5716794, 5863068, 5769292, 5676678, 5587361, 5726103, 5821620, 5729490, 5748230, 5750856, 5558522, 5274133, 5494256, 5608894, 5850782, 5904212, 5893348, 5952066, 5839297, 5969877, 5948239, 6073973, 6054483, 5925059, 6051959, 6017661, 5830074, 5906298, 6055506, 6068345, 6190017, 6231491, 6247651, 6509802, 6790922, 6907742, 7106002, 7332679, 7616291, 7555449, 7494121, 7373444, 7425929, 7094069, 6657752, 6716131, 6537613, 6569340, 6684371, 6484544, 6270746, 6122502, 6088613, 6175290, 6354447, 6348091, 6142015, 6006385, 6126729, 6140752, 5974779, 6067362, 6177385, 6199009, 6301401, 6261346, 6096388, 6151955, 6017822, 6134297]
4986F134297L15636J7927r4180K82238K07829J26798k5839j42801P5119k24916
4976F672108J06641J01128l0114j34028O0854q0021j80324J46345j8266j30433
4966F513890k3199K46613Q8211r9845j01556J13639R6691R1577n0229r4743K00222
4955F981271J57748j57384k4144L25590K17327K5297J84889J45247J84314J48987
4945H189142K56169j49668O3499l407k64453j13092Q3345J78981o3167o4424p9137
4934H033788J77942q0924j30774Q6835j13585K88775K70059K61049j9180n2533
4924H721452l8359j13681j08368J52883J9472J5056j02791M8940J73215P3723
4914H841542r5200n8051O1608J26061J59388J39405M368K208L15639O6141J74535
$$ y = [6134297, 6449933, 6467860, 6373680, 6655918, 6863747, 6990545, 6964706, 6821905, 6897024, 6672108, 6778749, 6879877, 6849763, 6715735, 6776589, 6696568, 6516244, 6662589, 6644323, 6513890, 6490691, 6737304, 6825515, 6725670, 6624114, 6737753, 6834444, 6926021, 6875792, 6781049, 6981271, 7139019, 6981635, 6957491, 7283081, 7500408, 7525705, 7710594, 7855841, 8040155, 8189142, 8445311, 8295643, 8359142, 8355735, 8091282, 7978190, 8061535, 8240516, 8177349, 8112925, 8033788, 8211730, 8130806, 8000032, 8086867, 7973282, 8262057, 8532116, 8793165, 8773985, 8721452, 8683093, 8569412, 8461044, 8613927, 8633399, 8648455, 8545664, 8594604, 8767819, 8841542, 8746342, 8688291, 8749899, 8875960, 9035348, 9174753, 9179121, 9181329, 9496968, 9563109, 9737644]
4903I737644Q6620P313j59965R4744K16402k2075M0166p2592k7555J32384K02037
4892A0235123P3712K03281K58422J20921M45507J13086J78004J8247K48793K32900
4882A2127996J56212J46854N517J52521M4099P8423k13061O3367K18078K88393
4872A3068399J01563L65003K69329p4997J79978J33719L60368K44879Q2236J78019
4862A4908496L75804J1050K04346Q2917L14147M25737K05705L05525L81819K70746
4852A7486292L65773N87405J64404J91773L43763K94182K01029K82007K73377
4843B0190005K80711L30035L82999M76610N28193N09691M42453M05837L27769
4834B3874303J84829J52193L10908J04799K67441K68112J72557L50858L09715
$$ y = [9737644, 9824264, 9831577, 9671612, 9766356, 9982758, 9960683, 10000849, 9928257, 9900702, 10033086, 10235123, 10308835, 10512116, 10770538, 10891459, 11336966, 11450052, 11628056, 11646303, 11895096, 12127996, 12284208, 12431062, 12436579, 12589100, 12633199, 12711622, 12498561, 12561928, 12780006, 13068399, 13169962, 13534965, 13804294, 13729297, 13909275, 14042994, 14403362, 14648241, 14730477, 14908496, 15284300, 15295350, 15499696, 15582613, 15896760, 16322497, 16528202, 16833727, 17215546, 17486292, 17852065, 18439470, 18603874, 18795647, 19139410, 19433592, 19634621, 19916628, 20190005, 20470716, 20800751, 21183750, 21660360, 22188553, 22698244, 23140697, 23546534, 23874303, 24059132, 24211325, 24522233, 24627032, 24894473, 25162585, 25335142, 25686000, 25995715]
4825B5995715O06934N27223O55355P17747M42036M45315P11323Q86622N57843
4816C1546113Q20091O64088O45360O96738P19768R61264Q68764R67901Q66947
4807C8757034Q75517J066905J212804J438968J447516J346681J208778J436268
4799D8790471J596570J487406J473464J495435J477811J367378J693704J818388
4791F1200627J413005J621644J626477J791888J630912J690947J978899J922997
4783G4877396K448093K948706L572115M094255N186120N924785O774379P945216
4775A13771065R258786J0944696J3499356J8128247K4553948L2944263L9372457
4768B62472818L7135450K0493289j770125k3214732l6587089l5478553k7382611
$$ y = [25995715, 26602649, 27129872, 27785227, 28502974, 28945010, 29390325, 30101648, 30988270, 31546113, 32366204, 33030292, 33675652, 34372390, 35092158, 36053422, 36922186, 37890087, 38757034, 39632551, 40699456, 41912260, 43351228, 44798744, 46145425, 47354203, 48790471, 50387041, 51874447, 53347911, 54843346, 56321157, 57688535, 59382239, 61200627, 62613632, 64235276, 65861753, 67653641, 69284553, 70975500, 72954399, 74877396, 77325489, 80274195, 83846310, 87940565, 93126685, 99051470, 105825849, 113771065, 123029851, 133974547, 147473903, 165602150, 190156098, 223100361, 262472818, 299608268, 320101557, 318331432, 295116700, 258529611, 223051058, 195668447]
4761A95668447j8745052j2662621q481394n705577l951488k701494j621557r00093
4753A40899171M05596R00792J536641J971375J869403J914606J581377J287099
4745A52366060J122294O09390M00196L48347M45998N89440P03731R66958J175149
4736A58727563J097847J185245J086137R03798N34389K03307k69975o66104j173897
4727A61628310j626297j342028q09394k45024K7357Q18650J893458K715900L366790
4718A66427722M108350N347613O480015P761212J0070872J2887519J6585881K1320712
4710B50989896K7607635L3641686L1508050J7914570K610581r394450k4268322
4703C30609646l5765524l5845302k8283790k0177225j4695286j1126892q843253
$$ y = [195668447, 176923395, 164260774, 155779380, 150073803, 146122315, 143420821, 141799264, 140899171, 141304767, 142205559, 143742200, 145713575, 147582978, 149497584, 151078961, 152366060, 153488354, 154097744, 154497940, 154846287, 155292285, 155881725, 156585456, 157552414, 158727563, 159825410, 161010655, 162096792, 163000590, 163534979, 163738286, 163468311, 162802207, 161628310, 160002013, 158659985, 157850591, 157605567, 157632924, 158451574, 160345032, 163060932, 166427722, 170536072, 175883685, 182363700, 190124912, 200195784, 213083303, 229669184, 250989896, 278597531, 312239217, 343747267, 361661837, 364272418, 354877968, 330609646, 294844122, 258998820, 230715030, 210537805, 195842519, 184715627, 175872374]
4696A75872374p037170n360942l874369k869123j929797p20661L55645R70217
4688A55406174J665941K057003J827227J272440P69692N2465p09668j752389k238917
4679A58349968k860827l546243m269464m545333m203334m081058l501196k935626
4671A28406887k818409k489618k739093l017605l572548m419200m490140m501957
4663A00358317m311312m037816l676578l497890k717490k517198j848851j525070
4655G6226112j119734p76564q68350j277474j258626j504997j961437j920129
4647F5538801j984296j734648j625918j392633j270593r08202n97967n89950n41422
4638E4893172m97710q05538p33027q19614p63854q22174q31512o24990n03897
$$ y = [175872374, 168835204, 163474262, 159599893, 156730770, 154800973, 154080312, 154435957, 155406174, 157072115, 159129118, 160956345, 162228785, 162998477, 163050942, 162341274, 160588885, 158349968, 155489141, 151942898, 147673434, 143128101, 138924767, 134843709, 131342513, 128406887, 125588478, 123098860, 120359767, 117342162, 113769614, 109350414, 104860274, 100358317, 96047005, 92009189, 88332611, 84834721, 82117231, 79600033, 77751182, 76226112, 75106378, 74329814, 73461464, 72183990, 70925364, 69420367, 67458930, 65538801, 63554505, 61819857, 60193939, 58801306, 57530713, 56622511, 56024544, 55434594, 54893172, 54395462, 53589924, 52856897, 52037283, 51273429, 50451255, 49619743, 48994753, 48490856]
4629D8490856q50273q85623p02891p55054r68903j061236j362687j236000j131681
4620C9536508r68457n51636m71050n07137k62791l15559j99788N8322N545j420
4610C6322537K03800K73559K71980J70691j28495m20130l05404k60197o45131
4601C5483210o29047l32010k30174p12973p32531n70651m36106n56794k86102
4592C0996822p0865K73043J50542K07412M03286O86706R70104O82371Q65390M03596
4582C5568407J09619m82750m39503o05702q25601r81949j139103q45314r62740
4573B9395364q83175p96941l38849j57822j15178o0803N1581l6571J77105M69573
4563B7704284N63174M04518L80010J8714p6247n53459j215314r91483j042345
$$ y = [48490856, 47640583, 46754960, 46052069, 45297015, 44328112, 43266876, 41904189, 40668189, 39536508, 38568051, 38016415, 37545365, 37038228, 36775437, 36459878, 36260090, 36318412, 36323957, 36322537, 36526337, 36799896, 37071876, 37242567, 37114072, 36693942, 36388538, 36128341, 35483210, 34854163, 34522153, 34291979, 33579006, 32846475, 32275824, 31839718, 31282924, 30996822, 30925957, 31199000, 31349542, 31556954, 31960240, 32646946, 33617050, 34299421, 35164811, 35568407, 35678026, 35195276, 34755773, 34150071, 33324470, 32342521, 31203418, 30358104, 29395364, 28512189, 27715248, 27376399, 27218577, 27103399, 27042596, 27094177, 27057606, 27234711, 27704284, 28267458, 28671976, 29051986, 29070700, 28994453, 28440994, 27225680, 26234197, 25191852]
4554B5191852j195429j044415r81841q69209q20032p39411l50599n40929l28791
4545A8321196j61899j78264l72603k85274j57980j97727N3444j14872k50304q1796
4535A6573921k68016r9038k30603k87058r3050J22103j05739l17942J59442N1283
4525A5505303j80404J1551N6291r9948j34098J55804m93k7691J00516o1720o0512
4514A5264599P8375O2867l0074K35027P5052K04502R2519J91499L54922J95398
4504A6724686L30829k8238J41773L29058j0651J58096K33151J65944J3765J83071
4494A8241484L90039N3490K85534M51305L13553L63746M61933J25927L12212N27060
4484B1526283L42598K97730K70493L68016N60399N75038L73875N55091M95628
$$ y = [25191852, 23996423, 22952008, 21970167, 21100958, 20280926, 19541515, 19190916, 18649987, 18321196, 18159297, 17981033, 17608430, 17323156, 17165176, 16967449, 17020893, 16906021, 16655717, 16573921, 16305905, 16206867, 15976264, 15689206, 15596156, 15718259, 15612520, 15294578, 15454020, 15505303, 15324899, 15336450, 15392741, 15292793, 15158695, 15314499, 15314006, 15286315, 15386831, 15325111, 15264599, 15342974, 15405841, 15375767, 15610794, 15685846, 15890348, 15982867, 16174366, 16529288, 16724686, 17055515, 17027277, 17169050, 17498108, 17487457, 17645553, 17878704, 18044648, 18058413, 18241484, 18631523, 18685013, 18970547, 19421852, 19735405, 20099151, 20561084, 20687011, 20999223, 21526283, 21868881, 22166611, 22437104, 22805120, 23365519, 23940557, 24314432, 24869523, 25365151]
4475B5365151L13985L69484M83632N24069N76397O18523P08837N30371M91307
4466B9981756R58870R86585R10897J440289J400585J807751K423700K889693K560875
4457D5361001M86874p45649o88562j60845L16019L69828O18588O78105J025448
4448D7260807J120455J113274J401288J526459J561314J863964J878463K053655
4440E9779679K210258K438541K762860L151919L427657L774212M271506N212666
4432H7029298N630221O489743P310172Q342524J0045382J1770518J4109845J7391752
4424A68119455K1284195K5526570L0070814L2141383K8065217J6338364L215029
4417C24761027m252289l784747K193880P109560N622779l895115j6531490k5272645
$$ y = [25365151, 25679136, 26048620, 26532252, 27056321, 27632718, 28251241, 28960078, 29490449, 29981756, 30940626, 31927211, 32838108, 34278397, 35678982, 37486733, 39910433, 42800126, 45361001, 45847875, 45102226, 44413664, 44252819, 44568838, 44938666, 45557254, 46235359, 47260807, 48381262, 49494536, 50895824, 52422283, 53983597, 55847561, 57726024, 59779679, 61989937, 64428478, 67191338, 70343257, 73770914, 77545126, 81816632, 87029298, 92659519, 99149262, 106459434, 114801958, 124847340, 136617858, 150727703, 168119455, 189403650, 214930220, 245001034, 277142417, 305207634, 321545998, 324761027, 320508738, 316723991, 318917871, 326027431, 331650210, 327755095, 311223605, 285950960]
4409B85950960k6823073k4113410k1053249j8659653j7609453j6879548j5471362
4402A45341212j3712115j1642138j0042591q771680p450929o883239o425875n430224
4394G4982421m988192m231103l573056l594241l230891k615158k405794k748144
4386D7595842k325931k038941k006605j638569j404151j445252j209974j374968
4378C4151451r27900j073051j026314j071592p26203r31406q41982r29090n86087
4369B6037826m91829p28184n52210p23460p83028m89100o91948l90208m00662
4360B0787197n05468n06100o89342n26519m05133k15017l15818l99741l99699
4351A6824360l40474l25603q2958k89796k93852j27873j54282l60173o3287k70887
$$ y = [285950960, 259127887, 235014477, 213961228, 195301575, 177692122, 160812574, 145341212, 131629097, 119986959, 109944368, 101172688, 93721759, 86838520, 80412645, 74982421, 69994229, 65763126, 62190070, 58595829, 55364938, 52749780, 50343986, 47595842, 45269911, 43230970, 41224365, 39585796, 38181645, 36736393, 35526419, 34151451, 33223551, 32150500, 31124186, 30052594, 29326391, 28394985, 27553003, 26623913, 26037826, 25545997, 24817813, 24265603, 23542143, 22759115, 22270015, 21578067, 21187859, 20787197, 20281729, 19775629, 19086287, 18559768, 18154635, 17939618, 17623800, 17224059, 16824360, 16483886, 16158283, 16075325, 15785529, 15491677, 15363804, 15209522, 14849349, 14786062, 14515175]
4341A4515175q5449l23626j57463n2118r3623k34400j17711K3274k28948k46186
4331A2998925j56071l03269p0062l2992k60286k8121N878j09207l06259j04892
4321A1633644k48972q7941k6556n736l4034j33977j61953J1223O762Q3357j22893
4310A0912924p569L1098j19339N2115J28726j63091p6273J06538L7623K06913
4300A1109665j59007n0570K8595L9542J25029l2413R8190J91916K166r2564J07833
4289A1368382p1973p134L4620k5107j5440q6072K40542l66k83189J55193M304
4278A1313760j18104P3800M5010j8693j88778K44692n5099J29098J71779J3527
4268A1610992J14348j0464p2253J05370J49650J43266J83062J19911J02477K37074
$$ y = [14515175, 14429726, 14106100, 13948637, 13896519, 13802896, 13568496, 13450785, 13474059, 13245111, 12998925, 12842854, 12539585, 12469523, 12436531, 12176245, 12148124, 12154002, 12044795, 11738536, 11633644, 11384672, 11296731, 11270175, 11264439, 11230405, 11096428, 10934475, 10945698, 10952460, 11035817, 10912924, 10905355, 10936453, 10817114, 10869229, 10997955, 10834864, 10758591, 10865129, 10902752, 11109665, 10950658, 10900088, 10928683, 10968225, 11093254, 11060841, 11159031, 11350947, 11353113, 11260549, 11368382, 11296409, 11289275, 11323895, 11298788, 11283348, 11197276, 11437818, 11437452, 11154263, 11309456, 11313760, 11195656, 11269456, 11314466, 11295773, 11106995, 11351687, 11296588, 11425686, 11597465, 11610992, 11725340, 11714876, 11642623, 11747993, 11897643, 12040909, 12223971, 12343882, 12446359, 12683433]
4258A2683433O6834R2305o9960K12525O8019o8366m1667L5138K9367R4890L0015
4247A3132533m1712J8293j5375M0861l41628n4764K9802L7570J12805k84153r8043
4236A2536189J14898J50767j38486j67501j0990j67906l24835m3896N6932j49457
4226A1855715j01141k08430j64288o5503M5755m0082l23953j40200k29455j00822
4216A0527596r2606j81190q7169j74456O0136j4792p5513k0973j47149L2325p9586
4205I746623j92283P7934q9844J52678J2772q2601o7297K43567o9773k04027N4381
4194I582130K5857L407P294J1002K2569j13893J84038R3148Q8589K7532j0067
4183I921606K00603j29513j83332j63894p9509k0112j11633j0499m9284q2060
$$ y = [12683433, 12750267, 12842572, 12772612, 12985137, 13053156, 12984790, 12943123, 12978261, 13007628, 13102518, 13132533, 13090821, 13109114, 13093739, 13134600, 12792972, 12738208, 12768010, 12805580, 12918385, 12634232, 12536189, 12651087, 12801854, 12663368, 12495867, 12484877, 12316971, 11992136, 11948240, 12005172, 11855715, 11754574, 11546144, 11381856, 11316353, 11362108, 11322026, 10998073, 10857873, 10628418, 10527596, 10434990, 10253800, 10166631, 9992175, 10052311, 10037519, 9962006, 9941033, 9793884, 9826209, 9746623, 9554340, 9632274, 9542430, 9695108, 9707880, 9625279, 9557982, 9801549, 9731776, 9527749, 9582130, 9607987, 9611394, 9618688, 9629690, 9652259, 9538366, 9722404, 9815552, 9904141, 9931673, 9921606, 10122209, 9992696, 9809364, 9645470, 9565961, 9545849, 9434216, 9423717, 9374433, 9292373]
4173I292373k00268M9216P9638j57680k07084k1490j84332n6652J57501J04486
4163H855708J06900P1300L8296O3431k1284R7470K58258L61231K69806J8873Q1145
4152A0201134J49793L24547L95235r2313J88208k5070j08037j00335k17301j17024
4142A0598837P3125M0383j78332L6640K8436o0438q4659J92029K2289O9664J60756
4131A0898730K76881J72600k5213K34292O0567P4089M24675J48307L92422L76069
4121A3033419L69401L35944N30143M47149L50181M36677K45618K26223K59862
4112A6234617K2798l40812o006l0709m36326k99494k11620k32056k95414P8360
4102A4483338j61340J14955J36488L6205R2649R6193J66252Q4931K71991M06867
$$ y = [9292373, 9092105, 9141321, 9220959, 9063279, 8856195, 8834705, 8650373, 8593721, 8751222, 8855708, 8962608, 9033908, 9072204, 9135635, 9114351, 9211821, 9470079, 9831310, 10101116, 10119989, 10201134, 10350927, 10675474, 11070709, 10978396, 11166604, 11141534, 11033497, 10933162, 10715861, 10598837, 10671962, 10712345, 10534013, 10570653, 10599089, 10538651, 10453992, 10646021, 10668310, 10737974, 10898730, 11175611, 11348211, 11322998, 11557290, 11617857, 11691946, 12116621, 12264928, 12657350, 13033419, 13402820, 13738764, 14268907, 14716056, 15066237, 15502914, 15748532, 15974755, 16234617, 16257415, 15916603, 15910597, 15879888, 15443562, 15144068, 14932448, 14700392, 14404978, 14483338, 14321998, 14436953, 14573441, 14609646, 14702295, 14798488, 14964740, 15049671, 15321662, 15728529]
4092A5728529L14186L48344K86125M00904N70018N32397N09912Q84079Q82012
4083B0456506Q04562Q99592O20929N00967M88507P1743k79183l5576k87257n88817
4073B2651973n84545l96459l08376k27235p3546o1178J39669J15961M15766L65141
4063B2037171K30196N95774N12566J92135M95431O27810N01097Q20073O18708
4054B6630961P83061R88187J149337J176851J221865Q85035Q31065M98310N0052
4045C4214724N9886k8241j6257N5587l45199k43622j84K37242K5728K70931J99117
4034C4429712K74456M37219M52789M93164N63516N90274N04860N77126O35670
4025C8958786N77741O52281Q70115Q62448P68169Q00320Q90153R32302J048761
$$ y = [15728529, 16042715, 16391059, 16677184, 17078088, 17648106, 18180503, 18690415, 19574494, 20456506, 21261068, 22160660, 22781589, 23282556, 23771063, 23842806, 23563623, 23528047, 23240790, 22651973, 22067428, 21670969, 21362593, 21135358, 21061812, 21000634, 21140303, 21256264, 21672030, 22037171, 22267367, 22863141, 23375707, 23567842, 24063273, 24691083, 25192180, 26012253, 26630961, 27414022, 28402209, 29551546, 30728397, 31950262, 32835297, 33666362, 34164672, 34214724, 34274610, 34246369, 34230112, 34285699, 33940500, 33696878, 33696694, 33933936, 33959664, 34230595, 34429712, 34704168, 35141387, 35594176, 36087340, 36650856, 37241130, 37745990, 38323116, 38958786, 39536527, 40188808, 41058923, 41921371, 42689540, 43489860, 44380013, 45312315, 46361076]
4016D6361076P44572Q27194N26943N02890L81269L20080N61635N51630N07921
4007E1285210P99340P96974Q43092R06794R64290J175031J241675J241426J530030
3998F0783862J722328J532715J706754J889437J690574J885965K095553K283359
3990G5590547K105071K197184K217162K385194K556199K550311K741303K944848
3982I5287819L037559K962097K935981K862546K801356K676096K029403J813288
3974A16406145J794595J495620J623664J769406J523196J411592J735866J652498
3966A29412582J429726J211513Q28484N72117L5623k44992l48241l79471l85849
3957A32131492k80216m6789l15359k64351l61818r01392j275170j540765j876891
$$ y = [46361076, 47105648, 47932842, 48459785, 48962675, 49343944, 49664024, 50225659, 50777289, 51285210, 52084550, 52881524, 53724616, 54631410, 55595700, 56770731, 58012406, 59253832, 60783862, 62506190, 64038905, 65745659, 67635096, 69325670, 71211635, 73307188, 75590547, 77695618, 79892802, 82109964, 84495158, 87051357, 89601668, 92342971, 95287819, 98325378, 101287475, 104223456, 107086002, 109887358, 112563454, 114592857, 116406145, 118200740, 119696360, 121320024, 123089430, 124612626, 126024218, 127760084, 129412582, 130842308, 132053821, 132882305, 133454422, 133490045, 133245053, 132896812, 132517341, 132131492, 131851276, 131804487, 131489128, 131224777, 130862959, 129961567, 128686397, 127145632, 125268741]
3948A25268741j949820k259668k173789k070438k030682j664251j522813j055645
3940A10541635q67370p45127j059193j620966j817997j845719j624768j486165
3932I9474330j119871q94074m60440j46813P2170K95176M28126K42376m1821l21039
3922I7528120n13671m59032r9789p0642M41688N90480O02839J017418P05694Q45957
3912A00589062P86755M51656j26977m20626m99987q28690n28986o11016o85273
3903I8125918n38712o22264o37903j052533j189250j359300j446092j627321j543378
3894H8109165j216576j252881j278510j227294j532265j312138j491898j657551
3886G7140052j623979j797478j952135k515662k032547j952306k070321j722082
$$ y = [125268741, 123318921, 121059253, 118885464, 116815026, 114784344, 113120093, 111597280, 110541635, 109674265, 108929138, 107869945, 106248979, 104430982, 102585263, 100960495, 99474330, 98354459, 97460385, 96999945, 96853132, 96925302, 97220478, 97648604, 97890980, 97849159, 97528120, 97014449, 96555417, 96455628, 96384986, 96826674, 97417154, 98019993, 99037411, 99743105, 100589062, 101375817, 101827473, 101700496, 101279870, 100779883, 99951193, 99422207, 98811191, 98125918, 97587206, 96964942, 96327039, 95274506, 94085256, 92725956, 91279864, 89652543, 88109165, 86892589, 85639708, 84361198, 83133904, 81601639, 80289501, 78797603, 77140052, 75516073, 73718595, 71766460, 69250798, 67218251, 65265945, 63195624, 61473542]
3878F1473542j575492j531652j390003j292225j274229j348828j173646j107019
3870E0780448q19777r01577o46669l95780l01854J00930M14901L08713M77307
3861D9016642N29249K74030O5818j44669l76917l67456q04380q65785n34284m44484
3851D6347764m24248k48535j50470k7311j34616j90942J24060p7050m00016o13511
3841D4205125j094221j080280j181719j438877j487200j197722r13744j220632
3833C4590730j035089p84105m53982m88924m11639m66719k45649l22226p25535
3824B9656862n25204o66540o46094n23059q76226m90141l92948l20425n89339
3815B4626886o11599n01571n33314l02242j91138j17520l75934k81920k3866l30743
$$ y = [61473542, 59898050, 58366398, 56976395, 55684170, 54409941, 53061113, 51887467, 50780448, 49960671, 49059094, 48412425, 48016645, 47714791, 47815721, 48230622, 48539335, 49016642, 49545891, 49819921, 49885739, 49741070, 49364153, 48996697, 48192317, 47326532, 46792248, 46347764, 45923516, 45674981, 45524511, 45497200, 45362584, 45171642, 45295702, 45218652, 44818636, 44205125, 43110904, 42030624, 40848905, 39410028, 37922828, 36725106, 35811362, 34590730, 33555641, 32771536, 32317554, 31828630, 31416991, 30950272, 30704623, 30382397, 29656862, 29131658, 28465118, 27819024, 27295965, 26419739, 25929598, 25536650, 25216225, 24626886, 24015287, 23513716, 22980402, 22678160, 22487022, 22369502, 21993568, 21711648, 21687782, 21357039]
3805B1357039k61013m3272j66818l51903l16657k52258J24735l92874k63612j3349
3795A9420018j35170k83933N8012j84461j68857j14980q4484j81378j26856l2822
3785A8165089j25536j23929L5686o1046j30256N8791j02248j22401J5600O2742
3775A7672492K6530N4668q517j42803L082J02347k77571O4192j04999l7301j07350
3764A7244770j01245j05769K05019J78106J0177J1509j48426m1530L6587R8969
3754A7388167J25023j83625l3982K79837j00766J49923J21549Q785K65306R4768
3744A8114985R0504K21141J31390k4333J86384L81016J73294J7865J12194J13085
3734A9517525P6806J71226J19377K02765L07987Q6294K7951J07987J51276K55799
$$ y = [21357039, 21096026, 21052754, 20885936, 20534033, 20217376, 19965118, 20089853, 19696979, 19433367, 19420018, 19284848, 19000915, 19058927, 18874466, 18705609, 18590629, 18506145, 18324767, 18197911, 18165089, 18039553, 17915624, 17951310, 17890264, 17760008, 17818799, 17716551, 17594150, 17609750, 17672492, 17699022, 17753690, 17745173, 17602370, 17605452, 17707799, 17430228, 17494420, 17389421, 17352120, 17244770, 17143525, 17037756, 17242775, 17420881, 17431058, 17442567, 17294141, 17252611, 17289198, 17388167, 17513190, 17329565, 17295583, 17575420, 17474654, 17624577, 17746126, 17754911, 18020217, 18114985, 18205489, 18426630, 18558020, 18533687, 18720071, 19101087, 19274381, 19292246, 19404440, 19517525, 19594331, 19765557, 19884934, 20087699, 20395686, 20481980, 20509931, 20617918, 20769194, 21024993]
3724B1024993L98817K03807K49187K84050L23081N8128J94353K57022J95943L30769
3714B3520150L43170K11932K18933M89883L56318J95361N59012M66629M80098
3705B6841486J94747L86364L58203O22990O73190K99572M23180O02430M88888
3696C0891050M88381O69985N53619N27049Q33015O18426Q95165P01870O76752
3687C6855312J000091R83111J094169J075137J491717J244529J486277J848810
3679D7079153J874323K398725K743846L516200L940274M745867M994005L775373
3671G5067766J802701p39628k600208l033715k817187k294302j273562r12155
3663F3199710l08752J52908M89364R00780J119809J118512J425284J498921J514489
$$ y = [21024993, 21423810, 21627617, 21876804, 22160854, 22483935, 22542063, 22736416, 22993438, 23189381, 23520150, 23863320, 24075252, 24294185, 24784068, 25140386, 25335747, 25894759, 26361388, 26841486, 27036233, 27422597, 27780800, 28403790, 29076980, 29376552, 29799732, 30402162, 30891050, 31379431, 32049416, 32603035, 33130084, 33963099, 34581525, 35476690, 36178560, 36855312, 37855403, 38838514, 39932683, 41007820, 42499537, 43744066, 45230343, 47079153, 48953476, 51352201, 54096047, 57612247, 61552521, 66298388, 71292393, 75067766, 76870467, 76130839, 73530631, 70496916, 67679729, 65385427, 64111865, 63199710, 62890958, 63043866, 63533230, 64434010, 65553819, 66672331, 68097615, 69596536, 71111025]
3654G1111025J620006J688488J871235K047242K475945K811728L071107L593271
3646I0290047M177127M451871L768103K215753q7422j637088k731188k813658
3638I7633545k492622j655197j082358q77825l97154j22076K76360K44938L43218
3629I1870829Q55861Q73101P84822R70619J080299R31902J217325J535567J303733
3620A01424058J482949J900719J879340J974628K201321K387823K310131K990942
3612A18551911K988253K951049L178414L413947L573588M155630M180285M354117
3604A47347194M361208M499096M573602M113646M086848L900022L768305L751805
3596A80401726L399700L357691L475166L476275L343534L033566K926214K703702
$$ y = [71111025, 72731031, 74419519, 76290754, 78337996, 80813941, 83625669, 86696776, 90290047, 94467174, 98919045, 102687148, 104902901, 104815479, 103178391, 100447203, 97633545, 95140923, 93485726, 92403368, 91525543, 91128389, 91006313, 91282673, 91527611, 91870829, 92726690, 93599791, 94384613, 95355232, 96435531, 97367433, 98584758, 100120325, 101424058, 102907007, 104807726, 106687066, 108661694, 110863015, 113250838, 115560969, 118551911, 121540164, 124491213, 127669627, 131083574, 134657162, 138812792, 142993077, 147347194, 151708402, 156207498, 160781100, 164894746, 168981594, 172881616, 176649921, 180401726, 183801426, 187159117, 190634283, 194110558, 197454092, 200487658, 203413872, 206117574]
3588B06117574K469098J878980J583649J275721O55739M07619j3655k30575j84031
3579B13960119j93895j20128j16569p860J78290M16277L61047O89624O66923N25721
3569B16359549R45606J112906Q22389P93740Q37078Q82168R81855J050603R16339
3560B24702233J561252K027664K170888K178289K384230K735099K656452K738264
3552B43154371K792636K725186L104821L003432L030501L080107L377867L603803
3544B67872724M191659M899773N487671O587270P883181Q825446J0077485J0989116
3536C26814325J2021237J2330089J1894090J0866308R173341P183804M714499
3529C94997693K103020R5690j272256k231946k369544k040452k027840k175235
$$ y = [206117574, 208586672, 210465652, 212049301, 213325022, 213980761, 214388380, 214374725, 214144150, 213960119, 213766224, 213646096, 213529527, 213521667, 213699957, 214116234, 214477281, 215166905, 215833828, 216359549, 217305155, 218418061, 219240450, 220034190, 220871268, 221753436, 222735291, 223785894, 224702233, 226263485, 228291149, 230462037, 232640326, 235024556, 237759655, 240416107, 243154371, 245947007, 248672193, 251777014, 254780446, 257810947, 260891054, 264268921, 267872724, 272064383, 276964156, 282451827, 289039097, 296922278, 305747724, 315825209, 326814325, 338835562, 351165651, 363059741, 373926049, 383099390, 390283194, 394997693, 397100713, 397196403, 395924147, 393692201, 391322657, 389282205, 387254365, 385079130]
3521C85079130k059348k352637l408900m776839o699905q674540j0591094j2606559
3513C33909308j4066608j4561858j4908508j4484746j3239552j2381887j1214325
3506B39051824r967292r161127q251356p556938o661472n911057n192433m552309
3498A81797840l989827l623392l528105k982465k687826k415854k087694k294116
3490A58188561k042609j725030k043592j865184k173414k348528k748506k663723
3482A40577975k594971k951344l460532l486578l522412l883829l902716l641561
3474A13134032l411987l415038l335480l526914l156391k805552k940684k824835
3466H7717151l017418k759002k617753k581904k533789k181470k034822j958286
$$ y = [385079130, 383019782, 380667145, 377258245, 372481406, 365781501, 357106961, 346515867, 333909308, 319842700, 305280842, 290372334, 275887588, 262648036, 250266149, 239051824, 229084532, 219923405, 211672049, 204115111, 197453639, 191542582, 186350149, 181797840, 177808013, 174184621, 170656516, 167674051, 164986225, 162570371, 160482677, 158188561, 156145952, 154420922, 152377330, 150512146, 148338732, 145990204, 143241698, 140577975, 137983004, 135031660, 131571128, 128084550, 124562138, 120678309, 116775593, 113134032, 109722045, 106307007, 102971527, 99444613, 96288222, 93482670, 90541986, 87717151, 84699733, 81940731, 79322978, 76741074, 74207285, 72025815, 69990993, 68032707]
3458F8032707j602007j410233j162341q92319r35501p74994m56754k43166k38932
3449F0316460j67039M2006j99896j51218m633n0311r7301o1318p4357j27620o4138
3438E9360635j01320K31544L03238K08824J94289K95003J95741M44834K11976
3429F1344764j24304K1316j48639j30126j4834k22139j16250j68087N5882k45239
3419F0252344j84032K3139M1820J36202q3253J36071q1922J43118Q0875J32685
3409F0597047L01217M31875R01357R63767J104315J901874K033139L021380L794583
3400G5050554M024578L627407J792436o87968k486580l269263k939776k062749
3392G3048639j416701n01629L0155Q59360J909419K268674K736527K410253L31402
$$ y = [68032707, 66430700, 65020467, 63858126, 62965807, 62030306, 61255312, 60798558, 60555392, 60316460, 60149421, 60191427, 59991531, 59840313, 59835680, 59785369, 59688068, 59626750, 59552393, 59424773, 59360635, 59259315, 59490859, 59794097, 60002921, 60197210, 60492213, 60687954, 61132788, 61344764, 61220460, 61241776, 61093137, 60963011, 60948177, 60726038, 60609788, 60441701, 60497583, 60252344, 60068312, 60091451, 60133271, 60269473, 60186220, 60322291, 60240369, 60383487, 60464362, 60597047, 60898264, 61330139, 62231496, 63195263, 64299578, 66201452, 68234591, 71255971, 75050554, 79075132, 82702539, 84494975, 83807007, 81320427, 78051164, 75111388, 73048639, 71631938, 71130309, 71160464, 72019824, 73929243, 76197917, 78934444, 81344697, 81676099]
3383H1676099k089369l748769m066344l637752k977951k047221j460682j174895
3375F0473116m18388j21354K64450M86008O26534J086002J502924J953507K181773
3366F8034572K121312K614107L017842L176100L209967L842101M035294M360075
3358I4411370M716304M712121N037417N365602N555456N299873N304462N606092
3350A36008697N416408N186725M747431L923722L807996L245932K544486J986339
3342A66867736J480025R20424J00573o32461j053456k023399k596578l193843
3334A59869021l492031l942418m349516m656480n144463n639295n574823n451318
3326A21618677n342742n455923n393105m978172m709881m912541m582379m206973
$$ y = [81676099, 79586730, 75837961, 71771617, 68133865, 65155914, 63108693, 61648011, 60473116, 60054728, 59933374, 60197824, 60683832, 61310366, 62396368, 63899292, 65852799, 68034572, 70155884, 72769991, 75787833, 78963933, 82173900, 86016001, 90051295, 94411370, 99127674, 103839795, 108877212, 114242814, 119798270, 125098143, 130402605, 136008697, 141425105, 146611830, 151359261, 155282983, 159090979, 162336911, 164881397, 166867736, 168347761, 169268185, 169368758, 168736297, 167682841, 165659442, 163062864, 159869021, 156376990, 152434572, 148085056, 143428576, 138284113, 132644818, 127069995, 121618677, 116275935, 110820012, 105426907, 100448735, 95738854, 90826313, 86243934, 82036961]
3318H2036961l866986l598779l201052k856439k917335k650811k330216k128605
3310E8486738j995246j712039j431968j089641q64765p13099l27507k53399k97101
3301D9801973L3375L6609m6717k73109j26059R054J24978Q8568J28150L55056
3291E0131878L33724N28212N12142O34559K51125J07687K99973M79776M53625
3282E3732701N36826N77751K02198L61294J62786K95239M15260L04259M50264
3273E7038578P88074R51024Q86309P20589J216669J250788Q03867N19777P22614
3264F4898289J014594R93301R81100J326403J547609J583589K030854K346588
3256G6722327K399889K535405K464001L305856L850409M018070M765141N431248
$$ y = [82036961, 78169975, 74571196, 71370144, 68513705, 65596370, 62945559, 60615343, 58486738, 56491492, 54779453, 53347485, 52257844, 51393079, 50679980, 50352473, 50099074, 49801973, 49835348, 49871957, 49825240, 49552131, 49426072, 49435126, 49560104, 49648672, 49776822, 50131878, 50465602, 50993814, 51505956, 52140515, 52391640, 52499327, 52799300, 53279076, 53732701, 54269527, 54847278, 55049476, 55410770, 55573556, 55868795, 56284055, 56588314, 57038578, 57826652, 58777676, 59663985, 60384574, 61601243, 62852031, 63655898, 64175675, 64898289, 65912883, 66906184, 67887284, 69213687, 70761296, 72344885, 74375739, 76722327, 79122216, 81657621, 84121622, 87427478, 91277887, 95295957, 100061098, 105492346]
3248A05492346O007404O787984P666598Q284765R625304J0934010J2030496J3487760
3240A80316667J4099458J3751011J2960074J0788332O662040J695182l052140
3233B37220624p307339j0115187j1380400j1899367j1391812j0696970r849253
3226A64580296q910096q000944p214715o840549o024171n530942n244312m685816
3218A12128751m292832l823572l554229l017044k944671k872895k639817k479033
3210H6504658k148576j674664j898149j620848j343546j395137j226411j595247
3202G3602080j041230j309665j350117j421188j407202j321959j791959j753420
3194F2205340j875035k126713j903322j813306j977344j598437j493291j627348
$$ y = [105492346, 111499750, 118287734, 125954332, 134239097, 143864401, 154798411, 166828907, 180316667, 194416125, 208167136, 221127210, 231915542, 238577582, 240272764, 237220624, 229913285, 219798098, 208417698, 196518331, 185126519, 174429549, 164580296, 155670200, 147669256, 140454541, 133613992, 127589821, 122058879, 116814567, 112128751, 107835919, 104012347, 100458118, 97441074, 94496403, 91623508, 88983691, 86504658, 84356082, 82681418, 80783269, 79162421, 77818875, 76423738, 75197327, 73602080, 72560850, 71251185, 69901068, 68479880, 67072678, 65750719, 63958760, 62205340, 60330305, 58203592, 56300270, 54486964, 52509620, 50911183, 49417892, 47790544]
3186D7790544j135073r46123j061436q19809q70171j060414j118379j189149q42283
3177C8747707m86286p88261p39495j160105j106387j220076j276097r65495q48439
3168C0157066o24693j109579q84756l90026o45477p61211p48346n86127k45020
3159B4161831m01816l17209m23520l42580j95243l10326l5535n2371q5526o7322
3149B1930383k80693l20475p28J78298K81971L82296k3404l29087q68075j157492
3139A9792994r57862r97843p70847o11320l79933l17752n54773l97628k17039
3130A4587997k18283k36214j45299j99897q2756k6441j69784j79109k56005j82974
3120A2891235o6604l60707R7667J72304N5965q8726J31928K93550J49553j4524
$$ y = [47790544, 46655471, 45709348, 44647912, 43828103, 42957932, 41897518, 40779139, 39589990, 38747707, 38261421, 37473160, 36733665, 35573560, 34467173, 33247097, 31971000, 31005505, 30157066, 29532373, 28422794, 27538038, 27148012, 26502535, 25741324, 24992978, 24406851, 24161831, 23760015, 23442806, 23019286, 22676706, 22481463, 22171137, 22135602, 22083231, 21997705, 21930383, 21649690, 21329215, 21328487, 21506785, 21788756, 22171052, 22147648, 21818561, 20950486, 19792994, 18835132, 17837289, 17066442, 16455122, 16075189, 15757437, 15202664, 14805036, 14587997, 14369714, 14133500, 13988201, 13788304, 13705548, 13679107, 13509323, 13330214, 13074209, 12891235, 12824631, 12463924, 12561591, 12733895, 12789860, 12701134, 12833062, 13126612, 13276165, 13261641]
3110A3261641L7013k58732n54781m24296m92340n87801k61327k10154l11061k51571
3100I946591K9452l44982j39390j28512j64123j43079j76345j77467q5551N29
3090H617123r0685j39306l59840K2553M7730J7706r2411m3648J8145k78726j24772
3079G593869R9856k09145p121j45431j26983j42060K25533j8315l898R1366j87756
3068G169915j73465j0932M1565J0036j83801j81731l2167j93029o869K84242n9778
3057F663986N8167j26252j45012j43068R4699N0875j28147l25038J49445K7782
3047F177437k89635J11989l7383k60535J00361Q7218J6599J25560q9128j23510
3037E818973N0N7404k67577l3552J00770J22779k7002q305J38360j48756J7778
$$ y = [13261641, 13298654, 13039922, 12485141, 12060845, 11568505, 10980704, 10719377, 10509223, 10198162, 9946591, 9976043, 9631061, 9491671, 9363159, 9199036, 9055957, 8879612, 8702145, 8616594, 8617123, 8526438, 8387132, 8027292, 8049845, 8097575, 8115281, 8022870, 7979222, 7997367, 7718641, 7593869, 7693725, 7484580, 7477459, 7332028, 7205045, 7062985, 7288518, 7270203, 7266305, 7357671, 7169915, 6996450, 6985518, 7027083, 7037119, 6853318, 6671587, 6639420, 6446391, 6439522, 6723764, 6663986, 6722153, 6595901, 6450889, 6307821, 6402520, 6453395, 6325248, 6000210, 6149655, 6177437, 5887802, 5999791, 5962408, 5701873, 5802234, 5889452, 5906051, 6031611, 5942483, 5818973, 5819023, 5876427, 5608850, 5575298, 5676068, 5798847, 5771845, 5763540, 5901900, 5753144, 5770922]
3026E770922J16958n9423k9044K1723O0058J66964k1478L1142J24269j21689J30421
3015F190823J01975J71577J00716K13729K30398K25505J25146J54479J38693K8529
3005G681570k24168j0914k89527l7365Q6110l2387P1335J55073M7960J30665J23339
2994G701691k4614j215L2974j24714J28169L1416j66108j18436O1760L17447J96881
2983H035251K54919K35053Q1286K08781M35147J78181M72162P2560r0193j38474
2973I744673k99491l19715j91323l64456j82495j9688j88512j68765j4090o8200
2963G927938r0090J20953j6629j19616j06352J95308j13537n5168P4441O4660
2953G881908L38804K84257m7471J43617K32730J71937K30015J56643J02202J87892
$$ y = [5770922, 5887880, 5828457, 5799413, 5821136, 5881194, 6048158, 6026680, 6057822, 6182091, 6060402, 6190823, 6292798, 6464375, 6565091, 6778820, 7009218, 7234723, 7359869, 7514348, 7653041, 7681570, 7457402, 7446488, 7156961, 7119596, 7205706, 7173319, 7244654, 7399727, 7447687, 7578352, 7701691, 7677077, 7675862, 7708836, 7584122, 7712291, 7743707, 7577599, 7459163, 7520923, 7838370, 8035251, 8290170, 8525223, 8606509, 8815290, 9250437, 9428618, 9900780, 9973340, 9883147, 9744673, 9445182, 9125467, 8934144, 8569688, 8387193, 8367505, 8178993, 8010228, 7996138, 7927938, 7837848, 7958801, 7942172, 7822556, 7716204, 7911512, 7797975, 7742807, 7817248, 7881908, 8220712, 8504969, 8457498, 8601115, 8833845, 9005782, 9235797, 9392440, 9494642, 9682534]
2943I682534O3843J99035K47712k35754J11140J33130J78812J06601Q4350L83164
2933A0954567N75371L12448M73129M10255M30456O10710M87002M33015N17592
2924A5204545L56076J85647K28990J00170j1686j77677j20879L0279J9812J47837
2914A5963114N0988n6774m2176J84204K8288n1647K24057J61313L84508M50570
2904A7296445L54713N45443O77843J044014J232342J558285J795927J960530J694349
2895B8159891M18814j179817k009445k216114k429530j875981j341191j248510
2887A6278117q55701m47752o44424n70875m51023l04162l38441l65046j77439
2878A2123254m5739J21699K3866N5346R999j19916O0180K28560K28459L86721
$$ y = [9682534, 9746377, 9945412, 10193124, 9957370, 10068510, 10201640, 10380452, 10487053, 10571403, 10954567, 11529938, 11842386, 12315515, 12725770, 13156226, 13766936, 14253938, 14686953, 15204545, 15560621, 15746268, 15975258, 16075428, 16063742, 15886065, 15765186, 15795465, 15815277, 15963114, 16014102, 15957328, 15915152, 16099356, 16127644, 16075997, 16300054, 16461367, 16845875, 17296445, 17651158, 18196601, 18874444, 19918458, 21150800, 22709085, 24505012, 26465542, 28159891, 28578705, 27398888, 25389443, 23173329, 20743799, 18867818, 17526627, 16278117, 15422416, 14974664, 14330240, 13759365, 13308342, 13004180, 12665739, 12300693, 12123254, 12077515, 12199214, 12223080, 12278426, 12288425, 12168509, 12228689, 12457249, 12685708, 13072429]
2868A3072429L26157J745K62764L0321k69507m96440o32345n77975q48874q09327
2858A0058948m78864n01608n24556m56642m90097l25178l79952k81263k14234
2849F406554m03400p0723k34507k26683j14680l30791l77404J03726k22033k866
2839D527193r9275k80327q0031j66694j41299J6603O069j84713k25499j33504
2829C238523j30926j50724r864j09417Q3101p2565j87175r0303N5817k8272j80056
2818B418139j21597j64904J15666j84336j92500j15643J33052J68732j67399j51303
2808A737907Q5493K26518J23348j52062j56804Q7052j86563j23365K17780n3221
2798A806083j02401j13828j12370J7563j16295j56022L6502l0901q2162N8901
$$ y = [13072429, 13398586, 13400331, 13663095, 13693416, 13423909, 12927469, 12295124, 11717149, 10868275, 10058948, 9580084, 9078476, 8553920, 8097278, 7607181, 7282003, 6902051, 6620788, 6406554, 6003154, 5932431, 5697924, 5471241, 5356561, 5025770, 4648366, 4752092, 4530059, 4527193, 4427918, 4147591, 4067560, 3900866, 3759567, 3776170, 3782239, 3597526, 3372027, 3238523, 3107597, 2956873, 2947009, 2837592, 2920693, 2848128, 2660953, 2570650, 2626467, 2598195, 2418139, 2296542, 2131638, 2247304, 2062968, 1870468, 1754825, 1887877, 2056609, 1889210, 1737907, 1823400, 2049918, 2173266, 2021204, 1864400, 1951452, 1764889, 1641524, 1859304, 1806083, 1703682, 1589854, 1477484, 1495047, 1378752, 1222730, 1259232, 1228331, 1146169, 1205070]
2788A205070J2839K3826r280K30751j77421p4012M9727j42771j49530n8603j97504
2777G13092j473K28921n215l5468J59788m5795j56411l3878K19949L1722o8693
2766A006539k36843M5566M6230M8448j68737J27719r5073j07233K9349Q9155L5648
2755H20768J24433o6392k17845O0561k21737q7449K01971J13149r8774j03644
2745E25041L54931K5235j69573J13032k7440j96219k62587J72619O2747K0090
2735F17876Q1721k10840J50188J33667m6754K039n9438N8461N0699j93413l3616
2724E50590K8319q118k3618q1618Q0667N4098K1924k15156j5740J0443J65532
2713E67323k44127j05174K9048J27393J7998j2819J44065J06015l8805o5245l44436
$$ y = [1205070, 1217909, 1241735, 1232455, 1463206, 1285785, 1211773, 1261500, 1118729, 969199, 910596, 713092, 711619, 940540, 935325, 899857, 1059645, 1013850, 857439, 823561, 1043510, 1075232, 1006539, 769696, 815262, 861492, 909940, 741203, 868922, 773849, 666616, 695965, 785120, 820768, 945201, 878809, 660964, 721525, 499788, 412339, 614310, 727459, 628685, 525041, 879972, 905207, 735634, 848666, 821226, 625007, 362420, 535039, 597786, 617876, 699597, 488757, 638945, 772612, 725858, 727897, 668459, 726920, 777619, 584206, 550590, 578909, 570791, 547173, 465555, 546222, 600320, 622244, 407088, 391348, 401791, 567323, 323196, 218022, 247070, 374463, 392461, 379642, 523707, 629722, 590917, 525672, 181236]
2702A81236n5681K52009J69123q7922j13363p2939Q787O6630J81502j96230k8822
2691C04330J0063m0397J06516P5348N6021j76245N9881n8422m068J19379l1249
2680D21157j92456K2730P2080J14982o9171q0775l1987j45933J22520J61032r0939
2669C03240k11767J38821O1734L1117k19703J43398l6793j33353J25215L1294
2659B33203j44440J26520K01667j41221Q565o1493J2044o968p982O7955q2443
2648B05407K285K7583j32758J27467n1657P6642p5359J08257J00616j3899N4158
2637D28742P206P2525j10280j48036M2604J32702k48311k1885Q2508j37270J33532
2626B34037N8841j0567o9984m649O3947J12492r1574j80259p0853j6341J03667
$$ y = [181236, 125555, 377564, 546687, 458765, 345402, 272463, 281250, 347880, 529382, 333152, 304330, 314393, 273996, 380512, 455860, 511881, 335636, 395517, 337095, 333027, 452406, 421157, 228701, 251431, 323511, 438493, 369322, 288547, 256560, 110627, 233147, 394179, 303240, 91473, 230294, 292028, 323145, 103442, 246840, 210047, 76694, 201909, 233203, 88763, 215283, 416950, 275729, 284294, 222801, 234845, 227877, 219895, 287850, 205407, 207692, 235275, 102517, 229984, 178327, 254969, 179610, 287867, 388483, 374584, 428742, 435948, 508473, 398193, 250157, 292761, 425463, 177152, 155267, 237775, 100505, 234037, 292878, 282311, 212327, 207678, 271625, 384117, 292543, 112284, 41431, 25090, 128757]
2615A28757J17111R8400q4907J2127K84701j64412j09480K8091j66387L1947n0866
2604A25082J36524m2514m8909R4364q6818K5844j22070o6959O9316J15612L5187
2593B34659O0222p5204M03L875j4766N753p6894n7966k6217J54394J69739k28720
2581A49278j45262K08393q8879r8845m5440N361j42463j07962J63898J08841L9116
2570D6036j04508N9754R3964L686R7959k55893j60139J79442K6595J38353j01112
2559B4137j5158q0756J0028n74P7566J01206l795q6821l2308P1148j09060K31005
2547A86618q8737q325k0816n6569m9451K9918m527q9145J56796n3492j35345J40901
2535G826J73638q6643n4932Q7424L9594n1915j29812j32436J1296O5874J42539
$$ y = [128757, 245868, 344268, 259361, 271488, 556189, 391777, 282297, 310388, 144001, 175948, 125082, 261606, 219092, 170183, 264547, 177729, 203573, 81503, 14544, 83860, 199472, 234659, 294881, 219677, 220080, 223955, 209189, 214942, 138048, 80082, 53865, 208259, 377998, 149278, 4016, 212409, 123530, 24685, -20755, -15394, -157857, -265819, -101921, 6920, 46036, -58472, 1282, 95246, 98932, 196891, -59002, -219141, -39699, -13104, 125249, 24137, 8979, -71777, -61749, -62323, 15243, 116449, 112654, 25833, -6475, 64673, -44387, 186618, 97881, 89556, 68740, 12171, -37280, -7362, -11889, -101034, 55762, 2270, -133075, 7826, 181464, 94821, 39889, 127313, 166907, 114992, -14820, -147256, -135960, -70086, 72453]
2524G2453j81593k0210J54356o8882R769j4949M8825M646J93531K02988m61234
2513f0300n7735P3463r8634j03014j2624J36859j76319K09494J89079l04574J4094
2502a90211M7101J55963Q6435J12231K4932j44406r1624j23757J07186L2273J07547
2491A23670q5859Q7375r8047k10279J62001J19649p7472m6116n1268m8825K06259
2480H1088K9879r3018j19057j5218k1238J374M5188j17487M6541M9106J81113
2469F8271j42692j14526o7661o7398L28164o0863j13269Q0272N8971J00418j14244
2458d4557j25666k4288J53517m1829R5218J64857J35949r0522j42904q5255o8372
2447g3852J81040r944k19433R5805p2867l4085J05854N3294j93830K9970L1590
$$ y = [72453, -109140, -129350, 25006, -43876, -34107, -49056, -231, 4415, 197946, 400934, -60300, -118035, -44572, -143206, -246220, -258844, -121985, -298304, -88810, 100269, -204305, -190211, -143110, 12853, 99288, 211519, 236451, 92045, 421, -123336, -16150, 16123, 123670, 37811, 125186, 27139, -183140, -21139, 98510, 21038, -25078, -76346, -125171, 81088, 110967, 17949, -101108, -116326, -137564, -136190, -91002, -208489, -161948, -112842, 68271, -74421, -188947, -256608, -324006, 4158, -56705, -169974, -89702, -30731, 69687, -44557, -170223, -194511, -40994, -82823, 12395, 177252, 313201, 222679, 79775, -5480, -73852, 107188, 97244, -122189, -26384, -99251, -133336, -27482, 25812, -168018, -138048, -106458]
2436a06458K290J0342k2900J13308k64338J27618J62360q7449J00830j42848j52759
2425b60004K8970L0912K3038J22404M7823m9140j35727Q9384J38508O3082l6097
2414F3153r1894K2992q0685J87810J6032O9182r2177p7659j41083J09300j04381
2403a19410m4692L502O2424Q5901p7249j3853j66475j51933J29432J49190N7437
2392h5726m146K4128P033Q8672j07907m1012R4955k80784L5794o4186J93664J22397
2380a7118n6554o1611J29130K20470p1889r0729j1163p0405m6346L4897M9910
2369H592k5649j100K81785k8598J6732Q0693p5676n0208J02221q3416j08344J0532
2357A27564j44544m5948J30710K02920l1657o6079k9474q628J03006j06102M0267
$$ y = [-106458, -104168, -93826, -116726, -3418, -267756, -140138, 22222, -65227, 35603, -107245, -260004, -231034, -200122, -177084, -54680, -6857, -55997, -191724, -102340, 36168, 99250, 63153, -28741, -5749, -86434, 101376, 117408, 186590, 94413, 16754, -124329, -15029, -119410, -164102, -160600, -98176, -12275, -89524, -103377, -269852, -421785, -292353, -143163, -85726, -89872, -65744, -58711, 29961, -77946, -118958, -24003, -304787, -268993, -333179, -139515, -17118, -73672, -135283, -6153, 214317, 142428, 51699, 40536, -29869, -76215, -41318, 8592, -17057, -18157, 263628, 235030, 251762, 332455, 256779, 206571, 308792, 225376, 117032, 127564, -16980, -62928, 67782, 270702, 239045, 172966, 143492, 134864, 237870, 131768, 172035]
2346A72035r9560k9415j36200J21482J66997j55126q1629k6331J65201j18297
2336b0843q3584Q899q2671L5063K19578j28251N4478n7741M5646l2263O9377J78288
2324B05976j40403K5641j36137R0162n9813j03082J78855N5119P4136k42543N7359
2313E270R6863m8956j4302k3796m0272J24849N892l5222k1250o6920J55321M6508
2301A83985O6647q3233p873J303m6036R5801K84801j62599k07911R4959m289m7079
2289A68476j29583k30282L08021j50156O2044J06337K2979J35684N958j08137
2279A91341j17602M10o6003n1670L2951R4327J6336r4368n2769j15553Q3797J37872
2267E9069K39965o9050k52292J55474k45259R6771J59133N3414M9670r1310j4513
$$ y = [172035, 72475, 43060, -93140, 28342, 195339, 40213, -41416, -67747, 97454, -20843, -104427, -95528, -178199, -143136, 76442, -51809, 2669, -55072, -9426, -41689, 27688, 205976, 65573, 91214, -44923, 45239, -14574, -117656, 61199, 116318, 190454, -52089, 5270, 102133, 53177, 38875, 15079, -25193, 99656, 105548, 70326, 49076, -17844, 137477, 183985, 250632, 167399, 159526, 160829, 114793, 210594, 495395, 332796, 124885, 219844, 215555, 168476, 38893, -191389, 116632, -33524, 28520, 134857, 157836, 293520, 299478, 191341, 73739, 74149, 8146, -43524, -10573, 83754, 100090, 5722, -47047, -162600, -78803, 59069, 299034, 229984, -22308, 133166, -112093, -15322, 143811, 197225, 246895, 155585, 141072]
2256A41072q4317M4074J51107k6702j76994m1638L2830j42355m4703K79863J87974
2245C20211j89705J42554K02620M2203k35501M901j54090K7996J22343R3057J5612
2234C92201j56118n4979Q5387q720J50991j25242k77161m6872J21133J23819m8228
2223A56211Q284M3931P7064p5947N0125Q4292P7975O901l1705j0925j20904k1035
2211B44267J53740P0094P9452P6521j88346j40539R8394K6859j63302M8956K61911
2200E68007k5204O9352M2388O859J8301J7954J30827o3129m4535J10600j70394
2189F61026N3948J19304Q4893j56857j9875J62998L810J87299L6538P7246L751
2178A214081J31186m729J06630j08435k93857L1322P0572j02887P2414K05752
$$ y = [141072, 56755, 100829, 251936, 225234, 48240, 6602, 39432, -102923, -147626, 132237, 320211, 130506, 273060, 475680, 517883, 282382, 287283, 133193, 161189, 283532, 376589, 392201, 236083, 181104, 266491, 257771, 408762, 283520, 6359, -40513, 80620, 204439, 156211, 164495, 208426, 285490, 209543, 259668, 343960, 421935, 428836, 397131, 386206, 265302, 244267, 398007, 468101, 547553, 624074, 435728, 295189, 393583, 420442, 257140, 306096, 568007, 542803, 612155, 654543, 661402, 679703, 697657, 828484, 765355, 720820, 831420, 661026, 714974, 834278, 919171, 762314, 742439, 905437, 909247, 1096546, 1133084, 1210330, 1214081, 1345267, 1340538, 1447168, 1338733, 1044876, 1076198, 1146770, 1043883, 1116297, 1322049]
2168A322049J71028P8699j65734J90376J22863l3708J0355O897K21511j5289n63
2157A908484j16522n1458L22218Q4972j19991j35828J74080L74451J7176j89839
2147B267743k8772K84282J19478n5008J02307K15533J39077j6515r0478R2484
2137C030131J64301K70554J06738K04207L20302R9545L5908J74927J41738R8756
2127D647107M05836J5916J71991K58863J81969K75494J18049J90632N80696N73369
2117G419922M59485M11344P97532J187718J017622M06588N60010N67536J253465
2108A4081222J179773J637342J712276K497370L404153M469117N961918Q925221
2100D3868392J2677330J6732833R788456o784911j4978554j4677889j0214590
$$ y = [1322049, 1493077, 1571776, 1406042, 1596418, 1719281, 1685573, 1695928, 1702825, 1924336, 1909047, 1908484, 1791962, 1740504, 2062722, 2147694, 2027703, 1891875, 2065955, 2440406, 2457582, 2267743, 2238971, 2523253, 2642731, 2587723, 2690030, 2905563, 3044640, 3028125, 2937647, 3030131, 3194432, 3464986, 3571724, 3775931, 4096233, 4195778, 4231686, 4406613, 4548351, 4647107, 5052943, 5068859, 5240850, 5499713, 5681682, 5957176, 6075225, 6265857, 6846553, 7419922, 7879407, 8290751, 9088283, 10276001, 11293623, 11700211, 12260221, 12827757, 14081222, 15260995, 16898337, 18610613, 21107983, 24512136, 28981253, 34943171, 43868392, 56545722, 73278555, 83067011, 76282100, 61303546, 46625657, 36411067]
2093C6411067p151470n220468m002836k910755k376906j678624j287380q68895
2085A0913733o67796m73945n01323p73698r97377p75261m74624l70469n28875
2076E350365k07275m13129l21037l65668r3211P3370k98438k52634l23957k32353
2066B916033l09632q8489N621j34220j57093j10178M340q3935j47653P2035j09834
2055A856995j6126j51260L0655j77559l9446L4256o7172k23354k9317J25674o2073
2044A281273k15329j7971J38459j08238q2984L6634j18747n074q6462j86556j08619
2033E26386n3198K21740K00723j13970K8235j62637r5213J04781n5625k06811
2023C94411O9837J80994p3577n0393j30908J13893q445o0537k35387j89753K27112
$$ y = [36411067, 29259597, 24039129, 20036293, 17125538, 14748632, 13070008, 11782628, 10913733, 10245937, 9771992, 9270669, 8496971, 7499594, 6724333, 6249709, 5879240, 5350365, 5143090, 4729961, 4408924, 4043256, 3950045, 4023415, 3724977, 3472343, 3148386, 2916033, 2606401, 2517912, 2523533, 2389313, 2232220, 2122042, 2126382, 2042447, 1894794, 1966829, 1856995, 1840869, 1689609, 1720264, 1542705, 1503259, 1537515, 1470343, 1246989, 1217672, 1343346, 1281273, 1065944, 1047973, 1186432, 1078194, 995210, 1031844, 913097, 908023, 821561, 635005, 526386, 473188, 694928, 895651, 781681, 809916, 647279, 552066, 656847, 601222, 394411, 464248, 645242, 571665, 521272, 390364, 504257, 495812, 435275, 199888, 10135, 237247]
2012B37247J75288l8338N6R2523J43999j24985j15692Q324Q3800K940k03945n2480
2000B08737J64496m7956J38513j19942j1425j26954J02371k0645M6939k1871k44343
1989F7920p9585L1459P5720Q2218L3090J25709n3199j62882O250L4234O729J58131
1977C25794p1065N3391j90440k12814L64558J0592r7563n5005r4804J79946j54779
1966E7811n5546L05026j43878j8472r6052O179q7691N9745o174P5057J7373l8364
1954G5014j48772r6442J18484n121N7107l4465P5658N5034J04152o3748k8562
1943A08339j33717q728J23953r2302M148k04632J90487j75827J81080J23037j00729
1932A5109J26216q3705l10053q4778K56608q4177q4151J31829J5562l7033J63442
$$ y = [237247, 412535, 374197, 374253, 466776, 610775, 485790, 370098, 378422, 462222, 465162, 261217, 208737, 373233, 325277, 463790, 343848, 332423, 205469, 307840, 287195, 334134, 312263, 67920, -11665, 19794, 95514, 177732, 210822, 336531, 283332, 120450, 126700, 160934, 167663, 325794, 254729, 308120, 117680, -95134, 269424, 280016, 182453, 127448, 32644, 212590, 57811, 2265, 307291, 163413, 144941, 48889, 55068, -32623, 27122, 20948, 96005, 113378, 75014, -73758, -170200, -51716, -56837, 270, -34195, 41463, 96497, 200649, 136901, 108339, -25378, -34106, 89847, -2455, 1693, -202939, -12452, -188279, -7199, 115838, 15109, 141325, 57620, -252433, -337211, -80603, -164780, -248931, -117102, -101540, -138573, 24869]
1921B4869j04756m8277K33358l7096p5271j31644n1580M9135K67178q6500j14916
1910g5500O4593j93678R8365O9581J18525r6019k24912k2995J79705J07084J99449
1899B24198J5313q4746m3232l3995J5739r3861n5079O82Q9489p984K9421r902
1887D6043J67052j35536L9144j99975q1439K82417o6662k2327J17404j10494j83622
1876a47995q5844O5929o7841Q8095J47051j37919j01129K40570J84187j53453
1866C1651K8437j41427p5699P4183J29437K431k06836J25004J9249q8845J0504
1855i1911J3308o1146N8770N2807q631j58342l0541j684O4178J65912L3144L8218
1843G4082L7854q6493l8353R1507k04519J18199J07829r7409r3845j5222J76083
$$ y = [24869, -79887, -128164, 105194, 68098, -7173, -138817, -190397, -141262, 125916, 39416, -75500, -10907, -204585, -106220, -36639, 81886, -14133, -239045, -262040, -82335, 24749, 224198, 239511, 154765, 111533, 77538, 93277, -584, -55663, -54981, 34508, 26524, 55945, 46043, 213095, 77559, 116703, -83272, -164711, 117706, 51044, 28717, 146121, 35627, -147995, -233839, -167910, -235751, -147656, -605, -138524, -239653, 917, 185104, 31651, 60088, -81339, -157038, -82855, 46582, 49013, -157823, -32819, -13570, -102415, -91911, -78603, -139749, -80979, -28172, -36803, -195145, -225686, -227370, -163192, 2720, 35864, 74082, 111936, 25443, -12910, 78597, -125922, -7723, 100106, 2697, -91148, -106370, 69713]
1832F9713J89041O6282N9258o7736k4610O3965l8532k40005l1186j94854K6769
1821a21895J25211L4425o0660L8764M271N0506l3663L1551j29125O1060P8608
1810G9053j20128n2737j87196o7737L19630j0435l7096j39625K1629J32082M8286
1799a4274l4589m2830J34392j9906j31167J51047K6126j95176J187M466J43590
1788B2866k6694k36j80003P5185M2917r2088J04539L103p9034j31842J75166J80178
1776I4057j96170P6771j33372M9216j09472K12332K3976o2454j53052m1681q2303
1765c22152J37875L3129k5046K6809R3788Q3166k06154J69644L7712j58802k01208
1754c31239j04589Q297K67808L1509M9190N339l1258K0601R8517j43012o615Q5341
$$ y = [69713, 258754, 325036, 384294, 316558, 291948, 355913, 317381, 77376, 46190, -148664, -121895, 3316, 37741, -22919, 15845, 20116, 70622, 36959, 68510, -60615, 445, 79053, -41075, -93812, -281008, -348745, -29115, -39550, -76646, -216271, -194642, -62560, -14274, -48863, -91693, 42699, 22793, -108374, 42673, 68799, -126377, -125190, -120724, 22866, -3828, -4064, -184067, -108882, -65965, -158053, -53514, -50411, -129445, -261287, -86121, 94057, -102113, -25342, -158714, -109498, -218970, -6638, 17338, -45116, -198168, -239849, -322152, -184277, -151148, -176194, -149385, -55597, 27569, -178585, -8941, 28771, -130031, -331239, -435828, -427531, -159723, -128214, -79024, -73685, -104943, -84342, 14175, -128837, -135452, -50111]
1742e0111r5211N2025k5939K02871j02141j58372J93438q0350J22814o6127m4941
1731e2044m2443j16110r3396Q9549n17J7270J28382L0253O2622j05807j49886
1720b32127J57387o3526p1132k5359K26457Q32j74653J30467j99686J1008J38378
1709a01954n0427j63913J51772J0803j78664N0567K9120P2476o3231R9676k5184
1698a68959K091J19373N8125J2991R2629j49459j58845q4203k740L5832M885K33654
1686d626l2971L981N7166k6419k47175k4489K99594l1849j75988R6476j9274O9051
1674c6523j2824r0645k0674J52723n234j40945j22083J37729o1994p0982p5586
1663c47038J10077K02571J52286j18940j99804p9630M0958J28074K56917k57265
$$ y = [-50111, -145322, -93297, -119236, 83635, -18506, -176878, 16560, -63790, 59024, -7103, -52044, -94487, -210597, -303993, -214444, -214961, -197691, -69309, -39056, 23566, -82241, -232127, -74740, -138266, -209398, -234757, -8300, -7468, -182121, -51654, -251340, -240332, -101954, -152381, -316294, -164522, -153719, -332383, -281816, -252696, -180220, -243451, -143775, -168959, -166868, -47495, 10630, 23621, 116250, -33209, -192054, -276257, -278997, -243165, -238280, -4626, -37597, -33616, 23550, -2869, -250044, -274533, 25061, -6788, -182776, -86300, -105574, -36523, -49347, -139992, -160666, -7943, -13177, -154122, -276205, -138476, -200470, -271452, -347038, -236961, -34390, 117896, -1044, -200848, -280478, -239520, -111446, 145471, -111794]
1653a11794r8887p9450p85K82987j56211L7784J02516k592q5401o0760q1673l3044
1641b87310J41272J46894n8961K1242j87781r475M1567K3228K7074q4032l565
1630b29847J6677j49259R6698J81736Q4666K7073j39460q3651k0643J01113P2468
1619d2429N5723j50288K8747M9134j9615L4660P33J98326j12398o8458J3691o3031
1607g5205K78n9012J06385q8556j27121o345K00393j93055K48J64474j06988l7993
1595b22497j93439k174K96738J57915j27164K0536L8305l3668o7101K2931l3113
1584a42731J16760J29668q9103K6872L6426p3211J02882k39685l9772J575Q1668
1573h8651J4649M5500L657o7971k34036p8624J19584J19227n820j1161N463o706
$$ y = [-111794, -210681, -290131, -290916, -7929, -164140, -126356, -23840, -26432, -111833, -172593, -254266, -287310, -146038, 856, -58105, -36863, -224644, -234119, -192552, -169324, -142250, -226282, -229847, -213170, -362429, -265731, -83995, 671, 27744, -111716, -195367, -216010, -114897, -42429, 13294, -136994, -108247, -59113, -78728, -44068, -43335, 154991, 42593, -25865, -12174, -75205, -74927, -133939, -27554, -116110, -243231, -249576, -49183, -242238, -241990, -77516, -184504, -222497, -415936, -418110, -121372, 36543, -90621, -70085, -31780, -65448, -132549, -109618, -142731, -25971, 103697, 14594, 41466, 77892, 4681, 107563, -132122, -171894, -170319, -88651, -74002, -28502, -24845, -92816, -326852, -405476, -285892, -166665, -172485, -183646, -178183, -184889]
1561a84889J12093j0497k5034q1652k83496J07273K49908l2047J45972Q3062j07380
1550b6687l42258R9996K72560L477J7746p7993j51342O9514o3176j0942J54992
1539e4113m3309J1236K5512j2272p1565J25870K2895k52021M0893L91243j86007
1528a638r3297J62944J2334j95269j4152p9768j3248o011k14646M6681M08561
1517A2491n5434r5505n6542j93363k9639J07138K05500j8862n2640M1813J07291
1506b7752j13739J13263K4322Q2816N197o0736K8950o940k08876J87377L6110
1495E9992q9164P1802J16240q3167k14901q8074N7484O6977K43024k35613R897
1484h5503O3123p6941r5969N5355J6816l4654J88826O7616p1817l6147l1631j602
$$ y = [-184889, -72796, -83293, -108327, -189979, -473475, -366202, -116294, -148341, -2369, 80693, -26687, -368945, -268949, 3611, 7088, 24834, -53159, -204501, -134987, -198163, -209105, -54113, -97422, -86186, -60674, -72946, -144511, -18641, 4254, -247767, -206874, 184369, -1638, -94935, 68009, 80343, -114926, -129078, -208846, -222094, -228105, -442751, -396070, 12491, -42943, -138448, -194990, -388353, -417992, -310854, -105354, -124216, -176856, -135043, -27752, -141491, -28228, -3906, 78910, 84107, 23371, 52321, 45381, -163495, 23882, 59992, -29172, 42630, 158870, 75703, -139198, -227272, -169788, -102811, 140213, -95400, -85503, -22380, -99321, -195290, -139935, -123119, -157773, 31053, 98669, 26852, -9295, -40926, -42528]
1472d2528r6499M1467m1800q6435J39869K03496k94873Q9743r8211n6985J41425
1461a01331j8682Q0724j26742J84995L3774Q5721j85392p5328k6640R9001O3861
1450A3961K7296r8659J748J5237r4842J9891j7182k25395N0788K34095J3028J3891
1438d6143J01274L6271J0834o4463N5732J1934j16862o4507j5854k4829j622M483
1426a13752J26015o2146M4669P2827j31590j95620j59399P4865J92745j32343
1416b83729j50168J52643P3847N3537m3419K1036J16360j64248q0255L0707K33880
1405c9809R981j05600M0393J4618j28794r2814J74810L099J3177l4809j702Q8479
1393e8971Q6957k179K9395K4080R1780Q4471j73300j42022M3265p0131O1467P9905
$$ y = [-42528, -139027, -97560, -139360, -225795, -85926, 117570, -177303, -87560, -185771, -242756, -101331, -120013, -39289, -166031, 18964, 52738, 138459, -46933, -122261, -148901, -49900, 13961, 41257, -57402, -55654, -40417, -135259, -115368, -132550, -357945, -307157, -73062, -60034, -46143, 55131, 91402, 102236, 37773, 93505, 105439, -11423, -75930, -91784, -116613, -118235, -113752, 12263, -49883, -5214, 67613, -63977, -259597, -418996, -344131, -151386, -283729, -433897, -281254, -207407, -153870, -197289, -176253, -59893, -224141, -304396, -273689, -39809, -29828, -135428, -95035, -80417, -209211, -302025, -127215, -124116, -110939, -145748, -147450, -58971, 27986, 25807, 55202, 79282, 171062, 255533, 82233, -59789, -16524, -86655, -25188, 54717]
1381E4717n5285j6743q1547J9414L107J1700M6150o2492J5823P1572j01297K51840
1369A56959P4604q5553k401L8412k08748r4893K09225o2113l2220k36376J93403
1358d9701J46640j92596M5321L4373l9405m0639L1911J2431j43157K20240J48482
1347A73900k99734j12231J93026o091J59827Q2619j75079k88818j69981K24107
1337b18455n4975J33142L4651O4079J93905j59510k11581n0442J24245J3643J17122
1326a4176o2465k7145R7412M517j33876o4076J12589q321m6732j16751R185j2486
1314b62325J15059J09854o6902o8343L7879K46664j10387L2883M2403l26809k5369
1303b75393K16704k0878j27236L0489J07560j49492m963Q808N0743n620J29179
$$ y = [54717, -568, -17311, -98858, -79444, -76337, -64637, -18487, -80979, -65156, 6416, -94881, 156959, 231563, 146010, 143609, 182021, -26727, -121620, 87605, 25492, -6728, -243104, -49701, 96939, -95657, -50336, -15963, -55368, -96007, -64096, -51665, -194822, 25418, 173900, -125834, -238065, -45039, -51130, 108697, 191316, 16237, -272581, -442562, -218455, -273430, -140288, -105637, -41558, 152347, -7163, -218744, -269186, -144941, -131298, -14176, -76641, -103786, -6374, -1857, -135733, -199809, -87220, -95541, -142273, -259024, -249839, -262325, -147266, -37412, -104314, -172657, -134778, 111886, 1499, 34382, 76785, -250024, -275393, -58689, -79567, -206803, -176314, -68754, -218246, -223209, -214401, -163658, -169278, -40099]
1292d0099K11561r3181J51834q5669r7931J9621k12084J42068L9150J8167j97604
1281a44167j98027p717R7681K8854j65919J37993K7599J27685Q0989K58644j53115
1270I0500j61198Q3815o80J39005k41673J03103L7595k39769N3332Q9727M6272
1259B9j03221J32344k5500k5857o2434N5809o6321R91k14120J53332m3811O0764
1247a37995j34254m920J44945l2273M9898N4404j25575L0007N7936j15278l1185
1236b44290r9842J36694k3303K07697j15147j79186J65760J04980k42035L2384
1226b56288j14308O0841K14318Q462J34959r9485o5114R1850n3572J01338j84225
1215a61224M586r0039Q1857N2106J38514l058k9006K13016q074q0007k64018j19613
$$ y = [-40099, 171462, 78281, 230115, 144446, 46515, 66136, -145948, -3880, 35270, 53437, -144167, -342194, -349911, -252230, -223376, -389295, -251302, -223703, -96018, -15029, 243615, 90500, -70698, 13117, 12437, 151442, -90231, 12872, 50467, -189302, -135970, -46243, 29, -103192, 29152, 3652, -22205, -84639, -28830, -95151, -94160, -308280, -154948, -198759, -137995, -272249, -277169, -132224, -164497, -114599, -60195, -185770, -155763, -97827, -213105, -244290, -344132, -207438, -230741, -23044, -138191, -317377, -151617, -46637, -288672, -256288, -370596, -309755, -95437, -86975, 47984, -51501, -116615, -24765, -78337, 23001, -161224, -156638, -246677, -164820, -112714, 25800, 22742, -6264, 206752, 198678, 118671, -145347, -264960]
1203b64960K04593R7142P2816j51060J29773J82160j71439M2306j99788k1017
1193g9474N427q0364M8810o7698R4032p411P8072q7980R3783l3151j10311o3557
1181b09822O9492L7583J15138K12653j27175L3022N2452k52317O5645R0497o1734
1170B5434J3497L0328K8619j64870K9855n9354Q2293o2743J17201m4496r0913
1159i5149j03587M787L7072Q9533P6958j52983M6971J71855m9107K7197R9988
1148A53535k4822j60099j58410j77868J50435J19801q281j61642R3069R6877M0656
1137c6749r7110n1497R5960j23513J04982J13757L0328n7097l5613N9947n2194
1126d8799k9741O543l2113N666L8514l092r9851K65685j57125m3091n2836q0775
$$ y = [-264960, -60367, 36775, 109591, -41469, 88304, 270464, 99025, 141331, -58457, -79474, -74047, -154411, -105601, -173299, -79267, -86678, -8606, -96586, -2803, -35954, -146265, -209822, -140330, -102747, 12391, 225044, 97869, 130891, 183343, -68974, -3329, 87168, 25434, 38931, 69259, 97878, -66992, -37137, -96491, -14198, -76941, 40260, -4236, -95149, -198736, -193949, -156877, -67344, 9614, -143369, -96398, 75457, 26350, 53547, 153535, 128713, -31386, -189796, -367664, -217229, -97428, -105709, -267351, -174282, -77405, -36749, -133859, -185356, -89396, -212909, -107927, 5830, 36158, -20939, -56552, 3395, -48799, -78540, -71997, -104110, -98444, -59930, -63022, -162873, 102812, -54313, -97404, -150240, -231015]
1114b31015K68453J98497j63045j6777P5500j29004j8934J1168J0307n533J05146
1103A04763p5436j22990J8639K9044J41198p1354p4933q5048N153j74145J05680
1092a99429Q1048O7132j05943j14005N6835J84343M5261m6732O7605q2848J18427
1081G1694k09963J95808j09043l7065l9607p1234j0181J10828O074n7177J32425
1070a7441J38165k30896j14186O1746l6848O3947J18906K2193l4830J63604k1881
1059A12479l0156k89204k35924J94031j0288P3445n9062n6934N8033k2390K9959
1048b36011K54137r0326p8250J64923J01450M0988j43723r0786p3385Q842Q5948
1037e6193N0615N8628j1376r5098J22410l292j85183R834l247M7569K1522j3829
$$ y = [-231015, 37438, 235935, 72890, 56113, 131613, 2609, -16325, -5157, 5150, -383, 104763, 29327, -93663, -75024, -45980, 95218, 23864, -51069, -136117, -130964, -305109, -199429, -118381, -51249, -157192, -271197, -214362, -30019, 15242, -31490, 36115, -46733, 71694, -138269, 57539, -51504, -88569, -128176, -199410, -209591, -98763, -92689, -149866, -17441, 120724, -110172, -224358, -162612, -199460, -135513, -16607, 5586, -29244, 134360, 112479, 82323, -206881, -442805, -248774, -259062, -185617, -244679, -301613, -243580, -265970, -236011, 18126, -72200, -150450, 14473, 115923, 156911, 13188, -77598, -150983, -142141, -56193, -5578, 53050, 41674, -53424, 68986, 65694, -119489, -109655, -112902, -65333, -43811, -57640]
1025e7640j8749j18350Q9075o8900N6974k4851k4625k9217N1049k3622K14083
1014D5227J78801j79803o6046j39440K34480j60219j93662J41682m9292J42901
1004d5371J04249n737k04563J9289o0022J29709l452N9293p721o2382K3271j56866
992b10303J47990J90133j89330O0624L4582L9694j05075l2004L7621j55671J37896
981d3843J84433j2719j21230r2675O5747n9691q7948j61416J87801J28792j42096
970a54845Q5759K185K35777j31276o6715O9636m7909K36897J60494j17096J9602
959B92509j53584J6648l6870r8425j07197j2316k5767J0460J20401k5327R6196
948G6728j57951J3454K49333m4416j4039M4837n1167K1804J11076J3765j9902
$$ y = [-57640, -76389, -194739, -105664, -174564, -117590, -142441, -167066, -196283, -145234, -168856, 45227, 224028, 44225, -21821, -161261, 73219, -87000, -280662, -138980, -188272, -45371, 58878, 53141, -151422, -132133, -192155, -62446, -65898, -6605, -14326, -76708, -53437, -210303, -62313, 127820, -61510, -886, 33696, 73390, -31685, -63689, -26068, -181739, -43843, 140590, 127871, 6641, -86034, -20287, -79978, -167926, -329342, -141541, -12749, -154845, -69086, -66901, 168876, 37600, -29115, 40521, -7388, 229509, 390003, 272907, 292509, 138925, 155573, 118703, 20278, -86919, -99235, -125002, -114542, 5859, -19468, 76728, -81223, -67769, 181564, 137148, 123109, 167946, 116779, 138583, 249659, 263424, 243522]
937B43522r7344q3749j33539J76288p2496K46952J4039l7713j04795j71135J51151
926A31181J9605N1765k0311j2807m4974L8698j82879j14836L9144P6512r2191
915a11093N1074J05933l037L8693L249j22355K7669o315R5422j11867q3288Q2727
903c3188j8093j40606k9872J83812K5801o11Q2436r5599L4200M6876J72289L5510
891B62955n2281l5810j95200M5421m3354J41574L8183j27983j12731K9860K0902
880b8464J58546j6577L0990q1453P7741m3327L539k8721r6397O3488K9735j32738
868f3638n0863K78532j7059O2656j91045k1468k8873J43945Q856q276r0747j006
856B1014J14805K9469J16848k04433m9906J56283J1481n625j27484j09995k5655
$$ y = [243522, 146178, 62429, -71110, 105178, 32682, 279634, 293673, 255960, 151165, -19970, 131181, 150786, 202551, 182240, 169433, 124459, 163157, -19722, -134558, -95414, -18902, -111093, -60019, 45914, 42877, 81570, 84819, -37536, -9867, -16182, 79240, -32627, -115915, -33188, -51281, -191887, -221759, -37947, -12146, -12757, 69679, -25920, 8280, 55156, 227445, 262955, 210674, 174864, -20336, 25085, -18269, 123305, 161488, 33505, -79226, -49366, -28464, 130082, 113505, 144495, 63042, 140783, 97456, 100995, 72274, -24123, 39365, 69100, -63638, -114501, 164031, 146972, 209628, 18583, -2885, -31758, 112187, 121043, 112767, 22020, 21014, 135819, 165288, 282136, 77703, 27797, 184080, 195561, 189936, 62452, -47543, -73198]
845g3198R1719Q9036n2912P9244j09219N5051J4344j37602Q3517O7121j29030
834b1929n1458J0379J19448J13948j69715N39l2730k7896j16247K6024J42280
823g357K2601j06625l4063K59067k8957r9803O5388N2178j8763O9194l2677j43277
811c094j7397K099Q9518k0026M6920l6095j28827N3476K255J6538O5031j62225
799i1827O4812k06j42980K25700k5266J35699K15781k42227q0764R2957q8818
788F2861n7004J490J28271K8666r1328p3489l0715q9476J40824m6912J2386m7853
776f2279J68114J02240k43831r8213j7374K08524J98045j06041R9528j11442K8840
765A66111j13661q6142J00210n3816p2002N3373R1772k6200J90628j48223k9279
$$ y = [-73198, 18521, 107557, 54645, 133889, 24670, 79721, 94065, -43537, 39980, 107101, -21929, -73387, -63008, 56440, 170388, 673, 1212, -31518, -59414, -175661, -149637, -7357, 15244, -91381, -125444, 133623, 104666, 4863, 70251, 122429, 103666, 172860, 140183, -3094, -20491, -18392, 71126, 51100, 98020, 61925, -66902, -13426, -11171, 5367, 70398, -91827, -27015, -27221, -170201, 55499, 30233, 165932, 381713, 139486, 58722, 151679, 62861, 5857, 7347, 135618, 164284, 72956, -533, -31248, -120724, 20100, -26812, -14426, -62279, 105835, 208075, -35756, -133969, -151343, 57181, 255226, 149185, 248713, 137271, 166111, 52450, -33692, 66518, 12702, -59300, -5927, 85845, 59645, 250273, 102050, 72771]
754G2771o0794j11558J70181q2378O0134J32422k04648O7274P6100m7952J11981
743A83533j18599j13680Q4361o0863N5984J38485l5087j25713m8541q7313K07081
732G9648Q7951j89802l0411k5097J77216O671j0942j10958N9146j687j83258K70905
720A29382P4474j96689q8785J75474j75534O0936P7320l8764o9894J51945r4209
709E656J6452j33992N6250p6991Q5612Q7497K02256k0940m3095n978m3483M7159
697A76403k5493q4182j7290k30170J97567J17814k45014K10590j75344n396K8896
686e1619J96365J9113O0261n5546k4331p9294j06922J27208J23222J31272j62393
675A77336j68107K3626j7801J56310Q8513k55470o450M1055j39472Q8688n2838
$$ y = [72771, 11977, -99581, 70600, -11778, 48356, 180778, -23870, 43404, 119504, 71552, 183533, 64934, -48746, 35615, -25248, 30736, 169221, 134134, 8421, -40120, -127433, 79648, 167599, -22203, -52614, -77711, 99505, 106176, 95234, -15724, 43422, 41735, -141523, 129382, 203856, 7167, -81618, 93856, -81678, -20742, 56578, 17814, -52080, 99865, 5656, 22108, -111884, -55634, -132625, -47013, 40484, 242740, 221800, 178705, 172727, 129244, 176403, 150910, 66728, 49438, -180732, 16835, 134649, -110365, 100225, -75119, -80515, -51619, 144746, 163859, 224120, 168574, 144243, 64949, -41973, 85235, 208457, 339729, 177336, 9229, 32855, 15054, 171364, 259877, 4407, -2043, 39012, -100460, -11772, -64610]
664f4610J27234l803k5842l1173p8439J94724l0828p9159J99110j63818O0695
653A04091K2115m0950J22223J58228r9159l1501n59K7837L4830q6325n648p3510
641A31672J35838o1771j37540J61302n090l1269j78495q165L2516l083j72166
630a36251N5766P7712O976K9372j4840Q8954j18391J96857L9819k07262N3080
619G1792r9875l5015K7139j11014J08231J21700N4229j80948J86557J42283o6299
608B18780k0995j43687k3477M3626J17539K2783r1545j48658J13089K8583j01859
597A4179M084J89367Q9461n9574j07637l0262P562J85884n5601j16734J02873
586B23602J48523j21524k03189Q4566O3553j46197J06009O6953j4739j19786j9186
$$ y = [-64610, 62624, 58821, 32979, 1806, -76633, 118091, 87263, 8104, 207214, 43396, 104091, 126206, 85256, 207479, 365707, 266548, 235047, 234488, 262325, 297155, 210830, 205182, 131672, 267510, 205739, 68199, 229501, 224411, 193142, 14647, 6482, 38998, 35915, -136251, -80485, -2773, 4203, 33575, 18735, 107689, -10702, 186155, 225974, 18712, 71792, -28083, -63098, -35959, -146973, -38742, 82958, 137187, -43761, 142796, 285079, 218780, 197785, 54098, 30621, 74247, 191786, 214569, 123024, -25634, 87455, 116038, 14179, 18263, 207630, 297091, 237517, 129880, 99618, 107180, 293064, 237463, 120729, 223602, 372125, 250601, 47412, 131978, 195531, 49334, 155343, 222296, 207557, 87771, 68585]
575F8585l3301q6341P1559Q5851L16261o7091l4795n9825J2876K1913l4333j37932
563A23427J25693l7280j69043P8528p165n2840r7975M7273J95871L3534j77301
552F2722j54198j56277J58409J33933p8950J39221m1107J02723J32559q2199k49687
541c2851J07550L721l6636O6593R0256l16560n2819J26715Q3770L1890j31888
530f0259k7450O9404J31543K8805K8845k0386j31398p4460N1412r6092L961J84165
518H8090R1173j14906j0939L0489j73646j50370J64687j1822J41406R2527l7345
507A09344P8945L2267J36591k32435q7598Q5121R9052J41423k01665q5405J18131
496A93771K3156K8793j17963m0813N2333J63837j42474l4535J56954l5231K0962
$$ y = [68585, 35284, -51057, 20502, 106353, 422614, 355523, 320728, 260903, 273779, 295692, 261359, 123427, 249120, 211840, 42797, 121325, 114160, 61320, -36655, 10618, 206489, 240023, 62722, -91476, -247753, -89344, 44589, -34361, 104860, 63753, 166476, 299035, 216836, -32851, 74699, 78420, 41784, 108377, 198633, -117927, -170746, -44031, 39739, 71629, -60259, -87709, -18305, 113238, 142043, 170888, 150502, 19104, -55356, -3944, -100036, -96075, 88090, 179263, 64357, 53418, 83907, -89739, -240109, -75422, -87244, 54162, 146689, 109344, 188289, 220556, 357147, 124712, 37114, 122235, 221287, 362710, 161045, 75640, 193771, 216927, 245720, 127757, 86944, 139277, 303114, 160640, 126105, 283059, 247828, 268790]
$$ [...]
##END NTUPLES=NMR SPECTRUM
##END=
