##TITLE=1H_EC-3302(2)
 CDCl3
 8 sc, 
 25.10.2023
##JCAMPDX= 6.0         $$ Bruker NMR JCAMP-DX V2.0
##DATA TYPE= NMR SPECTRUM
##DATA CLASS= NTUPLES
##ORIGIN= UXNMR, Bruker Analytische Messtechnik GmbH
##OWNER= root
$$ XWIN-NMR		Version 3.5
$$ Wed Oct 25 14:28:51 2023 Russian Standard Time (UT+4h)  she@DPX200
##.OBSERVE FREQUENCY= 200.13135
##.OBSERVE NUCLEUS= ^1H
##.ACQUISITION MODE= SIMULTANEOUS
##.ACQUISITION SCHEME= undefined
##.AVERAGES= 8
##.DIGITISER RES= 18
##SPECTROMETER/DATA SYSTEM= spect
##.PULSE SEQUENCE= zg30
##.SOLVENT NAME= D2O
##.SHIFT REFERENCE= (INTERNAL, D2O, 0, 15.77)
##AUDIT TRAIL= $$ (NUMBER, WHEN, WHO, WHERE, WHAT)
$$ ##TITLE= Audit trail, XWIN-NMR		Version 3.5
$$ ##JCAMPDX= 5.01
$$ ##ORIGIN= Bruker BioSpin GmbH
$$ ##OWNER= she
$$ F:/spectra/data/she/nmr/H-F/1/pdata/1/auditp.txt
$$ ##AUDIT TRAIL=  $$ (NUMBER, WHEN, WHO, WHERE, WHAT)
(   1,<2023-10-25 14:25:52.12 +0400>,<she>,<DPX200>,
      <created by zg, POWCHK disabled, PULCHK disabled
       configuration hash MD5:
       00 E9 B6 7A A2 85 ED C7 34 08 36 98 17 FE 4E 26
       data hash MD5: 16K
       7B 8B 04 07 D9 BC 7B 25 DC A1 06 AB A2 DF B9 C0>)
(   2,<2023-10-25 14:25:54.35 +0400>,<she>,<DPX200>,
      <Start of raw data processing
       efp BC_mod = 2 LB = 0.24 FT_mod = 6 PKNL = 1 PHC0 = -23510.54 PHC1 = 13.6527 SI = 16K 
       data hash MD5: 16K
       A0 F5 04 C7 0B 9E E5 8E A4 BA AF 85 EF 4F 4E B8>)
(   3,<2023-10-25 14:26:18.28 +0400>,<she>,<DPX200>,
      <pk PHC0 = -1.23158 PHC1 = 1.8 
       data hash MD5: 16K
       0C 2F E7 99 C3 04 6A BB A9 A0 E8 45 5C 4E B0 09>)
(   4,<2023-10-25 14:26:21.53 +0400>,<she>,<DPX200>,
      <abs ABSG = 5 
       data hash MD5: 16K
       12 FF 65 40 3E 6D 06 A2 25 D9 65 EC DE D4 4E 90>)
$$ ##END=
$$ 
$$ hash MD5
$$ 65 29 9F D7 B1 95 EC EB A7 D3 1A C3 2A B2 0C D9
##$RELAX= 
##$RELAX= 
##$RELAX= 
##$RELAX= 
##$RELAX= 
##$RELAX= 
$$ Bruker specific parameters
$$ --------------------------
##$DU= <F:/spectra>
##$EXPNO= 1
##$NAME= <H-F>
##$PROCNO= 1
##$TYPE= <nmr>
##$USER= <she>
##$AMP= (0..31)
100 100 100 100 100 100 100 100 100 100 100 100 100 100 100 100 100 100 
100 100 100 100 100 100 100 100 100 100 100 100 100 100 
##$AQSEQ= 0
##$AQ_mod= 1
##$AUNM= <au_zg>
##$AUTOPOS= <>
##$BF1= 200.13
##$BF2= 200.13
##$BF3= 200.13
##$BF4= 200.13
##$BF5= 200.13
##$BF6= 200.13
##$BF7= 200.13
##$BF8= 200.13
##$BYTORDA= 1
##$CFDGTYP= 0
##$CFRGTYP= 5
##$CHEMSTR= <none>
##$CNST= (0..31)
1 1 145 1 1 1 1 1 1 1 1 1 1 1 1 1 1 1 1 1 1 1 1 1 1 1 1 1 1 1 1 1 
##$CPDPRG= <>
##$CPDPRG1= <>
##$CPDPRG2= <>
##$CPDPRG3= <>
##$CPDPRG4= <mlev>
##$CPDPRG5= <mlev>
##$CPDPRG6= <mlev>
##$CPDPRG7= <mlev>
##$CPDPRG8= <mlev>
##$CPDPRGB= <>
##$CPDPRGT= <>
##$D= (0..31)
0 1.2 0 0 0 0 0 0 0 0.06 0 0.03 0 0 0 0 0.0002 0 0 0 0 0 0 0 0 0 0 0 0 
0 0 0 
##$DATE= 1698229551
##$DBL= (0..7)
120 120 120 120 120 120 120 120 
##$DBP= (0..7)
150 150 150 150 150 150 150 150 
##$DBP07= 0
##$DBPNAM0= <>
##$DBPNAM1= <>
##$DBPNAM2= <>
##$DBPNAM3= <>
##$DBPNAM4= <>
##$DBPNAM5= <>
$$ [...]
##$SUBNAM3= <"">
##$SUBNAM4= <"">
##$SUBNAM5= <"">
##$SUBNAM6= <"">
##$SUBNAM7= <"">
##$SUBNAM8= <"">
##$SUBNAM9= <"">
##$SW= 18.05172834244
##$SWIBOX= (0..15)
0 0 2 0 0 0 0 0 0 0 0 0 0 0 0 0 
##$SW_h= 3612.71676300578
##$TD= 16384
##$TD0= 1
##$TE= 0
##$TE2= 300
##$TE3= 300
##$TEG= 300
##$TL= (0..7)
0 120 120 120 120 120 120 120 
##$TP= (0..7)
150 150 150 150 150 150 150 150 
##$TP07= 0
##$TPNAME0= <>
##$TPNAME1= <>
##$TPNAME2= <>
##$TPNAME3= <>
##$TPNAME4= <>
##$TPNAME5= <>
##$TPNAME6= <>
##$TPNAME7= <>
##$TPOAL= (0..7)
0.5 0.5 0.5 0.5 0.5 0.5 0.5 0.5 
##$TPOFFS= (0..7)
0 0 0 0 0 0 0 0 
##$TUNHIN= 0
##$TUNHOUT= 0
##$TUNXOUT= 0
##$USERA1= <user>
##$USERA2= <user>
##$USERA3= <user>
##$USERA4= <user>
##$USERA5= <user>
##$V9= 5
##$VALIST= <valist>
##$VCLIST= <CCCCCCCCCCCCCCC>
##$VD= 0
##$VDLIST= <DDDDDDDDDDDDDDD>
##$VPLIST= <PPPPPPPPPPPPPPP>
##$VTLIST= <TTTTTTTTTTTTTTT>
##$WBST= 1024
##$WBSW= 4
##$XGAIN= (0..3)
0 0 0 0 
##$XL= 0
##$YL= 0
##$YMAX_a= 350794
##$YMIN_a= -452715
##$ZGOPTNS= <>
##$ZL1= 120
##$ZL2= 120
##$ZL3= 120
##$ZL4= 120
##$ABSF1= 15.64993
##$ABSF2= -2.401917
##$ABSG= 5
##$ABSL= 3
##$ALPHA= 0
##$AQORDER= 0
##$ASSFAC= 0
##$ASSFACI= 0
##$ASSFACX= 0
##$ASSWID= 0
##$AUNMP= <proc_1d>
##$AZFE= 0.1
##$AZFW= 0.1
##$BCFW= 0
##$BC_mod= 2
##$BYTORDP= 0
##$COROFFS= 0
##$CY= -3
##$DATMOD= 1
##$DC= 0
##$DFILT= <>
##$DTYPP= 0
##$F1P= 0
##$F2P= 0
##$FCOR= 1
##$FTSIZE= 16384
##$FT_mod= 6
##$GAMMA= 0
##$GB= 0
##$INTBC= 1
##$INTSCL= 3.70164e-10
##$ISEN= 128
##$LB= 0.24
##$LEV0= 0
##$LPBIN= 0
##$MAXI= 10000
##$MC2= 0
##$MEAN= 0
##$ME_mod= 0
##$MI= 1.114404
##$NCOEF= 0
##$NC_proc= -7
##$NLEV= 6
##$NOISF1= 3.799351
##$NOISF2= 2.8
##$NSP= 0
##$NTH_PI= 0
##$NZP= 0
##$OFFSET= 15.77003
##$PC= 1
##$PHC0= -23511.77
##$PHC1= 15.4527
##$PH_mod= 1
##$PKNL= yes
##$PPARMOD= 0
##$PSCAL= 0
##$PSIGN= 0
##$REVERSE= no
##$SF= 200.130000302945
##$SI= 16384
##$SIGF1= 3
##$SIGF2= 2
##$SINO= 5.538805
##$SIOLD= 16384
##$SREGLST= <1H.CDCl3>
##$SSB= 0
##$STSI= 16384
##$STSR= 0
##$SW_p= 3612.71676300578
##$SYMM= 0
##$S_DEV= 0
##$TDeff= 16384
##$TDoff= 0
##$TI= <>
##$TILT= no
##$TM1= 0
##$TM2= 0
##$TOPLEV= 0
##$USERP1= <user>
##$USERP2= <user>
##$USERP3= <user>
##$USERP4= <user>
##$USERP5= <user>
##$WDW= 1
##$XDIM= 16384
##$YMAX_p= 434481654
##$YMIN_p= -507168
$$ End of Bruker specific parameters
$$ ---------------------------------
##NTUPLES= NMR SPECTRUM
##VAR_NAME=  FREQUENCY,     SPECTRUM/REAL,   SPECTRUM/IMAG
##SYMBOL=    X,             R,               I
##VAR_TYPE=  INDEPENDENT,   DEPENDENT,       DEPENDENT
##VAR_FORM=  AFFN,          ASDF,            ASDF
##VAR_DIM=   16384,         16384,           16384
##UNITS=     HZ,            ARBITRARY UNITS, ARBITRARY UNITS
##FACTOR=    0.220516191357247, 1,           1
##FIRST=     3156.05611301376, 0,            0
##LAST=      -456.660649992015, 0,           0
##MIN=       -456.660649992015, -507168,     0
##MAX=       3156.05611301376, 434481654,    0
$$ Real data points
##PAGE= N=1
##DATA TABLE= (X++(R..R)), XYDATA
$$ [...]
$$ plain form
11820 -166161 -86155 -132314 -57399 32110 26706 -96954 78917 29300 -26841 65941 -149611
11809 -149611 -37401 63457 -8743 -158071 -86063 51980 75105 -91460 -244978 -114071
11799 -114071 -89309 55636 148288 33759 -14752 -34325 -111032 -120355 -37374 134860 -27128
11788 -27128 -157900 -87207 -78247 -157116 -299877 -333257 -185149 -21636 89704 56842 176290
11777 176290 84782 -55439 -170818 -145451 -101512 -170402 -27711 -188950 -79941 176999
11767 176999 -116148 14728 -63745 -91673 -57917 50555 48395 -43797 -240068 -152868 -133557
11756 -133557 -265599 -147577 -96120 -8891 -23960 77406 195991 93302 62946 -102042
11746 -102042 -242083 -230525 -225507 -10113 -65699 -101865 -133090 -131858 128418 164938 -31254
$$ packed form
11820a66161Q0006m6159P4915Q9509n404j23660J75871m9617n6141R2782k15552
11809a49611J12210J00858p2200j49328P2008J38043K3125j66565j53518J30907
11799a14071K4762J44945R2652j14529m8511j9573p6707r323Q2981J72234j61988
11788b7128j30772P0693Q960p8869j42761l3380J48108J63513J11340l2862J19448
11777A76290r1508j40221j15379K5367M3939o8890J42691j61239J09009K56940
11767A76999k93147J30876p8473k7928L3756J08472k160r2192j96271Q7200J9311
11756a33557j32042J18022N1457Q7229j5069J01366J18585j02689l0356j64988
11746a02042j40041J1558N018K15394n5586l6166l1225J232K60276L6520j96192
$$ plain form
11735 -31254 82980 19505 -2531 39728 -111724 -21132 63590 -58039 -123486 -274487 30670
11724 30670 131318 26348 -90060 -58614 -112301 -128401 -41582 175321 108093 83004 127391
11713 127391 -4570 44851 37055 -145889 -81635 -38666 -294852 -308468 7271 22525 -138570
11702 -138570 -70136 3097 -11381 -20462 -64471 -117639 -16010 88781 28461 4392 -103886
11691 -103886 -74134 -35563 -84323 -157458 -73911 -34401 23199 -16344 62688 26123 197683
11680 197683 210768 85132 -143401 -142091 -141638 -44835 -268843 -287182 -52518 -142480 -77907
11669 -77907 -48690 167566 84457 17338 -248364 -237445 5377 35759 -208157 -196574 -211576
11658 -211576 -152442 108528 171466 -70122 22718 129654 80531 -36526 -32731 -146560 -152747
$$ packed form
11735c1254J14234o3475k2036M2259j51452R0592Q4722j21629o5447j51001L05157
11724C0670J00648j04970j16408L1446n3687j6100Q6819K16903o7228k5089M4387
11713A27391j31961M9421p796j82944O4254M2969k56186j3616L15739J5254j61095
11702a38570O8434P3233j4478r081m4009n3168J01629J04791o0320k4069j08278
11691a03886K9752L8571m8760p3135Q3547L9510N7600l9543P9032l6565J71560
11680A97683J3085j25636k28533J310M53R6803k24008j8339K34664q9962O4573
11669g7907K9217K16256q3109o7119k65702J0919K42822L0382k43916J1583j5002
11658b11576N9134K60970O2938k41588R2840J06936m9123j17057L795j13829o187
$$ plain form
11647 -152747 -91390 47660 7903 32023 74673 185080 179933 -84226 -160387 42047 -11807
11636 -11807 -210187 -217797 -139157 -124332 -270363 -215480 -35523 -177322 -136487 -49082 77116
11625 77116 -55931 -209606 -142465 -168583 -148722 -145778 -88541 -25549 -108138 -63858 -17825
11614 -17825 -23378 -43702 -225702 -154106 -85165 138898 135393 -118239 -188992 17796 -18136
11603 -18136 -42353 -83442 -120524 -7942 86095 51541 47177 52963 135716 62048 42509 -167872
11591 -167872 -291528 -103535 -103149 -141258 -350899 -144812 -2458 17945 -125361 -229287
11581 -229287 -212294 -152951 -56198 -93327 -209976 -348159 -301982 -357091 -296075 -121255 -54483
11570 -54483 38207 14481 13060 19959 -116485 -18429 38511 -27785 -71262 -68121 -56798 53992
$$ packed form
11647a52747O1357J39050l9757K4120M2650J10407n147k64159p6161K02434n3854
11636a1807j98380p610P8640J4825j46031N4883J79957j41799M0835Q7405J26198
11625G7116j33047j53675O7141k6118J9861K944N7237O2992q2589M4280M6033
11614a7825n553k0324j82000P1596O8941K24063l505k53632p0753K06788l5932
11603a8136k4217m1089l7082J12582R4037l4554m364N786Q2753p3668j9539k10381
11591a67872j23656J87993L86l8109k09641K06087J42354K0403j43306j03926
11581b29287J6993N9343R6753l7129j16649j38183M6177n5109O1016J74820O6772
11570e4483R2690k3726j421O899j36444R8056N6940o6296m3477L141J1323J10790
$$ plain form
11558 53992 126269 -1846 -33548 -9093 18163 21285 105931 -12973 208168 164811 -148945
11547 -148945 -105219 63201 165510 90304 -93271 -200303 -201272 -14747 -79072 37414 155417
11536 155417 -99118 -18037 80940 85106 -17268 108452 161759 -4269 24063 105858 -101771
11525 -101771 -156774 -130825 -238362 -184132 -188146 -144940 11534 171751 147749 -7196 -78279
11514 -78279 -208025 -196631 -138831 -9152 25467 -112413 -51359 105650 -4951 79005 6510
11503 6510 -110125 -158275 -154829 -3430 11259 -47342 -125079 80812 180010 159508 -95350
11492 -95350 -170844 -2372 -100912 -80743 23514 24302 -87918 60631 91769 56200 19254
11481 19254 -43831 1577 -185488 -224551 -193612 -30580 -139233 -220843 -226545 -279562 -4949
$$ packed form
11558E3992P2277j28115l1702K4455K7256L122Q4646j18904K21141m3357l13756
11547a48945M3726J68420J02309p5206j83575j07032r69J86525o4325J16486J18003
11536A55417k54535Q1081R8977M166j02374J25720N3307j66028K8332Q1795k07629
11525a01771n5003K5949j07537N4230m014M3206J56474J60217k4002j54945p1083
11514g8279j29746J1394N7800J29679L4619j37880O1054J57009j10601Q3956p2495
11503F510j16635m8150L446J51399J4689n8601p7737K05891R9198k0502k54858
11492i5350p5494J68472r8540K0169J04257P88j12220J48549L1138l5569l6946
11481A9254o3085M5408j87065l9063L0939J63032j08653q1610n702n3017K74613
$$ plain form
11470 -4949 107175 157150 -51787 -18866 -56020 -126214 -74328 86795 89875 81733 32893 -96306
11458 -96306 79140 93787 191590 384974 252331 113278 92779 150107 129171 -10583 22563
11447 22563 25582 -23825 15988 -2322 -108971 -10566 195662 -85205 -49359 -42334 -19589
11436 -19589 -123981 -141396 92086 -44602 -216475 -233460 90673 123717 82729 36344 -39872
11425 -39872 4434 -65907 -157576 -149168 63801 58827 -110325 -109079 6465 -56115 51700
11414 51700 141647 -30725 -7138 -111923 -92266 -4727 -139689 -51561 62327 -96205 -93386
11403 -93386 -192606 -110340 -81192 -17495 -16661 -186419 -141743 -69484 -234725 -310704 -114004
11392 -114004 -137318 -23066 -14242 -124032 -81833 -151788 16251 -119104 -131246 -104589 -29805
$$ packed form
11470d949J12124M9975k08937L2921l7154p0194N1886J61123L080q142m8840j29199
11458i6306J75446J4647R7803J93384j32643j39053k0499N7328k0936j39754L3146
11447B2563L019m9407L9813j8310j06649R8405K06228k80867L5846P025K2745
11436a9589j04392j7415K33482j36688j71873j6985L24133L3044m0988m6385p6216
11425c9872M4306p0341r1669Q408K12969m974j69152J246J15544o2580J07815
11414E1700Q9947j72372K3587j04785J9657Q7539j34962Q8128J13888j58532K819
11403i3386r9220Q2266K9148O3697Q34j69758M4676P2259j65241p5979J96700
11392a14004k3314J14252Q824j09790M2199o9955J68039j35355j2142K6657P4784
$$ plain form
11381 -29805 82315 110001 -33641 -203302 -26099 10122 62990 71973 22774 -122361 -234771
11370 -234771 -163783 -145455 -44266 50501 12481 -9835 119122 -47158 -137481 -69017 -83241
11359 -83241 -129115 -211461 -81717 49732 286190 318761 253515 116048 -73487 -155354 -224872
11348 -224872 -139019 -203900 -6709 23973 -58531 6822 121878 78023 14220 -240874 -277854
11337 -277854 18923 -22261 -182990 -154644 -29164 119872 -14455 62118 -89565 -131681
11327 -131681 -28805 -59361 31358 120055 155149 21499 -66891 -145789 -164251 -143883 -104821
11316 -104821 -24280 7536 -12760 -108845 -237084 -310919 -123309 16774 23030 268730 182287
11305 182287 22346 34058 57918 147372 252108 -56631 -19765 -129106 -375730 -281077
$$ packed form
11381b9805J12120K7686j43642j69661J77203L6221N2868Q983m9199j45135j12410
11370b34771P0988J8328J01189R4767l8020k2316J28957j66280r0323O8464j4224
11359h3241m5874q2346J29744J31449K36458L2571o5246j37467j89535q1867o9518
11348b24872Q5853o4881J97191L0682q2504O5353J15056m3855o3803k55094l6980
11337b77854K96777m1184j60729K8346J25480J49036j34327P6573j51683m2116
11327a31681J02876l0556R0719Q8697L5094j33650q8390p8898j8462K0368L9062
11316a04821Q0541L1816k0296r6085j28239p3835J87610J40083O256K45700q6443
11305A82287j59941J1712K3860Q9454J04736l08739L6866j09341k46624R4653
$$ plain form
11295 -281077 -317913 -303535 -177023 -66284 143457 83317 -16714 -212898 -77027 125165
11285 125165 22917 -16371 -78430 -116658 -103244 -144105 26112 -94043 -89498 -88501 -82469 29639
11273 29639 146755 -173651 -213420 -55366 -264414 -51311 -72635 -99999 27433 -317084
11263 -317084 -198667 -149565 -194281 -161337 10522 69950 4778 199425 203745 38277 -82313
11252 -82313 -61732 -19509 95752 -51679 -130260 17155 13369 -139555 -21977 -91008 -68871
11241 -68871 -48675 -212273 -64939 -54451 -154602 114028 221026 273357 175694 -57658
11231 -57658 23707 -38310 -13768 122271 86660 -113333 -142160 -81207 -172904 -69733 -115900
11220 -115900 -119852 -21287 140672 155038 -111551 -215933 -29187 -128711 -302511 -242155 -138750
$$ packed form
11295b81077l6836J4378J26512J10739K09741o0140j00031j96184J35871K02192
11285A25165j02248l9288o2059l8228J3414m0861J70217j20155M545R97O032J12108
11273B9639J17116l20406l9769J58054k09048K13103k1324k7364J27432l44517
11263c17084J18417M9102m4716L2944J71859N9428o5172J94647M320j65468j20590
11252h2313K0581M2223J15261j47431p8581J47415l786j52924J17578o9031K2137
11241f8871K0196j63598J47334J0488j00151K68630J06998N2331r7663k33352
11231e7658Q1365o2017K4542J36039l5611j99993k8827O0953r1697J03171m6167
11220a15900l952R8565J61959J4366k66589j04382J86746r9524j73800O0356J03405
$$ plain form
11209 -138750 -141031 -120296 -263808 -212636 61725 267197 62900 61920 29816 -83904 -101869
11198 -101869 -156848 70123 -45302 -247033 -11386 -82080 -75462 -4121 -176391 -101207 7701
11187 7701 33685 -12253 -31929 67961 185206 -125250 112531 301834 207303 194082 102870
11176 102870 -2013 112901 142715 108563 80664 120125 37678 27887 101440 -12548 -731
11165 -731 25545 37992 -111265 -82348 207357 138484 -48589 -24005 -21456 -13796 -131237 -55264
11153 -55264 88504 199361 72003 100529 -132099 -176844 74582 65746 -40865 -41315 -163767
11142 -163767 -82834 73995 549 -3155 -58370 -67305 54830 170969 -88264 -135814 -59145
11131 -59145 139646 261888 479175 268060 219857 180773 29582 62509 34016 102587 30968
$$ packed form
11209a38750k281K0735j43512N1172K74361K05472k04297r80l2104j13720j7965
11198a01869n4979K26971j15425k01731K35647p0694O618P1341j72270P5184J08908
11187G701K5984m5938j9676R9890J17245l10456K37781J89303r4531j3221r1212
11176A02870j04883J14914K9814l4152k7899L9461q2447r791P3553j13988J1817
11165g31K6276J2447j49257K8917K89705o8873j87073K4584K549P660j17441P5973
11153e5264J43768J10857j27358K8526k32628m4745K51426q836j06611m50j22452
11142a63767Q0933J56829p3446l704n5215q935J22135J16139k59233m7550P6669
11131e9145J98791J22242K17287k11115m8203l9084j51191L2927k8493O8571p1619
$$ plain form
11120 30968 50036 202575 312341 302330 315322 209737 249399 273612 79084 -69897 77641
11109 77641 -89849 -34203 -40180 -166188 -146581 -204762 -153548 -35706 12030 35594 -45731
11098 -45731 31641 100591 46348 -76844 165415 -19414 -138579 -5694 -137600 -171107
11088 -171107 -230538 -177498 -57296 -88102 -165153 -67127 -13040 -127570 -328645 -372257 -209768
11077 -209768 -101437 98348 180022 58567 -87678 22798 -20628 -120360 -59750 -92264
11067 -92264 -34045 -127520 -174906 30969 102478 68209 85568 13517 -63455 -66780 -28895 -138674
11055 -138674 -69103 -115253 -47923 -153286 -204021 -66669 -8459 14092 53732 -134673 -193492
11044 -193492 -134517 -59584 -171304 -119482 58 -39247 -93173 -123223 -183924 -116137 10286
$$ packed form
11120C0968J9068J52539J09766j0011J2992j05585L9662K4213j94528j48981J47538
11109G7641j67490N5646n977j26008J9607n8181N1214J17842M7736K3564q1325
11098d5731P7372O8950n4243j23192K42259j84829j19165J32885j31906l3507
11088a71107n9431N3040J20202l0806p7051R8026N4087j14530k01075m3612J62489
11077b09768J08331J99785Q1674j21455j46245J10476m3426r9732O0610l2514
11067i2264N8219r3475m7386K05875P1509l4269J7359p2051p6972l325L7885j09779
11055a38674O9571m6150O7330j05363n0735J37352N8210K2551L9640j88405n8819
11044a93492N8975P4933j11720N1822J19540l9305n3926l0050o0701O7787J26423
$$ plain form
11033 10286 163238 37474 -37296 76624 -48017 -17129 -66507 -169493 95144 178700
11023 178700 77270 -42587 -234580 -324388 -162001 -110070 -15444 232295 153229 -203486
11013 -203486 -375990 -288449 -195499 -227677 -235857 -315560 -211728 -305527 -202436 -95479 -148731
11002 -148731 23134 3662 -184524 -167019 -42345 34264 -72712 -55572 -75797 -61005 120290
10991 120290 155437 -53472 -7043 -55144 -15176 1715 -10578 -66578 -32332 -154532 -76981
10980 -76981 152828 31729 -63713 -201221 938 44015 14161 -199061 -229046 -107449
10970 -107449 -132682 -184149 -55721 -101637 -46091 -78685 -21362 -86822 -104551 -198179 -203760
10959 -203760 -148134 -148217 -164459 -220673 -165963 -133905 -93712 25786 45355 177354 33803
$$ packed form
11033A0286J52952j25764p4770J13920j24641L0888m9378j02986K64637Q3556
11023A78700j01430j19857j91993q9808J62387N1931R4626K47739p9066l56715
11013b03486j72504Q7541R2950l2178q180p9703J03832r3799J03091J06957n3252
11002a48731J71865j9472j88186J7505J24674P6609j06976J7140k0225J4792J81295
10991A20290L5147k08909M6429m8101L9968J6891j2293n6000L4246j22200P7551
10980g6981K29809j21099r5442j37508K02159M3077k9854k13222k9985J21597
10970a07449k5233n1467J28428m5916N5546l2594N7323o5460j7729r3628n581
10959b03760N5626q3j6242n6214N4710L2058M0193J19498J9569J31999j43551
$$ plain form
10948 33803 148215 69866 733 32823 -28222 -155799 76764 100918 -48179 -110940 -38864
10937 -38864 26060 -72177 -121237 -68619 -171910 -130313 7377 -45038 -153680 -82934 -61470
10926 -61470 -163290 -36278 360 -166027 -163144 -37023 88142 123240 46896 -180176 -149223
10915 -149223 -38490 -146274 -259442 -259529 97396 197843 255051 81095 -128103 -136274 -102258
10904 -102258 6619 7143 -50992 -203288 -220424 -179150 -127057 -158652 -193908 -78095 -12392
10893 -12392 -34220 10038 219902 -110798 -138642 -22582 45738 -42682 -281687 -170342 -129657
10882 -129657 -233481 34848 -4024 -182284 -51880 2996 21636 -116807 -186701 -117639
10872 -117639 110275 146012 -71516 -94030 -4179 27407 206213 -17287 -258760 56142
$$ packed form
10948C3803J14412p8349o9133L2090o1045j27577K32563K4154j49097o2761P2076
10937c8864O4924r8237m9060N2618j03291M1597J37690n2415j08642P0746K1464
10926f1470j01820J27012L6638j66387K883J26121J25165L5098p6344k27072L0953
10915a49223J10733j07784j13168q7L56925J00447N7208j73956k09198q171L4016
10904a02258J08877N24n8135j52296j7136M1274N2093l1595l5256J15813O5703
10893a2392k1828M4258K09864l30700k7844J16060O8320q8420k39005J11345M0685
10882a29657j03824K68329l8872j78260J30404N4876J8640j38443o9894O9062
10872a17639K27914L5737k17528k2514Q9851L1586J78806k23500k41473L14902
$$ plain form
10862 56142 62554 84969 -143653 -98305 -3244 -81091 -79978 -85071 -127319 138006 149862 -87336
10850 -87336 -52829 -28170 -67112 -143483 -159303 -30199 74066 77874 6810 -137207 -85140
10839 -85140 22285 141416 94504 -124958 -22099 -135633 -293219 -194408 -82489 -142871
10829 -142871 -67843 61309 -17914 -42200 88130 168907 49922 -108807 -155811 -73373 4255
10818 4255 -87637 135608 139330 -53005 17314 141302 -17214 -10132 -129321 -98675 -46674
10807 -46674 -51704 37312 107562 -113377 -269335 -134904 -98769 -5811 79165 137549 114551
10796 114551 -93496 -148548 -88655 -210405 -115779 -124648 -74994 -188583 -224888 -131338 -369149
10785 -369149 -207399 -71281 -98676 -2433 -66138 12502 43482 4463 -158201 -130916 -191175
$$ packed form
10862E6142O412K2415k28622M5348R5061p7847J113n093m2248K65325J1856k37198
10850h7336L4507K4659l8942p6371j5820J29104J04265L808p1064j44017N2067
10839h5140J07425J19131m6912k19462J02859j13534j57586R8811J11919o0382
10829a42871P5028J29152p9223k4286J30330Q0777j18985j58729m7004Q2438P7628
10818D255r1892K23245L722j92335P0319J23988j58516P082j19189L0646N2001
10807d6674n030Q9016P0250k20939j55958J34431L6135R2958Q4976N8384k2998
10796A14551k08047n5052N9893j21750R4626q869M9654j13589l6305R3550k37811
10785c69149J61750J36118k7395R6243o3705P8640L0980l9019j62664K7285o0259
$$ plain form
10774 -191175 -24081 57678 56711 -215190 -120405 -94812 -161919 -43393 83257 53737 42741
10763 42741 -64874 -58163 -16017 -102571 -126521 -103231 62882 114476 154832 1646 -261094
10752 -261094 -187590 -158572 -50966 -22467 -195824 -330994 -35362 119297 115851 67255 267133
10741 267133 248302 13291 -150845 62568 17750 -106530 -117668 -190490 -73011 -191198
10731 -191198 -121195 -62211 114919 180466 251600 294780 47555 -174553 -127770 -139380 -138509
10720 -138509 -230524 -93325 78338 -109578 -46438 -159063 -163389 18862 -29970 17884 -107695
10709 -107695 -247926 -262004 -167387 -231398 -281713 -393947 -254686 -19289 -60456 -193619
10699 -193619 -82043 -88182 -7219 -179206 -212734 -181078 -23294 -240088 -338709 -155903 -180132
$$ packed form
10774a91175J67094Q1759r67k71901R4785K5593o7107J18526J26650k9520j0996
10763D2741j07615O711M2146q6554k3950K3290J66113N1594M0356j53186k62740
10752b61094P3504K9018J07606K8499j73357j35170K95632J54659l446m8596J99878
10741B67133j8831k35011j64136K13413m4818j24280j1138p2822J17479j18187
10731a91198P0003N8984J77130O5547P1134M3180k47225k22108M6783j1610Q71
10720a38509r2015J37199J71663j87916O3140j12625m326J82251m8832M7854j25579
10709a07695j40231j4078R4617o4011n0315j12234J39261K35397m1167j33163
10699a93619J11576o139Q0963j71987l3528L1656J57784k16794r8621J82806k4229
$$ plain form
10688 -180132 -225851 -100205 -8406 -91456 -96911 -297370 -276408 -324420 -309507 -215053 -60931
10677 -60931 -60652 -47508 44182 104407 -101661 -162882 -33452 -94134 -82759 -123827 -90812 -295927
10665 -295927 -373224 -213827 -194082 -343364 -299881 -82174 -159696 -241879 -315516 -233521 -266470
10654 -266470 -146667 -8832 -274171 -101012 -71487 -31330 39678 118331 105516 -214681
10644 -214681 -131962 -215846 -251934 -93999 -30856 99931 14816 -110235 975 -47198 -67377
10633 -67377 -51400 -189124 -174036 -53291 -16945 -38900 -168774 -165608 -214788 -158762 -101362
10622 -101362 106937 -11892 -15131 36111 -122869 -110692 -143139 -57634 73084 -340835 -290300
10611 -290300 -38731 -99753 109522 -82899 37038 179721 247556 9210 -116014 -9887
$$ packed form
10688a80132m5719J25646R1799q3050n455k00459K0962m8012J4913R4454J54122
10677f0931K79J3144R1690O0225k06068o1221J29430o0682J1375m1068L3015k05115
10665b95927p7297J59397J9745j49282M3483K17707p7522q2183p3637Q1995l2949
10654b66470J19803J37835k65339J73159K9525M0157P1008P8653j2815l20197
10644b14681Q2719q3884l6088J57935O3143J30787q5115j25051J11210m8173k0179
10633f7377J5977j37724J5088J20745L6346k1955j29874L166m9180N6026N7400
10622a01362K08299j18829l239N1242j58980J2177l2447Q5505J30718m13919N0535
10611b90300K51569o1022K09275j92421J19937J42683O7835k38346j25224J06127
$$ plain form
10601 -9887 61056 54525 -122831 -139041 -17792 -95643 -162491 -140154 -298364 -456586 -220086
10590 -220086 -415014 -313915 -211303 -62095 32001 25218 -8198 -228156 -97259 -47152
10580 -47152 -229515 -168773 32943 56873 -2711 -58917 155761 -107306 47157 58624 152499
10569 152499 203553 24359 -60500 -51712 47050 -125434 -214660 -191944 -72107 -45704 -15548
10558 -15548 -23425 -7773 -167449 -64677 -36142 -279487 -346852 -186280 -367458 -297580 -206244
10547 -206244 -85799 -182042 -347757 -118936 97506 -145797 -282754 77487 9580 -121221
10537 -121221 -109221 -143108 -185462 -146323 -58326 24719 -20580 165209 18052 -35911 -123727
10526 -123727 82688 82790 -10111 -84285 -59745 -106402 74531 203670 109200 -50435 -48009
$$ packed form
10601i887P0943o531j77356j6210J21249p7851o6848K2337j58210j58222K36500
10590b20086j94928J01099J02612J49208R4096o783l3416k19958J30897N0107
10580d7152j82363O0742K01716K3930n9584n6206K14678k63067J54463J1467R3875
10569A52499N1054j79194q4859Q788R8762j72484q9226K2716J19837K6403L0156
10558a5548p877J5652j59676J02772K8535k43345o7365J60572j81178O9878R1336
10547b06244J20445r6243j65715K28821K16442k43303j36957L60241o7907j30801
10537a21221J2000l3887m2354L9139Q7997Q3045m5299J85789j47157n3963q7816
10526a23727K06415J02r2901p4174K4540m6657J80933J29139r4470j59635K426
$$ plain form
10515 -48009 -271514 -260994 -243567 -297274 -245535 60425 136324 101140 -9108 -45962 165653
10504 165653 -48799 23809 134909 -116439 -113432 48254 83249 161480 149331 43108 -103327
10493 -103327 16295 40241 108449 250277 157220 -117881 -34221 -52971 -112239 -172369 -157549
10482 -157549 -159512 -97880 45142 45675 183937 161296 100046 92596 -76453 -83918 -232573 -145443
10470 -145443 -86035 -49719 -92121 -47192 -190568 -92210 82286 265546 33865 139832
10460 139832 119792 -101420 -41778 -158052 -203694 -189830 -83755 126540 223280 110661
10450 110661 36730 139 51625 82130 80274 -34956 -88204 -111584 -167473 -263175 -220006
10439 -220006 -5465 27966 164649 57887 -18467 5082 63590 179742 108104 60187 -24701
$$ packed form
10515d8009k23505J0520J7427n3707N1739L05960P5899l5184j10248l6854K11615
10504A65653k14452P2608J11100k51348L007J61686L4995P8231j2149j06223j46435
10493a03327J19622K3946O8208J41828r3057k75101Q3660j8750n9268o0130J4820
10482a57549j963O1632J43022N33J38262k2641o1250p450j69049p465j48655Q7130
10470a45443N9408L6316m2402M4929j43376R8358J74496J83260k31681J05967
10460A39832k0040k21212N9642j16274m5642J3864J06075K10295R6740j12619
10450A10661p3931l6591N1486L0505j856j15230n3248k3380n5889r5702M3169
10439b20006K14541L3431J36683j06762p6354K3549N8508J16152p1638m7917q4888
$$ plain form
10428 -24701 59116 34226 -31939 -115111 -73835 -95787 14158 158949 -129320 -184250 -102703
10417 -102703 -87024 238367 237595 225822 258422 129326 -40799 -100114 -46776 132411 209627
10406 209627 245372 93018 82920 -71025 -46213 -100470 -318125 -348856 -315510 -404563 -345631
10395 -345631 -371642 -290613 84699 41422 -81950 82139 220504 97506 -46869 -78807
10385 -78807 -13341 44848 62168 76225 97808 96660 137949 13502 -15643 12348 97040 -134958
10373 -134958 2851 119509 -63393 -128604 -192728 -192452 -24291 109330 166836 193360 153726
10362 153726 153748 18160 15887 21536 35016 -47598 -190897 -1695 49462 31006 105844 34351
10350 34351 -10447 -168738 -72313 -69934 49531 -50999 -137938 -258835 -205865 -35839 -14478
$$ packed form
10428b4701Q3817k4890o6165q3172M1276k1952J09945J44791k88269n4930Q1547
10417a02703J5679L25391p72j1773L2600j29096j70125n9315N3338J79187P7216
10406B09627L5745j52354j0098j53945K4812n4257k17655l0731L3346q9053N8932
10395c45631k6011Q1029L75312m3277j23372J64089J38365j22998j44375l1938
10385g8807O5466N8189J7320J4057K1583j148M1289j24447k9145K7991Q4692k31998
10373a34958J37809J16658j82902o5211o4124K76J68161J33621N7506K6524l9634
10362A53726K2j35588k273N649J3480q2614j43299J89202N1157j8456P4838p1493
10350C4351m4798j58291R6425K379J19465j00530q6939j20897N2970J70026K1361
$$ plain form
10339 -14478 45481 165052 176536 85585 -61744 -136581 24876 -94442 -83652 -182656 -11891
10328 -11891 -42643 6884 265165 184980 16270 -21835 -69804 -40380 -70069 -62156 -178801
10317 -178801 -144352 -37448 41744 -78394 -87650 -67593 95335 55513 -23158 83290 132415
10306 132415 38152 113588 92662 58506 -144450 -195259 177334 337946 180177 266649 258699
10295 258699 28982 39291 33113 50073 1634 -11611 -110402 119916 184078 30076 -112375
10284 -112375 -114530 -106488 -86282 -145361 -18314 -87805 35824 189127 198364 16466 33843
10273 33843 -61504 -3875 -226824 -215998 67356 96630 147790 22976 -45610 -15298 -128222
10262 -128222 -161193 -151261 16056 66151 -51794 -144766 -10398 90080 -98754 102855
$$ packed form
10339a4478N9959J19571J1484r0951j47329p4837J61457j19318J0790r9004J70765
10328a1891l0752M9527K58281q0185j68710l8105m7969K9424k9689P913j16645
10317a78801L4449J06904P9192j20138r256K0057J62928l9822p8671J06448M9125
10306A32415r4263P5436k0926l4156k02956n0809L72593J60612j57769Q6472p950
10295B58699k29717J0309o178J6960m8439j3245r8791K30318O4162j54002j42451
10284a12375k155Q042K0206n9079J27047o9491J23629J53303R237j81898J7377
10273C3843r5347N7629k22949J0826K83354K9274N1160j24814o8586L0312j12924
10262a28222l2971R932J67317N0095j17945r2972J34368J00478j88834K01609
$$ plain form
10252 102855 -59598 -48515 139321 167492 109619 25647 59790 153621 160635 160059 196960 106959
10240 106959 37017 158795 213051 70043 141793 174582 276303 382551 356735 -51825
10230 -51825 -99558 -122609 -17029 30639 -91936 83266 173237 102437 158405 294807 256807
10219 256807 359708 184300 73327 206900 161577 145986 100925 87953 206160 145213
10209 145213 -114779 -166447 109280 -148731 -22508 104747 144573 163185 119949 119398 69306
10198 69306 60492 253213 267847 -41614 11874 142127 173815 125031 129838 40048 -9509
10187 -9509 131114 115068 50363 -34078 79113 -171763 -120716 -42415 282124 234532 -22583
10176 -22583 -43424 69149 154952 111619 66713 69846 29627 -152379 -64678 -207257 -155487
$$ packed form
10252A02855j62453J1083J87836K8171n7873q3972L4143R3831P014n76L6901r0001
10240A06959o9942J21778N4256j43008P1750L2789J01721J06248k5816m08560
10230e1825m7733k3051J05580M7668j22575J75202Q9971p0800N5968J36402l8000
10219B56807J02901j75408j10973J33573m5323j5591m5061j2972J18207o0947
10209A45213k59992n1668K75727k58011J26223J27255L9826J8612m3236n51n0092
10198F9306q814J92721J4634l09461N3488J30253L1688m8784M807q9790m9557
10187i509J40623j6046o4705q4441J13191k50876N1047P8301L24539m7592k57115
10176b2583k0841J12573Q5803m3333m4906L133m0219j82006Q7701j42579N1770
$$ plain form
10165 -155487 -96735 -206098 -227340 -89881 -101007 17595 19666 -42065 7884 -44188 85176
10154 85176 7786 -33084 119764 107343 -79565 -18579 252 -136106 42980 15129 -34808
10143 -34808 -108113 -254569 -110120 -118905 -74807 3781 -24258 33187 120360 84664 162733
10132 162733 108299 -6828 75380 -59384 -3123 -65361 -227839 -290453 -159045 121540
10122 121540 252654 165413 103316 27768 -15300 -62517 16388 130298 -38731 -37035 -267912
10111 -267912 -276277 -60448 18019 -64909 -61733 5695 67475 -112767 -111576 30292 -44851
10100 -44851 58246 126175 225869 50593 134905 16980 173593 54330 -70318 -13393
10090 -13393 102334 14541 -47827 -72707 -290899 -232058 55167 91262 -73727 -254679 -143798
$$ packed form
10165a55487N8752j09363k1242J37459j1126J18602K071o1731M9949n2072J29364
10154H5176p7390m0870J52848j2421j86908O0986J8831j36358J79086k7851m9937
10143c4808p3305j46456J44449q785M4098P8588k8039N7445Q7173l5696P8069
10132A62733n4434j15127Q2208j34764N6261o2238j62478o2614J31408K80585
10122A21540J31114q7241o2097p5548m3068m7217P8905J13910j69029J696k30877
10111b67912q365K15829P8467q2928L176O7428O1780j80242J191J41868p5143
10100d4851J03097O7929R9694j75276Q4312j17925J56613j19263j24648N6925
10090a3393J15727q7793o2368k4880k18192N8841K87225L6095j64989j80952J10881
$$ plain form
10079 -143798 45861 117933 166596 103897 -100243 14640 47240 -98928 -147960 32084
10069 32084 238243 134704 36279 -93761 39043 99986 174010 237485 151894 122578 140818
10058 140818 153697 187427 53473 -12201 -103423 29598 -113652 -122762 13689 -52088 -44706
10047 -44706 -40922 74477 57142 -108874 -124515 -216089 -272145 -80568 138362 140019 -24330
10036 -24330 161422 106359 -32211 -29277 -114328 -180359 -93308 -94438 -281993 -286322 -101175
10025 -101175 -141908 -243729 -168920 -95065 32949 282959 170137 110193 131918 99377 -84723
10014 -84723 -20289 116262 135691 48082 95859 275758 25582 -13967 -56716 -40469 106159
10003 106159 176041 249514 415348 295151 133186 -60060 -54969 -141832 -94257 -64445 -30828
$$ packed form
10079a43798J89659P2072M8663o2699k04140J14883L2600j46168m9032J80044
10069C2084K06159j03539r8425j30040J32804O0943P4024O3475q5591k9316J8240
10058A40818J2879L3730j33954o5674r1222J33021j43250r110J36451o5777P382
10047d4706L784J15399j7335j66016j5641r1574n6056J91577K18930J657j64349
10036b4330J85752n5063j38570K934q5051o6031Q7051j130j87555m329J85147
10025a01175m0733j01821P4809P3855J28014K50010j12822n9944K1725l2541j84100
10014h4723O4434J36551J9429q7609M7777J79899k50176l9549m2749J6247J46628
10003A06159O9882P3473J65834j20197j61965j93246N091q6863M7575K9812L3617
$$ plain form
9992 -30828 -205596 -12139 207065 25631 -176194 -86132 127729 191557 163899 144454 23730
9981 23730 10946 155131 52417 125446 109050 -13149 219914 125490 101301 113365 55065
9970 55065 -34643 -41737 -158913 65075 133744 19246 145761 271147 -2674 21061 7853
9959 7853 -83000 104324 203288 206529 51345 3646 -164318 -89597 21936 115989 58101
9948 58101 32685 160360 -74108 -240066 -80890 -143720 3686 -87246 -74127 26866 22154
9937 22154 -158037 -14968 28373 39790 217830 254332 163428 -52360 -105988 -81771 11741
9926 11741 120710 41651 -131535 -194434 187770 76810 34985 17471 40733 72966 15888
9915 15888 45602 -17559 -97752 -103527 56368 195552 301487 17007 -74834 25050 30043
$$ packed form
9992c0828j74768J93457K19204j81434k01825R0062K13861O3828k7658j9445j20724
9981B3730j2784J44185j02714P3029j6396j22199K33063r4424k4189J2064n8300
9970E5065q9708p094j17176K23988O8669j14498J26515J25386k73821K3735j3208
9959G853r0853J87324R8964L241j55184m7699j67964P4721J11533R4053n7888
9948E8101k5416J27675k34468j65958J59176o2830J47406r0932J3119J00993m712
9937B2154j80191J43069M3341J1417J78040L6502r0904k15788n3628K4217R3512
9926A1741J08969p9059j73186o2899L82204j10960m1825j7514K3262L2233n7078
9915A5888K9714o3161q0193n775J59895J39184J05935k84480r1841R9884M993
$$ plain form
9904 30043 177524 -67388 -141627 -115603 -20788 -117815 -19882 -86381 -18136 61734 61196 78069
9892 78069 54548 70841 16560 -29521 -65205 56410 -118654 -142010 -91501 138960 103657
9881 103657 204269 112549 -6551 101423 234036 180909 141206 157305 170802 132879 198207
9870 198207 112760 -198616 -252696 69403 205206 178577 76508 86424 -14397 -63867 60633
9859 60633 81095 195510 280355 372586 45805 -312 210749 -3993 -83881 251 -276759
9848 -276759 -89445 6280 164 -93735 -176472 19980 75733 116387 153227 118170 175633
9837 175633 193668 104711 -28990 -44088 -68056 -183824 90746 5116 -85479 156735 300030
9826 300030 127066 -27439 -141359 -126327 -35109 -32344 -2975 -33920 -46429 -117481 -38910
$$ packed form
9904C0043J47481k44912p4239K6024R4815r7027R7933o6499O8245P9870n38J6873
9892G8069k3521J6293n4281m6081l5684J21615j75064k3356N0509K30461l5303
9881A03657J00612r1720j19100J07974J32613n3127l9703J6099J3497l7923O5328
9870A98207q5447l11376n4080L22099J35803k6629j02069R916j00821m9470J24500
9859F0633K0462J14415Q4845R2231l26781m6117K11061k14742p9888Q4132k77010
9848b76759J87314R5725o116r3899q2737J96452N5753M0654L6840l5057N7463
9837A75633J8035q8957j33701j5098k3968j15768K74570q5630r0595K42214J43295
9826C00030j72964j54505j13920J5032R1218K765K9369l0945j2509p1052P8571
$$ plain form
9815 -38910 136010 58717 6591 122322 161615 139609 229020 172300 195105 161870 12137
9804 12137 -11191 -64092 -3581 85612 267992 182983 42293 140883 319976 108342 27303
9793 27303 -109181 -108412 142755 95295 -13218 -60292 2003 70493 101847 -104972 -133306
9782 -133306 -32836 134026 212764 185810 106174 292817 61051 53815 68891 197699 175990
9771 175990 68618 37999 56108 229119 65513 -10584 127355 156081 117433 135448 262896
9760 262896 208798 127970 122486 261674 220944 158348 282554 67581 78734 194495 346031
9749 346031 262574 199872 221918 353090 275756 130129 -14940 111193 119258 229713 125893
9738 125893 79362 199648 74370 51198 221447 115057 177482 324188 182510 111584
$$ packed form
9815c8910J74920p7293n2126J15731L9293k2006Q9411n6720K2805l3235j49733
9804A2137k3328n2901O0511Q9193J82380q5009j40690R8590J79093k11634q1039
9793B7303j36484P69K51167m7460j08513m7074O2295O8490L1354k06819k8334
9782a33306J00470J66862P8738k6954p9636J86643k31766p236J5076J28808k1709
9771A75990j07372l0619J8109J73011j63606p6097J37939K8726l8648J8015J27448
9760B62896n4098q0828n484J39188m0730o2596J24206k14973J1153J15761J51536
9749C46031q3457o2702K2046J31172p7334j45627j45069J26133Q065J10455j03820
9738A25893m6531J20286j25278k3172J70249j06390O2425J46706j41678p0926
$$ plain form
9728 111584 61693 192537 170584 -23429 -79844 25341 -50965 87873 135161 -38950 -845
9717 -845 20867 54119 96890 -40202 -32597 -33890 70281 47602 153266 79587 -38045 222396
9705 222396 319818 240305 86385 157058 181986 107832 29278 94148 385261 392307 261669
9694 261669 259195 336995 301650 78611 4890 88792 137521 67886 1324 -98189 -77115 -53935
9682 -53935 42800 163745 73588 84392 243346 369106 269790 76681 -7810 32702 146888
9671 146888 279950 395245 518205 355710 374410 201251 140121 385572 280417 294554
9661 294554 350645 90762 -34704 -188935 -178637 -68257 -74500 52407 -50402 -83787 36868
9650 36868 104745 257281 407521 353679 263666 217840 205676 36906 87701 -175 -12726
$$ packed form
9728A11584m9891J30844k1953j94013n6415J05185p6306J38838M7288j74111L8105
9717h45K1712L3252M2771j37092P605j293J04171k2679J05664p3679j17632K60441
9705B22396R7422p9513j53920P0673K4928p4154p8554O4870K91113P046j30638
9694B61669k474P7800l5345k23039p3721Q3902M8729o9635o6562r9513K1074K3180
9682e3935R6735J20945r0157J0804J58954J25760r9316j93109q4491M0512J14186
9671A46888J33062J15295J22960j62495J8700j73159o1130K45451j05155J4137
9661B94554N6091k59883j25466j54231J0298J10380o243J26907j02809l3385J20655
9650C6868O7877J52536J50240n3842r0013m5826j2164j68770N0795q7876j2551
$$ plain form
9639 -12726 105992 171548 212805 165349 136715 176391 277993 328166 215150 277799 185674
9628 185674 136839 364014 356278 159175 166256 282987 179217 399662 434835 165538 295234
9617 295234 347661 345452 262746 269114 155994 207024 181302 250833 233033 354501 414777 483661
9605 483661 753157 617697 658830 727731 631879 599186 580154 590472 451266 527635 668483
9594 668483 724152 573347 452680 389334 271502 340743 419338 347282 339431 210769 134686
9583 134686 241658 48328 -171 64737 153637 124346 139778 310443 399924 235646 356098
9572 356098 171091 316969 413856 73088 56706 256785 200305 403709 313658 246952 205421
9561 205421 92414 29387 86087 153596 166985 225175 168838 88591 258607 208692 308158
$$ packed form
9639a2726J18718O5556M1257m7456k8634L9676J01602N0173j13016O2649r2125
9628A85674m8835K27175p736j97103P081J16731j03770K20445L5173k69297J29696
9617B95234N2427k209q2706O368j13120N1030k5722O9531j7800J21468O0276O8884
9605D83661K69496j35460M1133O8901r5852l2693j9032J0318j39206P6369J40848
9594F68483N5669j50805j20667o3346j17832O9241P8595p2056p851j28662p6083
9583A34686J06972j93330m8499O4908Q8900k9291J5432J70665Q9481j64278J20452
9572C56098j85007J45878R6887l40768j6382K00079n6480K03404r0051o6706m1531
9561B05421j13007o3027N6700O7509J3389N8190n6337q0247J70016m9915R9466
$$ plain form
9550 308158 275785 73982 55344 173214 74104 75626 256823 488725 369485 267681 340545
9539 340545 113104 287806 114348 -7667 203602 221214 212442 255204 222687 226916 316375
9528 316375 381940 123642 123350 159717 250792 301146 391727 333115 235026 3708 83576 299161
9516 299161 68151 -18070 63069 156065 160053 140764 88778 122255 231495 224112 216266 262761
9504 262761 368327 289000 140947 167500 254817 209758 233116 388494 454910 249007 27346
9493 27346 193878 280843 291649 334085 449203 223124 186973 214220 175570 298988 332059
9482 332059 190987 168874 350806 427641 355908 342702 250419 304705 359071 256616 351322
9471 351322 358691 283752 281046 360662 388399 427700 317682 398822 504185 559062 478751 493111
$$ packed form
9550C08158l2373k01803j8638J17870r9110J522J81197K31902j19240j01804P2864
9539C40545k27441J74702j73458j22015K11269J7612q772M2762l2517M229Q9459
9528C16375O5565k58298k92L6367R1075N0354R0581n8612r8089k31318P9868K15585
9516B99161k31010q6221Q1139R2996L988j9289n1986L3477J09240p383p846M6495
9504B62761J05566p9327j48053K6553Q7317m5059K3358J55378O6416k05903k21661
9493B7346J66532Q6965J0806M2436J15118k26079l6151K7247l8650J23418L3071
9482C32059j41072k2113J81932P6835p1733j3206r2283N4286N4366j02455R4706
9471C51322P369p4939k706P9616K7737L9301j10018Q1140J05363N4877q0311J4360
$$ plain form
9459 493111 467742 457459 596357 636319 601641 619613 556517 587026 438818 235556 286295
9448 286295 426809 442290 509494 681543 489069 343423 414870 487458 508414 461304 584108
9437 584108 565278 438476 342540 378634 569665 740064 732606 730180 695869 759773 698486
9426 698486 609726 705278 978916 1137105 1225659 1264708 1099735 1025509 943171 1014712 1084028
9415 1084028 1025007 952320 984850 991814 1081244 896322 864874 987726 1030944 1266963 1103945
9404 1103945 1084043 1112057 988425 1012490 1215017 1176263 1151703 1076423 1190216 1068691 790352
9393 790352 648132 774027 959130 951933 1049556 875490 755507 868075 858556 865635 1002290
9382 1002290 954490 981061 1008728 1311477 1175668 1286002 1357433 1603827 1675656 1534667
$$ packed form
9459D93111k5369j0283J38898L9962l4678J7972o3096L0509j48208k03262N0739
9448B86295J40514J5481O7204J72049j92474j45646P1447P2588K0956m7110J22804
9437E84108j8830j26802r5936L6094J91031J70399p458k426l4311O3904o1287
9426F98486q8760R5552K73638J58189Q8554L9049j64973p4226q2338P1541O9316
9415A084028n9021p2687L2530O964Q9430j84922l1448J22852M3218K36019j63018
9404A103945j9902K8014j23632K4065K02527l8754k4560p5280J13793j21525k78339
9393G90352j42220J25895J85103p197R7623j74066j19983J12568r519P079J36655
9382A002290m7800K6571K7667L02749j35809J10334P1431K46394P1829j40989
$$ plain form
9372 1534667 1766814 1796325 1696887 1659493 1724843 1718747 1859090 2025327 1923186 1975230 2057600
9361 2057600 2063007 2175570 2271496 2373172 2494038 2544421 2702314 2794632 3062491 3164939
9351 3164939 3176942 3459563 3526961 3682942 3953536 4362726 4724702 5180564 5433411 5824623
9341 5824623 6372838 6522343 6913502 7283089 7316164 7373672 7217575 6951143 6611571 6064046
9331 6064046 5484023 5073019 4754722 4291172 3807955 3404713 3088297 2740679 2443466 2284292
9321 2284292 2212898 2060812 1847109 1656938 1516536 1499770 1443206 1390727 1393198 1208898 1256757
9310 1256757 1213978 1143848 1126461 1005758 920821 938422 1070299 1074314 930753 958663 953024
9299 953024 1013191 1101892 819763 662472 834769 945444 801599 865156 777379 702195 613856
$$ packed form
9372A534667K32147K9511r9438l7394O5350o096J40343J66237j02141N2044Q2370
9361B057600N407J12563R5926J01676J20866N0383J57893R2318K67859J02448
9351C164939J2003K82621O7398J55981K70594M09190L61976M55862K52847L91212
9341E824623N48215J49505L91159L69587L3075N7508j56097k66432l39572n47525
9331F064046n80023m11004l18297m63550m83217m03242l16416l47618k97213j59174
9321B284292p1394j52086k13703j90171j40402j6766n6564n2479K471j84300M7859
9310A256757m2779p0130j7387j20703q4937J7601J31877M015j43561K7910n639
9299I53024O0167Q8701k82129j57291J72297J10675j43845O3557q7777p5184q8339
$$ plain form
9288 613856 632486 831722 893546 727815 738658 657694 644374 741345 559634 692696 830879
9277 830879 746266 762537 879013 881656 862285 748419 544974 398458 613934 549171 665472
9266 665472 677525 635606 809998 735007 723130 908554 866337 867134 885085 969891 998660 903164
9254 903164 1056011 1311210 1284510 1228473 1076421 943868 1051354 1130203 966424 1085988
9244 1085988 974930 1029904 1127405 927948 1016300 882123 767387 838705 860585 972624
9234 972624 1186707 1092821 1126254 1152722 1310689 1289578 1104210 1205733 1359560 1007928
9224 1007928 972867 1023564 1153317 1191267 1101852 1092166 1131169 1144200 1203404 1170452 1236982
9213 1236982 1440330 1427374 1434269 1397245 1215816 1222306 1166362 1118941 924368 1068869 1158953
$$ packed form
9288F13856J8630J99236O1824j65731J0843q0964j3320R6971j81711J33062J38183
9277H30879q4613J6271J16476K643j9371j13866k03445j46516K15476o4763J16301
9266F65472J2053m1919J74392p4991j1877J85424m2217P97J7951Q4806K8769r5496
9254I03164J52847K55199k6700n6037j52052j32553J07486P8849j63779J19564
9244A085988j11058N4974R7501j99457Q8352j34177j14736P1318K1880J12039
9234I72624K14083r3886L3433K6468J57967k1111j85368J01523J53827l51632
9224A007928l5061N0697J29753L7950q9415r686L9003J3031N9204l2952O6530
9213A236982K03348j2956O895l7024j81429O490n5944m7421j94573J44501R0084
$$ plain form
9202 1158953 1093292 1302692 1291118 1175221 1230120 1304740 1362362 1117749 1108850 1296821 1542309
9191 1542309 1410471 1371725 1563916 1645740 1607882 1547123 1508501 1565033 1590098 1572517 1506414
9180 1506414 1745001 2172683 2385847 2779223 3169991 2994535 2796050 2314452 1816571 1560580
9170 1560580 1335333 1161453 931784 832455 872742 962741 875193 803135 839013 848091 766046
9159 766046 766001 622997 655886 563069 634945 826756 885056 813101 879650 755806 572631
9148 572631 646078 959911 831230 956270 790212 677927 709582 873672 989685 932796
9138 932796 701730 529199 605646 463992 627107 680862 767398 855588 834467 758956 474197
9127 474197 605375 752720 888650 894679 841392 860371 995192 829233 855682 883171 747293
$$ packed form
9202A158953o5661K09400j1574j15897N4899P4620N7622k44613q899J87971K45488
9191A542309j31838l8746J92191Q1824l7858o0759l8622N6532K5065j7581o6103
9180A506414K38587M27682K13164L93376L90768j75456j98485m81598m97881k55991
9170A560580k25247j73880k29669r9329M0287Q9999q7548p2058L5878R078q2045
9159G66046m5j43004L2889r2817P1876J91811N8300p1955O6549j23844j83175
9148E72631P3447L13833j28681J25040j66058j12285L1655J64090J16013n6889
9138I32796k31066j72531P6447j41654J63115N3755Q6536Q8190k1121p5511k84759
9127D74197J31178J47345J35930O029n3287J8979J34821j65959K6449K7489j35878
$$ plain form
9116 747293 949981 1035208 977537 1060957 980286 892250 949292 849036 1024449 989551 894615
9105 894615 886607 982116 1149794 1049959 1094160 828843 609371 641540 865987 951941 838028
9094 838028 1007888 939730 886223 965760 991836 803323 750986 943881 1037522 1072879 1012309
9083 1012309 1119451 1138337 1054366 1017002 990043 1120158 1238117 1327461 1085614 1236156
9073 1236156 1202409 1294736 1393847 1315247 1447815 1230923 1195360 1341885 1560297 1616114 1505687
9062 1505687 1608869 1622611 1499954 1345529 1409212 1386399 1281443 1392514 1197186 1142374
9052 1142374 1419123 1548330 1531262 1583581 1417079 1247346 1357476 1510868 1610773 1519716
9042 1519716 1416661 1521629 1515866 1538429 1361173 1117570 1146806 1356143 1434096 1532754 1480071
$$ packed form
9116G47293K02688Q5227n7671Q3420q0671q8036N7042j00256J75413l4898r4936
9105H94615q008R5509J67678r9835M4201k65317k19472L2169K24447Q5954j13913
9094H38028J69860o8158n3507P9537K6076j88513n2337J92895R3641L5357o0570
9083A012309J07142J8886q3971l7364k6959J30115J17959Q9344k41847J50542
9073A236156l3747R2327R9111p8600J32568k16892l5563J46525K18412N5817j10427
9062A505687J03182J3742j22657j54425O3683k2813j04956J11071j95328n4812
9052A142374K76749J29207j7068N2319j66502j69733J10130J53392R9905r1057
9042A519716j03055J04968n763K2563j77256k43603K9236K09337P7953R8658n2683
$$ plain form
9031 1480071 1339705 1545084 1640237 1738359 1582818 1557459 1413163 1348026 1435972 1439317 1487254
9020 1487254 1541002 1708258 1749014 1706395 1652597 1558505 1556684 1783535 1807351 1740522 1729238
9009 1729238 1463657 1359911 1406958 1565821 1640914 1760184 1878806 1614339 1615133 1721223
8999 1721223 1623528 1528637 1610642 1484153 1632323 1621164 1476300 1548473 1792241 1709538 1887074
8988 1887074 1932363 1699587 1772701 1698539 1712034 1670481 1931049 2057544 2234755 1960983
8978 1960983 2065169 1990541 1962694 2105429 2129222 2404892 2421263 2369184 2464805 2502160 2579458
8967 2579458 2738154 2696449 2686080 2645034 2683276 2748895 2824877 2611389 2529930 2738771 2776176
8956 2776176 2858644 2659210 2837149 2755122 2948549 3139158 3254742 3384897 3398249 3432846
$$ packed form
9031A480071j40366K05379R5153R8122j55541k5359j44296o5137Q7946L345M7937
9020A487254N3748J67256M0756m2619n3798r4092j821K26851K3816o6829j1284
9009A729238k65581j03746M7047J58863P5093J19270J18622k64467P94J06090
8999A721223r7695r4891Q2005j26489J48170j1159j44864P2173K43768q2703J77536
8988A887074M5289k32776P3114p4162J3495m1553K60568J26495J77211k73772
8978A960983J04186p4628k7847J42735K3793K75670J6371n2079R5621L7355P7298
8967B579458J58696m1705j0369m1046L8242O5619P5982k13488q1459K08841L7405
8956B776176Q2468j99434J77939q2027J93427J90609J15584J30155J3352L4597
$$ plain form
8946 3432846 3287658 3247741 3271418 3321682 3200409 2996811 3148898 3390149 3452149 3209140
8936 3209140 3171721 3194643 3404033 3566647 3642781 3654176 3793686 3873641 4067670 4078022 3922841
8925 3922841 3994663 3932106 3788196 3651063 3666307 3853328 3910081 3539848 3485752 3542530 3562642
8914 3562642 3639033 3818308 3814459 3941190 3918040 3976968 4045896 3924560 3783704 3855763 3849114
8903 3849114 3556805 3420446 3484865 3462396 3528903 3710668 3757829 3653156 3523242 3603384
8893 3603384 3559263 3623298 3760525 3876310 3792617 3731497 3761067 3657774 3629137 3491429 3470385
8882 3470385 3389667 3497431 3521309 3709820 3769608 3856994 3750934 3783736 3636588 3875655
8872 3875655 4118922 4045582 3967146 4103403 4112242 3991012 3722493 3808317 3863547 3715163 3648496
$$ packed form
8946C432846j45188l9917K3677N0264j21273k03598J52087K41251O2000k43009
8936C209140l7419K2922K09390J62614P6134J1395J39510P9955J94029J0352j55181
8925C922841P1822o2557j43910j37133J5244J87021N6753l70233n4096N6778K0112
8914C562642P6391J79275l849J26731k3150N8928O8928j21336j40856P2059o649
8903C849114k92309j36359O4419k2469O6507J81765M7161j04673j29914Q0142
8893C603384m4121O4035J37227J15785q3693o1120K9570j03293k8637j37708k1044
8882C470385q0718J07764K3878J88511N9788Q7386j06060L2802j47148K39067
8872C875655K43267p3340p8436J36257Q839j21230k68519Q5824N5230j48384o6667
$$ plain form
8861 3648496 3871007 3865626 4069119 4140435 3952592 4063055 4070317 4119471 4108361 3923037 3972186
8850 3972186 4096709 4235501 4293242 4347210 4454901 4356730 4396092 4593459 4596945 4719938 4785061
8839 4785061 5097632 5116838 5050118 5135355 5114000 5004204 5124598 5133903 5246971 5549737 5592587
8828 5592587 5708565 5888639 5938417 6032844 6291162 6343712 6470101 6654436 6834045 7129225
8818 7129225 7475026 7651965 8046396 8578276 9077552 9803015 10510632 11383350 12192947 12941177
8808 12941177 13971722 14659528 14855647 14486227 13867601 13177377 12741882 12217212 11712306
8799 11712306 11787809 12080594 12434656 12829387 13085368 13558054 14033314 14756778 15356227 16040585
8789 16040585 16575266 17176285 17373809 17094825 16835795 16298406 15715505 15010422 14726148
$$ packed form
8861C648496K22511n381K03493P1316j87843J10463P262M9154j1110j85324M9149
8850C972186J24523J38792N7741N3968J07691r8171L9362J97367L486J22993O5123
8839D785061L12571J9206o6720Q5237k1355j09796J20394R305J13068L02766M2850
8828E592587J15978J80074M9778R4427K58318N2550J26389J84335J79609K95180
8818G129225L45801J76939L94431N31880M99276P25463P07617Q72718Q09597P48230
8808A2941177J030545O87806J96119l69420o18626o90224m35495n24670n04906
8799A1712306P5503K92785L54062L94731K55981M72686M75260P23464N99449O84358
8789A6040585N34681O01019J97524k78984k59030n37389n82901p05083k84274
$$ plain form
8780 14726148 14629130 14359441 14551274 14854057 15335388 15668718 16200677 16735577 17505092 18365295
8770 18365295 19449589 20511935 21491863 22207770 22629824 22380563 21696041 20871733 20087409
8761 20087409 19415833 19169354 18952773 18952522 19204397 19674517 20404109 21399001 22151721 23242039
8751 23242039 23934094 24728089 25552580 26543651 27043824 27257100 26788902 26598838 26184861
8742 26184861 25862155 25486301 25251223 25175998 25506784 25837836 26690541 27547739 28769702
8733 28769702 29466643 30192338 30494820 30966410 31855100 33194700 34398199 35387330 36262426
8724 36262426 37484084 38481736 40207200 42095932 44735453 47101741 49740692 52180510
8716 52180510 55660800 58955891 62686068 66656707 71449268 77334146 87332878 102625090
$$ packed form
8780A4726148r7018k69689J91833L02783M81331L33330N31959N34900P69515Q60203
8770A8365295J084294J062346R79928P15907M22054k49261o84522q24308p84324
8761B0087409o71576k46479k16581k51K51875M70120P29592R94892P52720J090318
8751B3242039O92055P93995Q24491R91071N00173K13276m68198j90064m13977
8742B6184861l22706l75854k35078p5225L30786L31052Q52705Q57198J221963
8733B8769702O96941P25695L02482M71590Q88690J339600J203499R89131Q75096
8724C6262426J221658R97652J725464J888732K639521K366288K638951K439818
8716E2180510L480290L295091L730177L970639M792561N884878R998732J5292212
$$ plain form
8708 102625090 127217980 161311911 210972108 279030391 367678537 434481654 406082366
8701 406082366 327976180 243263295 182227813 146181163 122632481 104936943 89632784
8694 89632784 76035245 65039606 57198206 50764319 46180140 42706517 40261460 38376127
8686 38376127 37240019 37041086 37426612 37583801 37931405 37449449 36744783 35842487 35258707
8677 35258707 34014092 32717640 30658075 28408657 26243159 24972292 24087424 23356197
8669 23356197 22838162 22973852 22896960 23026477 23171916 24314125 25823072 27718299 29197933
8660 29197933 30166572 30465040 30306595 29416221 27941540 25954477 24435541 22972961 21889203
8651 21889203 20926775 20336295 19964533 20057313 20487152 21012176 21656348 22755067 24018651
$$ packed form
8708A02625090K4592890L4093931M9660197O8058283Q8648146O6803117k8399288
8701D06082366p8106186q4712885o1035482l6046650k3548682j7695538j5304159
8694H9632784j3597539j0995639p841400o433887m584179l473623k445057j885333
8686C8376127j136108j98933L85526J57189L47604m81956p04666r02296n83780
8677C5258707j244615j296452k059565k249418k165498j270867q84868p31227
8669B3356197n18035J35690p6892J29517J45439J142209J508947J895227J479634
8660B9197933R68639K98468j58445q90374j474681j987063j518936j462580j083758
8651B1889203r62428n90480l71762R2780M29839N25024O44172J098719J263584
$$ plain form
8642 24018651 25423367 26464931 27504959 27607895 27097471 26044559 24557875 22382653
8634 22382653 20486507 18699422 17305472 16140792 15261836 14712833 14336866 13920157 14005447
8625 14005447 14198559 14368766 14905106 15421013 15570574 15359953 14615539 13808390 12716633
8616 12716633 11817642 10985550 10347923 9567176 8936130 8384714 8212993 7973464 7976733 7912132
8606 7912132 7814463 7714430 7604509 7681917 7588138 7498373 7466976 7307334 7166802 6941938
8596 6941938 6605816 6566520 6418831 6184514 6068779 5921822 6168868 6207383 6289892 6239076
8586 6239076 6065047 6074634 6034271 5968047 5666305 5629021 5572032 5446346 5330663 5206877 5085551
8575 5085551 4967843 5005998 4736476 5142938 5249529 4963898 5035951 4782707 4577190 4438271
$$ packed form
8642B4018651J404716J041564J040028J02936n10424j052912j486684k175222
8634B2382653j896146j787085j393950j164680q78956n49003l75967m16709Q5290
8625A4005447J93112J70207N36340N15907J49561k10621p44414q07149j091757
8616A2716633q98991q32092o37627p80747o31046n51416j71721k39529L269o4601
8606G912132r7669j00033j09921P7408r3779q9765l1397j59642j40532k24864
8596F941938l36122l9296j47689k34317j15735j46957K47046L8515Q2509n0816
8586F239076j74029R587m0363o6224l01742l7284n6989j25686j15683j23786j21326
8575E085551j17708L8155k69522M06462J06591k85631P2053k53244k05517j38919
$$ plain form
8565 4438271 4503566 4551336 4691606 4510063 4291991 4231664 4290955 4365051 4601978 4575594 4396623
8554 4396623 4358244 4439937 4324925 4379056 4480015 4552834 4521310 4331606 4324932 4558358 4532370
8543 4532370 4674778 4629937 4657810 4677386 4564679 4339776 4255873 4131894 4338862 4489759
8533 4489759 4476787 4531959 4475965 4372494 4327091 4340484 4521281 4605050 4787813 4799140 4851358
8522 4851358 4980398 4957945 5180756 5240303 5218156 5262799 5404568 5438396 5377330 5836259 5737162
8511 5737162 5636398 5784671 5855639 6210805 6387775 6477621 6713982 7134809 7294220 7248935
8501 7248935 7499717 7742109 8109879 8491685 8795958 9243622 9395313 9534014 10082715 10658216
8491 10658216 11213621 11906892 12563226 13290976 13949430 14790770 15974629 17154745 18629932
$$ packed form
8565D438271O5295M7770J40270j81543k18072o0327N9291P4096K36927k6384j78971
8554D396623l8379Q1693j15012N4131J00959P2819l1524j89704o674K33426k5988
8543D532370J42408m4841K7873J9576j12707k24903q3903j23979K06968J50897
8533D489759j2972N5172n5994j03471m5403J3393J80797Q3769J82763J1327N2218
8522D851358J29040k2453K22811N9547k2147M4643J41769L3828o1066M58929r9097
8511E737162j00764J48273P0968L55166J76970Q9846K36361M20827J59411m5285
8501G248935K50782K42392L67770L81806L04273M47664J51691J38701N48701N75501
8491A0658216N55405O93271O56334P27750O58454Q41340J183859J180116J475187
$$ plain form
8482 18629932 19816005 21261393 22488750 23631154 24691365 25579709 26277309 26590387 26505262
8473 26505262 26630657 26788961 26976689 27067554 27273582 27423527 27514574 27493448 27325238 26833091
8463 26833091 25791315 24496064 23198763 22175687 21331918 20755675 20260158 19984011 19861485
8454 19861485 20214604 20778835 21476980 22672986 23796524 25123513 26182330 26907076 27567273
8445 27567273 28086330 28316533 28548727 29162809 30304433 31766920 33495620 35570055 37370304
8436 37370304 38508433 38854074 38797608 38097892 36959836 35683303 34461492 33338955 32642290
8427 32642290 31969936 31636389 31271466 31089030 30773714 30176260 29232918 27885567 26374265
8418 26374265 25114152 23742023 22663266 21707679 20769779 20184421 19937046 19863675 19935822
$$ packed form
8482A8629932J186073J445388J227357J142404J060211Q88344O97600L13078q5125
8473B6505262J25395J58304J87728R0865K06028J49945R1047k1126j68210m92147
8463B6833091j041776j295251j297301j023076q43769n76243m95517k76147j22526
8454A9861485L53119N64231O98145J196006J123538J326989J058817P24746O60197
8445B7567273N19057K30203K32194O14082J141624J462487J728700K074435J800249
8436C7370304J138129L45641n6466o99716j138056j276533j221811j122537o96665
8427C2642290o72354l33547l64923j82436l15316n97454r43342j347351j511302
8418B6374265j260113j372129j078757r55587r37900n85358k47375p3371P2147
$$ plain form
8409 19935822 20427640 21007991 21659064 22518325 22858311 22968283 22566371 22006322 21469734
8400 21469734 21320394 21193849 21119177 21335764 21687645 22101620 22106969 21749090 21214455 20324421
8390 20324421 19423028 18400765 17625123 16672093 15767661 15256126 14894017 14552153 14315039
8381 14315039 14081882 14176864 14181875 14174569 14172990 14171658 14196618 14391778 14616693 14626450 14747922
8370 14747922 14961154 15186417 15425774 15703636 16120846 16657495 17236487 18070579 18723897
8361 18723897 19736594 20715369 21846287 23360598 24622110 25170391 24947532 24774250 24662534
8352 24662534 24550756 24683099 24898510 25325063 25661642 26221616 26456398 26306006 25754550
8343 25754550 25108477 24308515 23658653 23074224 22586909 22262350 21639040 20914531 20520464
$$ packed form
8409A9935822M91818N80351O51073Q59261L39986J09972m01912n60049n36588
8400B1469734j49340j26545p4672K16587L51881M13975N349l57879n34635q90034
8390B0324421r01393j022263p75642r53030r04432n11535l62109l41864k37114
8381A4315039k33157R4982N011p306j579j332K4960J95160K24915R757J21472
8370A4747922K13232K25263K39357K77862M17210N36649N78992Q34092O53318
8361A8723897J012697R78775J130918J514311J261512N48281k22859j73282j11716
8352B4662534j11778J32343K15411M26553L36579N59974K34782j50392n51456
8343B5754550o46073p99962o49862n84429m87315l24559o23310p24509l94067
$$ plain form
8334 20520464 20194704 19787244 19400450 19124529 19028181 19309969 19380043 19565194 19744590 20256919
8324 20256919 21223759 22087772 23101522 24040052 25463272 27499112 29671364 31678658 33680713
8315 33680713 35009622 35698780 35956211 35880562 36060317 36162742 36313780 36741910 37083190
8306 37083190 37204800 37419521 37210676 36400160 35070916 33630999 32108267 30807492 29469572
8297 29469572 27853369 26535964 24928574 23505082 22349366 21297690 20096993 19028190
8289 19028190 18332762 17610122 17290449 16757034 16229569 16140776 16049354 16071131 16456389 16763975
8279 16763975 17182688 17759141 18461758 19358814 20257813 20976710 21017578 20786959 20881140 20665208
8269 20665208 20513795 20596691 20353503 20186553 20316346 20388021 20270986 19577308 18842681 17781032
$$ packed form
8334B0520464l25760m07460l86794k75921r6348K81788P0074J85151J79396N12329
8324B0256919R66840Q64013J013750R38530J423220K035840K172252K007294K002055
8315C3680713J328909O89158K57431p5649J79755J02425J51038M28130L41280
8306C7083190J21610K14721k08845q10516j329244j439917j522732j300775j337920
8297B9469572j616203j317405j607390j423492j155716j051676j200697j068803
8289A9028190o95428p22640l19673n33415n27465q8793r1422K1777L85258L07586
8279A6763975M18713N76453P02617Q97056Q98999P18897M0868k30619R4181k15932
8269B0665208j51413Q2896k43188j66950J29793P1675j17035o93678p34627j061649
$$ plain form
8259 17781032 16995898 16104667 15413047 14903955 14044693 13449052 12796698 12078033 11379316
8250 11379316 10626572 10170892 9567347 8965901 8566920 7987406 7813455 7638431 7445462
8241 7445462 7336094 6958218 6616001 6369125 6174142 6056100 5748601 5905243 6032416 6004734
8231 6004734 5890478 5962558 6035937 6270717 6212057 6442448 6809949 6531779 5943168 5296284
8221 5296284 4807806 4352340 4320992 4275230 3965029 3806520 3592712 3423772 3475950 3481512
8211 3481512 3194062 3113431 2957575 3023623 2887023 2478937 2343471 2340726 2328133 2376071 2262494
8200 2262494 2221400 2012266 1960399 1969060 1917718 2044030 1983200 2292061 316235 -27018
8190 -27018 911160 898067 1217596 932723 917256 779725 814161 953281 911149 842047 948916
$$ packed form
8259A7781032p85134q91231o91620n09092q59262n95641o52354p18665o98717
8250A1379316p52744m55680o03545o01446l98981n79514j73951j75024j92969
8241G445462j09368l77876l42217k46876j94983j18042l07499J56642J27173k7682
8231F004734j14256P2080P3379K34780n8660K30391L67501k78170n88611o46884
8221E296284m88478m55466l1348m5762l10201j58509k13808j68940N2178N562
8211C481512k87450q0631j55856O6048j36600m08086j35466k745j2593M7938j13577
8200B262494m1094k09134n1867Q661n1342J26312o0830L08861j975826l43253
8190b7018R38178j3093L19529k84873j5467j37531L4436J39120m2132o9102J06869
$$ plain form
8179 948916 951682 798363 930227 852743 809612 833566 884431 1046664 916372 779871 864602
8168 864602 778797 581163 413939 596290 883234 557080 736171 702885 593094 635573
8158 635573 664267 757272 818892 755543 716055 413392 484254 631459 570546 722407 708328
8147 708328 588538 465188 394161 529739 481886 575180 656963 463052 360574 155169
8137 155169 225431 270064 187428 385351 442416 285473 507502 484688 384961 460872 334058
8126 334058 338538 288457 455745 416894 265705 279806 508886 422925 324612 297765 353578
8115 353578 437957 421877 330087 581266 618456 446646 510799 493568 522123 315790 311220
8104 311220 274014 182486 134105 271594 182487 483090 373804 453860 452773 442978 470942
$$ packed form
8179I48916K766j53319J31864p7484m3131K3954N0865J62233j30292j36501Q4731
8168H64602q5805j97634j67224J82351K86944l26154J79091l3286j09791M2479
8158F35573K8694R3005O1620o3349l9488l02663P0862J47205o0913J51861j4079
8147G08328j19790j23350p1027J35578m7853R3294Q1783j93911j02478k05405
8137A55169P0262M4633q2636J97923N7065j56943K22029k2814r9727P5911j26814
8126C34058M480n0081J67288l8851j51189J4101K29080q5961r8313k6847N5813
8115C53578Q4379j6080r1790K51179L7190j71810O4153j7231K8555k06333m570
8104C11220l7206r1528m8381J37489q9107L00603j09286Q0056j087r795K7964
$$ plain form
8093 470942 368204 141993 190058 219553 207133 335760 316544 194801 66534 69347 203105
8082 203105 545594 309400 304752 281693 396436 417850 536230 666333 513466 584364 533149
8071 533149 589438 572003 358163 340419 395902 368979 253534 163556 245475 219188 256033
8060 256033 438108 480907 290722 201242 109147 398148 536684 466954 322817 300206 275866
8049 275866 402613 365588 133567 262387 198200 195413 380963 380244 273157 279936 255390
8038 255390 244502 152450 287304 381533 253976 305497 572610 589369 495003 535715 465709
8027 465709 645040 586010 305226 524704 549111 320172 311820 484949 389799 316381 367790
8016 367790 356128 507594 540057 375350 256163 287847 417644 255487 118802 251121
$$ packed form
8093D70942j02738k26211M8065K9495j2420J28627j9216j21743j28267K813J33758
8082B03105L42489k36194m648k3059J14743K1414J18380J30103j52867P0898n1215
8071E33149N6289j7435k13840j7744N5483k6923j15445q9978Q1919k6287L6845
8060B56033J82075M2799j90185q9480r2095K89001J38536o9730j44137k2611k4340
8049B75866J26747l7025k32021J28820o4187k787J85550p19j07087O779k4546
8038B55390j0888r2052J34854R4229j27557N1521K67113J6759r4366M0712p0006
8027D65709J79331n9030k80784K19478K4407k28939q352J73129r5150p3418N1409
8016C67790j1662J51466L2463j64707j19187L1684J29797j62157j36685J32319
$$ plain form
8006 251121 368371 439511 402458 191933 316500 300464 170438 179236 177591 302699 512519
7995 512519 501877 403807 355385 467516 493166 374069 369858 402032 480777 401549 548394
7984 548394 318823 341384 352062 371576 415388 415074 260596 155388 143938 256852 217275
7973 217275 150833 139229 166897 282710 155223 249594 440280 399118 282641 454260 390801
7962 390801 196230 161853 173061 303348 264781 195151 209087 246562 347706 263249 434946
7951 434946 410089 324330 381252 438839 228278 56287 158023 286921 382607 423103 342063
7940 342063 139338 143514 262592 144574 240500 317799 298304 227422 164347 11874 139519
7929 139519 185671 251422 245281 161856 233727 340895 120397 73431 275621 59194 22030
$$ packed form
8006B51121J17250P1140l7053k10525J24567j6036j30026Q798j645J25108K09820
7995E12519j0642r8070m8422J12131K5650j19097m211L2174P8745p9228J46845
7984E48394k29571K2561J0678J9514M3812l14j54478j05208j1450J12914l9577
7973B17275o6442j1604K7668J15813j27487R4371J90686m1162j16477J71619o3459
7962C90801j94571l4377J1208J30287l8567o9630J3936L7475J01144q4457J71697
7951D34946k4857q5759N6922N7587k10561j71991J01736J28898R5686M0496q1040
7940C42063k02725M176J19078j18018R5926P7299j9495p0882o3075j52473J27645
7929A39519M6152O5751o141q3425P1871J07168k20498m6966K02190k16427l7164
$$ plain form
7918 22030 257165 120508 115502 138829 144565 325391 300012 123577 102441 345423 333706
7907 333706 300734 399832 602662 533461 349604 364075 310326 343221 255966 352771 356269
7896 356269 358173 322593 164375 185937 359105 414139 208218 157272 267580 398309 300884
7885 300884 261250 271930 220574 105370 396295 412849 299504 260694 269076 388960 517408
7874 517408 432290 102923 83272 271053 362382 483631 550077 461225 335132 338999 342106
7863 342106 424529 351374 188528 233137 370608 265440 241064 220173 214704 216404 158727
7852 158727 154917 265259 206499 188563 265320 246130 178111 142653 223385 268885 262388 268887
7840 268887 468290 261193 338481 509057 418462 321775 376425 593096 489818 404566 327756
$$ packed form
7918B2030K35135j36657n006K3327N736J80826k5379j76435k1136K42982j1717
7907C33706l2972R9098K02830o9201j83857J4471n3749L2895q7255R6805L498
7896C56269J904l5580j58218K1562J73168N5034k05921n0946J10308J30729r7425
7885C00884l9634J0680n1356j15204K90925J6554j13345l8810Q382J19884J28448
7874E17408q5118l29367j9651J87781R1329J21249O6446q8852j26093L867L107
7863C42106Q2423p3155j62846M4609J37471j05168k4376k0891n469J700n7677
7852A58727l810J10342n8760j7936P6757j9190o8019l5458Q0732M5500o497O499
7840B68887J99403k07097P7288J70576r0595r6687N4650K16671j03278q5252p6810
$$ plain form
7829 327756 436419 549561 498717 490286 814261 902944 919836 869032 826465 1143524 1086111
7818 1086111 1075877 1297523 1244349 1058843 906182 899569 1279336 1167855 1124704 1066395 1093229
7807 1093229 1207017 1070645 1056375 990056 786367 682553 626384 549258 457963 450803 424930
7796 424930 382552 397070 335493 185844 59976 141782 152204 120509 267055 279361 164468
7785 164468 202641 109528 300096 354478 437878 346970 234111 160472 188573 342740 391281
7774 391281 178585 125235 166539 120448 290996 366045 282288 188422 150501 285139 394294
7763 394294 237840 232460 102559 229297 353329 288961 227271 310296 270926 79598 160678
7752 160678 175592 213488 277932 268559 336244 256440 304139 241420 177658 164967 173043 221598
$$ packed form
7829C27756J08663J13142n0844q431L23975Q8683J6892n0804m2567L17059n7413
7818A086111j0234K21646n3174j85506j52661o613L79767j11481m3151n8309K6834
7807A093229J13788j36372j4270o6319k03689j03814n6169p7126r1295p160k5873
7796D24930m2378J4518o1577j49649j25868Q1806J0422l1695J46546J2306j14893
7785A64468L8173r3113J90568N4382Q3400r0908j12859p3639K8101J54167M8541
7774C91281k12696n3350M1304m6091J70548P5049q3757r3866l7921J34638J09155
7763C94294j56454n380j29901J26738J24032o4368o1690Q3025l9370j91328Q1080
7752A60678J4914L7896O4444r373O7685p9804M7699o2719o3762j2691Q076M8555
$$ plain form
7740 221598 203608 152178 101898 123677 188686 303346 215565 210104 114397 102355 104631 167793
7728 167793 218801 324455 436213 373997 281649 302549 360106 388345 284438 295411 436281
7717 436281 320686 349242 407699 423759 248428 31722 -46958 113410 179059 125244 219655
7706 219655 205469 50521 206181 225762 162510 320179 211828 28164 -147493 100980
7696 100980 296020 283167 433129 350681 329819 326757 220214 93018 204434 324005 535832
7685 535832 340629 231904 234036 5087 222017 246899 94609 169020 189690 151934 61889
7674 61889 236308 422616 515963 374291 176364 182868 200465 311932 232622 167013 83586
7663 83586 282078 129081 316491 332811 98410 39258 67221 349651 192295 168007 251252
$$ packed form
7740B21598j7990n1430n0280K1779O5009J14660q7781n461r5707j2042K276O3162
7728A67793N1008J05654J11758o2216r2348K0900N7557K8239j03907J0973J40870
7717D36281j15595K8556N8457J6060j75331k16706p8680J60368O5649n3815R4411
7706B19655j4186j54948J55660J9581o3252J57669j08351j83664j75657K48473
7696A00980J95040j2853J49962q2448k0862l062j06543j27196J11416J19571K11827
7685E35832j95203j08725K132k28949K16930K4882j52290P4411K0670l7756r0045
7674F1889J74419J86308R3347j41672j97927O504J7597J11467p9310o5609q3427
7663H3586J98492j52997J87410J6320k34401n9152K7963K82430j57356k4288Q3245
$$ plain form
7652 251252 243556 144595 195330 294180 343894 312651 215008 109519 250143 143820 92990
7641 92990 61147 37469 73653 37488 -17203 123217 325595 228365 38089 68866 130094
7630 130094 213376 380564 288228 269740 431130 404223 370617 233502 278364 165156 51898
7619 51898 149955 280272 161521 99797 227546 167974 163026 113202 258759 403944 448963
7608 448963 275289 218870 404917 469226 456779 338673 271252 459529 433819 452658 274333
7597 274333 254183 296234 554731 597045 446486 305030 169521 249965 380480 366151 270832
7586 270832 261881 340293 336809 275659 184072 261600 249790 342868 361299 350796 298211 311223
7574 311223 198506 160901 311362 355215 144467 -2545 191003 130168 126733 145004 226336
$$ packed form
7652B51252p696r8961N0735R8850M9714l1243r7643j05489J40624j06323n0830
7641I2990l1843k3678L6184l6165n4691J40420K02378r7230j90276L0777O1228
7630A30094Q3282J67188r2336j8488J61390k6907l3606j37115M4862j13208j13258
7619E1898R8057J30317j18751o1724J27749n9572m948m9824J45557J45185M5019
7608D48963j73674n6419J86047O4309j2447j18106o7421J88277k5710J8839j78325
7597B74333k0150M2051K58497M2314j50559j41456j35509Q0444J30515j4329r5319
7586B70832q951P8412l484o1150r1587P7528j1810R3078J8431j0503n2585J3012
7574C11223j12717l7605J50461M3853k10748j47012J93548o0835l435J8271Q1332
$$ plain form
7563 226336 249021 123148 196132 193377 224665 300909 242431 366672 403235 341831 346332 431330
7551 431330 352668 400502 426162 306854 222819 332551 300184 187083 281087 295743 329288
7540 329288 248071 378169 305366 207202 157669 437832 590002 304681 421847 490364 436067
7529 436067 358198 190961 269288 369082 404851 357939 292235 307778 206423 211303 387791
7518 387791 512759 397817 251134 416656 491003 305367 273599 263201 504600 558324
7508 558324 332144 308252 351765 352685 494219 436208 357135 354180 638270 451840 407716
7497 407716 591177 434944 499558 580444 342139 210158 198966 403355 444830 361018 330931
7486 330931 542303 597254 530413 354440 266236 410957 574150 492180 441372 409328 442461
$$ packed form
7563B26336K2685j25873P2984k755L1288P6244n8478J24241L6563o1404M501Q4998
7551D31330p8662M7834K5660j19308q4035J09732l2367j13101R4004J4656L3545
7540C29288q1217J30098p2803r8164m9533K80163J52170k85321J17166O8517n4297
7529D36067p7869j67237P8327R9794L5769m6912o5704J5543j01355M880J76488
7518C87791J24968j14942j46683J65522P4347j85636l1768j0398K41399N3724
7508E58324k26180k3892M3513R20J41534n8011p9073k955K84090j86430m4124
7497D07716J83461j56233O4614Q0886k38305j31981j1192K04389M1475q3812l0087
7486C30931K11372N4951o6841j75973q8204J44721J63193q1970n0808l2044L3133
$$ plain form
7475 442461 384732 385541 480708 600861 696667 561924 438945 339755 332667 305104 593345
7464 593345 660922 703357 661424 583944 689147 576151 627863 770799 696266 597021 615283
7453 615283 777332 805908 808866 737373 957454 1081327 1012143 877882 799200 834450 991425
7442 991425 1014427 1169937 1338238 1221663 1076092 1183011 1232123 1173945 1303505 1356201
7432 1356201 1258526 1384754 1501374 1465893 1129427 1170282 1269990 1460238 1742369 1518822
7422 1518822 1423245 1441931 1519915 1695401 1518845 1628583 1745184 1720006 1814556 1647318
7412 1647318 1430654 1620881 1612839 1521799 1556780 1390709 1226689 1372747 1569133 1364581
7402 1364581 1430522 1399838 1476178 1367499 1352461 1393610 1485322 1534114 1525386 1520478 1564122 1453770
$$ packed form
7475D42461n7729Q09R5167J20153R5806j34743j22979r9190p088k7563K88241
7464E93345O7577M2435m1933p7480J05203j12996N1712J42936p4533r9245J8262
7453F15283J62049K8576K958p1493K20081J23873o9184j34261p8682L5250J56975
7442I91425K3002J55510J68301j16575j45571J06919M9112n8178J29560N2696
7432A356201r7675J26228J16620l5481l36466M0855R9708J90248K82131k23547
7422A518822r5577J8686P7984J75486j76556J09738J16601k5178R4550j67238
7412A647318k16664J90227q042r1040L4981j66071j64020J46058J96386k04552
7402A364581O5941l0684P6340j08679j5038M1149R1712M8792q728m908M3644j10352
$$ plain form
7390 1453770 1452356 1618456 1602301 1354111 1536342 1611574 1432615 1620076 1610771 1553813 1664806
7379 1664806 1886996 1838774 1920363 1761872 1629428 1863732 1795603 1711445 1670764 1770440 1783884
7368 1783884 1814179 1879609 1803839 1936032 2009593 2112773 2095840 2083917 2078772 2156449 2315329
7357 2315329 2106773 1978895 2031717 2183681 2337721 2096810 1974244 1950295 1939685 1967460
7347 1967460 1942849 1858279 1761875 1800967 1880452 1815575 1722825 1622091 1671275 1503992 1609345
7336 1609345 1624581 1555574 1785859 1674667 1679829 1548920 1558646 1696857 1650239 1601162 1569889
7325 1569889 1513356 1691555 1534822 1327000 1361316 1405354 1778384 1613654 1414972 1548057
7315 1548057 1490989 1307079 1415960 1402453 1334541 1405320 1305205 1280105 1198320 1271760 1193721
$$ packed form
7390A453770j414J66100j6155k48190J82231P5232j78959J87461r305n6958J10993
7379A664806K22190m8222Q1589j58491j32444K34304o8129q4158m0681R9676J3444
7368A783884L0295O5430p5770J32193P3561J03180j6933j1923n145P7677J58880
7357B315329k08556j27878N2822J51964J54040k40911j22566k3949j0610K7775
7347A967460k4611q4570r6404L9092P9485o4877r2750j00734M9184j67283J05353
7336A609345J5236o9007K30285j11192N162j30909R726J38211m6618m9077l1273
7325A569889n6533J78199j56733k07822L4316M4038L73030j64730j98682J33085
7315A548057n7068j83910J08881j3507o7912P0779j00115k5100q1785P3440p8039
$$ plain form
7304 1193721 1295496 1367868 1241149 1248318 1161158 1187798 1304999 1332712 1427482 1589696 1370476
7293 1370476 1310629 1490176 1567279 1460707 1421522 1548483 1416112 1449823 1522084 1598075 1682052
7282 1682052 1741804 1509330 1441528 1524867 1492380 1360713 1360048 1310173 1137573 1033201 1334053
7271 1334053 1369474 1361940 1341102 1371615 1566910 1514956 1543411 1510060 1665255 1640263 1507654
7260 1507654 1659791 1914368 1841026 1725646 1603501 1752617 1876072 1710285 1692951 1957289
7250 1957289 2074755 1919263 1759669 1665996 1674465 1715972 1696429 1611600 1491569 1671740 1686801
7239 1686801 1648834 1718033 1814068 1835334 1678477 1565640 1558875 1509802 1699618 1606302 1800906
7228 1800906 1769339 1721927 1823120 1731011 1776813 1726158 1719927 1704322 1631552 1431278 1467704
$$ packed form
7304A193721J01775P2372j26719P169q7160K6640J17201K7713R4770J62214k19220
7293A370476n9847J79547P7103j06572l9185J26961j32371L3711P2261P5991Q3977
7282A682052N9752k32474o7802Q3339l2487j31667o65m9875j72600j04372L00852
7271A334053L5421p534k0838L0513J95295n1954K8455l3351J55195k4992j32609
7260A507654J52137K54577p3342j15380j22145J49116J23455j65787j7334K64338
7250A957289J17466j55492j59594r3673Q469M1507j9543q4829j20031J80171J5061
7239A686801l7967O9199R6035K1266j56857j12837o765m9073J89816r3316J94604
7228A800906l1567m7412J01193r2109M5802n0655o231j5605p2770k00274L6426
$$ plain form
7217 1467704 1453230 1475880 1556579 1463011 1335790 1246245 1306810 1266880 1384132 1472637 1537635
7206 1537635 1392114 1641348 1677713 1522975 1434281 1460459 1543542 1556369 1805873 1850473 1854174
7195 1854174 1583341 1491423 1373918 1625458 1595960 1480644 1442528 1435371 1629109 1718053 1548468
7184 1548468 1507029 1455573 1552343 1543647 1350545 1327421 1357069 1321421 1304142 1295034 1616745
7173 1616745 1489355 1403801 1236963 1112174 1216452 1292662 1212182 1053176 1077748 1122329
7163 1122329 1051841 1097935 993432 900839 928170 978844 944426 829657 889282 811320 774417
7152 774417 822763 806683 892481 843544 857876 775656 779867 879621 671820 651402 520528
7141 520528 437130 475072 670283 746024 783397 719907 567994 574116 786208 770572 648487
$$ packed form
7217A467704j4474K2650Q0699r3568j27221q9545O0565l9930J17252Q8505O4998
7206A537635j45521K49234L6365j54738q8694K6178Q3083J2827K49504M4600L701
7195A854174k70833r1918j17505K51540k9498j15316l8116p157J93738Q8944j69585
7184A548468m1439n1456R6770q696j93102k3124K9648l5648j7279r108L21711
7173A616745j27390q5554j66838j24789J04278P6210q0480j59006K4572M4581
7163A122329p0488M6094j04503r2593K7331N0674l4418j14769N9625p7962l6903
7152G74417M8346j6080Q5798m8937J4332q2220M211R9754k07801k0418j30874
7141E20528q3398L7942J95211P5741L7373o3490j51913O122K12092j5636j22085
$$ plain form
7130 648487 634559 657681 637953 638873 483248 492189 545753 408230 476683 418120 507694 709408
7118 709408 640873 555365 675760 635956 668917 475606 505971 599081 620221 517649 557842
7107 557842 568529 480382 514316 653597 889977 732681 658689 679234 741632 470953 513339
7096 513339 498804 586958 594302 667537 508477 457453 417787 392042 420407 655109 718455
7085 718455 517485 508164 667007 419026 465819 630507 592769 493513 595126 609444 773653
7074 773653 665795 549553 526552 596271 663607 464412 455075 546310 526187 429313 421522
7063 421522 506496 580403 636898 657009 569579 607799 823394 745928 591361 546516 267369
7052 267369 575934 807104 963415 815034 645649 697851 550681 529145 518222 526745 762862
$$ packed form
7130F48487j3928K3122j9728R20j55625Q941N3564j37523O8453n8563Q9574K01714
7118G09408o8535q5508J20395l9804L2961j93311L0365R3110K1140j02572M0193
7107E57842J0687q8147L3934J39281K36380j57296p3992K0545O2398k70679M2386
7096E13339j4535Q8154P344P3235j59060n1024l9666k5745K8365K34702O3346
7085G18455k00970r321J58843k47981M6793J64688l7738r9256J01613J4318J64209
7074G73653j07858j16242k3001O9719O7336j99195r337R1235k0123r6874p791
7063D21522Q4974P3907N6495K0111q7430L8220K15595p7466j54567m4845k79147
7052B67369L08565K31170J56311j48381j69385N2202j47170k1536j0923Q523K36117
$$ plain form
7041 762862 973813 826103 756043 597462 692867 647988 805889 745215 701510 870841 629425
7030 629425 844249 914395 781119 726185 564233 568965 671833 667203 829833 673209 729918
7019 729918 664916 738846 766436 882219 870223 855153 912247 1159012 1056064 1128929 1009486
7008 1009486 972380 856920 852983 838263 941501 918342 905991 916625 923125 1042548 1155683
6997 1155683 1161938 1215380 1353905 1097480 988835 1047148 1107218 1216214 1250230 978802 1031542
6986 1031542 941007 941966 1115159 1034365 1104043 1146125 1097075 1040754 1219248 1197111 1069903
6975 1069903 1164379 1225233 1338397 1561755 1619656 1577869 1487388 1539946 1348068 1400906 1547326
6964 1547326 1588411 1606596 1561662 1505995 1604315 1531643 1505433 1551231 1606803 1597854 1583637 1607041
$$ packed form
7041G62862K10951j47710p0060j58581R5405m4879J57901o0674m3705J69331k41416
7030F29425K14824P0146j33276n4934j61952M732J02868m630J62630j56624N6709
7019G29918o5002P3930K7590J15783j1996j5070N7094K46765j02948P2865j19443
7008A009486l7106j15460l937j4720J03238k3159j2351J0634O500J19423J13135
6997A155683O255N3442J38525k56425j08645N8313O0070J08996L4016k71428N2740
6986A031542r0535R59J73193q0794O9678M2082m9050n6321J78494k2137j27208
6975A069903R4476O0854J13164K23358N7901m1787r0481N2558j91878N2838J46420
6964A547326M1085J8185m4934n5667R8320p2672k6210M5798N5572q949j4217K3404
$$ plain form
6952 1607041 1534227 1636940 1683350 1804786 1842233 1792073 1873892 2030408 1986913 2041013 1930392
6941 1930392 1998473 1939831 1957281 2056146 2046661 1923694 2071377 1940895 1933552 1869875 1889105
6930 1889105 1963729 1935405 1903307 1891838 1956740 2177024 2277248 2323749 2262004 2232953 2252877
6919 2252877 2251775 2255193 2344729 2433382 2412700 2334603 2301678 2415613 2494299 2356266 2411820
6908 2411820 2305570 2427812 2446092 2601056 2787525 2844720 2860216 2831553 2997507 3170017
6898 3170017 3109905 3288827 3409285 3754153 3680182 3595407 3829956 4106679 4341580 4521629
6888 4521629 4538283 4648316 4910223 4875247 5009684 5075498 5239431 5337759 5479683 5702050
6878 5702050 5747263 5879768 6107143 6140018 6340032 6332722 6327899 6399676 6642190 6654361 6883498
$$ packed form
6952A607041p2814J02713M6410J21436L7447n0160Q1819J56516m3495N4100j10621
6941A930392O8081n8642J7450R8865r485j22967J47683j30482p343o3677J9230
6930A889105P4624k8324l2098j1469O4902K20284J00224M6501o1745k9051J9924
6919B252877j102L418Q9536Q8653k0682p8097l2925J13935P8686j38033N5554
6908B411820j06250J22242J8280J54964J86469N7195J5496k8663J65954J72510
6898C170017o0112J78922J20458L44868p3971q4775K34549K76723K34901J80049
6888D521629J6654J10033K61907l4976J34437O5814J63933R8328J41924K22367
6878E702050M5213J32505K27375L2875K00014p310m823P1777K42514J2171K29137
$$ plain form
6867 6883498 6983730 7205801 7253436 6966753 7206698 7279479 7347952 7371358 7452208 7445033 7299341
6856 7299341 7631092 7578965 7420669 7515296 7775601 7738079 7952486 8054867 8098640 8211035
6846 8211035 8327670 8372871 8274493 8466517 8580107 8572625 8449697 8459427 8480130 8471051 8515714
6835 8515714 8525126 8335001 8207865 8219989 8035024 8082896 8125573 8227881 8221749 8181183 7936404
6824 7936404 7855570 7703002 7717372 7924182 7614186 7475846 7252689 7249226 7372399 7366046 7409982
6813 7409982 7228310 7117827 7089770 7035699 7046499 6797698 6679466 6574114 6518029 6732298
6803 6732298 6603971 6586504 6563103 6336048 6235534 6231820 6083177 5912391 5834217 5776482 5579051
6792 5579051 5476218 5326310 5160641 5056813 4812533 4904309 4863630 4567794 4384099 4183965
$$ packed form
6867F883498J00232K22071M7635k86683K39945P2781O8473K3406Q0850p175j45692
6856G299341L31751n2127j58296R4627K60305l7522K14407J02381M3773J12395
6846H211035J16635M5201r8378J92024J13590p482j22928R730K0703r079M4663
6835H515714R412j90125j27136J2124j84965M7872M2677J02308o132m0566k44779
6824G936404q0834j52568J4370K06810l09996j38340k23157l463J23173o353M3936
6813G409982j81672j10483k8057n4071J0800k48801j18232j05352n6085K14269
6803F732298j28327j7467k3401k27055j00514l714j48643j70786p8174n7735j97431
6792E579051j02833j49908j65669j03828k44280R1776m0679k95836j83695k00134
$$ plain form
6782 4183965 4174048 4068772 3846057 3865499 3753231 3632349 3537478 3094058 3217562 3261767
6772 3261767 3123628 2976148 2961356 2971595 3182000 3108168 2740810 2577919 2674080 2726485
6762 2726485 2599101 2497893 2581175 2569303 2589704 2864137 3049609 3091115 2972802 3031338
6752 3031338 2970967 2841252 2570342 2350481 2530618 2603845 2401989 2356686 2437051 2603061
6742 2603061 2433519 2593881 2573755 2747168 2796211 2876107 2895431 2913132 3054916 3208949
6732 3208949 3273157 3196883 3121742 3027510 3003298 3067184 2970972 3063148 2974280 2923193 2989073
6721 2989073 3082724 3093892 2973730 3116302 3254325 3123817 3027790 2788395 2908025 3263808
6711 3263808 3387944 3363810 3469257 3483788 3479742 3633265 3721672 3554471 3465788 3542586 3554209
$$ packed form
6782D183965r917j05276k22715J9442j12268j20882r4871m43420J23504M4205
6772C261767j38139j47480j4792J0239K10405p3832l67358j62891R6161N2405
6762B726485j27384j01208Q3282j1872K0401K74433J85472M1506j18313N8536
6752C031338o0371j29715k70910k19861J80137P3227k01856m5303Q0365J66010
6742B603061j69542J60362k0126J73413M9043P9896J9324J7701J41784J54033
6732C208949O4208p6274p5141r4232k4212O3886r6212R2176q8868n1087O5880
6721B989073R3651J1168j20162J42572J38023j30508r6027k39395J19630L55783
6711C263808J24136k4134J05447J4531m046J53523Q8407j67201q8683P6798J1623
$$ plain form
6700 3554209 3587888 3654003 3665215 3522541 3397264 3206869 3230029 3179320 3201352 3027966 2928623
6689 2928623 3026282 3021290 2919908 2877183 2857375 2989321 3254883 3491753 3350039 3407723 3273708
6678 3273708 3342980 3210967 3285476 3321049 3207731 3194882 3165107 3155046 3014035 2958657 2766780
6667 2766780 2658253 2771660 2716794 2725449 2513171 2334984 2438511 2450935 2560820 2668059
6657 2668059 2647970 2579664 2419802 2433042 2376993 2275850 2370090 2262550 2241830 2210705 2062705
6646 2062705 1978978 2042738 1817585 1777818 1900510 2181716 2117577 2058158 1861271 1883123 1780163
6635 1780163 1784648 1784279 1758402 1683204 1764765 1777533 1863903 1935773 1689717 1899814 1925000 1899244
6623 1899244 2036233 2098199 2017947 1836175 1861939 1767596 1635110 1876026 1951048 1825389
$$ packed form
6700C554209L3679O6115J1212j42674j25277j90395K3160n0709K2032j73386r9343
6689B928623R7659m992j01382m2725j9808J31946K65562K36870j41714N7684j34015
6678C273708O9272j32013P4509L5573j13318j2849k9775j0061j41011n5378j91877
6667B766780j08527J13407n4866Q655k12278j78187J03527J2424J09885J07239
6657B668059k0089o8306j59862J3240n6049j01143R4240j07540k0720l1125j48000
6646B062705q3727O3760k25153l9767J22692K81206o4139n9419j96887K1852j02960
6635A780163M485l69k5877p5198Q1561J2768Q6370P1870k46056K10097K5186k5756
6623A899244J36989O1966q0252j81772K5764r4343j32486K40916P5022j25659
$$ plain form
6613 1825389 1744187 1682584 1562580 1580701 1578855 1691521 1595084 1668907 1897243 1715495 1735534
6602 1735534 1829004 1760689 1830030 1820522 2035962 2019263 1970732 1953361 2032698 2102077 2046306
6591 2046306 2113170 2154857 2146968 2157190 2366156 2286563 2118913 2309314 2322561 2308210 2298792
6580 2298792 2433394 2420075 2471396 2522159 2389312 2463367 2523241 2619971 2716501 2703514 2597452
6569 2597452 2382162 2505830 2640215 2711010 2848976 2847277 2898508 2901274 2921728 2988859 3132581
6558 3132581 3089471 3163487 3470153 3376510 3364777 3252126 3263022 3362196 3523268 3706077 3885683
6547 3885683 4039446 3939820 4097539 4098511 4246549 4118579 4255118 4329116 4395584 4686306 4857517
6536 4857517 5042402 5224941 5603527 5701159 5872786 6150256 6469107 6622005 6501469 6452015
$$ packed form
6613A825389q1202o1603j20004J8121j846J12666r6437P3823K28336j81748K0039
6602A735534R3470o8315O9341r508K15440j6699m8531j7371P9337O9379n5771
6591B046306O6864M1687p889J0222K08966p9593j67650J90401J3247j4351r418
6580B298792J34602j3319N1321N0763j32847P4055N9874R6730R6530j2987j06062
6569B597452k15290J23668J34385P0795J37966j699N1231K766K0454O7131J43722
6558C132581m3110P4016L06666r3643j1733j12651J0896R9174J61072J82809J79606
6547C885683J53763r9626J57719R72J48038j27970J36539P3998O6468K90722J71211
6536D857517J84885J82539L78586R7632J71627K77470L18851J52898j20536m9454
$$ plain form
6526 6452015 6456807 6407223 6502012 6341928 6363325 6507500 6479170 6492596 6451667 6440182 6319745
6515 6319745 6344047 6338336 6283428 6289057 5992409 5922048 5805691 5466052 5368546 5360898 5163501
6504 5163501 4911123 4774865 4788780 4704043 4466199 4226477 4409663 4350166 4278175 4352976
6494 4352976 4301356 4395593 4494445 4523247 4364233 4619709 4655210 4616755 4572551 4815130 4973747
6483 4973747 4969727 5051113 5156842 5226979 5367422 5442866 5662718 5965489 5866385 5941939 6181239
6472 6181239 6385240 6638005 6652302 6831413 7193744 7310699 7657146 7991565 8231938 8659933
6462 8659933 8992906 9340375 9864400 10288714 10791383 11229738 11595560 12057809 12285647 12505134
6452 12505134 12599375 12440112 12347711 12143135 12018594 11996627 11928952 11874337 11713524 11781038
$$ packed form
6526F452015M792m9584R4789j60084K1397J44175k8330J3426m0929j1485j20437
6515F319745K4302n711n4908N629k96648p0361j16357l39639r7506p648j97397
6504E163501k52378j36258J3915q4737k37844k39722J83186n9497p1991P4801
6494D352976n1620R4237R8852K8802j59014K55476L5501l8455m4204K42579J58617
6483D973747m020Q1386J05729P0137J40443P5444K19852L02771r9104P5554K39300
6472F181239K04001K52765J4297J79111L62331J16955L46447L34419K40373M27995
6462H659933L32973L47469N24025M24314N02669M38355L65822M62249K27838K19487
6452A2505134R4241j59263r2401k04576j24541k1967o7675n4615j60813O7514
$$ plain form
6442 11781038 11731088 11932420 11853054 11835983 11636613 11274621 10955632 10554081 10008707 9609975
6432 9609975 9381132 8793016 8374163 8099461 7740772 7425439 7096034 6807348 6521376 6283696
6422 6283696 6292936 6174453 5830658 5744726 5684787 5592319 5696667 5760139 5864883 5791152 5873601
6411 5873601 5960849 6122100 5919228 5945161 6084634 6231070 6181231 6141222 6182247 6216505 6452292
6400 6452292 6480972 6555821 6530038 6673879 6737376 6728565 6859560 6934081 6895303 6949725 6920964
6389 6920964 6895995 7124687 7275998 7516586 7911218 7902028 7898108 8374053 8884610 9248209
6379 9248209 9459934 9865710 10453817 11001057 11369006 11547422 11747082 11829876 12041282 12173570
6369 12173570 12099312 12134970 12149200 11912093 11658156 11524765 11351897 11434231 11387262 11456512
$$ packed form
6442A1781038m9950K01332p9366j7071j99370l61992l18989m01551n45374l98732
6432I609975k28843n88116m18853k74702l58689l15333l29405k88686k85972k37680
6422F283696R240j18483l43795q5932n9939r2468J04348O3472J04744p3731Q2449
6411E873601Q7248J61251k02872K5933J39473J46436m9839m0009M1025L4258K35787
6400F452292K8680P4849k5783J43841O3497q811J30995P4521l8778N4422k8761
6389F920964k4969K28692J51311K40588L94632r190l920M75945N10557L63599
6379I248209K11725M05776N88107N47240L67949J78416J99660Q2794K11406J32288
6369A2173570p4258L5658J4230k37107k53937j33391j72868Q2334m6969O9250
$$ plain form
6359 11456512 11639970 11992018 12203608 12317975 12852785 13354877 13948682 14510061 14823262
6350 14823262 15646517 16467421 17130881 17873322 18793966 19348185 20046431 20651514 21131783
6341 21131783 21288360 21148703 21137196 21143695 21048602 20862639 20647877 20345100 20112796 20199874
6331 20199874 20363432 20344147 20415494 20252497 19926299 19671143 19224036 18617767 18054570 17286710
6321 17286710 16841526 16022166 15249021 14502872 13946730 13422624 12865827 12418425 12138772
6312 12138772 11840147 11415042 11079659 10978521 11088032 11017058 10906528 10870118 11012846 11070477
6302 11070477 11082372 10976626 11110800 11182020 11228410 11431229 11551997 11297765 11175985 11133109
6292 11133109 10932381 10757215 10516068 10111801 10032323 9759067 9671476 9540611 9315665 9244702
$$ packed form
6359A1456512J83458L52048K11590J14367N34810N02092N93805N61379L13201
6350A4823262Q23255Q20904O63460P42441R20644N54219O98246O05083M80269
6341B1131783J56577j39657j1507O499r5093j85963k14762l02777k32304Q7078
6331B0199874J63558j9285P1347j62997l26198k55156m47107o06269n63197p67860
6321A7286710m45184q19360p73145p46149n56142n24106n56797m47402k79653
6312A2138772k98625m25105l35383j01138J09511p0974j10530l6410J42728N7631
6302A1070477J1895j05746J34174P1220M6390K02819J20768k54232j21780m2876
6292A1133109k00728j75166k41147m04267p9478k73256q7591j30865k24946p0963
$$ plain form
6282 9244702 9221919 9479814 9295437 9174957 9317637 9340258 9354486 9371948 9428482 9765579
6272 9765579 10066029 10433236 10618234 10822592 11054094 11231270 11192799 11013305 10929713 10926988
6262 10926988 10692304 10624736 10583422 10679028 10571132 10479890 10521447 10469174 10501167 10399704 10167867
6251 10167867 9983540 9491293 9210494 9057509 8656876 8425564 8324024 8088785 7861172
6242 7861172 7594432 7470501 7338605 7252225 7186405 7192193 7021165 6845655 6730901 6822259
6232 6822259 6701056 6602656 6670573 6645674 6682725 6853253 6815217 6576157 6447617 6322396
6222 6322396 6187224 6241892 6167592 6069255 6101200 6044471 6169458 6053005 5939098 6079211
6212 6079211 6395274 6327154 6590420 6554212 6630365 6794044 6905185 7135159 7547929 7842489
$$ packed form
6282I244702k2783K57895j84377j20480J42680K2621J4228J7462N6534L37097
6272I765579L00450L67207J84998K04358K31502J77176l8471j79494q3592k725
6262A0926988k34684o7568m1314R5606j07896r1242M1557n2273L1993j01463k31837
6251A0167867j84327m92247k80799j52985m00633k31312j01540k35239k27613
6242G861172k66740j23931j31896q6380o5820N788j71028j75510j14754R1358
6232F822259j21203r8400O7917k4899L7051J70528l8036k39060j28540j25221
6222F322396j35172N4668p4300r8337L1945n6729J24987j16453j13907J40113
6212F079211L16063o8120K63266l6208P6153J63679J11141K29974M12770K94560
$$ plain form
6202 7842489 8124862 8519825 8812242 9184688 9287298 9274433 9338365 9016904 8872932 8813213
6192 8813213 8729660 8815292 8838008 8749078 8874894 8973138 8976917 9316750 9879391 10337303 10943504
6181 10943504 11638441 11920556 11979967 11739995 11120261 10218813 9191820 8451474 8042695
6172 8042695 7573391 7079670 6709477 6483710 6414076 6324444 6040497 6020019 6108860 5913314
6162 5913314 5914467 5843694 5890528 6067177 6074490 6203196 6287081 6254598 6363792 6655688 6777422
6151 6777422 7053632 7196948 7493332 7881517 8292661 8901378 9511686 10370604 11304201 11940743
6141 11940743 12803128 13548641 13973508 14176997 13815176 13216878 12661974 12129749 11695615
6132 11695615 11343140 11016648 10760066 10751052 11018646 11002848 11079222 11416067 11786990 11941559
$$ packed form
6202G842489K82373L94963K92417L72446J02610j2865O3932l21461j43972n9719
6192H813213q3553Q5632K2716q8930J25816R8244L779L39833N62641M57912O06201
6181A0943504O94937K82115N9411k39972o19734r01448j026993p40346m08779
6172H042695m69304m93721l70193k25767o9634q9632k83947k0478Q8841j95546
6162E913314J153p0773M6834J76649P313J28706Q3885l2483J09194K91896J21734
6151F777422K76210J43316K96384L88185M11144O08717O10308Q58918R33597O36542
6141A1940743Q62385P45513M24867K03489l61821n98298n54904n32225m34134
6132A1695615l52475l26492k56582r014K67594j5798P6374L36845L70923J54569
$$ plain form
6122 11941559 12295390 12645316 12694419 12702526 12402127 11960702 11560063 10813887 10060883 9398158
6112 9398158 8941796 8303235 7729042 7417742 7007660 6863302 6625957 6396133 6136339 6072210
6102 6072210 6095445 6168607 6256830 6100665 6238310 6292622 6239146 6368675 6582694 6673606 6814688
6091 6814688 6442023 6109414 6226476 6343580 6027625 5851476 5925550 5713501 5651905 5459669
6081 5459669 5367549 5332469 5384454 5188201 4985635 4864848 4701379 4718753 4557320 4378396
6071 4378396 4358892 4376025 4156395 4184837 4007501 3764523 3770095 3781956 3904238 3929135 3988892
6060 3988892 3891882 3823889 3879986 3687950 3608099 3758501 3756559 3762439 3814662 3723577 3591902
6049 3591902 3867167 3846806 3875283 3908183 3881848 3928353 3928865 3926132 3929942 3874083 3965176 4233995
$$ packed form
6122A1941559L53831L49926M9103Q107l00399m41425m00639p46176p53004o62725
6112I398158m56362o38561n74193l11300m10082j44358k37345k29824k59794o4129
6102F072210K3235P3162Q8223j56165J37645N4312n3476J29529K14019R0912J41082
6091F814688l72665l32609J17062J17104l15955j76149P4074k12049o1596j92236
6081E459669r2120l5080N1985j96253k02566j20787j63469J7374j61433j78924
6071D378396j9504J7133k19630K8442j77336k42978N572J1861J22282K4897N9757
6060C988892r7010o7993N6097j92036p9851J50402j942N880N2223r1085j31675
6049C591902K75265k0361K8477L2900k6335M6505N12k733L810n5859R1093K68819
$$ plain form
6037 4233995 4334009 4299005 4398073 4505763 4596736 4609282 4771069 4965521 5029105 5080261 5140684
6026 5140684 5079167 5022702 5043511 5155344 5043382 5254224 5351284 5467599 5805512 5800862 5993621
6015 5993621 6070252 6435832 6705728 6778977 7103137 7273169 7552552 7646018 7772906 7748653
6005 7748653 7690049 7619923 7488101 7342137 7346783 7290552 7295492 7159224 7244750 7479132 7607464
5994 7607464 7790492 8086009 8431877 8813134 9181182 9442918 9811599 10249328 10833909 11222664
5984 11222664 11505262 11482307 11423133 11288728 11524623 11579241 11741348 11660732 11606765 11502500
5974 11502500 11323320 11492315 11603628 11622462 11622189 11739275 12079191 12409765 12668018 13131501
5964 13131501 13526779 13931641 14387582 14890515 15138828 15415227 15929796 16430771 16927915
$$ packed form
6037D233995J00014l5004R9068J07690R0973J2546J61787J94452O3584N1156O0423
6026E140684o1517n6465K0809J11833j11962K10842R7060J16315L37913m650J92759
6015E993621P6631L65580K69896P3249L24160J70032K79383R3466J26888k4253
6005G748653n8604p0126j31822j45964M646n6231M940j36268Q5526K34382J28332
5994G607464J83028K95517L45868L81257L68048K61736L68681M37729N84581L88755
5984A1222664K82598k2955n9174j34405K35895N4618J62107q0616n3967j04265
5974A1502500j79180J68995J11313J8834k73J17086L39916L30574K58253M63483
5964A3131501L95278M04862M55941N02933K48313K76399N14569N00975M97144
$$ plain form
5955 16927915 17192369 17567938 17885039 18244997 18258519 18091880 17868232 17494503 17110075 16797053
5945 16797053 16546103 16587926 16686528 16932821 17360123 17950887 18675036 19604495 20352285 20948625
5935 20948625 21939965 22948851 23758798 24319195 24802934 25519400 25972706 26235347 26714262
5926 26714262 27198020 27149527 27075704 26584101 25952851 25129716 24108072 23298430 22339740 21297854
5916 21297854 20115824 19088879 18204973 17189625 16081461 15091243 14206914 13357848 12777649
5907 12777649 12053256 11700915 11560287 11205440 10961704 10801144 11138917 11061146 10965633 11117446
5897 11117446 11400699 11538038 11844584 12041049 12199653 12345691 12468529 12224469 12110624
5888 12110624 11878008 11630953 11355566 11301077 11359536 11163823 11157447 11237902 11347382 11731743
$$ packed form
5955A6927915K64454L75569L17101L59958J3522j66639k23648l73729l84428l13022
5945A6797053k50950M1823R8602K46293M27302N90764P24149R29459P47790N96340
5935B0948625R91340J008886Q09947N60397M83739P16466M53306K62641M78915
5926B6714262M83758m8493p3823m91603o31250q23135j021644q09642r58690j041886
5916B1297854j182030j026945q83906j015348j108164r90218q84329q49066n80199
5907A2777649p24393l52341j40628l54847k43736j60560L37773p7771r5513J51813
5897A1117446K83253J37339L06546J96465J58604J46038J22838k44060j13845
5888A2110624k32616k47055k75387n4489N8459j95713o376Q0455J09480L84361
$$ plain form
5878 11731743 12216939 12582878 13129334 13605137 14371922 15294994 16114423 16895077 17523212
5869 17523212 17945826 18371176 18591466 18726542 18367993 17669348 16776619 15784248 14820226
5860 14820226 13920623 13127415 12644092 12076314 11448557 11221155 10738660 10283390 9843833
5851 9843833 9570635 9418427 9466456 9371482 9200929 9122331 9308783 9283598 9326582 9490481
5841 9490481 9565929 9602844 9588041 9646534 9756588 10133250 10389772 10971690 11044599 10977814 10944437
5830 10944437 10712410 10513923 10108416 9933807 9611321 9416679 9230552 9137757 8986979 8644197
5820 8644197 8302033 8130810 7924395 7718054 7540970 7436935 7328521 7269135 7114826 6975794
5810 6975794 6928591 6833624 6861842 6786265 6489986 6455976 6230845 6145043 6340234 6210637 6189661
$$ packed form
5878A1731743M85196L65939N46456M75803P66785R23072Q19429P80654O28135
5869A7523212M22614M25350K20290J35076l58549o98645q92729r92371r64022
5860A4820226q99603p93208m83323n67778o27757k27402m82495m55270m39557
5851I843833k73198j52208M8029r4974j70553p8598J86452k5185M2984J63899
5841I490481P5448L6915j4803N8493J10054L76662K56522N81918P2909o6785l3377
5830A0944437k32027j98487m05507j74609l22486j94642j86127r2795j50778l42782
5820H644197l42164j71223k06415k06341j77084j04035j08414n9386j54309j39032
5810F975794m7203r4967K8218p5577k96279l4010k25131q5802J95191j29597k0976
$$ plain form
5799 6189661 6308048 6273134 6148173 6158531 6269496 6401941 6479262 6683087 6893636 6932340
5789 6932340 6995539 7006447 6755100 6671624 6355670 6180137 5980685 6105997 5919925 5695118
5779 5695118 5659839 5618723 5715010 5797149 6029990 6033989 6246518 6607599 6701192 6796368 6702639
5768 6702639 6629847 6592887 6708992 6515416 6276946 6211387 6191035 6075624 6199999 6233182
5758 6233182 6088436 6058290 6211694 6366099 6417220 6419766 6394507 6467896 6634956 6750726 6693277
5747 6693277 6706941 6610282 6748083 6787415 6473666 6239367 6341589 6275694 6266624 6237359 6259195
5736 6259195 6259989 6331898 6390762 6289709 6276880 6428134 6634592 6840585 6958108 6902762 7119314
5725 7119314 7398464 7680320 7809394 7666651 7715681 7868083 7703117 7731533 7700857 7682793
$$ packed form
5799F189661J18387l4914j24961J0358J10965J32445P7321K03825K10549L8704
5789F932340O3199J0908k51347q3476l15954j75533j99452J25312j86072k24807
5779E695118l5279m1116R6287Q2139K32841L999K12529L61081R3593R5176r3729
5768F702639p2792l6960J16105j93576k38470o5559k0352j15411J24375L3183
5758F233182j44746l0146J53404J54405N1121K546k5259P3389J67060J15770n7449
5747F693277J3664r6659J37801L9332l13749k34299J02222o5895r070k9265K1836
5736F259195P94P1909N8864j01053j2829J51254K06458K05993J17523n5346K16552
5725G119314K79150K81856J29074j42743M9030J52402j64966K8416l0676j8064
$$ plain form
5715 7682793 7575669 7510018 7529508 7483457 7415913 7347618 7461073 7373607 7294019 7243769 7408468
5704 7408468 7546112 7621521 7802161 7958608 7955522 8210202 8563564 8776430 8938376 9210931
5694 9210931 9371221 9720560 10063728 10732389 11186983 11728892 12242629 12843638 13842277 14847510
$$ packed form
5715G682793j07124o5651J9490m6051o7544o8295J13455q7466p9588n0250J64699
5704G408468J37644P5409J80640J56447l086K54680L53362K12866J61946K72555
5694I210931J60290L49339L43168O68661M54594N41909N13737O01009R98639J005233
$$ [...]
##END NTUPLES=NMR SPECTRUM
##END=
