##TITLE=1H_EC-3301-x
 DMSO
 8 sc, 
 31.10.2023
##JCAMPDX= 6.0         $$ Bruker NMR JCAMP-DX V2.0
##DATA TYPE= NMR SPECTRUM
##DATA CLASS= NTUPLES
##ORIGIN= UXNMR, Bruker Analytische Messtechnik GmbH
##OWNER= root
$$ XWIN-NMR		Version 3.5
$$ Tue Oct 31 14:12:05 2023 Russian Standard Time (UT+4h)  she@DPX200
##.OBSERVE FREQUENCY= 200.13135
##.OBSERVE NUCLEUS= ^1H
##.ACQUISITION MODE= SIMULTANEOUS
##.ACQUISITION SCHEME= undefined
##.AVERAGES= 8
##.DIGITISER RES= 18
##SPECTROMETER/DATA SYSTEM= spect
##.PULSE SEQUENCE= zg30
##.SOLVENT NAME= DMSO
##.SHIFT REFERENCE= (INTERNAL, DMSO, 0, 15.748)
##AUDIT TRAIL= $$ (NUMBER, WHEN, WHO, WHERE, WHAT)
$$ ##TITLE= Audit trail, XWIN-NMR		Version 3.5
$$ ##JCAMPDX= 5.01
$$ ##ORIGIN= Bruker BioSpin GmbH
$$ ##OWNER= she
$$ F:/spectra/data/she/nmr/H-F/1/pdata/1/auditp.txt
$$ ##AUDIT TRAIL=  $$ (NUMBER, WHEN, WHO, WHERE, WHAT)
(   1,<2023-10-31 14:10:57.51 +0400>,<she>,<DPX200>,
      <created by zg, POWCHK disabled, PULCHK disabled
       configuration hash MD5:
       00 E9 B6 7A A2 85 ED C7 34 08 36 98 17 FE 4E 26
       data hash MD5: 16K
       9E CC 80 5C 3D 0A 22 AF BC CD 7A 2B F4 83 5B 7F>)
(   2,<2023-10-31 14:11:00.03 +0400>,<she>,<DPX200>,
      <Start of raw data processing
       efp BC_mod = 2 LB = 0.24 FT_mod = 6 PKNL = 1 PHC0 = -23873.16 PHC1 = 9.252709 SI = 16K 
       data hash MD5: 16K
       56 FF 41 71 98 EB 10 1A 2D 54 EB 07 C4 E1 9C 03>)
(   3,<2023-10-31 14:11:17.14 +0400>,<she>,<DPX200>,
      <pk PHC0 = -3.047883 PHC1 = 1.2 
       data hash MD5: 16K
       A0 83 11 5B C9 CA CC 76 0A 6E A8 19 42 99 96 13>)
(   4,<2023-10-31 14:11:22.40 +0400>,<she>,<DPX200>,
      <abs ABSG = 5 
       data hash MD5: 16K
       81 ED B1 1B EE BF 12 46 2B FF 1A 1B C3 3F B0 48>)
$$ ##END=
$$ 
$$ hash MD5
$$ 62 65 A3 62 A0 A4 35 C2 75 76 DA E3 86 72 D3 1B
##$RELAX= 
##$RELAX= 
##$RELAX= 
##$RELAX= 
##$RELAX= 
##$RELAX= 
$$ Bruker specific parameters
$$ --------------------------
##$DU= <F:/spectra>
##$EXPNO= 1
##$NAME= <H-F>
##$PROCNO= 1
##$TYPE= <nmr>
##$USER= <she>
##$AMP= (0..31)
100 100 100 100 100 100 100 100 100 100 100 100 100 100 100 100 100 100 
100 100 100 100 100 100 100 100 100 100 100 100 100 100 
##$AQSEQ= 0
##$AQ_mod= 1
##$AUNM= <au_zg>
##$AUTOPOS= <>
##$BF1= 200.13
##$BF2= 200.13
##$BF3= 200.13
##$BF4= 200.13
##$BF5= 200.13
##$BF6= 200.13
##$BF7= 200.13
##$BF8= 200.13
##$BYTORDA= 1
##$CFDGTYP= 0
##$CFRGTYP= 5
##$CHEMSTR= <none>
##$CNST= (0..31)
1 1 145 1 1 1 1 1 1 1 1 1 1 1 1 1 1 1 1 1 1 1 1 1 1 1 1 1 1 1 1 1 
##$CPDPRG= <>
##$CPDPRG1= <>
##$CPDPRG2= <>
##$CPDPRG3= <>
##$CPDPRG4= <mlev>
##$CPDPRG5= <mlev>
##$CPDPRG6= <mlev>
##$CPDPRG7= <mlev>
##$CPDPRG8= <mlev>
##$CPDPRGB= <>
##$CPDPRGT= <>
##$D= (0..31)
0 1.2 0 0 0 0 0 0 0 0.06 0 0.03 0 0 0 0 0.0002 0 0 0 0 0 0 0 0 0 0 0 0 
0 0 0 
##$DATE= 1698747056
##$DBL= (0..7)
120 120 120 120 120 120 120 120 
##$DBP= (0..7)
150 150 150 150 150 150 150 150 
##$DBP07= 0
##$DBPNAM0= <>
##$DBPNAM1= <>
##$DBPNAM2= <>
##$DBPNAM3= <>
##$DBPNAM4= <>
##$DBPNAM5= <>
$$ [...]
##$SUBNAM3= <"">
##$SUBNAM4= <"">
##$SUBNAM5= <"">
##$SUBNAM6= <"">
##$SUBNAM7= <"">
##$SUBNAM8= <"">
##$SUBNAM9= <"">
##$SW= 18.05172834244
##$SWIBOX= (0..15)
0 0 2 0 0 0 0 0 0 0 0 0 0 0 0 0 
##$SW_h= 3612.71676300578
##$TD= 16384
##$TD0= 1
##$TE= 0
##$TE2= 300
##$TE3= 300
##$TEG= 300
##$TL= (0..7)
0 120 120 120 120 120 120 120 
##$TP= (0..7)
150 150 150 150 150 150 150 150 
##$TP07= 0
##$TPNAME0= <>
##$TPNAME1= <>
##$TPNAME2= <>
##$TPNAME3= <>
##$TPNAME4= <>
##$TPNAME5= <>
##$TPNAME6= <>
##$TPNAME7= <>
##$TPOAL= (0..7)
0.5 0.5 0.5 0.5 0.5 0.5 0.5 0.5 
##$TPOFFS= (0..7)
0 0 0 0 0 0 0 0 
##$TUNHIN= 0
##$TUNHOUT= 0
##$TUNXOUT= 0
##$USERA1= <user>
##$USERA2= <user>
##$USERA3= <user>
##$USERA4= <user>
##$USERA5= <user>
##$V9= 5
##$VALIST= <valist>
##$VCLIST= <CCCCCCCCCCCCCCC>
##$VD= 0
##$VDLIST= <DDDDDDDDDDDDDDD>
##$VPLIST= <PPPPPPPPPPPPPPP>
##$VTLIST= <TTTTTTTTTTTTTTT>
##$WBST= 1024
##$WBSW= 4
##$XGAIN= (0..3)
0 0 0 0 
##$XL= 0
##$YL= 0
##$YMAX_a= 62572
##$YMIN_a= -74960
##$ZGOPTNS= <>
##$ZL1= 120
##$ZL2= 120
##$ZL3= 120
##$ZL4= 120
##$ABSF1= 15.76232
##$ABSF2= -2.28953
##$ABSG= 5
##$ABSL= 3
##$ALPHA= 0
##$AQORDER= 0
##$ASSFAC= 0
##$ASSFACI= 0
##$ASSFACX= 0
##$ASSWID= 0
##$AUNMP= <proc_1d>
##$AZFE= 0.1
##$AZFW= 0.1
##$BCFW= 0
##$BC_mod= 2
##$BYTORDP= 0
##$COROFFS= 0
##$CY= -3
##$DATMOD= 1
##$DC= 0
##$DFILT= <>
##$DTYPP= 0
##$F1P= 0
##$F2P= 0
##$FCOR= 1
##$FTSIZE= 16384
##$FT_mod= 6
##$GAMMA= 0
##$GB= 0
##$INTBC= 1
##$INTSCL= 3.70164e-10
##$ISEN= 128
##$LB= 0.24
##$LEV0= 0
##$LPBIN= 0
##$MAXI= 10000
##$MC2= 0
##$MEAN= 0
##$ME_mod= 0
##$MI= 1.114404
##$NCOEF= 0
##$NC_proc= -8
##$NLEV= 6
##$NOISF1= 3.799351
##$NOISF2= 2.8
##$NSP= 0
##$NTH_PI= 0
##$NZP= 0
##$OFFSET= 15.74799
##$PC= 1
##$PHC0= -23876.21
##$PHC1= 10.45271
##$PH_mod= 1
##$PKNL= yes
##$PPARMOD= 0
##$PSCAL= 0
##$PSIGN= 0
##$REVERSE= no
##$SF= 200.130004712939
##$SI= 16384
##$SIGF1= 3
##$SIGF2= 2
##$SINO= 5.538805
##$SIOLD= 16384
##$SREGLST= <1H.CDCl3>
##$SSB= 0
##$STSI= 16384
##$STSR= 0
##$SW_p= 3612.71676300578
##$SYMM= 0
##$S_DEV= 0
##$TDeff= 16384
##$TDoff= 0
##$TI= <>
##$TILT= no
##$TM1= 0
##$TM2= 0
##$TOPLEV= 0
##$USERP1= <user>
##$USERP2= <user>
##$USERP3= <user>
##$USERP4= <user>
##$USERP5= <user>
##$WDW= 1
##$XDIM= 16384
##$YMAX_p= 353471736
##$YMIN_p= -2349359
$$ End of Bruker specific parameters
$$ ---------------------------------
##NTUPLES= NMR SPECTRUM
##VAR_NAME=  FREQUENCY,     SPECTRUM/REAL,   SPECTRUM/IMAG
##SYMBOL=    X,             R,               I
##VAR_TYPE=  INDEPENDENT,   DEPENDENT,       DEPENDENT
##VAR_FORM=  AFFN,          ASDF,            ASDF
##VAR_DIM=   16384,         16384,           16384
##UNITS=     HZ,            ARBITRARY UNITS, ARBITRARY UNITS
##FACTOR=    0.220516191357247, 1,           1
##FIRST=     3151.64524378261, 0,            0
##LAST=      -461.071519223172, 0,           0
##MIN=       -461.071519223172, -2349359,    0
##MAX=       3151.64524378261, 353471736,    0
$$ Real data points
##PAGE= N=1
##DATA TABLE= (X++(R..R)), XYDATA
$$ [...]
8104a28284J05753J39574k55986k94539L17487M61749j80810q38805K83908P94816
$$ -128284 -22531 117043 -138943 -433482 -115995 345754 164944 -673861 -389953 404863
8094D04863k73962l49509L04991J96784l00125r8337J05690p265q6277K13525
$$ 404863 130901 -218608 86383 283167 -16958 -115295 -9605 -16870 -103147 110378
8084A10378M0613j99613p6274j65815j80090k64466K48203M84060l58505l26584
$$ 110378 150991 -48622 -124896 -290711 -470801 -735267 -487064 -3004 -361509 -688093
8074f88093K99706L79427L04031k89716J188R3204l94494M0874K44506m8617j69539
$$ -688093 -388387 -8960 295071 5355 6543 99747 -294747 -253873 -9367 -57984 -227523
8063b27523j64927K13614K97441m13843J40239L17607k65631O0042L01199L16112
$$ -227523 -392450 -178836 118605 -295238 -154999 162608 -103023 -42981 258218 574330
8053E74330n52090j79388P5444j07750o71125j3529Q83387K78965n29735Q9781
$$ 574330 22240 -157148 -81704 -189454 -860579 -874108 9279 288244 -241491 -151710
8043a51710L16473m74410k3760K83880K8331j63500M86465j25545o89845K57951
$$ -151710 164763 -309647 -333407 -49527 -21196 -184696 301769 176224 -513621 -255670
8033b55670P80839M9413l59721l22625L33369m66559j86643J37513N90756n32130
$$ -255670 525169 574582 214861 -107764 225605 -240954 -427597 -290084 300672 -231458
8023b31458n53475M83408M94570m20734k42957N23968N7367o15346J30782L84500
$$ -231458 -784933 -301525 193045 -227689 -470646 53322 110689 -504657 -373875 10625
8013A0625p20413J26930K73836M44136l77120n83810L66265P46107m11147m34205
$$ 10625 -709788 -582858 -309022 135114 -242006 -825816 -459551 286556 -124591 -558796
8003e58796L65362O5773m13342M58963r5514k68117j90686M22851J20044m06477
$$ -558796 -193434 -127661 -541003 -82040 -177554 -445671 -636357 -213506 -93462 -499939
7993d99939O05335L6863l65105L0766J33527p2855k38331o6657L23110K34142
$$ -499939 105396 142259 -222846 -192080 -58553 -131408 -369739 -436396 -113286 120856
7983A20856l14918n02735L77888J97576l96744q8133K79584K53914K1904j29827
$$ 120856 -194062 -696797 -318909 -121333 -518077 -606210 -326626 -72712 -50808 -180635
7973a80635k65025M5789L02143J86921k89809q5482K32671k57956k82064M13440
$$ -180635 -445660 -399871 -97728 89193 -200616 -286098 -53427 -311383 -593447 -180007
7963a80007L11583l52282l45106M91984j40685l43388L7812L03587M89899p85174
$$ -180007 131576 -220706 -565812 -73828 -214513 -557901 -520089 -216502 273397 -511777
7953e11777K84306M31358k87952n52933j5001R28465k92414k89550J68370K80138
$$ -511777 -227471 203887 -84065 -636998 -651999 276466 -15948 -305498 -137128 143010
7943A43010R6053l71367J79006k96729l10195m3476L35030l9993J32431J64869
$$ 143010 239063 -132304 46702 -250027 -560222 -603698 -268668 -308661 -176230 -11361
7933a1361n3727k97829l3694K80135J64058k73982l00926J84514N8846L16040
$$ -11361 -65088 -362917 -396611 -116476 47582 -226400 -527326 -342812 -283966 32074
7923C2074j53026p1326K64869m46696m66611L68479L60895k9942j05708n1754
$$ 32074 -120952 -192278 72591 -374105 -840716 -472237 -111342 -141284 -246992 -298746
7913b98746k765N3984k27007j7128R2531M55936l10743q4366N42423k79520o6227
$$ -298746 -301511 -247527 -474534 -491662 -399131 56805 -253938 -338304 204119 -75401 -141628
7902a41628O038L99039K88633p68730q6394Q279l34425M3281K63258J54258r4267
$$ -141628 -135590 263449 552082 -216648 -303042 -294763 -629188 -585907 -322649 -168391 -262658
7891b62658J69824o8672K6928K2395m98584N27465K26547J32637J3944o50497
$$ -262658 -92834 -161506 -134578 -112183 -610767 -83302 143245 275882 289826 -360671
7881c60671j02053K95218p8715j80804M32721N86403k42152r16047N10371L85703
$$ -360671 -462724 -167506 -246221 -427025 5696 592099 349947 -566100 -55729 329974
7871C29974j00318m96030k39568O40959L3052o07974P03739J137m27916k80029
$$ 329974 229656 -266374 -505942 135017 168069 -439905 263834 264971 -162945 -442974
7861d42974L30749O39199n85746l93469L40450J50277n93125m236M78704K47328
$$ -442974 -112225 526974 -58772 -452241 -111791 38486 -554639 -558875 -80171 167157
7851A67157r2889Q6451k29377J08966J07637k60417N0213J40797r3187k17295
$$ 167157 74268 160719 -68658 40308 147945 -112472 -62259 78538 -14649 -231944
7841b31944k2820K27239J00072j46999j02633J43618L97201o38565j12999K00426
$$ -231944 -254764 -27525 72547 -74452 -177085 -33467 363734 -274831 -387830 -187404
7831a87404M82291m83697j75901Q04975K62547l79779o70802N89293J01487l86117
$$ -187404 294887 -188810 -364711 440264 702811 323032 -347770 241523 343010 -43107
7821d3107k03171L70797k47108O9941k08866K40230j37626p49494L09200N71668
$$ -43107 -246278 124519 -122589 -52648 -261514 -21284 -158910 -908404 -599204 -27536
7811b7536K9149R9130R71791K95603q59716o67224l67102O31268L99100m67470
$$ -27536 1613 100743 1072534 1368137 508421 -158803 -525905 105363 504463 36993
7801C6993o02144n5334N77242j71710j36086M52807p5376k8105l41392M01599
$$ 36993 -565151 -620485 -43243 -214953 -351039 101768 26392 -1713 -343105 58494
7791E8494L03705l30594J05002L51682j85921m23509L51697M714k83760o69683
$$ 58494 362199 31605 136607 488289 302368 -121141 230556 235270 -48490 -718173
7781g18173M92519O67187k59668n30277L06156l30557M1807M07518K22292k85594
$$ -718173 -225654 441533 181865 -348412 -42256 -372813 -331006 76512 298804 13210
7771A3210l45069L92009J33257q6750L4247L22504k89434j70986K41935L0061
$$ 13210 -331859 60150 193407 106657 140904 463408 173974 2988 244923 274984
7761B74984m05290l71490N86094n65m64797P5302M39759j21721m19386M16629
$$ 274984 -130306 -501796 84298 83733 -381064 -305762 133997 12276 -407110 9519
7751I519j03614P7453J89517J66413o24046j89213K90036Q119N57697p7391N6251
$$ 9519 -94095 -16642 172875 339288 -284758 -473971 -183935 -175816 381881 304490 360741
7740C60741n7759m26995l01400j79110K20145l6652J77631J81577K90462l54108
$$ 360741 302982 -124013 -425413 -604523 -384378 -421030 -243399 -61822 228640 -125468
7730a25468j88840O7233J09671j92932K00025O49913l8975n3228o55179k18277
$$ -125468 -314308 -247075 -137404 -330336 -130311 519602 480627 427399 -227780 -446057
7720d46057R8077j10283J60807J84979K58886j29164j87876j36240K46354L5421
$$ -446057 -347980 -458263 -297456 -112477 146409 17245 -170631 -306871 -60517 -25096
7710b5096m45021M45041M11350l31795p5588P04264o38661j95680R4197O89449
$$ -25096 -470117 -25076 386274 54479 -21109 683155 44494 -151186 -56989 632460
7700F32460j02874n01307K06874K68551k01276m0182p6537j47751Q6605L9046
$$ 632460 529586 28279 235153 503704 302428 262246 185709 37958 124563 163609
7690A63609j40846j20899N32077J43763m78123j92882O21372l58336q96837K19337
$$ 163609 22763 -98136 433941 577704 99581 -93301 528071 169735 -727102 -507765
7680e07765O47033k27735l61617L07177M07801m33310K3638L26178J79160l52196
$$ -507765 139268 -88467 -450084 -142907 264894 -168416 -144778 181400 360560 8364
7670H364J39684K63395K26993M0838m57932k06606K04970j57605l9801j69864
$$ 8364 148048 411443 638436 679274 221342 14736 219706 62101 22300 -147564
7660a47564j11817m48609N91762K68856k13143K42210j34510J73417o2449L40475
$$ -147564 -259381 -707990 -116228 152628 -60515 181695 47185 220602 158153 498628
7650D98628l48739p1603K66514L23681m53376J95962k05601L0753j98952l88157
$$ 498628 149889 78286 344800 668481 215105 411067 205466 236219 37267 -350890
7640c50890M49814j49170L7174n2089K28813l9293M6466j75664k41094L33473
$$ -350890 98924 -50246 -13072 -65161 163652 124359 170825 -4839 -245933 87540
7630H7540l3216j89556K57773M14157k6903j07822J12237k06924k45283J64879
$$ 87540 54324 -135232 122541 536698 509795 401973 514210 307286 62003 226882
7620B26882L39801m43595l61669J3679N48363Q7529p87225O44875R5157l1924
$$ 226882 566683 123088 -238581 -224902 323461 410990 -376235 268640 363797 331873
7610C31873j64566m33169J70640o7158M97370k31278o30396M02260R3185j93863
$$ 331873 167307 -265862 -95222 -162380 334990 103712 -526684 -124424 -31239 -225102
7600b25102l42076J49333N60274p2658N747j6424N01592J43806o63446l34241
$$ -225102 -567178 -417845 142429 69771 75518 59094 560686 704492 41046 -293195
7590b93195M57388L48212j57834R4616M25973j80465j61822k60961q755L76539
$$ -293195 164193 512405 354571 449187 875160 694695 532873 271912 263157 639696
7580F39696k96823j05308n0421L17215p6646K32311R1562j66611n45477J0983
$$ 639696 342873 237565 187144 504359 427713 660024 751586 584975 39498 50481
7570E0481N49764K3262l9894l61916K19081K34927l87434N8370J97081J10176
$$ 50481 600245 623507 583613 221697 440778 675705 288271 346641 543722 653898
7560F53898m67622m658M92618J40604m17903N4776M45619j66376k08961Q8017
$$ 653898 186276 181618 674236 814840 396937 451713 897332 730956 521995 610012
7550F10012R30153j4182o12474k44360L22639o5480L01538k14534L89639J74997
$$ 610012 1540165 1525983 913509 669149 991788 926308 1227846 1013312 1402951 1577948
7540A577948L02688k22110j24512K85110k67001j24965M95831j61496K22485K2240
$$ 1577948 1880636 1658526 1534014 1819124 1552123 1427158 1922989 1761493 1983978 2006218
7530B006218Q6674L4579p7895M09120m0140j02462J94930l38827q4871L60768
$$ 2006218 2092892 2127471 2049576 2458696 2418556 2316094 2511024 2172197 2087326 2448094
7520B448094K94896J54659L7617P3037r5794M99138k39731J11809N5322M87904
$$ 2448094 2742990 2897649 2935266 3008303 2912509 3411647 3171916 3283725 3339047 3826951
7510C826951l7635O0565O30795j9952l93594K99452N09057M8518l41761K57057
$$ 3826951 3789316 3849881 4480676 4460724 4067130 4366582 4875639 4924157 4582396 4839453
7500D839453R03262L33728l99821l78028M97584O18104o54394K12230P75860j03575
$$ 4839453 5742715 6076443 5676622 5298594 5796178 6414282 5759888 5972118 6747978 6644403
7490F644403k67429K60298O8882k579j56208N50206j58438l19810m9997O10930
$$ 6644403 6376974 6637272 6706154 6703575 6547367 7097573 6939135 6619325 6569328 7180258
7480G180258k26573o70676L61007J95101k14532k11428K19304J9805l93131k53451
$$ 7180258 6953685 6283009 6644016 6839117 6624585 6413157 6632461 6652266 6259135 6005684
7470F005684K64554J47810m47682n48471j81517P5066K19711k78080n76540l0956
$$ 6005684 6270238 6418048 5970366 5421895 5240378 5315444 5535155 5257075 4680535 4649579
7460D649579J53548r8656l54239j25052j35859l22667J83286M61613K84087m31123
$$ 4649579 4803127 4704471 4350232 4225180 4089321 3766654 3949940 4411553 4695640 4264517
7450D264517n74067J4242L29746L20892N16781o992m44363k12950k31568j28554
$$ 4264517 3690450 3704692 4034438 4355330 4872111 4865119 4420756 4207806 3976238 3847684
7440C847684j00748N61098L12892L0808M9488p7930K00830J60828L89477o8201
$$ 3847684 3746936 4308034 4620926 4651734 4701222 4623292 4824122 4984950 5374427 5306226
7430E306226o5448L5690K41008r3869m92263M2654L90283L91050q6661m18821
$$ 5306226 5240778 5276468 5517476 5423607 4931344 4973998 5364281 5755331 5668670 5249849
7420E249849K02560k61665P2243J28261J9331K57737M27000m18681k44826N67271
$$ 5249849 5452409 5190744 5262987 5391248 5410579 5668316 6095316 5676635 5431809 5999080
7410E999080J54284p09043n14724J99434J71931k51699n81380K69187R0690l89884
$$ 5999080 6153364 5444321 4929597 5129031 5300962 5049263 4467883 4737070 4827760 4437876
7400D437876J67729K16742m03705m18429k60375j18828j16782m62901M22940l23006
$$ 4437876 4605605 4822347 4418642 4000213 3739838 3621010 3504228 3041327 3464267 3141261
7390C141261o4313R0884k13453K62213l53363p11052l3304K18321k2041p2300
$$ 3141261 3076948 3167832 2954379 3216592 2863229 2152177 2118873 2337194 2315153 2242853
7380B242853j40184K31619k30200l59080J15326J31823J21687n28759q7842M18143
$$ 2242853 2102669 2334288 2104088 1745008 1860334 1992157 2113844 1585085 1497243 1915386
7370A915386m19425J02033K89393n08642k5549k01687K8463k07562l4558J59780
$$ 1915386 1495961 1597994 1887387 1378745 1353196 1151509 1179972 972410 937852 1097632
7360A097632j13027m23545k76863K85061K46354K16314o09415O72834L6270o28127
$$ 1097632 984605 561060 284197 569258 815612 1031926 422511 1095345 1131615 503488
7350E03488k92086M74338L82402o77107j0756P4375J64278J82440k26615O3366
$$ 503488 211402 685740 1068142 391035 380279 454654 618932 801372 574757 638123
7340F38123j70322K11106R7374l92976j45164O81997n1787q12445j24010L49646
$$ 638123 467801 678907 776281 383305 238141 920138 868351 55906 -68104 281542
7330B81542R9085L76892j36347j74362k04725L76785m03448j48786O38134j01743
$$ 281542 380627 757519 621172 446810 242085 618870 215422 66636 704770 603027
7320F03027j90518l85641j28345J03331P2853L68586L29813n39591J00322L71619
$$ 603027 412509 26868 -101477 1854 74707 443293 773106 233515 333837 705456
7310G05456m62553l43321K15379J40988k47175m19477O15097O08456k39196m37128
$$ 705456 242903 -100418 114961 255949 8774 -410703 204394 812850 573654 136526
7300A36526j29269M09372l24899j64486K39130l08690K6876j62305l0250K31853
$$ 136526 7257 416629 91730 -72756 166374 -142316 -115440 -277745 -307995 -76142
7290g6142l01155k82971N41136M34827J37934j63774n1188j78100R8853N0672
$$ -76142 -377297 -660268 -119132 315695 453629 289855 238667 60567 159420 210092
7280B10092L84468r8807j83829p2797j04289m56773p983L64522J49308j19685
$$ 210092 594560 495753 311924 239127 134838 -321935 -329918 34604 183912 64227
7270F4227N7882q6933J33916k50633p0150J25382n4868Q814M95522K65546n35107
$$ 64227 122109 35176 169092 -81541 -151691 -26309 -81177 -72363 423159 688705 153598
7259A53598O1024J46777J65155o54668K78275R7812l7166K0031k42046j93122
$$ 153598 214622 361399 526554 -128114 150161 247973 210807 230838 -11208 -204330
7249b04330J37777R5577j25937k9575J1834j81303P4013K39617p70593N17351
$$ -204330 -66553 29024 -96913 -126488 -114654 -295957 -221944 17673 -752920 -235569
7239b35569M52870n99996K68873J6055K29938R397k88729Q13896m0859k49108
$$ -235569 217301 -382695 -113822 -97767 132171 141568 -147161 666735 625876 376768
7229C76768m92486J62622n0903n11416J4088k67760O23066j1842l35858K15211
$$ 376768 -115718 46904 -3999 -515415 -501327 -769087 -146021 -157863 -493721 -278510
7219b78510L29074M3448J31632k99672O3844j5011n1786K18226K16985l29689
$$ -278510 50564 94012 225644 -74028 -10184 -25195 -76981 141245 358230 28541
7209B8541m19626K22966M84172l40187j03040K46526M18576l63178p96019J11238
$$ 28541 -391085 -168119 316053 -24134 -127174 119352 537928 174750 -621269 -510031
7199e10031N98780J4314n48940J51335N22379j75937k73490j75443N58748J20611
$$ -510031 88749 103063 -445877 -294542 227837 51900 -221590 -397033 161715 282326
7189B82326k76175K85173O3544m13701n65583L71703K67786j14403J2330l8425
$$ 282326 6151 291324 354868 -58833 -624416 -252713 15073 -99330 -87000 -125425
7179a25425J94704K93138n57771p5643K04099j65058j55221K76569K29001k1884
$$ -125425 69279 362417 -195354 -270997 -66898 -231956 -387177 -110608 118393 96509
7169I6509k55460J48056L86566n42449L7929J16240O0170k8474M8936J24633k1676
$$ 96509 -158951 -10895 375671 -166778 -128849 -12609 47561 19087 68023 192656 170980
7158A70980K66669p6678o96986m06498K37345n3899m45504N67135Q77503j9889
$$ 170980 437649 360971 -336015 -742513 -505168 -559067 -1004571 -437436 440067 420178
7148D20178o01278K99411L9369m12257j81228K76402N34140l16340n0212L88317
$$ 420178 -181100 118311 157680 -254577 -435805 -159403 374737 58397 8185 396502
7138C96502M364p73886k2310L94617Q9739p24732J33238K38345K95069n35101
$$ 396502 400866 -373020 -395330 -713 89026 -635706 -502468 -264123 30946 -504155
7128e04155j35471O96304J27480k36750J13456K50280m11663n94568k0581M2178
$$ -504155 -639626 56678 184158 -52592 60864 311144 -100519 -695087 -715668 -673490
7118f73490N04508k19969m05867J71682L32690J97470j40368L9276M68385q4015
$$ -673490 -168982 -388951 -794818 -623136 -290446 -92976 -233344 -194068 274317 190302
7108A90302k83645J8821K28479l74749N4495N77499J17209l76717l88916j4977
$$ 190302 -93343 -74522 153957 -220792 -166297 411202 528411 151694 -237222 -252199
7098b52199J85757J78420q7682j85172J25364L43877l30389j9381K92735L04597
$$ -252199 -66442 111978 24296 -160876 -35512 308365 -22024 -41405 251330 555927
7088E55927m24255j91126O02175j00647q92704M45571J92726m91480j12318L72934
$$ 555927 131672 -59454 542721 442074 -450630 -5059 187667 -303813 -416131 -43197
7078d3197M31672o2753m78324Q9754N08646l24500k6230M5780q2186m01196J57156
$$ -43197 388475 325722 -152602 -62848 445798 121298 95068 140848 58662 -342534 -185378
7067a85378N52874l87808j3626J49252l77306l93456J7056Q0538L54283k12917
$$ -185378 367496 -20312 -33938 115314 -261992 -655448 -638392 -557854 -203571 -416488
7057d16488L46662J73565j78422n0823K2184J75420j67348q6658K76245n50781
$$ -416488 -69826 103739 -74683 -125506 -103322 72098 -95250 -181908 94337 -456444
7047d56444k54649N56232K40868o85694K15720M07860j8645l92280J65456P91978
$$ -456444 -711093 -154861 86007 -599687 -383967 23893 5248 -387032 -221576 570402
7037E70402n08830k86813K68694N03707q92648l71158K88603L46359K50137P28
$$ 570402 61572 -225241 43453 547160 -345488 -716646 -428043 -81684 168453 169181
7027A69181J14364l01026m27197K46243Q00280n88176k55026R3839J91331k77889
$$ 169181 283545 -17481 -444678 -198435 601845 13669 -241357 -147518 43813 -234076
7017b34076j84771M41804J67207k06936m28555M59961K25945m30604L274M66779
$$ -234076 -418847 22957 190164 -16772 -445327 14634 240579 -190025 -186751 280028
7007B80028l02807l39105L21656j5407l14842p472J92241k77927j02318m4142
$$ 280028 -22779 -361884 -40228 -55635 -370477 -377949 -185708 -463635 -565953 -610095
6997f10095L53422L4993k80968K46157L3323J20236Q3157J41942N60735q17125
$$ -610095 -256673 -221680 -502648 -256491 -223168 -102932 -19775 122167 682902 -134223
6987a34223m69546O21902r6678J69691l3619n4558k22341J34056O53363j62841
$$ -134223 -603769 18133 -78545 91146 57527 2969 -219372 -85316 568047 405206
6977D05206p89568K1773N68273k4265m59546j99885K70221J98002n41192j70845
$$ 405206 -384362 -362589 205684 181419 -278127 -478012 -207791 -9789 -550981 -721826
6967g21826L57222J42400j49790J52709L57198J40629l10231r733P8846K3791
$$ -721826 -364604 -222204 -371994 -219285 137913 278542 -31689 -41422 37424 61215
6957F1215J77072m5736m22129j95417k13654J5582J30200r6265N25184J38306
$$ 61215 238287 192551 -229578 -424995 -638649 -623067 -492867 -589132 -63948 74358
6947G4358l7339j58493K1692M27059J32274m02682j57995p0206L4749M80544m71735
$$ 74358 37019 -121474 -99782 327277 459551 56869 -101126 -171332 -136583 343961 -127774
6936a27774m01230L33913M57372l41928k2814Q0358L30707k4983m71039O05090
$$ -127774 -529004 -195091 262281 -79647 -102461 -22103 308604 283621 -187418 417672
6926D17672L03305j061023l37395L43897j26K59773K08080N43557k90149q99680
$$ 417672 720977 -340046 -677441 -333544 -333670 -73897 134183 677740 387591 -512089
6916e12089O42573M75589q81400n2652K61595N21825p31308r1927N07103K57200
$$ -512089 130484 606073 -275327 -327979 -66384 455441 -275867 -367794 139309 396509
6906C96509m71838k7522P37037n18874n80753K45280J84944j77607K8468K53860
$$ 396509 -75329 -102851 634186 115312 -465441 -220161 -35217 -212824 -184356 69504
6896F9504j43366o4099J44490p275j5471j59683L23127j22279l50142J73675L93411
$$ 69504 -73862 -137961 6529 -746 -16217 -175900 147227 24948 -325194 -151519 241892
6885B41892J03533o43842J57571K44673l80783J39640J98784K83460l66435M24268
$$ 241892 345425 -298417 -140846 103827 -276956 -137316 61468 344928 -21507 402761
6875D02761J7533K4705j27378n2376q433o99405l05736L74223M08082k97135l36118
$$ 402761 420294 444999 317621 265245 256812 -442593 -748329 -374106 33976 -263159 -599277
6864e99277K78016L25802o2069J63511k05629k53610N06121n41439k98825K13072
$$ -599277 -321261 4541 -57528 105983 -99646 -353256 152865 -388574 -687399 -474327
6854d74327L30964j11255O0173N34113j38847l85387k1538M83732m62725m31602
$$ -474327 -143363 -254618 -194445 339668 200821 -184566 -206104 277628 -185097 -616699
6844f16699J00295O67135l5165j83013M36779L8090j048886k18943J032282J30917
$$ -616699 -516404 150731 115566 -67447 369332 407422 -641464 -860407 171875 302792
6834C02792m23547J42468N91121p68981m84218N00402M02733m75229l14875M77139
$$ 302792 -120755 21713 612834 -156147 -640365 -139963 262770 -212459 -527334 -50195
6824e0195M57045k35575j6769J45284j19673Q411j04801K83364m7997j80391K60648
$$ -50195 406850 171275 154506 299790 180117 188528 83727 367091 319094 138703 399351
6813C99351M6789o18209j99400L51997k60482l16657O26968O2520l5008m03061
$$ 399351 446140 -172069 -371469 -19472 -279954 -596611 30357 92877 57869 -345192
6803c45192K22143N53166p50673J55055P60303j98124n59014m01305J78855J26274
$$ -345192 -123049 430117 -320556 -165501 594802 396678 -162336 -563641 -384786 -258512
6793b58512m49708J21273J016930j36544j74424l5704J55105J7482k10581m20149
$$ -258512 -708220 -586947 429983 293439 119015 83311 238416 255898 45317 -374832
6783c74832J7474N31284p5818k31489m27876M14617M61114J5383j55394L38226
$$ -374832 -357358 173926 98108 -133381 -561257 -146640 314474 329857 174463 512689
6773E12689K47835k36250n30913K21651K16334n97063k13409L04567J91612m63160
$$ 512689 760524 524274 -6639 215012 431346 -165717 -379126 -74559 117053 -346107
6763c46107j72309L05428L08960k41203j34704L53479K9266q70184N79638O22106
$$ -346107 -518416 -212988 95972 -145231 -279935 73544 102810 -767374 -187736 434370
6753D34370n45155n17176N32949P3244m55867j80921N41425l336j92890l94867
$$ 434370 -110785 -627961 -95012 -21768 -477635 -658556 -117131 -120467 -313357 -708224
6743g08224L82112M75556M329J014j6704M3993L10369r309k27233j15150j16700
$$ -708224 -326112 149444 153773 154787 138083 182076 492445 483136 255903 140753 24053
6732B4053K52772m98612l69894J92795O00995k60275o2948M52656J42374j87452
$$ 24053 276825 -221787 -591681 -398886 202109 -58166 -121114 331542 473916 286464
6722B86464k0882j38880K26383j63925l36414J57850p612l20638L59773M18283
$$ 286464 265582 126702 353085 189160 -147254 10596 2984 -317654 42119 460402
6712D60402j62995n33043L23518L17665m07976o34413O30627K71612l46037q2087
$$ 460402 297407 -235636 87882 405547 -2429 -636842 -6215 265397 -80640 -162727
6702a62727O78543o3398k53111K01036K10449P5340l14106k13786k57504m68613
$$ -162727 515816 452418 199307 400343 610792 686132 372026 158240 -99264 -567877
6692e67877K23912L33933P6698k17530J58705L11632l53192R6997K39127K5921
$$ -567877 -343965 -10032 66666 -150864 7841 319473 -33719 63278 302405 328326
6682C28326l41770L6321K8618j86956l1511j74234q8401j4900M66756j04496k05283
$$ 328326 -13444 22877 51495 -135461 -166972 -341206 -429607 -444507 22249 -82247 -287530
6671b87530J04980N80506J94108l27840k06713K38371n329m3548M6487k2228j89268
$$ -287530 -182550 397956 592064 264224 57511 295882 290553 247005 293492 271264 81996
6660H1996l17486L26424k06534k54699L88039R1279k0236r7609L9096r5340m22478
$$ 81996 -235490 90934 -115600 -370299 17740 109019 88783 -8826 30270 -65070 -487548
6649d87548L29531P00663Q0904p27474K4223J55482l7503j48679N76934M8979
$$ -487548 -158017 542646 623550 -103924 -79701 75781 38278 -110401 466533 515512
6639E15512m17622m34902N43472J5429n75819N30245j34158n26905L21389N09616
$$ 515512 97890 -337012 206460 221889 -353930 176315 42157 -484748 -163359 346257
6629C46257k75716o24915M11436L05131o7040k01511K95634K65163j20702k06953
$$ 346257 70541 -554374 -142938 162193 95153 -106358 189276 454439 333737 126784
6619A26784L89392K96455q29704k32444K40694K2275k15598l43959M46080J41257
$$ 126784 516176 812631 -17073 -249517 -8823 13452 -202146 -546105 -100025 41232
6609D1232k49388m6325P52763j29375o89473j35402O73421L09725m83024n0001
$$ 41232 -208156 -254481 498282 368907 -320566 -455968 217453 527178 44154 -5847
6599e847M49983K48754q37108j42027J014662N39538r91601m24794Q08679k7149
$$ -5847 444136 692890 -144218 -286245 728417 1267955 276354 -148440 660239 633090
6589F33090p99790P5586R22607k92602q80715L84216L94688l07890n67617L29363
$$ 633090 -166700 -91114 831493 538891 -341824 42392 437080 129190 -438427 -109064
6579a09064P40433r0644l15972l8037J29363k70831K522L25528k89691k12571
$$ -109064 631369 540725 224753 186716 316079 45248 47770 373298 83607 -128964
6569a28964M20243q4724j7505J6740M0498n9436m31726M75855M9286O208m04066
$$ -128964 291279 206555 189050 205790 246288 186852 -244874 230981 280267 286475 -117591
6558a17591K89926K10940j99427J19432J71003M2525m42744l18325M15345p9092
$$ -117591 172335 383275 183848 303280 474283 516808 74064 -244261 171084 91992
6548I1992j63712K55724J64162k4444m06300l52312O26729K10834l46452k57114
$$ 91992 -71720 184004 348166 323722 -82578 -434890 191839 402673 56221 -200893
6538b00893L54800K50263j98081P4661N7050P9693j31356l30170J03422K52255
$$ -200893 153907 404170 206089 280750 337800 417493 286137 -44033 59389 311644
6528C11644j51599J53854L54492K56178o55820j7074L17247m70055j24984O34626
$$ 311644 160045 313899 668391 924569 268749 251675 568922 98867 -26117 608509
6518F08509k0069m75717K285M39209m21941J19287K45268j14059j01099O9391
$$ 608509 588440 112723 115008 554217 132276 251563 496831 382772 281673 351064
6508C51064J8892M0601L05454n52629L7995K79494m9633j00083k44898l04277
$$ 351064 369956 410557 716011 163382 201377 480871 431238 331155 86257 -218020
6498b18020N31169M97555L8636n55014l02883L50975k45454n498M7983k77074
$$ -218020 313149 810704 849340 294326 -8557 342418 96964 91466 139449 -137625
6488a37625k96736M12358N11066j72996l46454K8213O00692K8765m04401K48839
$$ -137625 -434361 -22003 489063 316067 -30387 -2174 598518 627283 222882 471721
6478D71721n1169N7917o8319k15055K41331J36812n68656m69110M79264J60966
$$ 471721 420552 478469 410150 195095 436426 573238 4582 -464528 14736 175702
6468A75702o4066j07161K84043L16463l09265l34315M35229L39730m1006p394
$$ 175702 111636 4475 288518 604981 295716 -38599 396630 736360 695354 687960
6458F87960J69396j79061k64531J22104k33862m76202P7617K40689Q922k36873
$$ 687960 857356 678295 413764 535868 302006 -174196 -96579 144110 153032 -83841
6448h3841Q9846K68199l59263Q9706K73261O92219N0658j38010l38594l27250
$$ -83841 6005 274204 -85059 4647 277908 970127 1020785 882775 544181 216931
6438B16931M35653O62748l28815n47659L9000R8829j89365l37057n0037O9596
$$ 216931 652584 1315332 986517 438858 477858 576687 387322 50265 228 69824
6428F9824J73437o4532J44574K46821m51385J32987N03363k9011n12940k39751
$$ 69824 243261 178729 323303 570124 118739 251726 755089 726078 213138 -26613
6418b6613j15907j84185M54885J16189J60045m31156L93464r6724l56033R2996
$$ -26613 -142520 -326705 128180 244369 404414 -26742 366722 269998 -86035 6961
6408F961K40243J19615j61969J58743K96825k42696o6004K53569n0891p7126j14776
$$ 6961 247204 366819 204850 363593 660418 417722 351718 605287 554396 477270 362494
6397C62494K93622J64514q39947m71888Q25955L73105l87786n1966N41655k19550
$$ 362494 656116 820630 -19317 -491205 334750 707855 320069 268103 809758 590208
6387E90208q10097L97665P21208m52043q90526M69382O74654k64501l97933J3943
$$ 590208 -219889 177776 898984 446941 -443585 25797 700451 435950 38017 51960
6377E1960L34902M10916j2252j0k42070o1470k04934j15999P1978l22392O8857
$$ 51960 386862 797778 785526 785516 543446 481976 277042 161043 233021 -89371 -20514
6366b0514P42650J60193m90304K326K60475o0981o01453L23624O75194k25221
$$ -20514 722136 882329 392025 394351 654826 593845 -7608 316016 991210 765989
6356G65989j00154K71476J50106m42702k65290M05837K79456l09695k61064L71845
$$ 765989 665835 937311 1087417 644715 379425 785262 1064718 755023 493959 865804
6346H65804K08397o84403J0156M77198J04255J92308P1684M0691o94638j32387
$$ 865804 1074201 389798 399954 877152 981407 1173715 1245399 1286090 591452 459065
6336D59065L42901L30810Q2020n39067p530L58781q8983k75854J25974P00598
$$ 459065 801966 1132776 1214796 675729 668199 1026980 937997 662143 788117 1488715
6326A488715l14027m36832m30933K56661N12467Q5598m74090j261M84199l29954
$$ 1488715 1174688 737856 306923 563584 1076051 1161649 687559 686298 1170497 840543
6316H40543l20699K60872L3326L13957N0295j74130J1697n081K37720L83845l92673
$$ 840543 519844 780716 814042 1127999 1178294 1004164 1015861 1010780 1248500 1632345 1239672
6305A239672o1150K68238L82036n55344J17608M83143j59169l14458J38793j8352
$$ 1239672 1178522 1446760 1828796 1273452 1391060 1874203 1715034 1400576 1539369 1521017
6295A521017R3617q42743j13960O12034K97490p6873l2516J86506k69309j17336
$$ 1521017 1614634 771891 657931 1269965 1567455 1490582 1458066 1644572 1375263 1257927
6285A257927L93022L54909l95367m2450L92417M78207q56319j5887R40796O47338
$$ 1257927 1650949 2005858 1610491 1568041 1960458 2438665 1582346 1566459 2507255 3154593
6275C154593o84414m87039M86978K89250m61414M02667P94945M75904q78029j47213
$$ 3154593 2470179 1983140 2470118 2759368 2297954 2700621 3495566 3971470 3093441 2946228
6265B946228L76141L82547L78535j6527p107L25733l43K85405L2790j72128N11746
$$ 2946228 3322369 3704916 4083451 4066924 4059817 4385550 4385207 4670612 4703402 4531274 5043020
6254E043020O90410m4814q9022N62033L7277j84571O3619M14527K29384j72636
$$ 5043020 5733430 5688616 5599594 6161627 6198904 6014333 6077952 6492479 6721863 6549227
6244F549227L1714J07550o04790J30797K92183K36984l30868j35482O46885k16941
$$ 6549227 6580941 6688491 6083701 6214498 6506681 6743665 6412797 6277315 6924200 6707259
6234F707259k35158j03246m0954l42019k62554L9496K90388j61747l34861J05913
$$ 6707259 6472101 6368855 6327901 5985882 5723328 5762824 6053212 5891465 5556604 5662517
6224E662517M80500m64136m67608m2838L02305l90248k90824k35876J33978M42920
$$ 5662517 6143017 5678881 5211273 5168435 5470740 5080492 4789668 4553792 4687770 5130690
6214E130690m1504J03012O3134k61229l11101N92034K01228o16280L62469Q05264
$$ 5130690 5089186 5192198 5255332 4994103 4683002 5275036 5476264 4859984 5222453 6027717
6204F027717M7161m28996L396P59638K2053k82896N62388O96811j92981l48020
$$ 6027717 6074878 5645882 5649278 6408916 6430969 6148073 6710461 7407272 7214291 6866271
6194F866271J40445R45939K6831j43499O81382J27783J80287j89055L34388j6769
$$ 6866271 7006716 7952655 7979486 7835987 8517369 8645152 8825439 8636384 8970772 8954003
6184H954003J6071R92805j81839l59169k39460P78902J94395l75562l1893M46442
$$ 8954003 8970074 9962879 9781040 9421871 9182411 9961313 10155708 9780146 9748253 10194695
6174A0194695m78232r38122O34937n1170l94671o41300K22948J9850n31478J80222
$$ 10194695 9716463 8778341 9413278 9362108 8967437 8326137 8549085 8568935 8037457 8217679
6164H217679L03131n74111r22444l93333j24596M9232m58792l84851M46222k2417
$$ 8217679 8520810 7946699 7024255 6630922 6506326 6555558 6096766 5711915 6158137 6135720
6154F135720q87998l33826k3514J87463m40456m37123L08806l15827r74190j62241
$$ 6135720 5247722 4913896 4890382 5077845 4637389 4200266 4509072 4193245 3219055 3056814
6144C056814L34600M84646k55579l16068k45372q5419J84890K40217m10352n01136
$$ 3056814 3391414 3876060 3620481 3304413 3059041 2973622 3158512 3398729 2988377 2487241
6134B487241K18103N93673o65995l91134Q55955J73534o45339j03417M27192Q3102
$$ 2487241 2705344 3299017 2633022 2241888 3097843 3271377 2626038 2522621 2949813 3032915
6124C032915n33510Q5483O50920r8844o69812K09536K73543l04610o07592N60659
$$ 3032915 2499405 2584888 3235808 3136964 2467152 2676688 2950231 2645621 2038029 2598688
6114B598688J51738j1926m9948J37021k72168K87293L10196j52379J9271M17410
$$ 2598688 2750426 2738500 2688552 2825573 2553405 2840698 3150894 2998515 3017786 3435196
6104C435196L20685m18701L13584L37070j60183l62537p5232L08137L31897k76517
$$ 3435196 3755881 3337180 3650764 3987834 3827651 3465114 3389882 3698019 4029916 3753399
6094C753399K60132K90101L20588m11841j51019N10350P33991l60173K21202J92851
$$ 3753399 4013531 4303632 4624220 4212379 4061360 4571710 5305701 4945528 5166730 5359581
6084E359581N77038k92704m42977Q91564J46817q0111o36797O9969L10632L9087
$$ 5359581 5936619 5643915 5200938 6092502 6239319 6159208 5522411 5592380 5903012 5942099
6074E942099o71463m68314J146921l64040p77437L66866L65037q2584l29207M50785
$$ 5942099 5270636 4802322 5949243 5585203 4807766 5174632 5539669 5457085 5127878 5578663
6064E578663P77676k30852k68592K70092P54727L3723n14162M2045O15755k32114
$$ 5578663 6356339 6125487 5856895 6126987 6881714 6915437 6401275 6443320 7059075 6826961
6054F826961k14756M32232L41979j50986k02631J68062k9043J24272k9998R374
$$ 6826961 6612205 7044437 7386416 7235430 7032799 7200861 7171818 7296090 7266092 7275466
6044G275466j87083j86569M06188j88779K24253K98903l86746J04258J11882k6620
$$ 7275466 7088383 6901814 7308002 7119223 7343476 7642379 7255633 7359891 7471773 7445153
6034G445153K64785J74254j07950P82038R0938l02411K4712N8005J04909k57341
$$ 7445153 7709938 7884192 7776242 8558280 8649218 8346807 8371519 8429524 8534433 8277092
6024H277092J35526j05481K82036N38744P9225l20561K6343L54376n8890n26270
$$ 8277092 8412618 8307137 8589173 9127917 9207142 8886581 8912924 9267300 9208410 8682140
6014H682140Q8645J79070K6165j83812J03376J50115J27211j4994J36912M84379
$$ 8682140 8770785 8949855 8976020 8792208 8895584 9045699 9172910 9157916 9294828 9779207
6004I779207L61666n6034j10945L75940k479o1135J20823J16199j21281m70766
$$ 9779207 10140873 10084839 9973894 10349834 10347355 10286220 10407043 10523242 10401961 9931195
5994I931195l7961K74813n45564M042P93681J69985m76297k41962K45682M95628
$$ 9931195 9893234 10168047 9622483 9626525 10420206 10590191 10113894 9871932 10117614 10613242
5984A0613242N1345l16168J58758O49613L7581l70987q8113K92159j07379L5639
$$ 10613242 10664587 10348419 10507177 11156790 11194371 10823384 10735271 11027430 10920051 10955690
5974A0955690J57129o966L58164J28018j02635K29093M88991l71274n18059N7233
$$ 10955690 11112819 11105853 11464017 11592035 11489400 11718493 12207484 11836210 11318151 11375384
5964A1375384M0110m05565r9247j20809j3048l567j56849L44942M7896r4730J36591
$$ 11375384 11415494 11009929 10910682 10789873 10776825 10773258 10616409 10961351 11009247 10914517 11051108
5953A1051108L28772O4239L389k37477N16116l2233l390j6390o1186P4495l71617
$$ 11051108 11379880 11444119 11447508 11210031 11726147 11693914 11690524 11674134 11612948 11687443 11315826
5942A1315826R9833L03810N31935J2821m97976J59073k90623J34852m25211j95124
$$ 11315826 11415659 11719469 12251404 12264225 11766249 11925322 11634699 11769551 11344340 11149216
5932A1149216J19665K97091m16869m1301J20575j36274N19538q8410p5264P5312
$$ 11149216 11268881 11565972 11149103 11107802 11228377 11092103 11611641 11523231 11447967 11523279
5922A1523279n03616k0117N70153j94626J35441J52306K30121J70334M4047K12915
$$ 11523279 11019663 10999546 11569699 11375073 11510514 11662820 11892941 12063275 12107322 12320237
5912A2320237L75244K04825o6804R2014N08035K16004m68912P92516M37718n58112
$$ 12320237 12695481 12900306 12833502 12925516 13433551 13649555 13180643 13973159 14410877 13852765
5902A3852765j96797P25812N52981n91833R1503M92843K41094k95301N64591L77035
$$ 13852765 13655968 14381780 14934761 14342928 14434431 14927274 15168368 14873067 15437658 15814693
5892A5814693L09867m09209J01512P07845J53092J15033P49249P08567o46512
$$ 15814693 16124560 15715351 15816863 16524708 16677800 16792833 17542082 18250649 17604137
5883A7604137j39645J206985M61264l10535L13523R47320Q2102R1491M75815M66584
$$ 17604137 17464492 18671477 19132741 18822206 19135729 20083049 20165151 20256642 20732457 21199041
5873B1199041L22477J32632M11165J96147K01994N05241n69736N3381P45325K06422
$$ 21199041 21521518 21654150 22065315 22261462 22463456 22968697 22398961 22452342 23197667 23404089
5863B3404089J3484N8538L6173k61137l34741m10624K40610q30764o46517j8607
$$ 23404089 23417573 23476111 23512284 23251147 22916406 22505782 22746392 21915628 21269111 21250504
5853B1250504n02437r81482q52598k46947m78469q16374j008816k80978j88114
$$ 21250504 20748067 19766585 18913987 18667040 18188571 17372197 16363381 16082403 15894289
5844A5894289o69619j173091m57184K51612l19565p40559p00286j08033l93150
$$ 15894289 15224670 14051579 13594395 13846007 13526442 12785883 12085597 11977564 11584414
5835A1584414p78477L6576K25579j59114q91355q82557L62028j21221q35889k61410
$$ 11584414 10805937 10842513 11068092 10908978 10017623 9135066 9497094 9375873 8539984 8278574
5825H278574L27639k56985j73802N3668K17141l87261j63608K45065K36594l06663
$$ 8278574 8606213 8349228 8175426 8229094 8446235 8058974 7895366 8140431 8377025 8070362
5815H070362l06651N68811K67548o9677M85645K68053j45756K41322K59834k15819
$$ 8070362 7763711 8332522 8600070 8530393 9016038 9284091 9138335 9379657 9639491 9423672
5805I423672o41950l65092j6768k29389n79127k14546j91283m66508k30243m00375
$$ 9423672 8781722 8416630 8399862 8170473 7591346 7376800 7185517 6719009 6488766 6088391
5795F088391k44750m68258r64109M31928M80806j60304m31514k65613P6875k26882
$$ 6088391 5843641 5375383 4411274 4843202 5324008 5163704 4732190 4466577 4543452 4316570
5785D316570m14874k37126K38373O5341k58763M85650Q2264K63689J88765k89324
$$ 4316570 3901696 3664570 3902943 3968284 3709521 4195171 4277435 4541124 4729889 4440565
5775D440565m61147Q1587M30532j99225l40335K22995M11825r37174q51124O59522
$$ 4440565 3979418 4061005 4491537 4292312 3951977 4174972 4586797 3649623 2798499 3458021
5765C458021M78012l23799n36753L97067K93904r13844k52079L34348L48504p53873
$$ 3458021 3936033 3612234 3075481 3472548 3766452 2852608 2600529 2934877 3283381 2529508
5755B529508j72119M68226o69792l33968J16687L10542j863q23670J50495M79917
$$ 2529508 2357389 2825615 2155823 1821855 1938542 2249084 2247221 1423551 1574046 2053963
5745B053963k62528l34352N14670J63332q30424l20264N53386L8475n01735j74783
$$ 2053963 1791435 1457083 1971753 2135085 1304661 984397 1537783 1576258 1074523 899740
5735H99740N91922J95243l57418k00325Q7087L81340l56759j234J29955j08296
$$ 899740 1491662 1686905 1329487 1129162 1216249 1597589 1240830 1239596 1369551 1261255
5725A261255l76362J1303L41921m833k57773j4946M35667o41466k87598O41668
$$ 1261255 884893 896196 1238117 1233284 975511 960565 1396232 754766 467168 1108836
5715A108836K78651l02419j26178M11066N8160n74422J64529Q7647o8122j40898
$$ 1108836 1387487 1085068 958890 1369956 1428116 853694 1018223 1105870 1037748 896850
5705H96850m3531K22031J38584l49516j76908N27124n19629l51488L70177L13038
$$ 896850 853319 1075350 1213934 864418 687510 1214634 695005 343517 713694 1026732
5695A026732o31706J31389O74226J17480n93064N626L66479l9722l39211n2444
$$ 1026732 395026 526415 1200641 1318121 725057 730683 1097162 1057440 718229 665785
5685F65785K98022J60304m47750p9107M12401l17145q4934j11529q2021N35670
$$ 665785 963807 1124111 676361 597254 1009655 692510 607576 496047 414026 949696
5675I49696K96533j98186O3552j74079j81253l53729J49713K61724j71426k45941
$$ 949696 1246229 1048043 1111595 937516 756263 402534 552247 813971 642545 396604
5665C96604j735J04912J40295l62027R28613M94r04713K86172M83663K09326n76364
$$ 396604 394869 499781 640076 278049 1206662 1207156 302443 588615 1072278 1281604 705240
5654G05240j4135M55667J22537n34331J7311M61208m58086j1385N86490L27493
$$ 705240 691105 1146772 1269309 734978 752289 1213497 755411 744026 1330516 1658009
5644A658009n36050l12065N15290l03094l93021n5165K08482p2144J18294N75565
$$ 1658009 1121959 809894 1325184 1022090 629069 573904 782386 710242 828536 1404101
5634A404101j26410q87685J15453R97450k13141n08829k1692M14728k17845m05902
$$ 1404101 1277691 390006 505459 1502909 1289768 780939 759247 1173975 956130 550228
5624E50228Q91125k14828k71836P7945K49006j6113p83981M11613P24660k88124
$$ 550228 1441353 1226525 954689 1032634 1281640 1265527 481546 893159 1617819 1329695
5614A329695m41099K52107K72678k52857o09829M0986N17273Q1219m06146N66265
$$ 1329695 888596 1140703 1413381 1160524 550695 591681 1108954 1190173 784027 1350292
5604A350292K47321l26030p5204k09899J51960n34344J79471O78209j0011M182
$$ 1350292 1597613 1271583 1196379 986480 1138440 604096 783567 1461776 1451765 1455947
5594A455947j23163l28804J95385m1374k67127O77018R8725m34844K67000j58642
$$ 1455947 1332784 1003980 1199365 1157991 890864 1567882 1666607 1231763 1498763 1340121
5584A340121q7703K70340N04953j48252j08619J24537n08967J40360l62103K42509
$$ 1340121 1252418 1522758 2027711 1879459 1770840 1895377 1386410 1526770 1164667 1407176
5574A407176N04591p6284j94605K04633k0592J6136L74134m40184l28363K92021
$$ 1407176 1911767 1835483 1640878 1845511 1824919 1841055 2215189 1775005 1446642 1738663
5564A738663L50563l58392j77197K38202M53024K36609k62532N21208L31448n59837
$$ 1738663 2089226 1730834 1553637 1791839 2244863 2481472 2218940 2740148 3071596 2511759
5554B511759l1975R60158j74610p29449J91791O20956M16534r83122N46245Q53724
$$ 2511759 2479784 3439942 3265332 2535883 2727674 3348630 3765164 2782042 3328287 4182011
5544D182011k25397o37996O05284P63331n90390m55009K08120P82856r7242Q7847
$$ 4182011 3956614 3318618 3923902 4687233 4096843 3641834 3849954 4632810 4535568 4623415
5534D623415l06534K93557J79439Q5019N04999k9456J43440J3332j27942k65204
$$ 4623415 4316881 4610438 4789877 4874896 5379895 5350439 5493879 5507211 5379269 5114065
5524E114065J09351L26456J21733j2096L28093j14097l6039K10132k3364Q3574
$$ 5114065 5223416 5549872 5671605 5659509 5987602 5873505 5837466 6047598 6024234 6107808
5514F107808K59980k76599L83490j33720m13464M74852L85546r0834k76064N01391
$$ 6107808 6367788 6091189 6474679 6340959 5927495 6402347 6787893 6697059 6420995 6922386
5504F922386J87669n19661K94820N07386L28042j95598k91958K68007J80167l87905
$$ 6922386 7110055 6590394 6885214 7392600 7720642 7525044 7233086 7501093 7681260 7293355
5494G293355J99330J75488p509J1144j98974J38684m84989J81676K06578M02688
$$ 7293355 7492685 7668173 7660664 7671808 7472834 7611518 7126529 7308205 7514783 7917471
5484G917471K45617m43339k42789O97091M8405J2051j29729l5593k4714o2854
$$ 7917471 8163088 7719749 7476960 8174051 8222456 8234507 8104778 8069185 8044471 7981617
5474G981617J15111K03225l60043J21921N7222j38663K93338k9924j73297P22796
$$ 7981617 8096728 8299953 7939910 8061831 8119053 7980390 8273728 8243804 8070507 8793303
5464H793303M498l97648M1931k01666j55340o5687j94835K33910J66297m83230
$$ 8793303 8797801 8400153 8442084 8240418 8085078 8019391 7824556 8058466 8224763 7741533
5454G741533J01917P1805J86616p5496J53961m92415j28990n72347L57371k12252
$$ 7741533 7843450 7915255 8101871 8026375 8180336 7687921 7558931 6986584 7343955 7131703
5444G131703n00840l51540J16763M711o18774l09045r1618J00001Q659k02946
$$ 7131703 6630863 6279323 6396086 6400797 5782023 5472978 5381360 5481361 5490020 5287074
5434E287074K6235K45193o09299l65082J23129l05029l48750N04679J04188m59867
$$ 5287074 5313309 5558502 4949203 4584121 4707250 4402221 4053471 4558150 4662338 4202471
5424D202471k78573K21709M6196l34433m00724J62066M092j38279k50007j8990
$$ 4202471 3923898 4145607 4191803 3857370 3456646 3618712 3622804 3484525 3234518 3215528
5414C215528j10032l74208j12841N15538K93483l07561o32811M67195R0753l15846
$$ 3215528 3105496 2731288 2618447 3133985 3427468 3119907 2487096 2954291 3045044 2729198
5404B729198P8846J05758l3392r2711o2114p5083o4228k42550R3278K50404k74517
$$ 2729198 2808044 2913802 2880410 2787699 2725585 2650502 2586274 2343724 2437002 2687406 2412889
5393B412889l47953N93088K61401m94232k33554N79685p7856l82426r2624j39404
$$ 2412889 2064936 2658024 2919425 2425193 2191639 2771324 2693468 2311042 2218418 2079014
5383B079014j14817J78117M46583k26243n69907j80600J006622k8816o44413o0283
$$ 2079014 1964197 2142314 2588897 2362654 1792747 1612147 2618769 2589953 1945540 1885257
5373A885257L24900l77490j62325J05929J77456R2595j91087L02319m82o0356
$$ 1885257 2210157 1832667 1670342 1776271 1953727 2046322 1855235 2157554 2157072 2096716
5363B096716J45542J26361m45829j33357L29365N40883M6417l9034k63769K35918
$$ 2096716 2242258 2368619 1922790 1789433 2118798 2659681 2706098 2667064 2403295 2639213
5353B639213O80211l87951J06553K24221n31767q5559J23149M37936l14903K16530
$$ 2639213 3319424 2931473 3038026 3262247 2730480 2644921 2768070 3206006 2891103 3107633
5343C107633J56868l38514n95121K97663N05697r7624j62155L35033l2396k24621
$$ 3107633 3264501 2925987 2330866 2628529 3134226 3036602 2874447 3209480 3177084 2952463
5333B952463n947L48713L56614l14202k40833L47387n51j33089K43776K71592
$$ 2952463 2946516 3295229 3651843 3337641 3096808 3444195 3443644 3310555 3554331 3825923
5323C825923j84456m25711K94784P9171l18300L81384M19495j88172N582K17685
$$ 3825923 3641467 3215756 3510540 3589711 3271411 3652795 4072290 3884118 3889700 4107385
5313D107385N77156l15527M62850K28439m19393k7553L11902O24944m75026j75814
$$ 4107385 4684541 4369014 4831864 5060303 4640910 4613357 4925259 5550203 5075177 4899363
5303D899363O95721p1466n25796q1655P82055M45560n86428K60962J87668J11304
$$ 4899363 5595084 5523618 4997822 4916167 5698222 6143782 5557354 5818316 6005984 6117288
5293F117288m37068J76181K95537K75687K69190m4657M57538p5688L95166k43741
$$ 6117288 5680220 5856401 6151938 6427625 6696815 6652158 7109696 7034008 7429174 7185433
5283G185433M13359L62431j19833k21092L60800N85322l36896j16278N28606L24078
$$ 7185433 7598792 7961223 7841390 7620298 7981098 8566420 8229524 8113246 8641852 8965930
5273H965930l65450J24853N40440M20160n48182J61261N03270n979m01098p2062
$$ 8965930 8600480 8725333 9265773 9685933 9137751 9299012 9802282 9796303 9395205 9323143
5263I323143J56628M46491j34960j34386K88157K3210l559K31857N65913J85317
$$ 9323143 9479771 9926262 9791302 9656916 9945073 9968283 9964724 10196581 10762494 10947811
5253A0947811J12961j23825K92726K90491K55488M0697k01852K87217N18338o0590
$$ 10947811 11060772 10936947 11229673 11520164 11775652 11816349 11614497 11901714 12420052 12359462
5243A2359462l40425O94207P11162k54914l59385J57785O48568j67672l0021L39513
$$ 12359462 12019037 12713244 13424406 13169492 12810107 12967892 13616460 13448788 13418767 13758280
5233A3758280L36888m35429N20060K32062j94772k18700Q36686O02864k09089
$$ 13758280 14095168 13659739 14179799 14411861 14217089 13998389 14835075 15437939 15228850
5224A5228850n99162L81915N96808K481j22518Q19501N48762K7335K33839L30216
$$ 15228850 14629688 15011603 15608411 15610892 15488374 16307875 16856637 16883972 17117811 17448027
5214A7448027J018173N077J00283P10686N31051J88814K26934P09189M50859K81286
$$ 17448027 18466200 18471277 18571560 19282246 19813297 20002111 20229045 20938234 21389093 21670379
5204B1670379K41179O09852M41227k28744Q24407J122192J007164L96747K43286
$$ 21670379 21911558 22521410 22962637 22733893 23558300 24680492 25687656 26084403 26327689
5195B6327689J162012R54280K20508O87378J401610J063994M74430M04415R60473
$$ 26327689 27489701 28443981 28664489 29351867 30753477 31817471 32291901 32696316 33656789
5186C3656789J944078J102862P62367J832665K235700J621567K295690K085695
$$ 33656789 35600867 36703729 37466096 39298761 41534461 43156028 45451718 47537413
5178D7537413L019341L115988K281100K833561L722245L860696M086055N074786
$$ 47537413 50556754 53672742 55953842 58787403 62509648 66370344 70456399 75531185
5170G5531185N866487O233805P722006R700349J0656620J3086560J6940631K0496035
$$ 75531185 81397672 87631477 95353483 105053832 115710452 128797012 145737643 166233678
5162A66233678K3860105K7863540L2625268L5429927L3189262K4536272R733684
$$ 166233678 190093783 217957323 250582591 286012518 319201780 343738052 353471736
5155C53471736q377860k4200030l3014657l3497568l1786417k8004568k3645016
$$ 353471736 345093876 320893846 287879189 254381621 222595204 194590636 170945620
5148A70945620j9616265j6326588j4555713j1784027j0064723q914280p246190
$$ 170945620 151329355 135002767 120447054 108663027 98598304 89684024 82437834
5141H2437834o605442n520435n031205m432339l716244l060395k937381k908971
$$ 82437834 75832392 70311957 65280752 60848413 57132169 54071774 51134393 48225422
5133D8225422k306020j969356k521256k199851j631433j560829j932426k045485
$$ 48225422 45919402 43950046 41428790 39228939 37597506 36036677 34104251 32058766
5125C2058766q83515p25758j580630j882792j272105q15886j116174q87243l80970
$$ 32058766 31175251 30449493 28868863 26986071 25713966 24898080 23781906 22894663 22513693
5116B2513693r58375j050121n39332m27784r67225m57933j55704m59730m37153
$$ 22513693 21555318 20505197 19965865 19538081 18570856 18112923 17957219 17497489 17060336
5107A7060336m08049j66789k99119p86371q8223j7552k45587n51844p26906J46824
$$ 17060336 16652287 16485498 16186379 15400008 15311785 15294233 15048646 14496802 13769896 13916720
5097A3916720k92221J33499N90914k71280k23691m13932n465J26514L237j05529
$$ 13916720 13624499 13757998 14348912 14077632 13853941 13440009 13434544 13561058 13564295 13458766
5087A3458766O6793k78949l51114j70396R132j16074K8753o25803J65414L91591
$$ 13458766 13525559 13246610 12895496 12725100 12734232 12618158 12646911 12021108 12186522 12578113
5077A2578113m41425j80380q0883M98814j57388k66752L671L1545J65108n94898
$$ 12578113 12136688 11956308 11875425 12374239 12216851 11950099 11953770 11985315 12150423 11555525
5067A1555525L07757M39544Q0446p38479R5627J147447K3466o43221J61773N75016
$$ 11555525 11863282 12302826 12383272 11644793 11740420 12887867 12911333 12268112 12429885 13004901
5057A3004901j97770l44682O26713Q56837m314n32116m470N23676L43621q0609
$$ 13004901 12807131 12462449 13089162 13945999 13941685 13409569 13405099 13928775 14272396 14191787
5047A4191787Q40760R24901l13616o4105P88179K99609J19241l99283J79203N32112
$$ 14191787 15032547 15957448 15643832 15579727 16367906 16667515 16786756 16387473 16566676 17098788
5037A7098788J58833J58443l45170L25207r4037l9099M12183J04732Q9025R4508
$$ 17098788 17257621 17416064 17070894 17396101 17302064 17262965 17675148 17779880 17868905 17963413
5027A7963413m41629Q13246L64883m96156k16904L26431K52728j85384O9284M20073
$$ 17963413 17521784 18335030 18699913 18203757 17986853 18313284 18566012 18380628 18449912 18869985
5017A8869985K13090o95548J52762O04606J63291m29295J45474K40595n40952
$$ 18869985 19083075 18387527 18540289 19144895 19308186 18878891 19024365 19264960 18724008
5008A8724008k39177L75481L43980n06797j01198J09870J0797n27240R7571K46803
$$ 18724008 18484831 18860312 19204292 18697495 18596297 18706167 18716964 18189724 18287295 18534098
4998A8534098J86743n17812K00334J50816k53056J3030l4518J68739k61246J32098
$$ 18534098 18720841 18203029 18403363 18554179 18301123 18314153 18279635 18448374 18187128 18319226
4988A8319226L87177m84003L649K77123l08303n13259m70124L0175K53217j77690
$$ 18319226 18706403 18222400 18226049 18503172 18194869 17681610 17211486 17241661 17494878 17317188
4978A7317188k80331k59514j11034m97106o82219k23196J0646l8106o78965m92741
$$ 17317188 17036857 16777343 16666309 16169203 15486984 15263788 15274434 15236328 14557363 14064622
4968A4064622l09854N360k94789l30313L06918J28812l54796l89157j32791k75946
$$ 14064622 13754768 13760128 13465339 13135026 13441944 13570756 13215960 12826803 12694012 12418066
4958A2418066p33956m4701L94536L12230m88812n85233j56823K13200o26455J34156
$$ 12418066 11684110 11639409 12033945 12346175 11857363 11272130 11115307 11328507 10702052 10836208
4948A0836208P2260k12570P7823j67260R7543J03707M7255l68794P9889Q941p4950
$$ 10836208 10908468 10695898 10773721 10606461 10704004 10807711 10854966 10486172 10566061 10575002 10500052
4937A0500052m3414k10689k9798m8207P9995J19946j48811r1377P3975k45180
$$ 10500052 10456638 10245949 10216151 10167944 10247939 10367885 10219074 10127697 10201672 9956492
4927I956492q2708J51229m23004m89485j18436L00821q3384n37722L23340q273
$$ 9956492 9873784 10025013 9602009 9112524 8994088 9294909 9211525 8673803 8997143 8988870
4917H988870n58238j24083K56443L2172K10642j43143n70827k1728q8127K28360
$$ 8988870 8430632 8306549 8562992 8595164 8805806 8662663 8091836 8070108 7981981 8210341
4907H210341j80053K89154L59524l34217n99900J18527J76740k92027m30718L7046
$$ 8210341 8030288 8319442 8678966 8344749 7744849 7863376 8040116 7748089 7317371 7354417
4897G354417M82963o3816r54078J808L88731l98070l41437k86539N14086L0610
$$ 7354417 7837380 7773564 6819486 6821294 7210025 6811955 6470518 6183979 6698065 6728675
4887F728675o08123J22879L58147l05133n87145M41010L2183r56005l62098N98907
$$ 6728675 6120552 6243431 6601578 6296445 5709300 6150310 6182493 5226488 4864390 5463297
4877E463297O07227n14311l46980K32247n9282l20222k64878O26826j16079l48127
$$ 5463297 6070524 5556213 5209233 5441480 5382198 5061976 4797098 5423924 5307845 4959718
4867D959718j67496k26954n19640n20485P75369j71446l07504O86727K98128n19009
$$ 4959718 4792222 4565268 4045628 3525143 4300512 4129066 3821562 4508289 4806417 4287408
4857D287408k32655M10809M74658n73857l05517N9672J97689k98282j3909N91303
$$ 4287408 4054753 4465562 4940220 4366363 4060846 4120518 4318207 4019925 4006016 4597319
4847D597319M8444j59949l41636j56978J40788m4033J45014J47826K57676K79926
$$ 4597319 4645763 4485814 4144178 3987200 4127988 4083955 4228969 4376795 4634471 4914397
4837D914397K01752m59228m08488M31733m483R08M5114M37983L29756l92084n7743
$$ 4914397 5116149 4656921 4248433 4680166 4675683 4676591 4721705 5159688 5489444 5097360 5039617
4826E039617P22195J41974o11352M55001O24755n3098n919K27633L11239m22312
$$ 5039617 5761812 5903786 5292434 5747435 6372190 6319092 6313173 6540806 6852045 6429733
4816F429733M45106O15560K10418k20839j07233O33314K69595K13584m6709K50607
$$ 6429733 6874839 7490399 7700817 7479978 7372745 8006059 8275654 8489238 8442529 8693136
4806H693136M07772o230j07292O03379N50449P89840J88853L61498M91602L89755
$$ 8693136 9100908 9094678 8987386 9590765 10141214 10931054 11119907 11481405 11973007 12362762
4796A2362762M12831P53411O55083L59749P07841J86175O16187O89310O62119
$$ 12362762 12775593 13529004 14184087 14543836 15251677 15437852 16054039 16743349 17405468
4787A7405468O36694N46954J060533J476879J309567J248586J176997J508715
$$ 17405468 18042162 18589116 19649649 21126528 22436095 23684681 24861678 26370393
4779B6370393J540009J730844J601993J754601J808385J472855J665939K069314
$$ 26370393 27910402 29641246 31243239 32997840 34806225 36279080 37945019 40014333
4771D0014333J862669J136152J244635J805425J276275Q44313R99331J501715
$$ 40014333 41877002 43013154 44257789 46063214 47339489 48183802 49183133 50684848
4763E0684848K79412K96281O49744j68163K39195p2317j97234l89252j40170l5034
$$ 50684848 50964260 51260541 51910285 51742122 51981317 51909000 51711766 51322514 51182344 51147310
4753E1147310l09582o51222o02350o05717o33141n14921p15095j086186j547764
$$ 51147310 50837728 50186506 49584156 48978439 48345298 47830377 47115282 46029096 44481332
4744D4481332j027075j305507j611125j661989j539590j975341j377206j745255
$$ 44481332 43454257 42148750 40537625 38875636 37336046 35360705 33983499 32238244
4736C2238244j510467j756565j748483j047024j290142j083662j127777q54720
$$ 32238244 30727777 28971212 27222729 26175705 24885563 23801901 22674124 21819404
4728B1819404r94913j254397n43596l05671j276235o59286r7069j36634p71796
$$ 21819404 20824491 19570094 19026498 18720827 17444592 16785306 16688237 16551603 15779807
4719A5779807n57800l10701m15452m67788m43334l96524k37126o19867j63954
$$ 15779807 15222007 14911306 14495854 14028066 13584732 13188208 12951082 12331215 12167261
4710A2167261q0030q8528l36301r69901P8902J29744l19417m88709j07670J82536
$$ 12167261 12087231 11998703 11662402 10692501 10771403 10901147 10581730 10093021 9985351 10167887
4700A0167887l9657n52530n70575j12023K19601k05666q03411L49051j0232n11222
$$ 10167887 10128230 9575700 9005125 8893102 9112703 8907037 8103626 8452677 8442445 7931223
4690G931223k83730M68554j86329k50898k91809N936M61836l51865l45742L00922
$$ 7931223 7647493 8116047 7929718 7678820 7387011 7392947 7854783 7502918 7157176 7458098
4680G458098K02368q38850k25610M37511k43048j80297L06252o7887l49225n06865
$$ 7458098 7660466 6821616 6596006 7033517 6790469 6610172 6916424 6848537 6499312 5992447
4670E992447J10570J32652j74987n0049J87817m97728j73844K28382m79802n23530
$$ 5992447 6103017 6235669 6060682 6010633 6198450 5700722 5526878 5755260 5275458 4751928
4660D751928J5576M23257j5367o23796m57342j13598j8797o8758k0194Q6804J95041
$$ 4751928 4767504 5190761 5175394 4551598 4094256 3980658 3961861 3893103 3872909 3959713 4154754
4649D154754l25000l5766l52895m31182K38185Q0430Q7956l40136k84361Q7826
$$ 4154754 3829754 3793988 3441093 3009911 3248096 3328526 3416482 3076346 2791985 2879811
4639B879811m48390q8209K16102J54668p6121k70637j1050O89816j56235p34030
$$ 2879811 2431421 2343212 2559314 2713982 2637861 2367224 2356174 3045990 2889755 2155725
4629B155725J01137n5740J19659k56061N3841K7880n13422J96204J49587N1759
$$ 2155725 2256862 2201122 2320781 2064720 2118561 2146441 1633019 1829223 1978810 2030569
4619B030569j07177l82794M92646k90191J1233j26642j8606K16867l17805O25345
$$ 2030569 1923392 1540598 2033244 1743053 1754286 1627644 1609038 1825905 1508100 2133445
4609B133445k35124o90088k61981M93791L05262l74861J6518J09428L37392l61957
$$ 2133445 1898321 1208233 946252 1440043 1745305 1370444 1386962 1496390 1833782 1471825
4599A471825j62863O87205k85273n20941n5595P4920n785j08400L99002j07940
$$ 1471825 1308962 1996167 1710894 1189953 1134358 1209278 1203493 1095093 1494095 1386155
4589A386155j22157l93016j23399J11961J71254Q5502N28495J60134n55862m1323
$$ 1386155 1263998 870982 747583 859544 1030798 1116300 1644795 1804929 1249067 1207744
4579A207744j345n34854j00004O33888n4j20357j2305K20667J82027j66272k37423
$$ 1207744 1206399 671545 571541 1205429 1205375 1085018 1072713 1293380 1475407 1309135 1071712
4568A071712Q3590k98105Q7829j62158L28579j06359j599k12847k20046L23039
$$ 1071712 1155302 857197 945026 782868 1111447 1005088 1003489 790642 570596 893635
4558H93635j85203K54520J37936j06016k16356l04402J94381M95272J87455j15345
$$ 893635 708432 962952 1100888 994872 778516 474114 668495 1163767 1351222 1235877
4548A235877l2240J27682k18770k87577k5400M3530l30260Q1168L36969l73113
$$ 1235877 1203637 1331319 1112549 824972 799572 843102 512842 594010 930979 557866
4538E57866n10214K4695N84032M32297j56546p7081m3862J13486l47947p320L54661
$$ 557866 47652 72347 656379 1088676 932130 855049 811187 924673 576726 569406 924067
4527I24067K73960l55059n75965M80961M79916q4661l81608L70732O5706j64229
$$ 924067 1198027 842968 267003 747964 1227880 1143219 761611 1132343 1198049 1033820
4517A033820m38351K57221K74191j83771J16874L7959l73675o33685O08154J51409
$$ 1033820 595469 852690 1126881 943110 1059984 1097943 724268 90583 698737 850146
4507H50146k51215J32951L12358K53268l34724n49694J11917k9078p1071N83165
$$ 850146 598931 731882 1044240 1297508 962784 413090 525007 495929 424858 1008023
4497A008023L67227l75763m88050N62416N64593n78417O1704L5819K36028q207
$$ 1008023 1375250 999487 511437 1073853 1638446 1060029 1121733 1157552 1393580 1385373
4487A385373J24235j95659K12026K08301n1929P8499k24078j49251j13742j92442
$$ 1385373 1509608 1313949 1525975 1734276 1682347 1760846 1536768 1387517 1273775 1081333
4477A081333q3705J71864J44028P4484o9182j24140k96130L90947O6347p3003
$$ 1081333 997628 1169492 1313520 1388004 1318822 1194682 898552 1289499 1355846 1282843
4467A282843K05841o0160J24002o790j9603J50582K51421P2653o5300k2566k7712
$$ 1282843 1488684 1428524 1552526 1545736 1526133 1676715 1928136 2000789 1935489 1912923 1885211
4456A885211P6086K33738l8771p02540l28389M63947J35422k12232J24944K32165
$$ 1885211 1961297 2195035 2156264 1453724 1125335 1589282 1724704 1512472 1637416 1869581
4446A869581M87976j74489L17779L46839j38011m61686N43601K8149n0832N12293
$$ 1869581 2357557 2183068 2500847 2847686 2709675 2247989 2791590 2819739 2768907 3281200
4436C281200K1090j06121m6201k66162O48544j03696l34400K84316J47887k26223
$$ 3281200 3302290 3196169 3149968 2883806 3532350 3428654 3094254 3378570 3526457 3300234
4426C300234K20466L26966K85604N78223l07053N7429J06516l25623M45121K71959
$$ 3300234 3520700 3847666 4133270 4711493 4404440 4461869 4568385 4242762 4687883 4959842
4416D959842J10599M86474K78845k87088m3196L14473N63905N09874k58437N79477
$$ 4959842 5070441 5556915 5835760 5548672 5505476 5819949 6383854 6893728 6635291 7214768
4406G214768K71984L6795K24668J91075M99305J05542L20838N04344L38069M02479
$$ 7214768 7486752 7523547 7748215 7939290 8438595 8544137 8864975 9369319 9707388 10109867
4396A0109867N58447P22446L10469M50161R51598J323719N72168J069932J770808
$$ 10109867 10668314 11390760 11701229 12151390 13102988 14426707 14998875 16068807 17839615
4387A7839615J645265K342081K592158K815713L901364L557594K950716K426946
$$ 17839615 19484880 21826961 24419119 27234832 31136196 34693790 37644506 40071452
4379D0071452K180888J775366J803221L222660N020858N468551M585457L189514
$$ 40071452 42252340 44027706 45830927 49053587 54074445 59542996 64128453 67317967
4371F7317967J200968J3900l35237J327367L583332M666240M648627K238466j001407
$$ 67317967 68518935 68532835 68197598 69524965 73108297 77774537 82423164 84661630 83660223
4362H3660223l813705m905113l448425j688083r36084j39940J50349k074162m658748
$$ 83660223 79846518 74941405 71492980 69804897 68868813 68728873 68879222 66805060 62146312
4353F2146312n050248m873037l945502l101202k124598k007511j631131l600587
$$ 62146312 57096064 52223027 48277525 45176323 43051725 41044214 39413083 35812496
4345C5812496l663065l183294l359266l153376k191846j840664j776237j200434
$$ 35812496 32149431 28966137 25606871 22453495 20261649 18420985 16644748 15444314
4337A5444314j165743q57911q27154q14617q28073q64564l23511j49184r81961
$$ 15444314 14278571 13420660 12593506 11778889 10950816 10086252 9762741 9613557 8631596
4328H631596n84499j85301m0901n25305n64642n8182K04840k93824q37695j94701
$$ 8631596 8047097 7861796 7820895 7295590 6730948 6672766 6877606 6583782 5746087 5551386
4318E551386q4533j91681n14879R8340M36149l84153j83115m8457l20739m07543
$$ 5551386 5466853 5275172 4760293 4858633 5294782 4910629 4727514 4679057 4358318 3950775
4308C950775L73471O0709J0093j85976m19241p9266m40563M0642k99488k3281
$$ 3950775 4324246 4384955 4395048 4209072 3789831 3710565 3270002 3310644 3011156 2987875
4298B987875P00708k62051l29562n22574K92535K4186j74739k42155J67148M3715
$$ 2987875 3688583 3426532 3096970 2574396 2866931 2891117 2716378 2474223 2641371 2685086
4288B685086l26216n37712Q57855M7390p56018L51838k57233l59585J49191l34238
$$ 2685086 2358870 1821158 2679013 2726403 1970385 2322223 2064990 1705405 1854596 1520358
4278A520358M8853K36458J13125j80927Q6456L30070m04294k21028K48565J07446
$$ 1520358 1569211 1805669 1918794 1737867 1824323 2154393 1750099 1529071 1777636 1885082
4268A885082k99422k92613J68661M06484j16882k55109j20440j06958o23256m45314
$$ 1885082 1585660 1293047 1461708 1868192 1751310 1496201 1375761 1268803 645547 200233
4258B00233P70095J36487M6228M01777l5679n56604k11062K45645q9624n8336
$$ 200233 970328 1106815 1153043 1554820 1519141 962537 751475 997120 907496 849160
4248H49160l53825K10862N00760l72899r9489M81175n6767k04535K05387K94103
$$ 849160 495335 706197 1206957 834058 734569 1215744 1158977 954442 1159829 1453932
4238A453932n5818m12541m0867J38876K15785j0571Q2438L6373k71026l37383
$$ 1453932 1398114 985573 944706 1083582 1299367 1288796 1371234 1407607 1136581 799198
4228G99198j01104K19326j00544j84094J38281J20115P149n93403l32659O66847
$$ 799198 698094 917420 816876 632782 771063 891178 898327 304924 -27735 639112
4218F39112j26109l46649J92588M41734J02731m6000k0659P9068J77813j17505
$$ 639112 513003 166354 358942 800676 903407 857407 836748 915816 1093629 976124
4208I76124k58129L55633J41620R6399k52597o8522j95935L09463M35871K5705
$$ 976124 717995 1073628 1215248 1311647 1059050 990528 794593 1104056 1539927 1565632
4198A565632k57326O4790k03268j73514O3860K89843k80744k0678K66035M2764
$$ 1565632 1308306 1373096 1169828 996314 1060174 1350017 1069273 1048595 1314630 1357394
4188A357394K01140n71201k68779R6539j92970O20510J21803q0308k65792l4964
$$ 1357394 1558534 987333 718554 815093 622123 1242633 1364436 1284128 1018336 983372
4178I83372Q6271m09582K2914K03852K33291j5278k3062L777m77458J62673J87340
$$ 983372 1069643 660061 682975 886827 1120118 1104840 1081778 1085555 608097 770770 958110
4167I58110j31752j71179L47322J06738l10812N2670R45654m22092p11309M14168
$$ 958110 826358 655179 1002501 1109239 798427 851097 1796751 1374659 663350 1077518
4157A077518K82730K89091p81095J61210K95802K91307q2299R0291m8999n8346
$$ 1077518 1360248 1649339 868244 1029454 1325256 1616563 1534264 1624555 1575556 1517210
4147A517210n06558j61784N27071J34442m90511L82024M82973k0713m05216Q9766
$$ 1517210 1010652 848868 1375939 1510381 1019870 1401894 1884867 1864154 1458938 1548704
4137A548704J02592k62868K43930k7677M35255O8508l30403M7730J34996L65363
$$ 1548704 1651296 1388428 1632358 1604681 2039936 2108444 1778041 1825771 1960767 2326130
4127B326130k6244l11071k01809L99619R4750n37786J36254j27012K54478j15281
$$ 2326130 2299886 1988815 1787006 2186625 2281375 1743589 1879843 1752831 2007309 1892028
4117A892028o31413L8448P08352O27952n12811j4319K55702n8620j29351M394
$$ 1892028 1260615 1299063 2007415 2635367 2122556 2108237 2363939 2305319 2175968 2180362
4107B180362M9922M7571J56858K48711k38186M24330K49172N0702n48529m2283
$$ 2180362 2230284 2277855 2434713 2683424 2445238 2869568 3118740 3169442 2620913 2578630
4097B578630R50652n9439o83981k84263P35563k71994k54135J66161N17235K97919
$$ 2578630 3529282 3469843 2785862 2501599 3237162 2965168 2711033 2877194 3394429 3692348
4087C692348J17436L27119j58665k2817j79021M06500K63068k15332J04842K73582
$$ 3692348 3809784 4136903 3978238 3955421 3776400 4182900 4445968 4230636 4335478 4609060
4077D609060q0785j44129L66464K60441O6498k09086M42320Q46582j1872L467
$$ 4609060 4528275 4384146 4750610 5011051 5077549 4868463 5310783 6157365 6145493 6148960
4067F148960M47576L64236j18464K36594M17599P5142O0817O98207L88079K01003
$$ 6148960 6596536 6960772 6842308 7078902 7496501 7571643 7632460 8330667 8718746 8919749
4057H919749m0115O13942P03122N91296P38109P59927L37908o92L86566Q03175
$$ 8919749 8879634 9493576 10196698 10787994 11526103 12286030 12623938 12623246 13009812 13812987
4047A3812987K72954O56211J333710O29425J065298N66815J235682Q69409N54720
$$ 13812987 14085941 14742152 16075862 16705287 17770585 18337400 19573082 20442491 20997211
4038B0997211N19281J463455J172461R33154J011740J090233R50305J117546M66642
$$ 20997211 21516492 22979947 24152408 25085562 26097302 27187535 28137840 29255386 29722028
4029B9722028J061181J652702Q96789O40961J418671J622972P08604N74227J035554
$$ 29722028 30783209 32435911 33332700 33973661 35392332 37015304 37723908 38298135 39333689
4020C9333689J349662k10207R1670O84776P33306M06163j1082N98965J67583l54992
$$ 39333689 40683351 40473144 40564814 41249590 41982896 42389059 42377977 42976942 43144525 42789533
4010D2789533m99162L04240K56449q49390q87290k60000l42819p52571m06579
$$ 42789533 42290371 42594611 42851060 42001670 41114380 40854380 40511561 39758990 39352411
4001C9352411j41650j023323m86759j59767r35157j076986p03324m62653q47766
$$ 39352411 39210761 38187438 37700679 37540912 36605755 35528769 34825445 34362792 33515026
3992C3515026p26204k74311k01236N8820J127505J914100J345406q67973k185209
$$ 33515026 32788822 32514511 32313275 32372095 33499600 35413700 36759106 35891133 33705924
3983C3705924l023499l466410l071062j333946j085811j519928j644111o61772
$$ 33705924 30682425 27216015 24144953 22811007 21725196 20205268 18561157 17899385
3975A7899385j204507j309710p82671j11108r67830j418859k18228K4452m52003
$$ 17899385 16694878 15385168 14602497 14491389 13523559 12104700 11886472 11910924 11458921
3966A1458921j246380m29734j14057j18271m21141m3159l59394l72368l22984
$$ 11458921 10212541 9782807 9668750 9550479 9129338 9086179 8726785 8354417 8031433
3957H031433j64366K15110o75810r1585P8155n31668k28478L04940K30129p80014
$$ 8031433 7867067 8082177 7406367 7314782 7392937 6861269 6632791 6937731 7167860 6387846
3947F387846m45299P05145J72055k67733l67723j09880K8444p48598j01539J99233
$$ 6387846 5942547 6647692 6819747 6552014 6184291 6074411 6102855 5354257 5252718 5451951
3937E451951k4552j2781J90484J7375l42993J43919l2445j81779j23861N86817
$$ 5451951 5427399 5414618 5605102 5622477 5279484 5423403 5390958 5209179 5085318 5672135
3927E672135K17916n49212j6813J771L34362k19066K37064P9026M68164j91196
$$ 5672135 5890051 5340839 5324026 5325797 5660159 5441093 5678157 5757183 6225347 6034151
3917F034151o55869Q44351L62993n48832l42994P41691Q9382n24662M89670L66948
$$ 6034151 5378282 6222633 6585626 6036794 5693800 6435491 6524873 6000211 6489881 6856829
3907F856829k00773J02230n66608N98376P27169j19327K55927N17644K4566l76141
$$ 6856829 6656056 6758286 6191678 6790054 7517223 7397896 7653823 8171467 8196033 7819892
3897G819892L28415R82904K49629k34199N03188N50142L40190k55685K05511Q68587
$$ 7819892 8148307 9131211 9380840 9146641 9649829 10199971 10540161 10284476 10489987 11358574
3887A1358574L62144j01794L59704M03916J82805J61858L62802l1256R7475N55671
$$ 11358574 11720718 11618924 11978628 12382544 12565349 12727207 13090009 13058753 13156228 13711899
3877A3711899J79721K45445j75069L78588J238341Q951m28512N35506M03783j91368
$$ 13711899 13891620 14137065 13961996 14340584 15578925 15587876 15159364 15694870 16098653 15907285
3867A5907285j66337M81918N85659K18373M0720K88249J063059J71947k53634
$$ 15907285 15740948 16222866 16808525 17026898 17067618 17355867 18418926 18590873 18337239
3858A8337239O37579O35562L01585N7071P69301J151337Q19558Q93229Q57409
$$ 18337239 18974818 19610380 19911965 19969036 20738337 21889674 22709232 23602461 24459870
3849B4459870N86550J077080J252293R99916J247300J880852J347510J468400
$$ 24459870 25046420 26123500 27375793 28375709 29623009 31503861 32851371 34319771
3841C4319771K055177K000655J360430K022990K671957J910114J644469K208864
$$ 34319771 36374948 38375603 39736033 41759023 44430980 46341094 47985563 50194427
3833E0194427L005137K387563J700143K138824L173002K014656J314367J912401
$$ 50194427 53199564 55587127 57287270 59426094 62599096 64613752 65928119 67840520
3825F7840520K729699J452608J057618J653827J462939N64393N29474P24204l37896
$$ 67840520 70570219 72022827 73080445 74734272 76197211 76761604 77291078 78015282 77677386
3816G7677386m23987n1048j45656j022556j227269j276589r74091j270889k252560
$$ 77677386 77253399 77202351 77056695 76034139 74806870 73530281 72556190 71285301 69032741
3807F9032741j453505j231430k204685k208818k101082j671612j977359k312047
$$ 69032741 67579236 66347806 64143121 61934303 59833221 58161609 56184250 53872203
3799E3872203j869363k191997k467516j793625k300130k358532j545169j641495
$$ 53872203 52002840 49810843 47343327 45549702 43249572 40891040 39345871 37704376
3791C7704376j685298j865193j628421j121597j104354k050290j530927m38169
$$ 37704376 36019078 34153885 32525464 31403867 30299513 28249223 26718296 26280127
3783B6280127j444493j757158n42741n865j051367j547651r80378J04882m21344
$$ 26280127 24835634 23078476 22535735 22529870 21478503 19930852 18950474 19055356 18634012
3774A8634012n34083o08113m736k18905r39627m80447M93140J31020m71586o92244
$$ 18634012 18099929 17491816 17487080 17268175 16328548 15848101 16341241 16472261 16000675 15308431
3764A5308431O8516K48816j021886k07017L3340k17003j81516m2059l13909m88710
$$ 15308431 15376947 15625763 14603877 14396860 14430200 14213197 14031681 13989622 13675713 13187003
3754A3187003l63033M89679O650o84012o84276j67947r3943n54063m54590m71920
$$ 13187003 12823970 13313649 13320299 12636287 11952011 11784064 11690121 11136058 10681468 10209548
3744A0209548k95992j69702k34927j49557l25390m0059o9022j99269n77462L0845
$$ 10209548 9913556 9743854 9508927 9359370 9033980 8993921 8924899 8725630 8148168 8179013
3734H179013L37117o82294o31340J21191k06979o83933N4186M57211j259l80790
$$ 8179013 8516130 7833836 7202496 7323687 7116708 6432775 6486961 6944172 6942913 6562123
3724F562123j61868m53118j21467O6728m88822j12416k92596K33614k53366j39025
$$ 6562123 6400255 5947137 5825670 5892398 5403576 5291160 4998564 5232178 4978812 4839787
3714D839787L43806J38867K03599l35949l19191k58612Q8846Q9120K93438r06
$$ 4839787 5183593 5322460 5526059 5190110 4870919 4612307 4701153 4790273 5083711 5082805
3704E082805J33490m63080k16055k4619Q5746K23924j7611L7223k83895L992J68425
$$ 5082805 5216295 4753215 4537160 4512541 4598287 4822211 4804600 4841823 4557928 4561920 4730345
3693D730345J92766J72476j63425P4274k70431R8866M63104r7888K47006j31303
$$ 4730345 4923111 5095587 4932162 5006436 4736005 4834871 5297975 5200087 5447093 5315790
3683E315790m31962K39407K60072O0446p0586L04053M2038l43645l02560K41924
$$ 5315790 4883828 5123235 5383307 5443753 5373167 5677220 5719258 5375613 5073053 5314977
3673E314977O98843p552K68890j80191j6182J09725N47426p1547m71998P43197
$$ 5314977 6013820 6006268 6275158 6094967 6078785 6188510 6735936 6664389 6192391 6935588
3663F935588O26832L6139k53680j13385L6286J49705M562Q90737J092788K94230
$$ 6935588 7562420 7598559 7344879 7231494 7267780 7417485 7422047 8312784 9405572 9699802
3653I699802J8451K51651M36630P0507K03273N35424Q03284n8405R976k6586o7261
$$ 9699802 9718253 9969904 10406534 10477041 10680314 11215738 12019022 11960617 11970593 11944007 11876746
3642A1876746N65282O39888N63368M43070L23141n4087j13758K5631j48320K25321
$$ 11876746 12442028 13081916 13645284 14088354 14411495 14357408 14243650 14269281 14120961 14346282
3632A4346282N8940O20968J7641l66770M6750n2354q4971M0118L28459o2878J14874
$$ 14346282 14405222 15026190 15043831 14677061 14723811 14671457 14586486 14626604 14955063 14892185 15007059
3621A5007059p0557O6812K87898P40054L84761j96465L1995Q03651J1163j24102
$$ 15007059 14936502 15003314 15291212 16031266 16416027 16219562 16251557 17055208 17066371 16942269
3611A6942269Q45554R65954M68749K81970O87285R75875N56547J045912R91107
$$ 16942269 17787823 18753777 19222526 19504496 20191781 21167656 21724203 22770115 23761222
3602B3761222R62174J237614J058267J882626J325239P75158J316331J534407
$$ 23761222 24723396 25961010 27019277 28901903 30227142 31002300 32318631 33853038
3594C3853038J121394J284363J834501J858367J315134R29465K005220K103828
$$ 33853038 34974432 36258795 38093296 39951663 41266797 42196262 44201482 46305310
3586D6305310J029289Q14787J357763J641196J253508J006196J308653J087712
$$ 46305310 47334599 48149386 49507149 51148345 52401853 53408049 54716702 55804414
3578E5804414R49586J164945P18504N47777J86694J77549N79763l0921p1665M47099
$$ 55804414 56754000 57918945 58637449 59185226 59371920 59549469 60129232 60098311 60026646 60473745
3568F0473745J04932j10050q8913j13242K67725j57112n57755k03164l63209p56808
$$ 60473745 60578677 60468627 60379714 60266472 60534197 60377085 59819330 59616166 59252957 58496149
3558E8496149q62963k29329r81307m89593q15704j065004j052653j330978j142496
$$ 58496149 57633186 57403857 56422550 55932957 55117253 54052249 52999596 51668618 50526122
3549E0526122j526303j267994j114284r35490j372293j410194j666506r10682
$$ 50526122 48999819 47731825 46617541 45682051 44309758 42899564 41233058 40322376
3541D0322376j278817j517812j478002j342214j127605j660773j590562q03314
$$ 40322376 39043559 37525747 36047745 34705531 33577926 31917153 30326591 29523277
3533B9523277p56370j999265j626309j068028q02610j168421j037698l72340p23503
$$ 29523277 28766907 26767642 25141333 24073305 23270695 22102274 21064576 20692236 19968733
3524A9968733q94351q81191K87748o25766j320069n610J53793o49277j82003m9994
$$ 19968733 19074382 18193191 18480939 17855173 16535104 16529494 16683287 16034010 15852007 15802013
3514A5802013J59597o03436n12173P42690K06889p12612q18941n7514K21256r5260
$$ 15802013 15961610 15358174 14846001 15588691 15795580 15082968 14264027 14206513 14427769 14332509
3504A4332509m07390p5153m7122o0676K39594J46902n70784m72108J72668k24404
$$ 14332509 13925119 13849966 13802844 13742168 13981762 14128664 13557880 13085772 13258440 13034036
3494A3034036p55330l54202m06792k30956m79100o8419k25022j09434o62083l46025
$$ 13034036 12278706 11924504 11517712 11286756 10807656 10739237 10514215 10404781 9742698 9396673
3484I396673l00683o50971m2331k18197k21410k79200m18558l5841p93681n72591
$$ 9396673 9095990 8445019 8402688 8184491 7963081 7683881 7265323 7229482 6435801 5863210
3474E863210j55916j18370n6844j78571K54695l13590p10193j22199L52911J95945
$$ 5863210 5707294 5588924 5532080 5353509 5608204 5294614 4584421 4462222 4815133 5011078
3464E011078k86793j66320l47806L001k08622n07570j85818Q3233J1740n10946
$$ 5011078 4724285 4557965 4210159 4213160 4004538 3496968 3311150 3394383 3406123 2895177
3454B895177K25351k71454j04036M12517J8683m84076K9704q6571j72695J9604
$$ 2895177 3120528 2849074 2745038 3157555 3176238 2692162 2721866 2635295 2462600 2482204
3444B482204r3893J47283l24663p30206K80411M01454k30853o04763N27776O21313
$$ 2482204 2388311 2535594 2210931 1480725 1761136 2162590 1931737 1326974 1854750 2476063
3434B476063L1260n48689l32716m4670m9970J71989k19164L7587R8325K88580
$$ 2476063 2507323 1958634 1625918 1581248 1531278 1703267 1484103 1521690 1620015 1908595
3424A908595j98331l78566K87586J42576l11298k29103l8942J71923l08851n3162
$$ 1908595 1710264 1331698 1619284 1761860 1450562 1221459 1182517 1354440 1045589 992427
3414I92427k28117N4144j70404J90635J14041o1864j02580J15792J60729m20391
$$ 992427 764310 818454 648050 838685 952726 890862 788282 904074 1064803 644412
3404F44412J07419L35278J92181p67030K33499N60025l31297l36214l10763O70101
$$ 644412 751831 1087109 1279290 512260 745759 1305784 974487 638273 327510 997611
3394I97611M4445o08531M4415N96125J47059l65903p1944M54213k79133k93080
$$ 997611 1042056 433525 477940 1074065 1221124 855221 783277 1237490 958357 665277
3384F65277O6091n0998K58885J19568l50597j24157J28720l55492O3858L21310
$$ 665277 731368 680370 939255 1058823 708226 584069 712789 357297 421155 742465
3374G42465L21255k43807J33977l38334k81508l34181M635K76148K35058L19017
$$ 742465 1063720 819913 953890 615556 334048 -133 4502 280650 515708 834725
3364H34725m26328j90351K71597j42472j85992L73486O60057p26773l78902p2083
$$ 834725 408397 218046 489643 347171 161179 534665 1194722 467949 89047 16964
3354A6964N21889K33155k84489j80036J08357J94802k64185j56636K46838K65781
$$ 16964 538853 772008 487519 307483 415840 610642 346457 189821 436659 702440
3344G02440k01819n34023J45740N21742O9708n76243l5508P68767l57648l56081
$$ 702440 500621 -33402 112338 634080 703788 127545 92037 860804 503156 147075
3334A47075o0542K27102n15901m254M37680L80007p28360j74083O39457K05608
$$ 147075 86533 313635 -202266 -206520 231160 611167 -117193 -291276 348181 553789
3324E53789q95471Q9470P88122q4484l88303J16620M79856l4404n19162j18193
$$ 553789 -341682 -252212 535910 451426 63123 179743 659599 625195 106033 -12160
3314a2160N07255j4636n43299P6018N23282k51566k63824N92601L3871k80066
$$ -12160 495095 480459 -62840 13178 536460 284894 21070 613671 647542 367476
3304C67476L78236l49062m74241l8351L45588N83922r4515j007763P78232Q15270
$$ 367476 745712 396650 -77591 -115942 229646 813568 719053 -288710 489522 1304792
3294A304792n04139o21135J74249K11261k42992R6592N71915j55434n11103N6685
$$ 1304792 800653 179518 353767 565028 322036 418628 990543 835109 324006 380691
3284C80691K27321K22636k56496j05698N84377k40501k25639k69474L3264K38727
$$ 380691 608012 830648 574152 468454 1052831 812330 586691 317217 350481 589208
3274E89208q8826j88244Q0378J03908l40429K23518K77731k44632n23083Q75892
$$ 589208 500382 312138 392516 496424 155995 379513 657244 412612 -110471 765421
3264G65421K14542k57733n22245K38812M64080o72347m5601M62494K93452k25111
$$ 765421 979963 722230 199985 438797 902877 230530 184929 647423 940875 715764
3254G15764j18513N23307l19385j71347K61130M989n52785m66703L22002J83782
$$ 715764 597251 1120558 801173 629826 890956 895945 343160 -123543 198459 382241
3244C82241j35996k28853K84044L62453m83167l8538N83772L40060o81593n33966
$$ 382241 246245 17392 301436 663889 180722 142184 725956 1066016 384423 -149543
3234a49543P08674L85153r01660M3070L47650J9500j17610m26974N59918P3311
$$ -149543 559131 944284 42624 85694 433344 452844 335234 -91740 468178 541489
3224E41489j90955K87507K13557J54563j07465m2540J32167j63047j20528K87740
$$ 541489 350534 638041 851598 1006161 898696 856156 988323 825276 704748 992488
3214I92488P847k49697J13566L23881l05794k47614J35724k55499j79813O31913
$$ 992488 1000335 750638 864204 1188085 882291 634677 770401 514902 335089 967002
3204I67002j60012k21845J26321r6189m17593j23091M37012K10627n8322j46826
$$ 967002 806990 585145 711466 615277 197684 74593 511605 722232 663910 517084
3194E17084J21682p9583o59177J97328J55477j91742m3233k07799O39399r7850
$$ 517084 638766 559183 -99994 97334 252811 61069 17836 -189963 449436 351586
3184C51586Q4558j75662R074k99925O15222K598o61131j65089M26787L69248k88131
$$ 351586 436144 260482 269556 -30369 584853 587451 -73680 -238769 188018 557266 269135
3173B69135l33724N71065L01828n19836l8911K47565l46446M6785l2978k00186
$$ 269135 -64589 506476 808304 288468 249557 497122 150676 197461 164483 -35703
3163c5703N1713m10682O96080M92726p22600j25039K17602r5815m7051M34287
$$ -35703 16010 -394672 301408 794134 71534 -53505 164097 68282 21231 455518
3153D55518K42607j86274k68137n3275J16639k89367o08291L69828J78648p6836
$$ 455518 698125 511851 243714 190439 307078 17711 -590580 -220752 -42104 -118940
3143a18940K87756J43850N6173K24097J14744l43581m08037J30344Q40666r3206
$$ -118940 168816 312666 368839 592936 707680 364099 -43938 86406 927072 833866
3133H33866m09769j88096M31471J32593P4923R6787O6734l60772K1779r7846p4167
$$ 833866 424097 236001 667472 800065 874988 971775 1038509 677737 699516 601670 527503
3122E27503k5867j14048J64509n03359l650L28859j08739m85921L82281N57581
$$ 527503 501636 387588 552097 48738 45088 373947 265208 -220713 161568 719149
3112G19149j14976l09315j27195M68449n47150m78363K86989L86355l47827J35856
$$ 719149 604173 294858 167663 636112 88962 -389401 -102412 283943 -63884 71972
3102G1972R84906m17870p40568P38723K27253n75533o12320K36549L78415n4109
$$ 71972 1056878 639008 -101560 637163 864416 288883 -323437 -86888 291527 237418
3092B37418q9673R0399k16451j99706M33532j92061M03431j04968m6973p3600
$$ 237418 147745 238144 21693 -178013 255519 63458 466889 361921 314948 241348
3082B41348n27015N6202K67345k62410M8279M11822j58233R4243l83814J06952
$$ 241348 -285667 -229465 37880 -224530 -176251 235571 77338 171581 -212233 -105281
3072a05281M71978j90837P064J73370k80451J35952k16107J82039k88936j17311
$$ -105281 366697 175860 182924 356294 75843 211795 -4312 177727 -111209 -228520
3062b28520N51596j4860l70296j63003M4445J66895l44837J54313M77092j03972
$$ -228520 323076 308216 -62080 -225083 -180638 -13743 -358580 -204267 272825 168853
3052A68853R9321n41850L80369M64488m11962k09995j44016L18660l19463j31268
$$ 168853 268174 -273676 106693 571181 159219 -50776 -194792 123868 -195595 -326863
3042c26863M38300J61040k74755k29331M73370K31149m26496k88861Q42224O8896
$$ -326863 111437 272477 -2278 -231609 241761 472910 46414 -242447 599777 668673
3032F68673r02190n86147O61054K81139k39709K8497M30446J2738l23268J79615
$$ 668673 -233517 -819664 -158610 122529 -117180 -88683 341763 354501 31233 210848
3022B10848L48202J6546m09218p68410O41334J44530o48522l08555Q19887O08489
$$ 210848 559050 575596 166378 -602032 39302 183832 -464690 -773245 46642 655131
3012F55131o33428j26181O11230K22024p19330J19317O99850l25294o26284n39479
$$ 655131 21703 -104478 506752 728776 9446 128763 828613 503319 -122965 -662444
3002f62444M09381N38155n67743j06542K12798K129m29082L59356l06504j88348
$$ -662444 -253063 285092 -282651 -389193 -176395 -174266 -603348 -243992 -550496 -738844
2992g38844N04993K28133M08040j49887R1631J41036m24531P9156J6786j31379
$$ -738844 -233851 -5718 402322 252435 344066 485102 60571 139727 156513 25134
2982B5134j26949L50683M07406n15546l18094M3879O52862P6149l55575J28384
$$ 25134 -101815 248868 656274 140728 -177366 -133487 519375 595524 239949 368333
2972C68333j98759l28457k80209O28855J54848l66249K14715m24084n4917j11192
$$ 368333 169574 -158883 -439092 189763 344611 -21638 193077 -231007 -285924 -397116
2962c97116K42800P1862j69766J57296m46148L50534J40369o1548o8642j01970
$$ -397116 -154316 -82454 -252220 -94924 -541072 -190538 -50169 -111717 -180359 -282329
2952b82329J19632r6087j98741O5252J44709k33657M14373L05195j93805j2427
$$ -282329 -162697 -258784 -457525 -392273 -247564 -481221 -66848 238347 44542 32115
2942C2115L562K57251m9606j37335l57236m0888r1673j06053K18532j36018Q4774
$$ 32115 35677 292928 243322 105987 -251249 -292137 -383810 -489863 -271331 -407349 -322575
2931c22575O0168J99967K07680n10299k09843N22028j28182n658K72751K04510
$$ -322575 -262407 -62440 145240 -365059 -574902 -52874 -181056 -186714 86037 290547
2921B90547k20447k61272p7390K01646O35426m92355k42025J03239K3979l33855
$$ 290547 70100 -191172 -268562 -66916 568510 76155 -165870 -62631 -38652 -372507
2911c72507m6978O28962K47716L8407q3036j12363l50321R9597L5105Q6218J13312
$$ -372507 -419485 209477 457193 495600 412564 300201 -50120 49477 84582 170800 284112
2900B84112k88332J105R2140m37420J03117J44882n7194j19940L27755M65049
$$ 284112 -4220 -3115 89025 -348395 -245278 -100396 -157590 -277530 50225 515274
2890E15274n90945r7216L30045J63268m65403Q6800L5398N59453j85191r4851
$$ 515274 -75671 -172887 157158 320426 -144977 -58177 -22779 536674 351483 256632
2880B56632K32253k24924j95652k97910M45014j01079J53544p4507l46829O390
$$ 256632 488885 263961 68309 -229601 215413 114334 267878 193371 -153458 -147068
2870a47068L3611K26444n6507K7533l91717j68126M06899J07425j71200p238J09650
$$ -147068 -113457 112987 56480 84013 -307704 -475830 -68931 38494 -132706 -139944 -30294
2859c0294L45754j97777l40042K66443J41538P9574k3105J10195k15813J25973
$$ -30294 315460 117683 -222359 44084 185622 265196 242091 352286 136473 262446
2849B62446k83125j28355L84693M48862o15373o5260N19651O20710l60504o21988
$$ 262446 -20679 -149034 235659 684521 69148 3888 523539 1144249 783745 161757
2839A61757J75813k07179J20793l83467m54711N74711M22829o55997j36550N57809
$$ 161757 337570 130391 251184 -132283 -586994 -12283 410546 -245451 -382001 175808
2829A75808L29765l26878l06791N21006q9971p93655M79336N34302r02601j27835
$$ 175808 505573 178695 -128096 392910 302939 -490716 -11380 522922 -379679 -507514
2819e07514N60212O30236m14432q15378J46974L36899k48453l78392N05301J17332
$$ -507514 52698 682934 268502 -546876 -399902 -63003 -311456 -689848 -184547 -67215
2809f7215m25812l76446L62884P49798q54923k38288N00187M09516j70977j59539
$$ -67215 -493027 -869473 -506589 243209 -611714 -850002 -349815 59701 -111276 -270815
2799b70815R3029L69330l9455q07979J62669M47556j6620m40391L04968J27817
$$ -270815 -177786 191544 152089 -655890 -493221 -45665 -62285 -502676 -197708 -69891
2789f9891p8749Q1274k06762K65546J05627l71832L20945N9689J74896l35759
$$ -69891 -148640 -67366 -274128 -8582 97045 -274787 46158 105847 280743 -55016
2779e5016N8597r5801m86823K17860M92304k7507N9944l97930j30697K93941j76574
$$ -55016 3581 -92220 -579043 -361183 131121 103614 163558 -234372 -365069 -71128 -247702
2768b47702l04071J66747L94719j7180l97749J39131J04433L3930k51554j03690
$$ -247702 -551773 -385026 9693 -7487 -405236 -266105 -161672 -127742 -379296 -482986
2758d82986N45200j53741o74875j47300O94626L15856o56118k2299K06638K15569
$$ -482986 62214 -91527 -766402 -913702 -219076 96780 -559338 -581637 -374999 -159430
2748a59430k38662M22507J0954k26755M20283r1141l26287j42112O78686n3714
$$ -159430 -398092 24415 35369 -191386 228897 137756 -188531 -330643 348043 294329
2738B94329k90418l35483r5728L87987J45977r2977Q3116l95663m9043K40354
$$ 294329 3911 -331572 -427300 -39313 106664 13687 96803 -298860 -347903 -107549
2728a07549j79490l22533L69890K26490l19133k11753q5563K08314n3333n09799
$$ -107549 -287039 -609572 -239682 -13192 -332325 -544078 -629641 -421327 -474660 -984459
2718i84459O31782O552m23358M13831L888o2243N5453j77975m85551L46404N35066
$$ -984459 -352677 -346125 -769483 -355652 -351764 -414007 -358554 -536529 -1022080 -675676 -140610
2707a40610M15512j11595j70623N30319J2007l62163j17709M36598p20074k16262
$$ -140610 274902 163307 -7316 523003 535010 172847 55138 491736 -228338 -444600
2697d44600j94477M16627J37677l13581L07514K16636j19134m59676J91907L12283
$$ -444600 -639077 -222450 -84773 -398354 -90840 125796 6662 -453014 -261107 51176
2687E1176q1136J97708K09912j24822k97629l69025M68415K04235p15973L16357
$$ 51176 -29960 167748 377660 252838 -44791 -413816 54599 258834 -457139 -140782
2677a40782L96021j7647l69430j38706O49L17410m48805j02226K40656M0635J30830
$$ -140782 255239 237592 -131838 -270544 -269895 47515 -401290 -503516 -262860 -222225 -91395
2666i1395j32624J391P1003L35674n18722J80294O07841n3382r59097L4042Q1019
$$ -91395 -224019 -222628 -151625 184049 -334673 -154379 453462 400080 -559017 -524975 -443956
2655d43956J4627J76331M81581L88980m11595j34277l3987o59554q3648L34526
$$ -443956 -429329 -252998 228583 617563 205968 71691 37704 -621850 -705498 -370972
2645c70972M73715l128r6144L70287j01943k16732n12851J72174L73985j83621
$$ -370972 102743 99615 3471 373758 271815 55083 -457768 -285594 88391 -95230
2635i5230K32308k81408j75510Q3906K04604K16170o94605p0732P11575l25231
$$ -95230 137078 -144330 -319840 -235934 -31330 184840 -509765 -580497 131078 -194153
2625a94153n85618L83519P68262j49257n56905j6649L67317p33217q6524O82278
$$ -194153 -779771 -396252 372010 222753 -334152 -350801 16516 -716701 -803225 -120947
2615a20947N98456l89063n48594J48762L15842m77791l00108L09503J68542k4
$$ -120947 477509 88446 -460148 -311386 4456 -473335 -773443 -463940 -295398 -295422
2605b95422J51163N7661k32950K08909j7580L61763m21652j06374N5976o6316
$$ -295422 -144259 -86598 -319548 -110639 -128219 233544 -188108 -294482 -238506 -304822
2595c04822n21402R1650N21275j53792J02513L96427j04355n91425J58969K35862
$$ -304822 -826224 -734574 -213299 -367091 -264578 131849 27494 -563931 -404962 -169100
2585a69100J82290k60126k2534j96468m25569J32306K19580L10224k17191J5218
$$ -169100 13190 -246936 -269470 -465938 -891507 -759201 -539621 -229397 -446588 -431370
2575d31370q2473K39946q8111k40315M75019N68944J12214o25844K7333L06772
$$ -431370 -513843 -273897 -362008 -602323 -127304 441640 553854 -71990 -44657 262115
2565B62115m22624o5670J14412N39483j90511k9558K8633l11395Q643P3694q3152
$$ 262115 -160509 -226179 -111767 427716 237205 207647 236280 -75115 -66472 7222 -75930
2554g5930J06336J82475j71j87422j9482J61178k335k47847J58785K26947n24784
$$ -75930 30406 212881 212710 25288 5806 166984 164649 -83198 75587 302534 -222250
2543b22250L476R3373J13700j66075l33891J72375K1034Q0883M9317j46998m69909
$$ -222250 -218774 -125401 -11701 -177776 -511667 -339292 -318258 -237375 -188058 -335056 -804965
2532h04965k4618N25507j8139r7945k3840K31574j40259J93106K96162n7969J03656
$$ -804965 -829583 -304076 -322215 -420160 -444000 -212426 -352685 -159579 136583 78614 182270
2521A82270l08745k63522N19343Q9042p4714q3664K33559j46321j6802n9k2047
$$ 182270 -126475 -389997 129346 218388 143674 60010 293569 147248 130446 130387 108340
2510A08340o65437p2773N24066M64269J5798o05082Q9727P7246L30780o28587
$$ 108340 -557097 -629870 -105804 358465 374263 -230819 -141092 -63846 266934 -361653
2500c61653J31406K47938j36530K2988N2310k37469O7216p4220O6191P0929k62141
$$ -361653 -230247 17691 -118839 -95851 -43541 -281010 -213794 -288014 -221823 -150894 -413035
2489d13035M09878m02754P9458L4159O9557j59587K42663j05651l47437R6211
$$ -413035 -3157 -405911 -326453 -292294 -222737 -382324 -139661 -245312 -592749 -496538
2479d96538J21661L58376j82950M63531k85649l16104l06697N45261M39511n24192
$$ -496538 -374877 -16501 -199451 264080 -21569 -337673 -644370 -99109 340402 -183790
2469a83790l22851M18740L45729n22978r9825O66696O09459q98506k38938N41796
$$ -183790 -506641 -87901 257828 -265150 -364975 301721 911180 12674 -226264 315532
2459C15532M6075p33509j5016J47741K11931p29718j20103Q18806l75507n10936
$$ 315532 361607 -371902 -386918 -239177 -27246 -756964 -877067 -58261 -433768 -944704
2449i44704P49008L89418k63717J1898Q8722k81602o96892M92205N21369n70725
$$ -944704 -195696 193722 -69995 -58097 30625 -250977 -947869 -455664 65705 -505020
2439e05020Q6000N80934N67649n88826k84680J41558n708l30775L52462K29620
$$ -505020 -419020 161914 729563 140737 -143943 -2385 -8093 -338868 13594 243214
2429B43214j02627J20334k07304K90435O454m137m18445L20500l11535k33593
$$ 243214 140587 260921 53617 344052 350506 346369 -72076 248424 -63111 -296704
2419b96704j0678M89375j88191r0035K47645O98331l62608o51406J8911O00675
$$ -296704 -307382 181993 -6198 -96233 151412 849743 487135 -164271 -145360 455315
2409D55315q097n09346Q619J03539k15394J25624j09540k1933m06310J19264M45302
$$ 455315 447218 -62128 -53509 50030 -165364 -39740 -149280 -171213 -577523 -458259 -12957
2398a2957N2835m16496M87417M24413n43917k27424K51110J56453l96764L48344
$$ -12957 39878 -376618 110799 535212 -8705 -236129 14981 171434 -225330 123014
2388A23014M7967k74412l61447K11775J74493o5936k04640L89008L1290o24717
$$ 123014 170981 -103431 -464878 -253103 -78610 -144546 -349186 39822 71112 -553605
2378e53605M32649L64356K67506o11900j60575M47253j99786k03154j11034P40397
$$ -553605 -120956 243400 510906 -100994 -261569 185684 -14102 -217256 -328290 412107
2368D12107k78586p07874L48369P22871n56217j23438K95822K29604k30119p9102
$$ 412107 133521 -574353 -225984 496887 -59330 -182768 113054 342658 112539 33437
2358C3437M96204k31137l23681m2240j97370K53423r7640J62846Q6927l40584
$$ 33437 529641 298504 -25177 -67417 -264787 -11364 -109004 53842 140769 -199815
2348a99815j86822J71678r6493J59316j07824J22705m8953k31661J11868L60026
$$ -199815 -386637 -214959 -311452 -152136 -259960 -137255 -186208 -417869 -306001 54025
2338E4025M51185o70183p8032K62690O8389J57003k68214l43688J65041K13765
$$ 54025 505210 -164973 -243005 19685 88074 245077 -23137 -366825 -201784 11981
2328A1981j1578M5708l79186O06433J41215j52941k46239o1041N15308m28200
$$ 11981 403 46111 -333075 273358 414573 261632 15393 -45648 469660 41460
2318D1460k10627L32383j704m16937k60698J77977J39116k75401j24385L80559
$$ 41460 -169167 163216 161512 -255425 -516123 -338146 -199030 -474431 -598816 -218257
2308b18257M13072k77724j65971M32875P831r8220K48768l55957m10901M78000
$$ -218257 194815 -82909 -248880 183995 191826 93606 342374 -13583 -424484 53516
2298E3516K82068j34993k53923P6286j97061K52894k7149M3352J69459l41336
$$ 53516 335584 200591 -53332 22954 -174107 78787 51638 94990 264449 -76887
2288g6887k03971L20640J83083m70313L49309M68371o84609l01174O72023m740
$$ -76887 -280858 39782 222865 -247448 101861 570232 -114377 -415551 256472 251732
2278B51732k25239m42579M13476N65905m93670l62276O80419L79906p41019m26726
$$ 251732 26493 -416086 -2610 563295 69625 -292651 387768 767674 26655 -400071
2268d00071J007197j74290p76942L6338N41901k23239m39210K92563K57037l7894
$$ -400071 607126 432836 -344106 -307768 234133 10894 -428316 -135753 121284 83390
2258H3390j26038J25071M62328O909r36169j03424K52609J39819j75517K13146
$$ 83390 -42648 82423 544751 551660 -384509 -487933 -235324 -95505 -271022 -57876
$$ [...]
##END NTUPLES=NMR SPECTRUM
##END=
