##TITLE=1H_EC-3301(II-4)
 CDCl3
 8 sc, 
 26.10.2023
##JCAMPDX= 6.0         $$ Bruker NMR JCAMP-DX V2.0
##DATA TYPE= NMR SPECTRUM
##DATA CLASS= NTUPLES
##ORIGIN= UXNMR, Bruker Analytische Messtechnik GmbH
##OWNER= root
$$ XWIN-NMR		Version 3.5
$$ Thu Oct 26 14:21:06 2023 Russian Standard Time (UT+4h)  she@DPX200
##.OBSERVE FREQUENCY= 200.13135
##.OBSERVE NUCLEUS= ^1H
##.ACQUISITION MODE= SIMULTANEOUS
##.ACQUISITION SCHEME= undefined
##.AVERAGES= 8
##.DIGITISER RES= 18
##SPECTROMETER/DATA SYSTEM= spect
##.PULSE SEQUENCE= zg30
##.SOLVENT NAME= CDCl3
##.SHIFT REFERENCE= (INTERNAL, CDCl3, 0, 15.7502)
##AUDIT TRAIL= $$ (NUMBER, WHEN, WHO, WHERE, WHAT)
$$ ##TITLE= Audit trail, XWIN-NMR		Version 3.5
$$ ##JCAMPDX= 5.01
$$ ##ORIGIN= Bruker BioSpin GmbH
$$ ##OWNER= she
$$ F:/spectra/data/she/nmr/H-F/1/pdata/1/auditp.txt
$$ ##AUDIT TRAIL=  $$ (NUMBER, WHEN, WHO, WHERE, WHAT)
(   1,<2023-10-26 14:19:50.76 +0400>,<she>,<DPX200>,
      <created by zg, POWCHK disabled, PULCHK disabled
       configuration hash MD5:
       00 E9 B6 7A A2 85 ED C7 34 08 36 98 17 FE 4E 26
       data hash MD5: 16K
       0B AD 7E A0 73 60 82 F5 CD 71 F3 74 BA F2 75 3D>)
(   2,<2023-10-26 14:19:54.21 +0400>,<she>,<DPX200>,
      <Start of raw data processing
       efp BC_mod = 2 LB = 0.24 FT_mod = 6 PKNL = 1 PHC0 = -23517.99 PHC1 = 21.45272 SI = 16K 
       data hash MD5: 16K
       93 8F ED E6 39 2A DE 20 B4 17 EF AC 70 70 F9 AD>)
(   3,<2023-10-26 14:20:15.17 +0400>,<she>,<DPX200>,
      <pk PHC0 = 6.969609 PHC1 = -7.000001 
       data hash MD5: 16K
       07 8D C5 4C CA 71 12 0C 01 A8 A7 12 BD FE 6E 9A>)
(   4,<2023-10-26 14:20:18.71 +0400>,<she>,<DPX200>,
      <abs ABSG = 5 
       data hash MD5: 16K
       37 48 2A B8 AF 34 B2 29 E1 C6 BC 35 79 5D 51 30>)
$$ ##END=
$$ 
$$ hash MD5
$$ 8E 11 67 D8 5F 57 5D E9 4E A2 AB 4E 77 E1 7E 39
##$RELAX= 
##$RELAX= 
##$RELAX= 
##$RELAX= 
##$RELAX= 
##$RELAX= 
$$ Bruker specific parameters
$$ --------------------------
##$DU= <F:/spectra>
##$EXPNO= 1
##$NAME= <H-F>
##$PROCNO= 1
##$TYPE= <nmr>
##$USER= <she>
##$AMP= (0..31)
100 100 100 100 100 100 100 100 100 100 100 100 100 100 100 100 100 100 
100 100 100 100 100 100 100 100 100 100 100 100 100 100 
##$AQSEQ= 0
##$AQ_mod= 1
##$AUNM= <au_zg>
##$AUTOPOS= <>
##$BF1= 200.13
##$BF2= 200.13
##$BF3= 200.13
##$BF4= 200.13
##$BF5= 200.13
##$BF6= 200.13
##$BF7= 200.13
##$BF8= 200.13
##$BYTORDA= 1
##$CFDGTYP= 0
##$CFRGTYP= 5
##$CHEMSTR= <none>
##$CNST= (0..31)
1 1 145 1 1 1 1 1 1 1 1 1 1 1 1 1 1 1 1 1 1 1 1 1 1 1 1 1 1 1 1 1 
##$CPDPRG= <>
##$CPDPRG1= <>
##$CPDPRG2= <>
##$CPDPRG3= <>
##$CPDPRG4= <mlev>
##$CPDPRG5= <mlev>
##$CPDPRG6= <mlev>
##$CPDPRG7= <mlev>
##$CPDPRG8= <mlev>
##$CPDPRGB= <>
##$CPDPRGT= <>
##$D= (0..31)
0 1.2 0 0 0 0 0 0 0 0.06 0 0.03 0 0 0 0 0.0002 0 0 0 0 0 0 0 0 0 0 0 0 
0 0 0 
##$DATE= 1698315590
##$DBL= (0..7)
120 120 120 120 120 120 120 120 
##$DBP= (0..7)
150 150 150 150 150 150 150 150 
##$DBP07= 0
##$DBPNAM0= <>
##$DBPNAM1= <>
##$DBPNAM2= <>
##$DBPNAM3= <>
##$DBPNAM4= <>
$$ [...]
##$SUBNAM3= <"">
##$SUBNAM4= <"">
##$SUBNAM5= <"">
##$SUBNAM6= <"">
##$SUBNAM7= <"">
##$SUBNAM8= <"">
##$SUBNAM9= <"">
##$SW= 18.05172834244
##$SWIBOX= (0..15)
0 0 2 0 0 0 0 0 0 0 0 0 0 0 0 0 
##$SW_h= 3612.71676300578
##$TD= 16384
##$TD0= 1
##$TE= 0
##$TE2= 300
##$TE3= 300
##$TEG= 300
##$TL= (0..7)
0 120 120 120 120 120 120 120 
##$TP= (0..7)
150 150 150 150 150 150 150 150 
##$TP07= 0
##$TPNAME0= <>
##$TPNAME1= <>
##$TPNAME2= <>
##$TPNAME3= <>
##$TPNAME4= <>
##$TPNAME5= <>
##$TPNAME6= <>
##$TPNAME7= <>
##$TPOAL= (0..7)
0.5 0.5 0.5 0.5 0.5 0.5 0.5 0.5 
##$TPOFFS= (0..7)
0 0 0 0 0 0 0 0 
##$TUNHIN= 0
##$TUNHOUT= 0
##$TUNXOUT= 0
##$USERA1= <user>
##$USERA2= <user>
##$USERA3= <user>
##$USERA4= <user>
##$USERA5= <user>
##$V9= 5
##$VALIST= <valist>
##$VCLIST= <CCCCCCCCCCCCCCC>
##$VD= 0
##$VDLIST= <DDDDDDDDDDDDDDD>
##$VPLIST= <PPPPPPPPPPPPPPP>
##$VTLIST= <TTTTTTTTTTTTTTT>
##$WBST= 1024
##$WBSW= 4
##$XGAIN= (0..3)
0 0 0 0 
##$XL= 0
##$YL= 0
##$YMAX_a= 617046
##$YMIN_a= -718522
##$ZGOPTNS= <>
##$ZL1= 120
##$ZL2= 120
##$ZL3= 120
##$ZL4= 120
##$ABSF1= 15.73147
##$ABSF2= -2.320379
##$ABSG= 5
##$ABSL= 3
##$ALPHA= 0
##$AQORDER= 0
##$ASSFAC= 0
##$ASSFACI= 0
##$ASSFACX= 0
##$ASSWID= 0
##$AUNMP= <proc_1d>
##$AZFE= 0.1
##$AZFW= 0.1
##$BCFW= 0
##$BC_mod= 2
##$BYTORDP= 0
##$COROFFS= 0
##$CY= -3
##$DATMOD= 1
##$DC= 0
##$DFILT= <>
##$DTYPP= 0
##$F1P= 0
##$F2P= 0
##$FCOR= 1
##$FTSIZE= 16384
##$FT_mod= 6
##$GAMMA= 0
##$GB= 0
##$INTBC= 1
##$INTSCL= 3.70164e-10
##$ISEN= 128
##$LB= 0.24
##$LEV0= 0
##$LPBIN= 0
##$MAXI= 10000
##$MC2= 0
##$MEAN= 0
##$ME_mod= 0
##$MI= 1.114404
##$NCOEF= 0
##$NC_proc= -5
##$NLEV= 6
##$NOISF1= 3.799351
##$NOISF2= 2.8
##$NSP= 0
##$NTH_PI= 0
##$NZP= 0
##$OFFSET= 15.75019
##$PC= 1
##$PHC0= -23511.02
##$PHC1= 14.45272
##$PH_mod= 1
##$PKNL= yes
##$PPARMOD= 0
##$PSCAL= 0
##$PSIGN= 0
##$REVERSE= no
##$SF= 200.130004272478
##$SI= 16384
##$SIGF1= 3
##$SIGF2= 2
##$SINO= 5.538805
##$SIOLD= 16384
##$SREGLST= <1H.CDCl3>
##$SSB= 0
##$STSI= 16384
##$STSR= 0
##$SW_p= 3612.71676300578
##$SYMM= 0
##$S_DEV= 0
##$TDeff= 16384
##$TDoff= 0
##$TI= <>
##$TILT= no
##$TM1= 0
##$TM2= 0
##$TOPLEV= 0
##$USERP1= <user>
##$USERP2= <user>
##$USERP3= <user>
##$USERP4= <user>
##$USERP5= <user>
##$WDW= 1
##$XDIM= 16384
##$YMAX_p= 483023329
##$YMIN_p= -134901
$$ End of Bruker specific parameters
$$ ---------------------------------
##NTUPLES= NMR SPECTRUM
##VAR_NAME=  FREQUENCY,     SPECTRUM/REAL,   SPECTRUM/IMAG
##SYMBOL=    X,             R,               I
##VAR_TYPE=  INDEPENDENT,   DEPENDENT,       DEPENDENT
##VAR_FORM=  AFFN,          ASDF,            ASDF
##VAR_DIM=   16384,         16384,           16384
##UNITS=     HZ,            ARBITRARY UNITS, ARBITRARY UNITS
##FACTOR=    0.220516191357247, 1,           1
##FIRST=     3152.08554820169, 0,            0
##LAST=      -460.631214804093, 0,           0
##MIN=       -460.631214804093, -134901,     0
##MAX=       3152.08554820169, 483023329,    0
$$ Real data points
##PAGE= N=1
##DATA TABLE= (X++(R..R)), XYDATA
$$ [...]
7158E792L7672O913M6783m302N9857n0442J7776J0137l8476n992l2969N5660m0671
7145F7738N209j8580J0421r060N4286l4464P9630l7393K191l9189K3659J8177
7133A22625J4908j9037m9621m87n5860P9225m0298N5320k4091L8213l7173N7036
7121A40760k8510N838m2528J0439L334l2623M3438o9865O6620q712M2965n0395
7109H0761K4666m6755K0726J2596k7926K3925j2881O7308j13886P3387j0179M1100
7097A32842m8749L1433k502Q614K7467k6741j6171k736L3169Q525L0841k1946
7085A54046n6371l2433O0595k4261J0132L9383O300J0967M307k0584j1441K920
7073A43560j3160M1158n168m1473j3773m1740K7737m3500K2744j7493O1273o6454
$$ y = [5792, 43464, 50377, 97160, 92858, 152715, 102273, 120049, 130186, 91710, 85718, 52749, 108409, 67738, 72947, 54367, 64788, 55728, 110014, 75550, 155180, 117787, 119978, 80789, 104448, 122625, 137533, 118496, 68875, 68388, 12528, 91753, 51455, 106775, 82684, 120897, 83724, 140760, 112250, 118088, 75560, 85999, 89333, 56710, 100148, 30283, 96903, 88191, 131156, 80761, 105427, 58672, 79398, 91994, 64068, 87993, 75112, 142420, 28534, 101921, 91742, 132842, 84093, 115526, 113024, 121638, 149105, 122364, 106193, 103457, 136626, 145151, 175992, 154046, 97675, 65242, 125837, 101576, 111708, 151091, 157391, 168358, 172665, 152081, 140640, 143560, 130400, 171558, 166390, 124917, 111144, 69404, 97141, 53641, 76385, 58892, 120165, 53711]
7061E3711O5018m1439N2205m0452P091k0668L6911p5773M805O156J8971l651P897
7048G0782K4923k7662N0433l7553m848K4564n0249M2719M2425j2730k5024k5641
7036G2139R344j8152J2566K8533L8219l5673j2337j3638l9899j3955L8912K064
7024F8123M291n480K4519o6472O9664J148N785K2689M131o4448K4766L4531j8381
7011A04866J4609k1824J9003K8287q2685K1755k3403K2872k3925O1148m7997M6634
6999A19340Q880J1937j8812p746l2655P5557p175o5005k711J1312J7910o418j2410
6986I2004k1325M3588k2759M6474N993r92j6749N6063P043k3357M6459p0339P256
6973A49359l7204O152J5375k4663j983M282K094j719K5179Q759j1633k0586n9921
$$ y = [53711, 118729, 77290, 129495, 89043, 96134, 75466, 112377, 36604, 41409, 47565, 66536, 62885, 70782, 95705, 68043, 118476, 80923, 76075, 100639, 50390, 93109, 135534, 122804, 97780, 72139, 81483, 63331, 75897, 104430, 142649, 106976, 94639, 81001, 41102, 27147, 66059, 68123, 72414, 66934, 91453, 24981, 94645, 95793, 101578, 124267, 128398, 63950, 88716, 123247, 104866, 119475, 97651, 116654, 144941, 62256, 84011, 60608, 83480, 59555, 120703, 72706, 119340, 128220, 140157, 121345, 113599, 80944, 156501, 149326, 84321, 81610, 92922, 110832, 104414, 92004, 70679, 114267, 91508, 137982, 143975, 142983, 126234, 182297, 189340, 165983, 212442, 142103, 149359, 112155, 118307, 133682, 109019, 107036, 111318, 113412, 111693, 136872, 145631, 133998, 113412, 53491]
6960E3491L5541m642M6202O830j4902k5356m9605N5181j8497O0507p6094O5978
6948A34634K2405J5284n1486P670J769k4026N1300K77m2736k7196m747K7531k7682
6935H2997K6634k3371P9442n4787m5087L8786N7729n3595l5911L2622m4537O8465
6923A29387k3082l6107K0580R164m097L467l4287K1291J2368N0438n9558M5753
6911A35317R741k2914N110j9936N9915r720J6320p4151K2258k270j7841K4365
6899A26194O6962p6809N063q299K7136k2180k301p49l2527O0795k5590R174j6833
6886A10036L2711p531P9328m4948l0569J1453k5976J2136k3394L704J486L4448
6874A52884k2899m3324J3718N0622l5121K4003m539j7588k5147P7701L6693j7009
$$ y = [53491, 89032, 84390, 130592, 137422, 122520, 97164, 47559, 102740, 84243, 144750, 68656, 134634, 157039, 172323, 120837, 128507, 130276, 106250, 157550, 157827, 115091, 87895, 83148, 110679, 82997, 109631, 86260, 165702, 110915, 65828, 104614, 162343, 108748, 72837, 105459, 60922, 129387, 106305, 70198, 90778, 99942, 95845, 99312, 65025, 86316, 98684, 149122, 89564, 135317, 145058, 122144, 127254, 107318, 167233, 157513, 173833, 99682, 121940, 119670, 101829, 126194, 193156, 116347, 121410, 113111, 140247, 118067, 115766, 115017, 82490, 143285, 117695, 126869, 110036, 142747, 135216, 214544, 169596, 139027, 150480, 124504, 136640, 113246, 116950, 118436, 152884, 129985, 86661, 100379, 151001, 115880, 139883, 135344, 117756, 92609, 170310, 207003, 189994]
6862A89994K5156q9388l6970M2128o797j8255j2201L3488j9827K2682k3068O231
6850A13173K0931R798n170j00J6461o093j9107Q973N0645r1041O1j9362N7395
6837A36564k8303R588m3977N3834K8449K5221J6330j8023l8636j4380J3566O3551
6825B03784o3117l4949K7789L4672k7253L0640l3129L3364n9011J42J1415K7969
6813A52316J8706m478m6239L0605M5018j1443K0011p8088N7460m4898L7807k8785
6801A47992N80k9170o930K8095k5269J3857N19L3636j4270K8744m0531N4648m7085
6788A44816k8722J7996p456J7688k7166P5921l8943K5475J923L2481n8299J7379
6776A73093J5784M040k3467P54J9889r0318M3018L407J9833q4M086L160J4470
$$ y = [189994, 215150, 125762, 88792, 130920, 124123, 105868, 93667, 127155, 107328, 130010, 106942, 113173, 134104, 143902, 138732, 138632, 155093, 149000, 129893, 138866, 189511, 98470, 98531, 79169, 136564, 108261, 117849, 73872, 127706, 156155, 181376, 197706, 179683, 141047, 126667, 140233, 203784, 140667, 105718, 133507, 168179, 140926, 171566, 138437, 171801, 112790, 112932, 124347, 152316, 171022, 166544, 120305, 150910, 195928, 184485, 204496, 126408, 183868, 138970, 176777, 147992, 148572, 119402, 112472, 140567, 115298, 129155, 129674, 163310, 149040, 177784, 137253, 191901, 144816, 116094, 134090, 126634, 144322, 117156, 193077, 154134, 179609, 181532, 214013, 155714, 173093, 188877, 192917, 169450, 170204, 190093, 99775, 142793, 146200, 166033, 165949, 170035, 173195, 187665]
6763A87665L1209n8316K6463m5390M6604p5176M4965M2046L0207o0833M68j5558
6751A54354k1727k0803R28O7073o289J5642m7547J9444j8281J1323L007j2546
6739A44578M4346j7426K1582n8084N6783m6723J7821j2094J7467K0911Q589K4153
6727B21903j1443L3457k4692k9706K5999o232l0293K5687J6416j0072m7037k391
6715A61596k267L4924j2991m075k614J8373n4211K7625l2583j9291L2379K5339
6703A72204j3357K9478O0177J0343l4206m5971m1901L1302l0122L3863j4701O529
6691A63638k180l3910J5643q549m561J9388M5468M1069n3499L5589k6237R739
6679B01598j5564j0744K4798N7735m6959m0990n193j2605O2446o5237L6302j3436
$$ y = [187665, 218874, 160558, 187021, 141631, 188235, 113059, 158024, 200070, 230277, 169444, 169912, 154354, 132627, 111824, 112752, 179825, 173536, 189178, 141631, 161075, 142794, 154117, 157124, 144578, 188924, 171498, 193080, 134996, 191779, 145056, 162877, 150783, 168250, 189161, 197750, 221903, 210460, 243917, 219225, 189519, 215518, 209286, 178993, 204680, 221096, 211024, 163987, 161596, 159329, 194253, 181262, 177187, 174573, 192946, 138735, 166360, 133777, 114486, 146865, 172204, 158847, 188325, 248502, 258845, 224639, 178668, 136767, 168069, 137947, 171810, 157109, 163638, 161458, 127548, 143191, 134642, 130081, 149469, 194937, 236006, 182507, 218096, 191859, 201598, 186034, 175290, 200088, 257823, 210864, 169874, 164681, 152076, 214522, 149285, 185587, 172151]
6667A72151R209O777j9777L6660p7713j0913J2752O7278m9226M5355K865k9475
6655A65943R047j0056M9067o1450L9440L3809k1337j1181m546m1576M9760J3193
6643B10113j1749k8219J4320K4794N420l745l0399O8919j8104k563p2039M0531
6631A97279l8681M8087l2807L662N3j6853Q3969o3777P9929p4584M1857l5816
6619A92318O0949p8196K8230J5443m2968M9242k8279J4347r578j2496M0255n6469
6607A72798j7333M6477n201l5919K0473q586j8872M9903l1860R4922m8833m299
6595B13670l5671J0223O9091q4709J6880m8872O1835J5994N4279m6096l3250O305
6583A99679Q0386p7104o413J1668L1750n3474O2513M6661m4217n056p3508M2699
$$ y = [172151, 181360, 188137, 168360, 205020, 127307, 116394, 129146, 196424, 147198, 192553, 195418, 165943, 174990, 164934, 214001, 152551, 191991, 225800, 204463, 193282, 188736, 147160, 196920, 210113, 198364, 170145, 184465, 209259, 214679, 210934, 180535, 249454, 231350, 228787, 156748, 197279, 158598, 206685, 173878, 177540, 177593, 160740, 244709, 180932, 260861, 186277, 228134, 192318, 253267, 175071, 203301, 218744, 175776, 225018, 196739, 211086, 201508, 189012, 229267, 172798, 155465, 201942, 196741, 160822, 181295, 172709, 153837, 203740, 171880, 266802, 217969, 213670, 177999, 188222, 257313, 172604, 189484, 140612, 202447, 218441, 272720, 226624, 193374, 199679, 280065, 202961, 196548, 208216, 239966, 186492, 249005, 295666, 251449, 246393, 172885, 215584]
6571B15584m3789Q3340m5379K5359j549K4328k0538k6490N2906k6656o14j7757
6559B18745K5877n0658m400m826L2641o534L2302N5562k2571l6214p143N3287
6547B86068J430k2513j8839N8331n8287L5730p3164N6105j4532n9028L9887q94
6535B30294L567L322K3518Q412m5320K8142j9386l8565k8293Q0263k3635N4871
6523B77190m7210O383q045m0737R1510J4841n8325M79N8459j0362j5046P232J1492
6510B87861n8863J8672j7794J3602N773J8258j6606J0190L03k1966o965K2163
6498B54628J7187k2403j5048k058l4722N1742K3677J9269j3497j8503M3868J3972
6486C18112O852j9975m1164n511l0510K2963R329k9078J4902M2655K41K7929k0160
$$ y = [215584, 171795, 255135, 209756, 235115, 233566, 257894, 237356, 210866, 263772, 237116, 236502, 218745, 244622, 193964, 189564, 184738, 217379, 210845, 243147, 298709, 276138, 239924, 232781, 286068, 287498, 264985, 246146, 304477, 246190, 281920, 208756, 264861, 250329, 191301, 231188, 230294, 233861, 237183, 260701, 269113, 223793, 251935, 232549, 193984, 165691, 245954, 222319, 277190, 229980, 236363, 228318, 187581, 279091, 293932, 235607, 236086, 294545, 284183, 269137, 276369, 287861, 228998, 247670, 229876, 243478, 249251, 267509, 250903, 261093, 261396, 239430, 232465, 254628, 271815, 249412, 234364, 232306, 197584, 249326, 273003, 292272, 278775, 260272, 304140, 318112, 324964, 304989, 263825, 258314, 227804, 250767, 260096, 231018, 245920, 288575, 288816, 316745, 296585]
6473B96585j1220k0641j0665M540j6223K0439M7395l8533m1635L4980k5380J9950
6461B59592j1492l2864O3133j9478M2994L25l4654J9823l5157K0525o2626L7098
6449B47219m4278P0801l6166P529L7161P092l1810J382J7149r548j2341L6079
6437B90269J5896j210J6164l2462J960M026J1167p3323N6113K3425N3537j513
6425C64049q5623k5525J15526m6282j6996k5195L1259j556j2782q212J5259L7431
6413C41353k6565L692n0068L3719K6762k9102o0571M1540M1052m8840O482J2747
6401B92201L6682k7162O04j7236J9531n618K2944o634K9207o378j2914m0207L414
6388B88434J999R591O686k1327J0150O742K9724l9964M0163m1270M4880m5505
$$ y = [296585, 285365, 264724, 254059, 258599, 242376, 262815, 310210, 271677, 230042, 265022, 239642, 259592, 248100, 215236, 278369, 258891, 301885, 302210, 267556, 287379, 252222, 272747, 210121, 247219, 202941, 273742, 237576, 245105, 282266, 289358, 257548, 258930, 276079, 266531, 254190, 290269, 306165, 304955, 321119, 288657, 290617, 294643, 305810, 232487, 288600, 312025, 365562, 364049, 278426, 252901, 368427, 322145, 305149, 279954, 311213, 309657, 296875, 288663, 303922, 341353, 314788, 318480, 268412, 302131, 328893, 299791, 239220, 280760, 321812, 272972, 279454, 292201, 328883, 301721, 302325, 285089, 304620, 299002, 321946, 315312, 344519, 338141, 325227, 285020, 288434, 290433, 300024, 306710, 285383, 295533, 302275, 331999, 292035, 332198, 290928, 335808, 290303]
6376B90303O308J9134L5562p672J4315j9893l6623K2888J856k0946L3270O242
6364C44744k6846J3351o7711K6107k2634J5797L6986J0147N7900O279K0329m4303
6352C70146k169r9722K4619l145L8610J4727j1931j3849l1655M9911L643K7409
6340C66594l81k8195M478K7950L652K8749q0240M3113O429l2079q927K2206j3712
6327C39637n5506K6372K9363p729n4978N4809q757M8924o429J347j4370K4191
6315C76874j7819J9634N9642p0431L448M3493l1922j1217L9718j4299J9845p1378
6303C45588N075j6983N8616n9307M2266m3394J5445K2368K50J9585K207P459n6925
6290C42250K1185K471l3654J7349L0998M2825l7267K6947J0427k7034m7120j8683
$$ y = [290303, 296611, 315745, 351307, 343635, 357950, 338057, 301434, 324322, 326178, 305232, 338502, 344744, 317898, 331249, 263538, 289645, 267011, 282808, 319794, 329941, 387841, 394120, 414449, 370146, 367977, 268255, 292874, 289729, 328339, 343066, 331135, 317286, 285631, 335542, 339185, 366594, 366213, 338018, 342496, 370446, 374098, 402847, 322607, 365720, 372149, 340070, 331143, 353349, 339637, 284131, 310503, 339866, 332137, 277159, 331968, 323211, 372135, 365706, 367053, 352683, 376874, 359055, 378689, 438331, 367900, 371348, 414841, 382919, 371702, 411420, 397121, 416966, 345588, 350663, 333680, 392296, 332989, 375255, 331861, 347306, 369674, 369924, 389509, 391716, 399175, 342250, 363435, 365906, 332252, 349601, 380599, 423424, 386157, 413104, 423531, 396497, 349377, 330694]
6278C30694N4329p3047K997O0733J6809j3171l7522O4877l1800M191N658j3118
6266C71630K0358L715L7343m410k5142p235M3834j6915p836k4321r656q357n520
6253C67488L2135n1360j2126N5739J5135M4169l9695o579l4957O3219k7511n3787
6241C51870o72l2805P2644N8531j9803k0362j903O48j4299J3433p9780R1342n2570
6228C66274O647N20Q4O115l3959K3642k2116K0259j2823K3293M5336j0300j4177
6215C98795k3088O3116N066m3220M3243n1229j1141q417O7599l9279M3146l5306
6203D09285m4512N2034p7062O0331q6556M5017o938Q2907j5949o4805O3270m197
6191D12825J8233p030L869L6331j8348q214j0547J4733k8517J4220L7629k7511
$$ y = [330694, 385023, 311976, 314973, 375706, 392515, 379344, 341822, 406699, 374899, 379090, 384748, 371630, 391988, 395703, 433046, 428636, 403494, 396259, 440093, 423178, 415342, 391021, 381365, 373008, 367488, 399623, 348263, 336137, 391876, 407011, 451180, 411485, 404906, 369949, 433168, 405657, 351870, 351198, 318393, 391037, 449568, 429765, 409403, 407500, 408148, 393849, 407282, 327502, 418844, 366274, 372921, 373441, 373525, 379640, 345681, 369323, 347207, 367466, 354643, 377936, 423272, 412972, 398795, 375707, 438823, 443889, 400669, 443912, 392683, 381542, 373125, 440724, 401445, 444591, 409285, 364773, 416807, 339745, 400076, 313520, 358537, 351599, 434506, 418557, 353752, 417022, 412825, 431058, 424028, 427897, 464228, 445880, 437666, 427119, 441852, 413335, 427555, 465184, 437673]
6179D37673J8000l1920N2550m0509l3775L279j956J1750J4692J6693K7699J153
6167D75329l9774k6827K4734l299J3924n7888N9491O3030o2846J8897J9596Q762
6155D93129m5899q58N6149l2107l6776l6547O9555m3404J12264k3008L8444l8472
6143E12470M4188n3342l2440L29m187L6067P6j6989l9848N5153L1026n548n1042
6130D75913L4421K9730k2450l7328J7901J2872Q7613J2026m4058K7561r051L4484
6118F19634n3317m1988J2695l1501P0228l2631J0082j6656L9899r4756k2852M3911
6106E02748k9040L5676J890j2123l2327M2608K9998j0231k4878q86L176m2364
6094D64247J9996Q185K3179m3788M3235p278j2570R686o451K842o5086R7744l4295
$$ y = [437673, 455673, 423753, 476303, 435794, 402019, 405298, 403342, 415092, 429784, 446477, 474176, 475329, 435555, 408728, 433462, 430163, 444087, 386199, 445690, 508720, 445874, 464771, 484367, 493129, 447230, 446372, 502521, 470414, 433638, 397091, 466646, 423242, 535506, 512498, 550942, 512470, 556658, 503316, 470876, 471205, 467018, 503085, 503161, 486172, 446324, 501477, 532503, 526955, 475913, 510334, 540064, 517614, 480286, 498187, 511059, 598672, 610698, 566640, 594201, 585150, 619634, 566317, 524329, 537024, 505523, 575751, 543120, 553202, 536546, 576445, 481689, 458837, 502748, 473708, 509384, 511274, 499151, 466824, 509432, 539430, 529199, 504321, 503435, 506611, 464247, 484243, 492428, 515607, 471819, 515054, 507776, 495206, 504892, 498441, 501283, 436197, 533941, 499646]
6081D99646j1331Q491M2478j6920k1154K6080K5787J8769o1779K2582m8337J8417
6069E02729J0895M7878k275j3341L1184k6660P179n0542R2644n6985K9994m3112
6057E29588o279q789M3932M7644n1278Q466J6475K6859n1582q191j2107M6849
6045E81587J2672L647k6420J0626k5635L1542k0915L7975o2508N3782q988N0756
6033F38121N7915n8060m8419K3276L0970J7562o9226J2660m3286M722K8798M1530
6021F36563p951J1644j8781J8258o318j9050l7930K7690K6315k863K253J9826
6009F49656k1926R77O0514n1208J2126m9568J02762k2622L6018o4825P646P1079
5997G30629m4385K8658n9218P0194J0771J5191n2264K384N5185k966P7186l2612
$$ y = [499646, 488315, 496806, 539284, 522364, 501210, 527290, 553077, 571846, 510067, 532649, 484312, 502729, 513624, 561502, 559227, 545886, 577070, 550410, 557589, 507047, 599691, 542706, 572700, 529588, 523309, 514520, 558452, 606096, 554818, 563284, 579759, 606618, 555036, 546845, 534738, 581587, 594259, 597906, 571486, 582112, 556477, 588019, 567104, 605079, 542571, 596353, 587365, 638121, 696036, 637976, 589557, 612833, 643803, 661365, 592139, 604799, 561513, 566235, 595033, 636563, 628612, 640256, 621475, 639733, 633415, 614365, 576435, 604125, 630440, 627577, 629830, 649656, 627730, 628707, 689221, 638013, 650139, 600571, 703333, 680711, 716729, 651904, 659550, 730629, 686244, 714902, 655684, 725878, 736649, 751840, 699576, 701960, 757145, 754179, 831365, 798753]
5985G98753P2494k7022l5428k5009o481k3593P2678J5843L1834n0438j4936K8743
5973H37438k7300l1538L4904j2201K7956J1837K3616K6472k9703j289k4222L5356
5961H71326k3402r118K581L934O02N008R254L1736M1031l7744L878l0669M1581
5948I09998j3772K7549R15N580O792k7501n2300Q7474J8080p6823j3348Q858M7333
5935I28835J1644K8638j1221J8875N301K4531J19L0146P885l6466L0313j3658
5923A024942l1658k2458o30L8932J5372k9085n207k179K2677K5590k1571K8820
5911A043545n3045j609M5068K1915J3439J5322j3957j5068l5053L9880J8458M8010
5899A126905p6481L2801K7658O912O913o613J9267J7219L1591m0906J02316l0369
$$ y = [798753, 871247, 844225, 808797, 783788, 777307, 753714, 826392, 842235, 874069, 823631, 808695, 837438, 810138, 778600, 813504, 801303, 829259, 841096, 864712, 891184, 861481, 860192, 835970, 871326, 847924, 838806, 841387, 845321, 845923, 850931, 860185, 891921, 932952, 895208, 899086, 868417, 909998, 896226, 923775, 924690, 930270, 937062, 909561, 857261, 944735, 962815, 885992, 872644, 881502, 928835, 940479, 969117, 957896, 976771, 982072, 1006603, 1006722, 1036868, 1044753, 1008287, 1038600, 1024942, 993284, 970826, 970196, 1009128, 1024500, 995415, 990208, 988029, 1010706, 1036296, 1014725, 1043545, 990500, 988891, 1033959, 1055874, 1069313, 1084635, 1070678, 1055610, 1020557, 1060437, 1078895, 1126905, 1050424, 1083225, 1110883, 1117795, 1124708, 1118095, 1137362, 1154581, 1186172, 1145266, 1247582, 1217213]
5887A217213O5275m328O4797O6490K2715J04282J5472R5530p4189l8344l1200
5876A503713r7124k8602l6480k7669j02413m2598K1050m7711N1731m2791L2436
5865A183542k6028J0792m1817L0600M852P564K7270m8047K4945m3715K6864J0573
5853A167395L4332k6269k668J4096M7697l6379m3879Q5679M1689j6261n9903Q109
5841A213638K5673M3634K8462P85O4205l330J2076L1669J6058L275j4882p271
5829A413992l148K0916L4845Q563m1487P4362J3484J5500J0378J7407L6722L02
5817A601836k529J5794O6950l611K2806L143M5O872M7130O576L4610N5643K0451
5804A875716R287M8982J2648J9497m0278O2841j9337M5485J7843K1903J4469R1680
$$ y = [1217213, 1282488, 1278160, 1342957, 1409447, 1432162, 1536444, 1551916, 1647446, 1573257, 1534913, 1503713, 1406589, 1377987, 1341507, 1313838, 1211425, 1168827, 1189877, 1142166, 1193897, 1151106, 1183542, 1157514, 1168306, 1126489, 1157089, 1161941, 1169505, 1196775, 1148728, 1173673, 1129958, 1156822, 1167395, 1201727, 1175458, 1172790, 1186886, 1234583, 1198204, 1154325, 1240004, 1281693, 1265432, 1205529, 1213638, 1239311, 1282945, 1311407, 1312192, 1376397, 1373067, 1385143, 1416812, 1432870, 1436145, 1421263, 1413992, 1410844, 1431760, 1466605, 1475168, 1433681, 1508043, 1521527, 1537027, 1547405, 1564812, 1601534, 1601836, 1599307, 1615101, 1682051, 1678440, 1701246, 1704389, 1704434, 1711306, 1758436, 1765012, 1799622, 1855265, 1875716, 1885003, 1933985, 1946633, 1966130, 1925852, 1988693, 1969356, 2014841, 2032684, 2054587, 2069056, 2160736]
5792B160736L963Q3848K4460N7523M7060M4238R2197N7302J35889Q5627O2250
5781B855093P031N3895l1292O6337J6459J82118M2594O0921Q3605R1205O9797
5770C497763J16704J01427J04142J02836J01182J36370L6442R0962O2331Q38J8139
5759D369136L6651k5895K2729J4648m8518P2256P8210P7458N4001L7942J01037
5748D789655J36847J66990K20476J57505J74980J93808K61182K34367L60163K38000
5738F933973M02443L55999M79420N03298M69803N50152M74042L29518J73515k9323
5728A0642840l03117m07178m58145l90748l76827l09622k29621j60436j99460
5719G807686p3350p5696k4489l9827N6194j2993j3781Q8623P8147Q0752J41574
$$ y = [2160736, 2164699, 2248547, 2273007, 2330530, 2377590, 2421828, 2514025, 2571327, 2707216, 2792843, 2855093, 2862124, 2916019, 2884727, 2951064, 2967523, 3149641, 3192235, 3253156, 3336761, 3427966, 3497763, 3614467, 3715894, 3820036, 3922872, 4024054, 4160424, 4196866, 4287828, 4350159, 4350997, 4369136, 4405787, 4379892, 4402621, 4417269, 4368751, 4441007, 4519217, 4596675, 4650676, 4688618, 4789655, 4926502, 5093492, 5313968, 5471473, 5646453, 5840261, 6101443, 6335810, 6695973, 6933973, 7336416, 7692415, 8171835, 8675133, 9144936, 9695088, 10169130, 10498648, 10672163, 10642840, 10339723, 9932545, 9474400, 9083652, 8706825, 8397203, 8167582, 8007146, 7807686, 7734336, 7658640, 7634151, 7594324, 7650518, 7637525, 7623744, 7712367, 7790514, 7871266, 8012840]
5708H012840J14452J20494R8165J41278J12244J51675J46767K50810K06469K49859
5698I605053K78421L05570L90606M20843M64458M30729O10891O63017O92066Q48253
5688A4709907R62504J032768R55701R49500P81304M54677N1397l16549n52208
5679A9029001p34053p55438q28197p76028p04321o83719n66901n35706m45660
5670A2998978l94534l24305l61818j89259j69307r1742l7769L1213N0974J13527
5660A1625958J76508J81878K91517K80458M49633M04397M76717M66488N63271
5651A4916825M00474L64039K33770J41100N9986M603n6498j38506n7288k4976
5641A5843529M8068M0563K09422K29249K48268J75340M7533Q463k26024l40854
$$ y = [8012840, 8127292, 8247786, 8345951, 8487229, 8599473, 8751148, 8897915, 9148725, 9355194, 9605053, 9883474, 10189044, 10579650, 11000493, 11464951, 11895680, 12506571, 13169588, 13861654, 14709907, 15672411, 16705179, 17660880, 18610380, 19391684, 19846361, 19897758, 19581209, 19029001, 18294948, 17539510, 16711313, 15935285, 15230964, 14547245, 13980344, 13444638, 12998978, 12604444, 12280139, 11918321, 11729062, 11559755, 11468013, 11430244, 11461457, 11512431, 11625958, 11802466, 11984344, 12275861, 12556319, 13005952, 13410349, 13887066, 14353554, 14916825, 15317299, 15681338, 15915108, 16056208, 16116194, 16120797, 16064299, 15925793, 15868505, 15843529, 15891597, 15932160, 16141582, 16370831, 16619099, 16794439, 16841972, 16850435, 16624411, 16283557]
5631A6283557m36457n01155m91465m94750m12659l74381l37642k73804j54141
5622A2807103o0869m2239l9543J08195J95109K13931K20610K55130K93504M04894
5612A4355825M06107M67166M65978N52103N82932P00903Q32643R00739J047629
5603B0312025J097827J263442J238908J135902J016691P95751K92710j51214n65265
5594B6436777q84332j055142j130791j022874r16332q02841p07121n69552m16444
5585A8931348k58655j53334j01828j06867l9466R435K4061n2151q5358j5850o7739
5574A8083596j44285n6349K4049k4962P5735J00937J69886K44526K85408K81747
5564A9040288L50696K63735K83200L42821L49403M26033M02875M46980N11144
$$ y = [16283557, 15847100, 15345945, 14854480, 14359730, 13947071, 13572690, 13235048, 12961244, 12807103, 12746234, 12703995, 12664452, 12772647, 12967756, 13181687, 13402297, 13657427, 13950931, 14355825, 14761932, 15229098, 15695076, 16247179, 16830111, 17531014, 18363657, 19264396, 20312025, 21409852, 22673294, 23912202, 25048104, 26064795, 26860546, 27153256, 27002042, 26436777, 25552445, 24497303, 23366512, 22343638, 21427306, 20624465, 19917344, 19347792, 18931348, 18672693, 18519359, 18417531, 18310664, 18271198, 18280633, 18304694, 18252543, 18167185, 18151335, 18083596, 17939311, 17882962, 17907011, 17882049, 17957784, 18058721, 18228607, 18473133, 18758541, 19040288, 19390984, 19654719, 19937919, 20280740, 20630143, 21056176, 21459051, 21906031, 22417175]
5555B2417175N17248N19978N50937N34172M71114L99586J65584j7752l42906n37827
5545B4677309p29382p98197p76855p61316p93666p82896p10147q59546q18503
5536A7646801q21207p92503o96480o03554o33937o50126o78067o72879o59695
5527A1438353o82089n23127n21662l95268l89842l03303k64913k83528l01991
5518G772630k11269k13165k30799j00127j79971j06868j52367j84683j23869j65735
5508F103777q4706j83145p5550r4460n7730p8458j66162o6321j23937q9902j30570
5497D952836m6384r3039j02296j40529o3421j54160j43257r0542j32779j06871
5487C879558j23128j72686n0044q7932o3107o3234j09442n9972o1531j0112q2588
$$ y = [22417175, 22934423, 23454401, 24005338, 24539510, 25010624, 25410210, 25575794, 25558042, 25215136, 24677309, 23947927, 23149730, 22372875, 21611559, 20817893, 20034997, 19324850, 18465304, 17646801, 16825594, 16033091, 15336611, 14733057, 14099120, 13448994, 12770927, 12098048, 11438353, 10756264, 10233137, 9711475, 9316207, 8926365, 8623062, 8358149, 8074621, 7772630, 7561361, 7348196, 7117397, 7017270, 6837299, 6730431, 6578064, 6393381, 6269512, 6103777, 6019071, 5835926, 5760376, 5665916, 5608186, 5529728, 5363566, 5297245, 5173308, 5083406, 4952836, 4906452, 4813413, 4711117, 4570588, 4507167, 4353007, 4209750, 4119208, 3986429, 3879558, 3756430, 3583744, 3533700, 3445768, 3382661, 3319427, 3209985, 3150013, 3088482, 3078370, 2995782]
5476B995782j5515m4921p5464J2375k3630n2709q1941L2969p1723l3845n657o1130
5464B574591L8401r55l4496l5549j1783m93m4980n52k5208J014m684j1542j8516
5451B425248j4693L506k8586J2139l8244R6156m464M6485j801P9653K1302P951
5439B604652j1516j0690n2868J0167m6212O817J9386n374O5809j10778Q420L4182
5427B511995M4066N920K2386j7350P4040L999j9662N1100J5685n2186K8944M1735
5415B710672N6164j677O2429J04709J18728O7150R0369J5980k6825j07781q5976
5404C003942k0727J7406Q576L8118R664M921K2576M3862K7941N161N9479L1312
5392C252231J28445J7574M7352M5059J8739O3358M7362J19524O8166J25976Q6729
$$ y = [2995782, 2980267, 2935346, 2859882, 2872257, 2848627, 2795918, 2713977, 2746946, 2675223, 2641378, 2635721, 2574591, 2612992, 2612037, 2577541, 2541992, 2530209, 2529716, 2484736, 2484184, 2458976, 2459990, 2455306, 2443764, 2425248, 2410555, 2414061, 2385475, 2397614, 2359370, 2455526, 2451062, 2497547, 2495746, 2575399, 2596701, 2604652, 2593136, 2582446, 2529578, 2539745, 2493533, 2500350, 2519736, 2514362, 2580171, 2469393, 2477813, 2511995, 2556061, 2561981, 2584367, 2567017, 2641057, 2645056, 2625394, 2676494, 2692179, 2639993, 2668937, 2710672, 2766836, 2765159, 2827588, 2932297, 3051025, 3118175, 3208544, 3224524, 3197699, 3089918, 3003942, 2983215, 3000621, 3009197, 3047315, 3056979, 3061900, 3084476, 3128338, 3156279, 3161440, 3220919, 3252231, 3380676, 3398250, 3445602, 3490661, 3509400, 3572758, 3620120, 3739644, 3807810, 3933786, 4020515]
5381D020515P5622J15911K19291K00765J23289P6061P5112M1624M0978P0522J60437
5370E220127J23692J40365J64089J77646L22169K33637K97480L77138M18551L89209
5360G864103M60273M90174M54756M91483M27118M32191K43096K10580P0295m5643
5350A1098426j76135k40573k94707l59461k81712l66730l30574l33770l01902
5341H412862k73691k34864j55374p8342j20382n2758p2398m1715M8552O1379P2329
5330G565598J44764J29597J44062J95361J49338K13089K54468K61290L22504K97178
5320I677249M72935L21121M96697M24352N17928N22926N96300N23713O02361N08200
5310A4663782N81529N13790M58761N23084O45014O85829P97769Q80701R79139
$$ y = [4020515, 4096137, 4212048, 4431339, 4632104, 4755393, 4831454, 4906566, 4948190, 4989168, 5059690, 5220127, 5343819, 5484184, 5648273, 5825919, 6148088, 6381725, 6679205, 7056343, 7474894, 7864103, 8324376, 8814550, 9269306, 9760789, 10187907, 10620098, 10863194, 11073774, 11144069, 11098426, 10922291, 10681718, 10387011, 10027550, 9745838, 9379108, 9048534, 8714764, 8412862, 8139171, 7904307, 7748933, 7670591, 7550209, 7497451, 7425053, 7383338, 7431890, 7493269, 7565598, 7710362, 7839959, 7984021, 8179382, 8328720, 8541809, 8796277, 9057567, 9380071, 9677249, 10150184, 10471305, 10968002, 11392354, 11910282, 12433208, 13029508, 13553221, 14155582, 14663782, 15245311, 15759101, 16217862, 16740946, 17385960, 18071789, 18869558, 19750259, 20729398]
5301B0729398J085824J121669J263490J340125J358382J275129J224802R72520
5293C0371339O66966L31205q0164m32172p89186j047553j163378j305099j395990
5284B5155968j403113j373630j273644j159109j011147r61921q18707p02697n11103
5275A5940897m00826l26373k07971j09739K0337R1783K14035K99569M49324N20742
5265A6491778O80653P75773R57014Q90933J107206J165530J169312J133930J184763
5256B5556892J008027R67299O66095M31213L5180l03240o31064r09848j138110
5247B5682444j270568j297173j384995j460254j364378j337236j311501j214640
5239A5041699j014686j058453q64098q34603o96257o32939o15533m26952m70181
$$ y = [20729398, 21815222, 22936891, 24200381, 25540506, 26898888, 28174017, 29398819, 30371339, 31038305, 31369510, 31289346, 30857174, 30067988, 29020435, 27857057, 26551958, 25155968, 23752855, 22379225, 21105581, 19946472, 18935325, 17973404, 17154697, 16452000, 15940897, 15540071, 15213698, 15005727, 14895988, 14916325, 15008108, 15222143, 15521712, 15971036, 16491778, 17172431, 17948204, 18905218, 19796151, 20903357, 22068887, 23238199, 24372129, 25556892, 26564919, 27532218, 28198313, 28629526, 28664706, 28361466, 27730402, 26820554, 25682444, 24411876, 23114703, 21729708, 20269454, 18905076, 17567840, 16256339, 15041699, 14027013, 12968560, 12104462, 11269859, 10573602, 9940663, 9325130, 8898178, 8427997]
5230H427997l53198l46970l06421k78738k55401j75096k17203k15703j09994j61351
5220F007922j41512r8016q8048j08680o8610o8852o4817l6093n8644J3819k1982
5209E266487M9238J0415J21831J38815J24537J64283J81561K39605K72292K99842
5199F868906K99718L63178L18024L32842L83499K66660K31399P3278p461n9424
5189I070619k14009k81953l73255m00903l61858l75145m35764m17891m39327m09013
5179E361501k99202k55463k80022k92547k12179k20792j88561j55102j55078n8660
5169C243895j16441o1922j11395o3552j12300p4838j7813q246j00149l6458J0825
5158B551606P7505k7092Q9459P2580J00043j41304j21870j66055j45781m0982
$$ y = [8427997, 8074799, 7727829, 7421408, 7142670, 6887269, 6712173, 6494970, 6279267, 6169273, 6007922, 5866410, 5768394, 5680346, 5571666, 5503056, 5434204, 5369387, 5333294, 5274650, 5288469, 5266487, 5315725, 5326140, 5447971, 5586786, 5711323, 5875606, 6057167, 6296772, 6569064, 6868906, 7168624, 7531802, 7849826, 8182668, 8566167, 8832827, 9064226, 9137504, 9130043, 9070619, 8856610, 8574657, 8201402, 7800499, 7438641, 7063496, 6627732, 6209841, 5770514, 5361501, 5062299, 4806836, 4526814, 4234267, 4022088, 3801296, 3612735, 3457633, 3302555, 3243895, 3127454, 3065532, 2954137, 2890585, 2778285, 2703447, 2685634, 2677388, 2577239, 2540781, 2551606, 2629111, 2602019, 2691478, 2764058, 2864101, 2722797, 2600927, 2434872, 2289091, 2248109]
5148B248109p7964m6459q0426J2094p0478n5365m097n154m9744J1426n5746n4794
5136A771402M598J9398m0698j0924k8896j5064L5475K164k0340j25544L5242j8201
5124A608612M2105L3280p6432m72p0772J9580J8392m419q4372K6055j3994L2722
5112A530285k9361l4468K6094p6678M9680L5701L493O912m0062m8220L6594K5020
5100A484990l752m6655J8044M928m2836L4762n411K9136j5881K6750k8278r7510
5088A358287O8539N717J5740N194N310k1607Q394n5505N6651j0664M7511n3379
5076A430188l0762p551k4274L0508J913r980N5237o256l0390j3521N707l319j8822
5063A378678k6656l5156L6836n705o215l0585J3081k47p639l2389L3884k72O5595
$$ y = [2248109, 2170145, 2123686, 2043260, 2055354, 1984876, 1929511, 1925414, 1920260, 1870516, 1881942, 1826196, 1771402, 1776000, 1795398, 1754700, 1743776, 1714880, 1699816, 1735291, 1737455, 1717115, 1591571, 1626813, 1608612, 1650717, 1683997, 1607565, 1607093, 1536321, 1555901, 1574293, 1569874, 1485502, 1511557, 1497563, 1530285, 1500924, 1466456, 1492550, 1415872, 1465552, 1501253, 1504746, 1511658, 1471596, 1423376, 1459970, 1484990, 1481238, 1434583, 1452627, 1457555, 1414719, 1449481, 1444070, 1473206, 1457325, 1484075, 1455797, 1358287, 1426826, 1432543, 1448283, 1453477, 1458787, 1437180, 1445574, 1390069, 1446720, 1436056, 1483567, 1430188, 1399426, 1391875, 1367601, 1398109, 1400022, 1390042, 1445279, 1439023, 1408633, 1395112, 1400819, 1397500, 1378678, 1352022, 1316866, 1353702, 1347997, 1341782, 1311197, 1324278, 1324031, 1316392, 1284003, 1317887, 1317615, 1383210]
5050A383210l1553m5957M8642o094l603k5134J9060q902J5138n173j9396K6756
5038A346994J1214K0882o8667P760l761R6090m8664l5845k205m472l3066L6853
5026A323113k2094N816k1694j390n2977K1798J6261p857J2435Q100q307j7234
5014A255970N0118k4468N8971m0756j0239L5840m192K1785l9318K3230M796O355
5002A338092p975M8643J3755o644J3283o2367L2503K1493N116k4411o752M4695
4990A409431J211m080n0615J3199K0404k8741J522m7258O3786j6535m745n3713
4978A303866N0105o3459J4770L1391R764m7276n1083L4794l8433J5032J031J7915
4966A278417k1243Q131O696J9225n5536l5269J8073N8733K5602l851l5575L0460
$$ y = [1383210, 1351657, 1305700, 1354342, 1348248, 1344645, 1319511, 1338571, 1329669, 1344807, 1339634, 1320238, 1346994, 1358208, 1379090, 1310423, 1318183, 1314422, 1410512, 1361848, 1326003, 1323798, 1319326, 1286260, 1323113, 1301019, 1306835, 1285141, 1283751, 1230774, 1252572, 1268833, 1260976, 1273411, 1281511, 1273204, 1255970, 1306088, 1281620, 1340591, 1299835, 1289596, 1325436, 1321244, 1343029, 1303711, 1326941, 1331737, 1338092, 1330117, 1378760, 1392515, 1385871, 1399154, 1336787, 1369290, 1390783, 1395899, 1371488, 1364736, 1409431, 1410642, 1406562, 1355947, 1369146, 1389550, 1360809, 1362331, 1315073, 1378859, 1362324, 1357579, 1303866, 1353971, 1290512, 1305282, 1336673, 1346437, 1299161, 1248078, 1282872, 1244439, 1259471, 1260502, 1278417, 1257174, 1265305, 1272001, 1291226, 1235690, 1200421, 1218494, 1277227, 1302829, 1298978, 1263403, 1293863]
4954A293863j4644q123n570R045m3282M7385J994j7512l7498J3182l5220L3748
4942A237368N2967K1814K1982o8162j3351K0885j5237l7957j990M523N2215k7890
4930A247167Q482L4962N956K6430k9672K4281k2412J4150j0966Q40K0658J6986
4918A336862L6531n9905J4867j0330J4073p4751l6620O0192K7810K7001l2774
4907A302956L9523j2931L4656j3928J2363K2479n354l6770m4675M5503l2730L7060
4895A348152k2421j6557q800N8610k7194J0755K9776N989j4381N2788p0554J7137
4883A363300m5670j3941k1959l2782L1000J0846n974N955L8108k4924j3419L3969
4871A324509k3511j3920L5703K1814j5702k0630L6075l3008p939P59K5073J6841
$$ y = [1293863, 1279219, 1271096, 1265526, 1274571, 1231289, 1278674, 1280668, 1263156, 1225658, 1238840, 1203620, 1237368, 1290335, 1312149, 1334131, 1265969, 1252618, 1273503, 1258266, 1220309, 1218319, 1222842, 1275057, 1247167, 1255649, 1290611, 1296567, 1322997, 1293325, 1317606, 1295194, 1309344, 1298378, 1299218, 1319876, 1336862, 1373393, 1313488, 1328355, 1318025, 1332098, 1257347, 1220727, 1280919, 1308729, 1335730, 1302956, 1342479, 1329548, 1364204, 1350276, 1362639, 1385118, 1379764, 1342994, 1298319, 1343822, 1311092, 1348152, 1325731, 1309174, 1300374, 1358984, 1331790, 1342545, 1372321, 1378310, 1363929, 1416717, 1346163, 1363300, 1317630, 1303689, 1281730, 1248948, 1279948, 1290794, 1284820, 1290775, 1328883, 1303959, 1290540, 1324509, 1300998, 1287078, 1322781, 1344595, 1328893, 1308263, 1344338, 1311330, 1303391, 1304150, 1329223, 1346064]
4859A346064M0153J3868k2096J8402p96P9834r2405L0344k9425O6085q37L3227
4847A482418m6735r109J6061k0953L8225k2163L5590k0288M7659K5709j0470J3095
4835A529039j5986o892J1633j7124N2168J8535l0985K1487J0178l0188n724P0116
4823A606257n81k6839K7195n9032L4894K9401j6466L1405K9067j0263p3134O2219
4811A634123m2910L0137m943J2601M3801m1238L0165J5448M683K421J1666L8779
4799A734733K3446r883K0003O7832K961p6685N232M4918N2638M9269K3564r398
4787A928630K6071J6900J9738j5522P0464L3178O1175L389P7796m9449N5362P059
4775B234791P4197j5302M2069n808O3571n7723N2865K3473R7087M6787L7097K0604
$$ y = [1346064, 1386217, 1400085, 1377989, 1396391, 1395595, 1475429, 1383024, 1413368, 1383943, 1450028, 1449191, 1482418, 1435683, 1426574, 1442635, 1421682, 1459907, 1437744, 1473334, 1453046, 1500705, 1526414, 1515944, 1529039, 1513053, 1506161, 1517794, 1500670, 1552838, 1571373, 1540388, 1561875, 1572053, 1541865, 1536141, 1606257, 1605676, 1578837, 1606032, 1547000, 1581894, 1611295, 1594829, 1626234, 1655301, 1645038, 1571904, 1634123, 1591213, 1621350, 1616407, 1629008, 1672809, 1631571, 1661736, 1677184, 1681867, 1684288, 1695954, 1734733, 1758179, 1748296, 1768299, 1836131, 1839092, 1762407, 1767639, 1812557, 1865195, 1914464, 1938028, 1928630, 1954701, 1971601, 1991339, 1975817, 2046281, 2079459, 2140634, 2144023, 2221819, 2172370, 2227732, 2234791, 2308988, 2293686, 2335755, 2329947, 2393518, 2335795, 2388660, 2412133, 2509220, 2556007, 2593104, 2613708]
4763B613708J12107M6550R2422J43796J12990J31853J96110K59517K65333M37451
4753D411837N20926O38988M26488J71759k33368m78384n22435m47217l30852j83148
4743C974594j35488j5505p0180m1297k3710j4351Q7362J5806J13583l459M4760
4732C932115P6619J53620Q6377Q8034J02704o560J78153N7721J62149P1824J47715
4721E050471J6820N2557N4450Q3988O4556J7260k5723L3049O0458Q042P6606Q4231
4709E576765J32940P4073J50635J23952K48992J71360J83364J61823K43460J56049
4699G223413J69260K31395K07555K13605J19974J73237J46699K41542K39290L57312
4689I323282M49638M03880J89364r388j68360m54830n35649n65435m02920k03162
$$ y = [2613708, 2725815, 2772365, 2864787, 3008583, 3121573, 3253426, 3449536, 3709053, 3974386, 4411837, 4932763, 5571751, 5998239, 6169998, 5936630, 5458246, 4935811, 4488594, 4157742, 3974594, 3839106, 3823601, 3753421, 3712124, 3688414, 3674063, 3761425, 3777231, 3890814, 3887355, 3932115, 4008734, 4162354, 4248731, 4336765, 4439469, 4432909, 4611062, 4668783, 4830932, 4902756, 5050471, 5067291, 5119848, 5174298, 5258286, 5322842, 5340102, 5314379, 5347428, 5407886, 5415928, 5492534, 5576765, 5709705, 5783778, 5934413, 6058365, 6307357, 6478717, 6662081, 6823904, 7067364, 7223413, 7392673, 7624068, 7831623, 8045228, 8165202, 8338439, 8485138, 8726680, 8965970, 9323282, 9772920, 10176800, 10366164, 10356776, 10188416, 9733586, 9197937, 8632502, 8229582, 8026420]
4679H026420k36525j30594m1750J817m6189L4411J445J02814N9225P2489J67733
4668H011296J08213J47301J02391J27394P9053R5908N0721J08664J16221N7010
4658I004172J49556J28458J61566J24183J20856Q0793J53873J56312J08484O0997
4648A0249250Q8030P4262Q2253l6360p963k2652m4862N0168J04595P2382L3871
4637A0642974R8443J34631J33360K15851K04029L23734L29155M50149K94758M10563
4627A3237647L98253L93764M82205L77290L82440K27533K73675R1264K9339l7599
4617A5855811j83766j68873k47700k73071m06447l42970m44851l84180m35576
4608A2968377l56996l72841l18799k32792j96404j16989j13617o6992N8969L8389
$$ y = [8026420, 7789895, 7659301, 7617551, 7619368, 7573179, 7607590, 7609035, 7711849, 7771074, 7843563, 8011296, 8119509, 8266810, 8369201, 8496595, 8575648, 8671556, 8722277, 8830941, 8947162, 9004172, 9153728, 9282186, 9443752, 9567935, 9688791, 9769584, 9923457, 10079769, 10188253, 10249250, 10337280, 10411542, 10493795, 10457435, 10449472, 10426820, 10381958, 10432126, 10536721, 10609103, 10642974, 10741417, 10876048, 11009408, 11225259, 11429288, 11753022, 12082177, 12532326, 12827084, 13237647, 13635900, 14029664, 14511869, 14889159, 15271599, 15499132, 15772807, 15864071, 15893410, 15855811, 15672045, 15503172, 15255472, 14982401, 14575954, 14232984, 13788133, 13403953, 12968377, 12611381, 12238540, 11919741, 11686949, 11490545, 11373556, 11259939, 11192947, 11251916, 11290305]
4598A1290305J00694M9541J20152J39747J81085M2298Q5446Q2334N1584L8173
4588A2181359o500p3346j31968j55028k31894j87947j88226j10137k18931m6180
4578A0831202k07196j7191n3637r349p399M7500N6435N4761J88010J33968J97891
4567A1214995J34824K09521K39462J95836J63576J52379K12974J44293J34539
4558A2802399R8668J38871O9396J88718J09034L31006J92886K96720K94258L88204
4548A4910160L16253M69998M09461M71143M55159M14632M47377L18803K90528
4539A8503514K06098J87609L6323m093j17371j09082j99799k11888j20685j34506
4529A8036120p8564q5496k1484j08862K7254r9982j00107o0395q9699k5163N4143
$$ y = [11290305, 11390999, 11440540, 11560692, 11700439, 11881524, 11923822, 12009268, 12091602, 12143186, 12181359, 12174859, 12101513, 11969545, 11814517, 11582623, 11394676, 11206450, 11096313, 10877382, 10831202, 10624006, 10606815, 10553178, 10543829, 10536430, 10583930, 10640365, 10695126, 10883136, 11017104, 11214995, 11349819, 11559340, 11798802, 11994638, 12158214, 12310593, 12523567, 12667860, 12802399, 12901067, 13039938, 13109334, 13298052, 13407086, 13738092, 13930978, 14227698, 14521956, 14910160, 15226413, 15696411, 16105872, 16577015, 17032174, 17446806, 17894183, 18212986, 18503514, 18709612, 18897221, 18933544, 18929451, 18812080, 18702998, 18503199, 18291311, 18170626, 18036120, 17957556, 17872060, 17850576, 17741714, 17768968, 17668986, 17568879, 17508484, 17418785, 17393622, 17447765]
4518A7447765O9008P2710N8836Q5446J04294L5867j9737o6296j40609q7209j42461
4507A7417614k37410l13463k82319k50881k98946k29414k53004k62267j24798
4498A5165112o1504N5584O2348J23004K46471L10829L68319M39572N17232N12438
4488A7739405N70033N71798O05660M68389M19858L96241K96398K25141J67780
4479B1460703K03306J68532K13854K26902K78751L40986L42616L58674L83271
4470B3977595L66646L13824L71898L01899K91494L55312L46167L97843L19239
4461B7041917J57097l8872j86277l79853m34235l79322m37283k83364k21529j27693
4451B4710586j11286J7246M8324J79342K24139L27904L55930N85991N96112P95675
$$ y = [17447765, 17516773, 17589483, 17648319, 17733765, 17838059, 17873926, 17854189, 17787893, 17647284, 17560075, 17417614, 17180204, 16866741, 16584422, 16333541, 16034595, 15805181, 15552177, 15289910, 15165112, 15103608, 15159192, 15221540, 15344544, 15591015, 15901844, 16270163, 16709735, 17226967, 17739405, 18309438, 18881236, 19486896, 19955285, 20375143, 20771384, 21067782, 21292923, 21460703, 21664009, 21832541, 22046395, 22273297, 22552048, 22893034, 23235650, 23594324, 23977595, 24344241, 24658065, 25029963, 25331862, 25623356, 25978668, 26324835, 26722678, 27041917, 27199014, 27160142, 26973865, 26594012, 26159777, 25780455, 25343172, 25059808, 24838279, 24710586, 24599300, 24616546, 24664870, 24844212, 25068351, 25396255, 25752185, 26338176, 26934288, 27729963]
4441B7729963Q74115J150280J322014J387924J496969J477651J485332J318706
4433C8242954R99565O01674L28248J11161q5519j30028k95380k42054l57651k12929
4423C8960041k91589k85843l83996m32169n86882o55833p81084p96862q19606
4414C3926177o87048n40874l43277j80844O0633J56408K65358L57800L80300L68454
4404C3763087M22895M26816K97668K26945O1940j67058l86627o25303p68939r01772
4394C2349652q89187r23114q15374o84350n84052m72750l45449k29166j61651
4385B7244559q9070N6412J33688K98435K63059L16713M44582M74859M07081L83433
4375B9933751M05868M06212L26356J72858K01328P0972L4509r1779j92521l34936
$$ y = [27729963, 28604078, 29754358, 31076372, 32464296, 33961265, 35438916, 36924248, 38242954, 39242519, 39844193, 40172441, 40283602, 40198083, 40068055, 39772675, 39530621, 39172970, 38960041, 38668452, 38382609, 37998613, 37566444, 36979562, 36323729, 35542645, 34745783, 33926177, 33239129, 32698255, 32354978, 32174134, 32234767, 32391175, 32656533, 33014333, 33394633, 33763087, 34185982, 34612798, 34910466, 35137411, 35199351, 35032293, 34645666, 34020363, 33251424, 32349652, 31460465, 30537351, 29721977, 29037627, 28453575, 27980825, 27635376, 27406210, 27244559, 27155489, 27211901, 27345589, 27644024, 27907083, 28223796, 28668378, 29143237, 29550318, 29933751, 30339619, 30745831, 31072187, 31245045, 31446373, 31517345, 31551854, 31460075, 31267554, 30932618]
4365C0932618m42937n60252o99875q03152p82354p18863o13456n51069l68429
4356B5392231j79958k1052R5188K81614M13262N64250O82562P51788P92806R92471
4346B9765162R70637J081232J103972J116452R80553P55170L3604p62778j595901
4337C3448103j875643j905664j772924j555405j303226j217999r46532q44685
4329B2026025p00784n60182l62632k80936l5526n7385J86080J71134K81339K62157
4319B0929290L24879K08603R8941j26882j75357l85512n94887p11963q35022p39024
4309A7993066q13668o51937o99255m96025m62931m18471l04556l26362j88320
4300A3631541j41498n7944j7997O0724N0112J66739J19318J97233J71611P5747
$$ y = [30932618, 30489681, 29929429, 29229554, 28426402, 27644048, 26925185, 26311729, 25760660, 25392231, 25212273, 25191221, 25286409, 25568023, 25981285, 26545535, 27228097, 27979885, 28772691, 29765162, 30735799, 31817031, 32921003, 34037455, 35018008, 35773178, 35806782, 35044004, 33448103, 31572460, 29666796, 27893872, 26338467, 25035241, 23817242, 22870710, 22026025, 21325241, 20765059, 20402427, 20121491, 20085965, 20028580, 20214660, 20385794, 20667133, 20929290, 21254169, 21462772, 21561713, 21434831, 21259474, 20873962, 20279075, 19567112, 18732090, 17993066, 17179398, 16527461, 15828206, 15332181, 14869250, 14450779, 14146223, 13819861, 13631541, 13490043, 13432099, 13414102, 13474826, 13524938, 13691677, 13810995, 14008228, 14179839, 14255586]
4290A4255586O2126p6194j20049j80490k38533l35472l25568k98804k84506k97101
4280A2160995k08388j98551j08695p2063j7037J5136J0506J00181P0552M7604
4270A1800240L8989J91795K16689J22476J03866J94362J24610J28714R4220J00151
4260A3116112J09552J21999J86235K19585J60421K15021K63011K84999L06513
4251A4983448L20919K67365K97997L28252L91531M39770L76796M59859M47487
4242A8313424N51999M67036N24839N77205O70091O54385P07472Q36470P70386
4233B4073307Q69918J001844J142164J159279J311803J491062J700148J900849
4225C4650374K102506K437699K917273L517776L757220M405310M988957N834198
$$ y = [14255586, 14317712, 14241518, 14121469, 13940979, 13702446, 13366974, 13041406, 12742602, 12458096, 12160995, 11952607, 11754056, 11645361, 11573298, 11556261, 11571397, 11581903, 11682084, 11752636, 11800240, 11839229, 12031024, 12247713, 12370189, 12474055, 12668417, 12793027, 12921741, 13015961, 13116112, 13225664, 13347663, 13533898, 13753483, 13913904, 14128925, 14391936, 14676935, 14983448, 15304367, 15571732, 15869729, 16197981, 16589512, 17029282, 17406078, 17865937, 18313424, 18865423, 19332459, 19857298, 20434503, 21104594, 21758979, 22466451, 23302921, 24073307, 24943225, 25945069, 27087233, 28246512, 29558315, 31049377, 32749525, 34650374, 36752880, 39190579, 42107852, 45625628, 49382848, 53788158, 58777115, 64611313]
4217F4611313O806076Q055715R201785J0228153J0475135R607523O673511K044335
4209A27703546l447065p906006j0583643j1133154j0482318r261999q001667p044295
4201E9843399n939164n049917m324527l742868l241470k789385k532247k191346
4193C0032475k062294j738639j606760j238770j134646r71446j013937q77322
4185A9388661q60370p47987p02929n99585o28198n81397n37622m03884m41182
4176A3885507l59299l66599l28302l28679k42034k53658k22512j67480j00210
4167A1516734r8091q5128j64604j43812k53320j56871j94913j37941j61621r2256
4157A0028177j34295k9358m2848K3040o3743M1148j637l8029q3292p0079K5859
$$ y = [64611313, 71417389, 79473104, 88674889, 98903042, 109378177, 118985700, 125659211, 127703546, 124256481, 116350475, 105766832, 94633678, 84151360, 74889361, 66887694, 59843399, 53904235, 48854318, 44529791, 40786923, 37545453, 34756068, 32223821, 30032475, 27970181, 26231542, 24624782, 23386012, 22251366, 21279920, 20265983, 19388661, 18528291, 17780304, 17077375, 16477790, 15849592, 15268195, 14730573, 14326689, 13885507, 13526208, 13159609, 12831307, 12502628, 12260594, 12006936, 11784424, 11616944, 11516734, 11418643, 11333515, 11168911, 11025099, 10771779, 10614908, 10419995, 10282054, 10120433, 10028177, 9893882, 9864524, 9821676, 9844716, 9780973, 9822121, 9820484, 9782455, 9699163, 9629084, 9654943]
4146I654943O6218M1618M28J19812K00793K48622K15141K27709J43557O1307N5048
4135A1035196k1625l8882p7117o732j1441K6721n350j25104k3762m2217M2333
4124A0752020j1652M6708Q4232L8841P9463R7475J83077K34156K42687K56442
4114A2003449K76096L80448K70595M11823K14212M56426K07121L38538K45343
4105A4804051K56358J71681K28052J96694L14541K52422L58242M50051O65599
4096A7697691P59716R05265P43414J024822P47423R67373O17881N33685M64940
4087B4462210P78317P23416J067912Q98204J238123J125667J307013P94044O24533
4078C3019439K86463R36922R15156J605639J499056J876585J442408J815903J412008
$$ y = [9654943, 9721161, 9762779, 9763207, 9883019, 10083812, 10332434, 10547575, 10775284, 10918841, 10980148, 11035196, 11013571, 10974689, 10897572, 10890840, 10879399, 10906120, 10900770, 10775666, 10751904, 10709687, 10752020, 10740368, 10787076, 10871308, 10910149, 10989612, 11087087, 11270164, 11504320, 11747007, 12003449, 12279545, 12659993, 12930588, 13342411, 13556623, 14013049, 14220170, 14558708, 14804051, 15060409, 15232090, 15460142, 15656836, 15971377, 16223799, 16582041, 17032092, 17697691, 18457407, 19362672, 20106086, 21130908, 21878331, 22845704, 23463585, 23997270, 24462210, 25240527, 25963943, 27031855, 27930059, 29168182, 30293849, 31600862, 32394906, 33019439, 33305902, 34242824, 35157980, 36763619, 38262675, 40139260, 41581668, 43397571, 44809579]
4069D4809579J885580J821164K738958K788286M081116M658194O165767N829958
4061G4778602O568188O508464Q421242R891010J4507072J9580698K8889171L8058315
4053B07202762N3019574P1447521R6822217N4531255l9476282q2841588r1378224
4046B69327235o1136781m0005914k7593270k0611332j5982582j4130815j1309647
4039G8556894r267649o659282n162393m061846m318521m012962l826352l105283
4031C8142606k731899k238913k036756j611466j276136q80670r32575r07839j012199
4022B4514153j128763j199042j072329p93844o55425m60885o81307p09559p64176
4013A7048823n91042o39441n42797o13239m15500j95013N3549L3985N2042M764
$$ y = [44809579, 46695159, 48516323, 51255281, 54043567, 58124683, 62782877, 68948644, 74778602, 81346790, 87855254, 96276496, 106167506, 120674578, 140255276, 169144447, 207202762, 260222336, 331669857, 428492074, 483023329, 443547047, 360705459, 269327235, 208190454, 168184540, 140591270, 119979938, 103997356, 89866541, 78556894, 69289245, 62629963, 57467570, 53405724, 49087203, 45074241, 41247889, 38142606, 35410707, 33171794, 31135038, 29523572, 28247436, 27366766, 26434191, 25526352, 24514153, 23385390, 22186348, 21114019, 20320175, 19664750, 19203865, 18522558, 17812999, 17048823, 16457781, 15818340, 15275543, 14662304, 14246804, 14051791, 14105340, 14139325, 14191367, 14196131]
4003A4196131m6745k29657l07666m81584l93273l64985l24448l43102k30519k48362
3993A1225790r0891j92132J1768j24185J28697q7273P1056p101O488k00565n6879
3982A0684773q0720l1892r2832m3910j58011j7053q5795r7868j55047j9694j70248
3971I731703j44037q3007O7045O646M4320P5611P7451J6225Q6475R6823J60402
3960A0135657J13012J89128Q6455K62183Q5731K14323O3109K60926Q2990K06991
3950A1700505J08173K26629K07172L69316L03057M11442L74924M86475M42665
3941A4630358M59262M74946N29928M48921M88431N37097N28051O37173O75170
3932A9409337P16075Q98950Q51796R01335Q62296J019828R52292J119426J109448
$$ y = [14196131, 14149386, 13919729, 13612063, 13130479, 12737206, 12372221, 12047773, 11704671, 11474152, 11225790, 11134899, 10942767, 10954535, 10830350, 10959047, 10871774, 10942830, 10935729, 10942217, 10741652, 10684773, 10604053, 10572161, 10479329, 10435419, 10277408, 10260355, 10174560, 10076692, 9921645, 9901951, 9731703, 9587666, 9504659, 9571704, 9578350, 9622670, 9698281, 9775732, 9791957, 9878432, 9975255, 10135657, 10248669, 10437797, 10524252, 10786435, 10872166, 11086489, 11149598, 11410524, 11493514, 11700505, 11808678, 12035307, 12242479, 12611795, 12914852, 13326294, 13701218, 14187693, 14630358, 15089620, 15564566, 16094494, 16543415, 17031846, 17568943, 18096994, 18734167, 19409337, 20125412, 21024362, 21876158, 22777493, 23639789, 24659617, 25611909, 26731335, 27840783]
3923B7840783J146707J097112J215204J179157J206585J295729J364291J390689
3915C7736257J484132J351908J431557J376606J419218J326463J410227J234119
3907D8770487J053244J052314R22558R01548Q19170P92581P28771P05412N67184
3898E6313269N16424M43215L20110P4321N9864j44812l50138m37101n31368o95906
3888E5567878p24112p57471r02007q82004j041126j171045j136613j127280j208438
3879D6617782j329201j288765j363711j404398j590301j627698j633057j558377
3871C4822274j556649j541986j398450j407300j319222j327713j295633j292077
3863B3683244j233378j101571j109750r62377r93791r11840r18884q07470q36941
$$ y = [27840783, 28987490, 30084602, 31299806, 32478963, 33685548, 34981277, 36345568, 37736257, 39220389, 40572297, 42003854, 43380460, 44799678, 46126141, 47536368, 48770487, 49823731, 50876045, 51798603, 52700151, 53519321, 54311902, 55040673, 55746085, 56313269, 56829693, 57272908, 57593018, 57667339, 57727203, 57582391, 57232253, 56795152, 56263784, 55567878, 54843766, 54086295, 53184288, 52302284, 51261158, 50090113, 48953500, 47826220, 46617782, 45288581, 43999816, 42636105, 41231707, 39641406, 38013708, 36380651, 34822274, 33265625, 31723639, 30325189, 28917889, 27598667, 26270954, 24975321, 23683244, 22449866, 21348295, 20238545, 19276168, 18282377, 17370537, 16451653, 15644183, 14807242]
3854A4807242p03606p27375o23366n92716n49797o06832n34121m96633m28482
3845I544314l71817l73447l23623k46506l24737k15088k73698j43117k12970j38573
3835F920738j76513r9143j41208j57400k04993j15278j51485j72876k01635j53505
3825E346702j45511r3624j35936j45817j79164o4270j06716j30345j24261o3819
3815D157239o6539m8770j18486j4693j65320p120p1360m0758r2213m441p6993
3804C450546P255K1283k7625j7404n5672m9252o5285L3125o4790L2383j6046o8833
3792C179685n2204M068L596l2212j7757k2120K8508n5015K6763j9765m751o6742
3780B972054N7131P202j00129m3650O2987J4962j6866l2437r670K6961k9961L5514
$$ y = [14807242, 14103636, 13376261, 12752895, 12160179, 11610382, 11003550, 10469429, 9972796, 9544314, 9172497, 8799050, 8475427, 8228921, 7904184, 7689096, 7415398, 7272281, 7059311, 6920738, 6744225, 6645082, 6503874, 6346474, 6141481, 6026203, 5874718, 5701842, 5500207, 5346702, 5201191, 5107567, 4971631, 4825814, 4646650, 4582380, 4475664, 4345319, 4221058, 4157239, 4090700, 4041930, 3923444, 3908751, 3743431, 3736311, 3664951, 3624193, 3531980, 3527539, 3450546, 3457801, 3479084, 3451459, 3434055, 3378383, 3329131, 3263846, 3296971, 3232181, 3264564, 3248518, 3179685, 3127481, 3131549, 3135145, 3102933, 3085176, 3063056, 3091564, 3036549, 3063312, 3043547, 3038796, 2972054, 3029185, 3036387, 2936258, 2892608, 2955595, 2970557, 2953691, 2921254, 2911584, 2938545, 2908584, 2944098]
3768B944098P5792J58577J63965J89476J84338K37368K21512R7380m472n3246
3758D214788k01353k60548k90854j86047j76484j22404j29239o0629q2546K1179
3748B725863o5188k8257j38675l6891m2534L6597n174o5825J3834n9398N2519
3737B386871m0832R47j0290P6244l4018k8197P8603r655p81p1888Q3535O526L8803
3724B475868M343P0290m5764Q495n8358r711k814L8470J7133O2190l106o837M3927
3711B594126L6951n591J9876j342L6698m2103K1604k711Q8489k8856Q1535M2474
3699B841150j9579K2421M7341k2007K7666J3530J542K4078L8515m4224P0291K0465
3687C021189Q9788r175N9350J761O4588L1453Q639O6346j5350N3596N0969P5173
$$ y = [2944098, 3019890, 3178467, 3342432, 3531908, 3716246, 3953614, 4175126, 4272506, 4268034, 4214788, 4013435, 3752887, 3462033, 3275986, 3099502, 2977098, 2847859, 2787230, 2704684, 2725863, 2660675, 2632418, 2493743, 2456852, 2414318, 2450915, 2445741, 2379916, 2393750, 2334352, 2386871, 2346039, 2346986, 2336696, 2412940, 2378922, 2350725, 2429328, 2419673, 2418892, 2347004, 2430539, 2437065, 2475868, 2480211, 2550501, 2504737, 2513232, 2454874, 2445163, 2442349, 2480819, 2497952, 2560142, 2557036, 2550199, 2594126, 2631077, 2625486, 2645362, 2644020, 2680718, 2638615, 2660219, 2657508, 2745997, 2717141, 2798676, 2841150, 2821571, 2843992, 2891333, 2869326, 2896992, 2910522, 2912064, 2936142, 2974657, 2930433, 3000724, 3021189, 3110977, 3101802, 3161152, 3162913, 3227501, 3258954, 3267593, 3333939, 3318589, 3372185, 3423154, 3498327]
3675C498327M6976K6506R0417P9407P0461k488Q7678O0541N0170J04103L7278
3664D149376L0562O8601P5018O9996M4387J28904J33539R3432J47842R6280J14357
3653E152294J01711J45248J05570J49172O5545J35442J40157K03317J32764J38893
3643F470113J41657J12855J24487J69196J34237J71088J15174K25133J70158K23479
3633H057577J24145J69253K25301K56379J81449J55827K26662K54158K67402L02506
3623A0220659L19222L69289M05182M15615M32249M61916N48871N02514N87115
3614A4262632O76721O85962P05768O78760P04059O84603O91389N88244O56964
3605B0335102N78824O10812N25103N43507N43427N09046M65567M88902M53245
$$ y = [3498327, 3545303, 3571809, 3662226, 3741633, 3812094, 3809606, 3897284, 3957825, 4007995, 4112098, 4149376, 4179938, 4248539, 4323557, 4393553, 4437940, 4566844, 4700383, 4793815, 4941657, 5037937, 5152294, 5254005, 5399253, 5504823, 5653995, 5719540, 5854982, 5995139, 6198456, 6331220, 6470113, 6611770, 6724625, 6849112, 7018308, 7152545, 7323633, 7438807, 7663940, 7834098, 8057577, 8181722, 8350975, 8576276, 8832655, 9014104, 9169931, 9396593, 9650751, 9918153, 10220659, 10539881, 10909170, 11314352, 11729967, 12162216, 12624132, 13173003, 13675517, 14262632, 14939353, 15625315, 16331083, 17009843, 17713902, 18398505, 19089894, 19678138, 20335102, 20913926, 21524738, 22049841, 22593348, 23136775, 23645821, 24111388, 24600290, 25053535]
3596B5053535L73294K69158J81757J39243N7531m5089r8788p1132q8129j63137
3586B5608243j19464j64719j12211j01001j20274j13740n5084j39689J6665o7738
3576B4630988J6527M1725R2764K13378L02742L50644L52478N13673N98782O56590
3566B7770291Q18011Q71640J166083J144855J333396J451711J499166J666041
3558C7721194J688225J841398J782749J904864J863793J842522J786381J739675
3550E2170801J710068J569534J526525J403989J480740J321998J261484J026973
3542F3472112J026233Q09021O22270L75280R1827j82317m20066n62540p86274
3533F4445546q74310r10575q89758j055498j017819j077813r95361j061272r92743
$$ y = [25053535, 25426829, 25695987, 25877744, 26016987, 26074518, 26029429, 25930641, 25859509, 25771380, 25608243, 25488779, 25324060, 25211849, 25110848, 24990574, 24876834, 24821750, 24682061, 24698726, 24630988, 24647515, 24689240, 24782004, 24995382, 25298124, 25648768, 26001246, 26514919, 27113701, 27770291, 28588302, 29459942, 30626025, 31770880, 33104276, 34555987, 36055153, 37721194, 39409419, 41250817, 43033566, 44938430, 46802223, 48644745, 50431126, 52170801, 53880869, 55450403, 56976928, 58380917, 59861657, 61183655, 62445139, 63472112, 64498345, 65307366, 65929636, 66304916, 66396743, 66214426, 65794360, 65231820, 64445546, 63571236, 62660661, 61770903, 60715405, 59697586, 58619773, 57624412, 56563140, 55570397]
3524E5570397j088234r32534r02424q27296o31186n01159l15381k37633j1234
3515E0123316J46352L48894M23795O19953P15872P17205Q84275P94801Q78543
3506E5653006P73333Q77569Q64917Q35215P68891Q90678P67298Q00626O14904
3497F2846437N21458L60776K66143m8806l00506m87589o50882q33147j078485
3488F0595399j193641j473067j417920j553534j577331j535188j611285j574593
3480D8658840j657791j557935j593514j567844j752853j599452j638271j615407
3472C5675773j609111j494793j373087j191585j032997r59432q04530o87399n63656
3463B5959183m22229k87186j45630m4640J8893J43441J93989K21394K18648K86063
$$ y = [55570397, 54482163, 53549629, 52647205, 51819909, 51188723, 50687564, 50372183, 50134550, 50123316, 50269668, 50618562, 51042357, 51662310, 52378182, 53095387, 53979662, 54774463, 55653006, 56426339, 57303908, 58168825, 59004040, 59772931, 60663609, 61430907, 62231533, 62846437, 63367895, 63728671, 63994814, 63946008, 63645502, 63157913, 62507031, 61673884, 60595399, 59401758, 57928691, 56510771, 54957237, 53379906, 51844718, 50233433, 48658840, 47001049, 45443114, 43849600, 42281756, 40528903, 38929451, 37291180, 35675773, 34066662, 32571869, 31198782, 30007197, 28974200, 28014768, 27210238, 26522839, 25959183, 25536954, 25249768, 25104138, 25059498, 25078391, 25221832, 25415821, 25637215, 25855863, 26141926]
3453B6141926K68493K33314K55775K20074K53360J69473K64844L22137L17254
3444B8446650L06308K51534K90214J50643J78344J18113l6143j00433j38913j65443
3434B9300874k70271k93094l34217k61418k84869l15673k52329l14954k10900
3425B6763149k51412k20777k65058l40912k80364l72161k77048l59471k69291
3416B4126655k42081k23359k03435j21505j3004n7870M526J0541J28447J15896
3406B3524811J66755K15469K12065K54637K83979L37873L46849L34763M21364
3397B6098565M55157M83970M93428N68716O35697P02580O90427Q54002R08159
3388C1890701J013741J085988J161090J226928J433990J541981J817491J883377
$$ y = [26141926, 26410419, 26643733, 26899508, 27119582, 27372942, 27542415, 27807259, 28129396, 28446650, 28752958, 29004492, 29294706, 29445349, 29623693, 29741806, 29705663, 29605230, 29466317, 29300874, 29030603, 28737509, 28403292, 28141874, 27857005, 27541332, 27289003, 26974049, 26763149, 26511737, 26290960, 26025902, 25684990, 25404626, 25032465, 24755417, 24395946, 24126655, 23884574, 23661215, 23457780, 23336275, 23323271, 23265401, 23269927, 23280468, 23408915, 23524811, 23691566, 23907035, 24119100, 24373737, 24657716, 24995589, 25342438, 25677201, 26098565, 26553722, 27037692, 27531120, 28099836, 28735533, 29438113, 30128540, 30982542, 31890701, 32904442, 33990430, 35151520, 36378448, 37812438, 39354419, 41171910, 43055287]
3380D3055287K212369K349236K708925K950859L276020L616651L955159M435889
3372F8560395M838427N329079N763479O091337O323922O519071O513719O142908
3364A16082337N830367N149845M417896L565350K736529J887880J208471N78378
3356A41457053Q4766l08612o09716q76727j286048j732906k306053k862591l613293
3347A27945873m314809n030965n641748o128370o479313o560918o586846o392862
3339H0810042o110539n685086n354821m873395m446367l998717l663190l289064
3331D3388863k883757k653952k326115k163934j880642j779863j464853j453753
3323B6781994j216353j117105r62476q72946p83716p16137o32178n71648n10797
$$ y = [43055287, 45267656, 47616892, 50325817, 53276676, 56552696, 60169347, 64124506, 68560395, 73398822, 78727901, 84491380, 90582717, 96906639, 103425710, 109939429, 116082337, 121912704, 127062549, 131480445, 135045795, 137782324, 139670204, 140878675, 141457053, 141541819, 141233207, 140623491, 139746764, 138460716, 136727810, 134421757, 131559166, 127945873, 123631064, 118600099, 112958351, 106829981, 100350668, 93789750, 87202904, 80810042, 74699503, 69014417, 63659596, 58786201, 54339834, 50341117, 46677927, 43388863, 40505106, 37851154, 35525039, 33361105, 31480463, 29700600, 28235747, 26781994, 25565641, 24448536, 23486060, 22613114, 21829398, 21113261, 20481083, 19909435, 19398638]
3314A9398638n22429m83229l69931m02790l91379l43897k84154l39807l24420
3305A5936602k73400k83929k58332k72136k53632k84912k92703k15558k52262
3296A3549738k94717l01290k08432k90508k09297k71503k49253k41734k70137
3287A1212867k59321k94771k84210k63436l62619k93800k92090k64470k09152
3278H688998k61496j96854k54573j92477j84897k01474j33934j41394j66772j30077
3268F825050j38458j56082j06814j63017n0614q1484l3269l5314q0120m4208p4178
3257E861492q0713j6277l1673m9477j3052R301n0929M775l7786o2958L1607n2388
3245E511922k0036r076M4234m1136O0135k5226R2737L9079J10154P3368J24377
$$ y = [19398638, 18876209, 18392980, 18023049, 17620259, 17228880, 16884983, 16600829, 16261022, 15936602, 15663202, 15379273, 15120941, 14848805, 14595173, 14310261, 14017558, 13802000, 13549738, 13255021, 12953731, 12745299, 12454791, 12245494, 11973991, 11724738, 11483004, 11212867, 10953546, 10658775, 10374565, 10111129, 9748510, 9454710, 9162620, 8898150, 8688998, 8427502, 8230648, 7976075, 7783598, 7598701, 7397227, 7263293, 7121899, 6955127, 6825050, 6686592, 6530510, 6423696, 6260679, 6210065, 6128581, 6095312, 6059998, 5979878, 5935670, 5861492, 5780779, 5764502, 5732829, 5683352, 5670300, 5679601, 5628672, 5633447, 5595661, 5532703, 5564310, 5511922, 5491886, 5482810, 5527044, 5485908, 5546043, 5520817, 5613554, 5652633, 5762787, 5836155, 5960532]
3234E960532R3750J05520J44812J55125J34289K06972J32321K15779Q4384L6799
3224G270283j0716m3465m9410j43559k01607j02951o5726r4945k66661l67225
3214E924018m50088m55643l42372j89415k41580j78273j62645j38196j30428p0566
3204C564812p2829m773j9986J1532q73l8270j54030j21719r0423j55150n0595
3193B867696j09612o6862j26784j3595j2400k9118n9561l8054j20475J0022J9439
3182B320696M8945p1408j8712l4126m2920n66k9293K5509j9108J09173K4559J10437
3170B423186O7012J95983J04165q001j01585k53770j62139j24823o9912j73926
3160A896190q212n8118k2728k4598j0748l9938K934m7850O020M628p4355l6006
$$ y = [5960532, 6054282, 6159802, 6304614, 6459739, 6594028, 6801000, 6933321, 7149100, 7233484, 7270283, 7259567, 7216102, 7166692, 7023133, 6821526, 6718575, 6652849, 6557904, 6291243, 5924018, 5473930, 5018287, 4675915, 4486500, 4244920, 4066647, 3904002, 3765806, 3635378, 3564812, 3491983, 3487210, 3467224, 3478756, 3477883, 3439613, 3285583, 3163864, 3073441, 2918291, 2867696, 2758084, 2691222, 2564438, 2550843, 2538443, 2509325, 2449764, 2411710, 2291235, 2301257, 2320696, 2369641, 2298233, 2279521, 2245395, 2202475, 2201909, 2172616, 2198125, 2179017, 2288190, 2312749, 2423186, 2490198, 2686181, 2790346, 2782345, 2680760, 2426990, 2264851, 2140028, 2070116, 1896190, 1887978, 1829860, 1807132, 1782534, 1771786, 1731848, 1734782, 1686932, 1692952, 1697580, 1623225, 1587219]
3148A587219j9920M4911l4830j3368l7123J331K6114N5031O8828K7607N5211j049
3136A759962P6757k7009p0626j00578n4282p8193k3504n3582j7354o686q2379
3125A322526l9350r455o5165P9240j08091k070p1114P1500j4305j8911o6027r979
3113A068799K1031k0246M2972K5892o081M972m5021J8505l3226L8428j2133m480
3101A099412o424L6528J9756k3815j6401n5324L0592R833M0522j7992n2276J8820
3089A083231j2182O0563m231M5081L8242j6871j0313K1093M3356l6609L4777L4565
3077A280702r747J9361K0157j8048O1162j462L1999r641J2656k0252l0383k6047
3065A310457m2211l7575M7695l9286p641j866o2692j7056K8878l6719j5211r323
$$ y = [1587219, 1567299, 1612210, 1577380, 1564012, 1526889, 1528220, 1554334, 1609365, 1678193, 1705800, 1761011, 1759962, 1836719, 1809710, 1739084, 1638506, 1584224, 1506031, 1482527, 1428945, 1411591, 1404905, 1322526, 1283176, 1273721, 1208556, 1287796, 1179705, 1177635, 1106521, 1178021, 1163716, 1144805, 1078778, 1068799, 1089830, 1069584, 1112556, 1138448, 1132367, 1137339, 1092318, 1110823, 1077597, 1116025, 1103892, 1099412, 1092988, 1129516, 1149272, 1125457, 1109056, 1053732, 1084324, 1094157, 1134679, 1116687, 1064411, 1083231, 1071049, 1131612, 1127381, 1172462, 1210704, 1193833, 1183520, 1204613, 1247969, 1211360, 1246137, 1280702, 1270955, 1290316, 1310473, 1292425, 1353587, 1352125, 1384124, 1374483, 1387139, 1366887, 1336504, 1310457, 1268246, 1230671, 1278366, 1239080, 1231439, 1229573, 1166881, 1149825, 1178703, 1141984, 1126773, 1117450]
3053A117450m1616m1236j1998o5924J3293j01533J8243l0379l7671k4k3255m9487
3041G45863J3015j845l9982m5379l8110K798J804M416j1753k753K6846q652n294
3028F40974j414J2482n4008M9418l9511K2626k2562L3959p6271M2123P892j8147
3016E97561m577K722K1501l2956m1844L2910P636k5917m0200K2475O230J904J0687
3003E58132l2497L0807k3473O9148o277l1827j4553n7080L0588l4862p472M812
2991D85446m3069j4747J6615K2839J4119o0947l677K5305Q347j2900K8466l6255
2979D29542N852m9165J9975K6235J7727K7854N520l2555j5304L093j3663k5766
2967C99345q899q17M2090l3115K2415j2737p7685N0006r616J01892j11936O6807
$$ y = [1117450, 1075834, 1034598, 1022600, 956676, 969969, 868436, 886679, 856300, 818629, 818605, 795350, 745863, 758878, 757033, 717051, 671672, 633562, 636360, 638164, 642580, 630827, 628074, 654920, 646268, 640974, 639560, 652042, 598034, 647452, 607941, 630567, 608005, 641964, 565693, 607816, 615708, 597561, 592984, 595706, 617207, 584251, 542407, 575317, 582953, 557036, 516836, 539311, 545541, 547445, 558132, 525635, 556442, 532969, 602117, 595840, 564013, 549460, 492380, 522968, 488106, 480634, 485446, 442377, 427630, 444245, 467084, 481203, 420256, 416579, 441884, 450231, 437331, 465797, 429542, 435394, 386229, 406204, 432439, 450166, 478020, 483540, 450985, 435681, 438774, 425111, 399345, 390446, 389629, 431719, 398604, 421019, 408282, 330597, 380603, 370987, 472879, 360943, 427750]
2955D27750k7890o450k625m4251J9711j1822K4619k6168L2777k4417K4429J2332
2943C97995m380j8383n6885P2339m3614L2859o1057N4134l5351M0541j214L3456
2931D10440k9281m5345O4837n1080L1865K6772p116k45K1590K6094J4442M8255
2919E11228K185J4619k0972J5397j5185M3815Q428J0721k3515k0638j4120K9377
2907E41340j0034M4772j03581J183n1722J5365L4344Q0867n0771o984Q82j0491
2895D85170m5199N0837Q8155j3226L6016J0805P506J1270M5524m8149l230j9927
2883F05552J0139j12102n329k3265j1823Q08l8043k3934J6914R953l1244M6567
2871D44193k7938L880j3629M479l5126J8886l9610N1248N4390o4148J2028K1982
$$ y = [427750, 399860, 393410, 390785, 346534, 366245, 354423, 379042, 352874, 385651, 361234, 385663, 397995, 393615, 375232, 318347, 390686, 347072, 379931, 318874, 373008, 337657, 378198, 376984, 410440, 381159, 335814, 400651, 349571, 381436, 408208, 401092, 400847, 422437, 448531, 462973, 511228, 513413, 528032, 507060, 522457, 507272, 551087, 559515, 570236, 546721, 526083, 511963, 541340, 531306, 576078, 472497, 473680, 421958, 437323, 471667, 552534, 501763, 494779, 495661, 485170, 439971, 490808, 578963, 565737, 601753, 612558, 620064, 631334, 676858, 628709, 625479, 605552, 615691, 503589, 498260, 474995, 463172, 463980, 425937, 402003, 418917, 428870, 397626, 444193, 416255, 420135, 406506, 410985, 375859, 394745, 355135, 406383, 460773, 396625, 408653, 430635]
2859D30635N4891k5195N4241p1040J1673q3917K5707P22J3962m7145m069m0156
2847C20309K4959J5984r5419M5361n5844L8004k3404J3723O6285j3073p6879K4014
2835B84020O5964l2586l9762J462R108k5315L9009l9474n1066L3029m6977M2476
2823B39888q626Q536j0082j3370P566K6564J2088m4684K2743o4136M1896k1612
2811A96771L8152k2406K0161k7086L0036n3010P5336j1168m2103k3357L3438J9593
2799B34357k5569J449Q573n8204j1795k6468P5115n4057M6204L885j4183N4210
2787B33517J7024L2691n0022n9766l8069J4042l3149K9025j4354K0568L4521m6430
2775A39598L1471L9351n000l1454o2093M2715k1768J1202K6860l854k9255p525
$$ y = [430635, 485526, 460331, 514572, 443532, 455205, 371288, 396995, 397717, 411679, 364534, 360465, 320309, 345268, 361252, 265833, 311194, 255350, 293354, 269950, 283673, 349958, 336885, 260006, 284020, 349984, 317398, 277636, 279098, 288206, 262891, 301900, 262426, 211360, 244389, 197412, 239888, 231262, 239798, 229716, 216346, 223912, 250476, 262564, 217880, 240623, 176487, 218383, 196771, 234923, 212517, 232678, 205592, 235628, 182618, 257954, 246786, 204683, 181326, 214764, 234357, 208788, 210237, 218810, 160606, 148811, 122343, 197458, 143401, 189605, 193490, 179307, 233517, 250541, 283232, 233210, 173444, 135375, 149417, 116268, 145293, 130939, 151507, 186028, 139598, 171069, 210420, 205420, 173966, 111873, 154588, 132820, 144022, 170882, 167028, 137773, 130248]
2763A30248n234L4970k4677m2122o0417Q0467L8127K6229m4536q1l9927L4097
2751A27144j5936n1245J7865J3718N8k973M2341P207P852p6577L9920Q333J4824
2738A32531o6367K7169J2633M128J0875l736j3387O9311k1556l2473L0854K0210
2726A70192p5181O300j4010J1445K2421j8627N143o5450N6348m0157K1082J5004
2714I4510j7045q423J4097r189P0841k9168o609m2310r462K9019O4264m3668k0643
2701H6214j6893M4023K2839n0916Q739j8054P1506j225j5698N264m4471J0094
2689A01422M0697m0180P250J9010J2435n417l5973J2130j188R979m0232m413J2834
2676H8354J9305k1941P4578l2642J8731k9007j3066p752n620j794M085M5058n9081
$$ y = [130248, 125014, 159984, 135307, 93185, 32768, 113235, 151362, 177591, 133055, 132974, 93047, 127144, 111208, 59963, 77828, 91546, 91604, 88631, 130972, 138179, 146031, 69454, 109374, 117707, 132531, 66164, 93333, 105966, 110094, 120969, 117233, 103846, 173157, 151601, 119128, 149982, 170192, 95011, 101311, 87301, 98746, 121167, 102540, 107683, 42233, 98581, 58424, 79506, 94510, 77465, 69042, 83139, 73950, 144791, 115623, 109014, 66704, 57242, 86261, 150525, 106857, 86214, 69321, 113344, 136183, 85267, 94006, 75952, 147458, 146233, 130535, 135799, 91328, 101422, 142119, 101939, 109189, 128199, 140634, 135217, 99244, 111374, 110186, 120165, 79933, 75520, 88354, 107659, 85718, 160296, 127654, 146385, 117378, 104312, 96560, 90940, 89146, 93231, 138289, 79208]
2663G9208m4665J6577M2833J3469J0722l632J0067j1175j3833Q520J6719J3047
2651A37857q988R747o9267L0535n2491N8052m4606Q755J4129K8346k797J4775
2639A24047l0816J5035j8262m8788M9517o094J6923j5665J9851q4113L4426R7
2627E6158J2986K068L5813p3451N3397L469l3571p201k1153l7279L2184m4447
2615b1027L5818L7490L2745m4599j2404J5946L0405j801K7624K3731m8836L4498
2603A09590m5931L6272m2907P549j7974R5J7609j1870l5683m952p664J8046K7900
2590E0080K4951o870k7061k3924M171K8986l687J3676k0615Q137j6830K4480j9612
2577C5882j7271L2005J5046q907k8510J7197L1487j9874L0066j9602L547r308
$$ y = [79208, 34543, 51120, 93953, 107422, 118144, 114512, 124579, 113404, 99571, 108091, 124810, 137857, 128869, 138616, 69349, 99884, 47393, 105445, 60839, 69594, 83723, 112069, 109272, 124047, 93231, 108266, 90004, 41216, 90733, 84639, 101562, 85897, 105748, 21635, 56061, 56158, 69144, 71212, 107025, 33574, 86971, 90440, 56869, 49668, 28515, -8764, 23420, -21027, 14791, 52281, 85026, 40427, 28023, 43969, 74374, 72573, 100197, 123928, 75092, 109590, 63659, 99931, 57024, 64573, 46599, 46694, 64303, 52433, 16750, 11798, 4134, 22180, 50080, 75031, 68161, 41100, 17176, 21347, 50333, 46646, 60322, 39707, 47844, 31014, 55494, 35882, 18611, 50616, 65662, 56755, 28245, 45442, 76929, 57055, 87121, 67519, 71066, 61758]
2565F1758K764O1770k8939j3703J4074j543k1190L4571o1426J6890J060k882M6893
2552A10097n2378j998l3754K9071J548M8131j9179L1642l7888k7334Q160K3478
2540G9596l1356j3340O06N1611k0657J1198k1854m93J3766L504k9452J5631n5995
2527B765K7935j7486J488j2018q205N1705k4816L7996n786o162J5599J3440l4193
2514D2262n6828L9292Q669j5892L2995l2498m2141L8323M6354k5758j1046j2161
2502A1571J2028J6757k9567N3189p3289K4268q883k4532j4050J0108N7501r323
2490B5778J4401o4608N3043o1454P2056j8050K1885j1092J8915j7905l6557K2614
2478A9026Q706N9074k9477Q6996j11937M3625m5650l6192J0822k6153N7812m0130
$$ y = [61758, 64522, 126292, 97353, 83650, 97724, 96181, 74991, 109562, 48136, 65026, 66086, 63204, 110097, 57719, 55721, 21967, 51038, 52586, 100717, 81538, 113180, 75292, 47958, 56118, 79596, 48240, 34900, 35506, 87117, 66460, 77658, 55804, 55311, 69077, 72581, 43129, 58760, 2765, 30700, 13214, 14702, 2684, -5521, 46184, 21368, 59364, 53578, 47416, 63015, 76455, 42262, -14566, 24726, 33395, 17503, 50498, 18000, -24141, 14182, 60536, 34778, 23732, 11571, 23599, 40356, 10789, 63978, -9311, 14957, 6074, -18458, -32508, -22400, 35101, 25778, 40179, -24429, 28614, -32840, 39216, 21166, 43051, 31959, 50874, 32969, -3588, 19026, 27732, 86806, 57329, 144325, 32388, 76013, 30363, -5829, 4993, -21160, 36652, -3478]
2466c478r363l932O7167p3349R8296r9331P3180m7671K1555k265J8728k9357l8094
2453b7914O5262q616J0608n4830M2091n959M1417l3479k6893R5881n8848M6540
2441H5260n8034R175k9386j9529J1015L8362L6009o069o1897K9921l859K669M3163
2428G6800l8427j2100n5715l21N1046M2908R532J6626M290j1219N1868l2074q067
2415I5147p0477N7903r672K8685k9467l2636k8507J9015O325Q181J5618m7824
2403A2291J2900L335k4750K6328m36j7214K7214j9656J8844q206R954n1695K6505
2390A5414k9974J3326O033J0055k849N4638k9148L7258l0359k423k7788p591Q5079
2377I1671L0164j0568J0423j04515M0939J1543k4640m6323K4455M194k2752M5287
$$ y = [-3478, -12841, -16773, 50394, -22955, 75341, -23990, 49190, 1519, 23074, 20809, 39537, 10180, -27914, 37348, 28732, 39340, -15490, 26601, 20642, 62059, 28580, 1687, 97568, 38720, 85260, 27226, 36401, 7015, -12514, -1499, 36863, 72872, 66803, 4906, 34827, 30968, 33637, 76800, 38373, 26273, -29442, -29763, 21283, 64191, 73723, 90349, 94639, 83420, 135288, 103214, 95147, 24670, 82573, 72901, 101586, 72119, 39483, 10976, 29991, 36316, 44497, 60115, 12291, 25191, 28526, 3776, 30104, 29668, 12454, 39668, 20012, 38856, 30650, 40604, -11091, 15414, -14560, -1234, 4799, 14854, 12005, 66643, 37495, 74753, 44394, 41971, 14183, 6592, 91671, 121835, 111267, 121690, 17175, 58114, 69657, 45017, -1306, 23149, 27343, 4591, 49878]
2365D9878K0753m1843J3267j5184M7479J5560n750L535K0143j7317j4889P990
2353H3622m5149n629k954j3119n263M5935m941j372O0003k0317j0525o1407K3390
2340D2274j0063K094O7Q328N7399l0150n574J1391k9132J6109o44j5411q374L1474
2326F9788M489p1286K3553j5005n6233K8671L3643J1218J8761l0479K6277M0668
2314H4065j15880P9781J392M9336q3993L5222L831O447k5784l8217R192l0012
2302b4620O1164l0619L9772l3400M50L250J2258J5434k5734p246j8258J5525M2505
2289E0481K3314m9669N0512r63k0931l0035o495R249l7105J8976j6993N2676l0712
2276A2305L5227k9837M9336k1147M3516l3639o6085O8285j1026L2741k1956p26
$$ y = [49878, 70631, 28788, 42055, 26871, 74350, 89910, 84160, 87695, 107838, 90521, 75632, 83622, 38473, 32844, 29890, 16771, 11508, 57443, 52502, 51130, 111133, 90816, 80291, 18884, 42274, 32211, 34305, 34372, 42700, 100099, 69949, 64375, 75766, 46634, 62743, 62099, 46688, 38314, 69788, 74277, 2991, 26544, 11539, -44694, -16023, 17620, 28838, 47599, 17120, 43397, 84065, -31815, 47966, 49358, 98694, 14701, 49923, 53754, 60201, 34417, -3800, 5392, -24620, 36544, 5925, 45697, 12297, 12747, 15997, 28255, 43689, 17955, 10709, -7549, 7976, 50481, 73795, 24126, 74638, 73675, 52744, 22709, 16214, 25463, -11642, 7334, -9659, 43017, 12305, 47532, 17695, 67031, 45884, 89400, 55761, -10324, 57961, 46935, 79676, 57720, 56994]
2264E6994L528j9599j2659L812N8316p2775K7689M744J9932k4817L5976J8349
2252I9490k2630j1119M2569j5627m7424j4475J2273M6794M1413r554l9292m2827
2240C9591J7965O7138J1307R631m4305n3199R874j3136K7884l4458K7998n3998
2228A2292P3887r741M7367M185n9608J9957J1995P449o0736J373O0367k3352O4275
2215A49710k7753K9057q8894M8145J1846q372j4897m233K6576m046K883m0315
2203G9707K1790j8606l3574N0641M318L5962q1942J361J9940O7332J4665J239
2191A62833J4310n2177N6738j6148L1793l9405L3073P626Q367k9549J0952q621
2179A79792M2793n3524M3740J5899Q9688k1759J3425r7032O0846K5853L0779j4783
$$ y = [56994, 60522, 40923, 28264, 32076, 90392, 17617, 45306, 50050, 69982, 45165, 81141, 99490, 76860, 65741, 108310, 92683, 45259, 30784, 43057, 89851, 131264, 121710, 82418, 39591, 57556, 124694, 136001, 145632, 101327, 48128, 58002, 44866, 72750, 38292, 66290, 12292, 86179, 76438, 123805, 127990, 68382, 88339, 100334, 107783, 47047, 48420, 108787, 85435, 149710, 121957, 151014, 62120, 110265, 122111, 113739, 98842, 94609, 121185, 117139, 120022, 79707, 101497, 82891, 49317, 99958, 104276, 140238, 58296, 59657, 79597, 146929, 161594, 162833, 177143, 124966, 181704, 165556, 197349, 157944, 191017, 198643, 207010, 177461, 188413, 179792, 222585, 169061, 212801, 228700, 318388, 296629, 310054, 213022, 273868, 299721, 330500, 315717]
2167C15717k8706K1836l1488l3553M0915O8548q216M0131J0555K537j3924k3826
2155C60526L3051l1186J03859n7686L6814n823L2692J8333L1662j1561j7763K732
2143D95650l6188R1654k7932L4794M627K6213K3942L1711M1400K9268P9876l4140
2131G60875N1437N2683K8352K2820P7084L7299k531P6090N554M5228M9003Q3431
2119A287325L0485M3379P6352j7539N6990L0827J11921J32337J08368P0301J15757
2108B046503R7296J34420J91421K59981J76087J49386J35451J95407K39697L49150
2098C974799L94770M87779P70773J025292J502444J943775K614467L703695L943044
2089B0360838J89566k821967m036618l357471k049058j486914j013880p87850
$$ y = [315717, 287011, 308847, 277359, 243806, 284721, 353269, 345053, 385184, 395739, 398276, 384352, 360526, 393577, 362391, 466250, 408564, 445378, 439555, 472247, 490580, 522242, 510681, 492918, 495650, 459462, 551116, 523184, 557978, 562605, 588818, 612760, 644471, 685871, 715139, 795015, 760875, 812312, 864995, 893347, 916167, 993251, 1030550, 1028019, 1104109, 1109663, 1154891, 1203894, 1287325, 1317810, 1361189, 1437541, 1420002, 1476992, 1507819, 1619740, 1752077, 1860445, 1930746, 2046503, 2143799, 2278219, 2469640, 2729621, 2905708, 3055094, 3190545, 3385952, 3625649, 3974799, 4369569, 4857348, 5628121, 6653413, 8155857, 10099632, 12714099, 16417794, 20360838, 20550404, 17728437, 13691819, 10334348, 8285290, 6798376, 5784496, 4996646]
2081D996646o09419o40301m60939l00019k02901j77509n5751j96117j56037k16303
2071A981350j93251j75526j33782j28885j09516j6840j26042j3923l3921k6037
2061A023627j06404K31o8851o4433P889l4169m7846p0980j751l5042L9943j22219
2049E19995o711k4189J909K745J4564n7548K330L900N1118l1245r1538k9569K0207
2036C75968K6064O033m3384m7282L1407j2045q751k1963K0629J5628r0919J2259
2024B63644r193o976j3059M9826k9172j2736O91K5442L0360p8140K4627l1195
2012B14119J1818l6358j2384m7615N7062m9288k7457L2175Q385o2653M0303J242
2000A29349j2650J5426m6257R866j173R527J8310j7188j1287j8779o182j8858
$$ y = [4996646, 4387227, 3746926, 3285987, 2985968, 2783067, 2605558, 2549807, 2353690, 2197653, 1981350, 1788099, 1612573, 1478791, 1349906, 1240390, 1223550, 1097508, 1083585, 1049664, 1023627, 917223, 917454, 848603, 784170, 792059, 757890, 710044, 639064, 637313, 602271, 642214, 519995, 513284, 489095, 491004, 493749, 508313, 450765, 453095, 456995, 508113, 476868, 385330, 355761, 375968, 402032, 408065, 364681, 317399, 348806, 336761, 328010, 306047, 326676, 342304, 251385, 263644, 254451, 247475, 234416, 284242, 255070, 242334, 243025, 268467, 298827, 220687, 245314, 214119, 225937, 189579, 177195, 129580, 186642, 137354, 109897, 142072, 150457, 87804, 128107, 129349, 116699, 132125, 85868, 95734, 94561, 104088, 122398, 105210, 93923, 75144, 68962, 50104]
1988E0104L3936Q735l7827J0718M9420j1126m6568j5018k6202J2833N311K8561
1976F2877K0847m9719L1890m2776l3179O8228j7462J0374o926j1256o882K8169
1964E4185k6688P061P9417o3030J8501k7367j4415l9395M5668P804j2126M39O1000
1951I1054p2100J5400O7557k7320n3082l4467J2032J2662k290K5137N365p0648
1939c0700M0900K347j649j8587O7910J0212p0802m0660O072L9731p84q213l0351
1926c4574K5793j8133K911K5143L5848l1258Q228L2069J4334K2252k2739l7148
1914B2726l2693M3844k1714K730j0530L3972o8810J8682n7754P7320P379L231
1902A8383j6104L4624o5466L8393K626N2242N036K8707o0479J4028l6898K2505
$$ y = [50104, 84040, 92775, 54948, 65666, 115086, 103960, 57392, 42374, 16172, 29005, 34316, 62877, 83724, 34005, 65895, 23119, -10060, 58168, 40706, 51080, 44154, 32898, 26016, 54185, 27497, 34558, 113975, 50945, 69446, 42079, 27664, -11731, 33937, 41741, 29615, 30054, 91054, 18954, 34354, 101911, 74591, 21509, -12958, -926, 11736, 9446, 34583, 39948, -30700, 10200, 12547, 10898, -7689, 60221, 70433, -369, -41029, -34957, 4774, 3990, -4223, -34574, -8781, -26914, -24003, 1140, 36988, 5730, 13958, 46027, 60361, 82613, 59874, 22726, -9967, 33877, 12163, 14893, 4363, 38335, -30475, -11793, -69547, 7773, 15152, 18383, 2279, 36903, -28563, 9830, 12456, 64698, 69734, 98441, 37962, 51990, 15092, 37597]
1890C7597q017j443j7377J003l0348k9559N4637j0808J0353j3717N3221n3071
1878g529J7358K114j0011J4092K2772k6643J7942j5128L749l2881l658L2972K8375
1865D3524o9859N5484m8919R267k7991O6723l5129L3081P842m5554L9665k9083
1853i49N9851l3525L4499j2089J3902n7755M325k5358n898K43l4229M6054O084
1840d845M8840n7220r354L5226R268K7786j5176n2902K0033L5394k7441J4176
1828B3785j4153k0035l0395P7185L935M0169R440J3200m0019k7372L1269j0045
1816E6964j5254o557J3889l9485j6835J4237O0768l1634J8429p2289l3359L2007
1804a9119N4812l0972j8709Q367m7825k5262J11806m4703R172k2924K7166m9486
$$ y = [37597, 29580, 28137, 10760, 11763, -18585, -48144, 6493, -4315, 6038, -7679, 45542, -7529, 9829, 11943, 1932, 16024, 38796, 12153, 30095, 14967, 18716, -14165, -17823, 15149, 43524, -26335, 29149, -19770, -10503, -38494, 28229, -6900, 26181, 34023, -11531, 28134, -949, 58902, 25377, 59876, 47787, 61689, 3934, 8259, -17099, -22997, -22754, -56983, -10929, -4845, 43995, -13225, -22579, 12647, 21915, 49701, 34525, -18377, 1656, 37050, 9609, 23785, 9632, -10403, -40798, 36387, 40322, 80491, 89931, 103131, 63112, 35740, 67009, 56964, 41710, 35153, 49042, 9557, -7278, 6959, 67727, 36093, 54522, -17767, -51126, -19119, 35693, 4721, -13988, -5621, -53446, -78708, 33098, -11605, -2433, -25357, 1809, -47677]
1792d7677M8826k4091M5781k6772m6120L8745m2042L1620M0326j8120j2588J5697
1780C585o811M182k2207O158K407m7833O037M6001L1030j6228m8157k9083N5752
1767a5167L848k5229L6105l7457L2994j793K3760n9374k0k4673K0223j7682M7408
1754a7057j7752M5068K8908j7838l5635K3744L1755n7198J0873Q522J502l9870
1742c4978J6360L313K5235Q063j2267P807q046o6946N5497k366K3606K0823J8432
1729E4533j6460N440o4344P380k9103N2271k0305l3253L296M6981P160j4276P175
1716F495j3225n094p7854P9363j22273L0703j9324p155o537O6322Q20L9787k6781
1703e4753K9032P901M8561l1188m875j5803K3429k9296L7048j0056L5378k0966
$$ y = [-47677, 1149, -22942, 22839, -3933, -50053, -11308, -53350, -21730, 18596, 476, -12112, 3585, -3226, 956, -21251, -15093, -12686, -60519, -54482, -8481, 22549, 6321, -41836, -70919, -15167, -11319, -36548, -443, -37900, -4906, -6699, 17061, -42313, -42333, -67006, -46783, -64465, -17057, -34809, 10259, 39167, 21329, -14306, 9438, 41193, -16005, -5132, 3390, 4892, -34978, -18618, -15305, 9930, 17993, 5726, 13533, 5487, -61459, -5962, -8328, 15278, 36101, 54533, 38073, 43513, -20831, -13451, -42554, 9717, -10588, -43841, -40545, 6436, 13596, -680, 6495, -6730, -11824, -89678, -10315, -132588, -101885, -121209, -128364, -134901, -68579, -67759, -27972, -54753, -25721, -17820, 30741, -447, -5322, -21125, 2304, -26992, 10056, 0, 35378, 14412]
1691A4412L3353o1198j3635p122j6963J5171J5492q651M0682m943o0801J4285
1679c9918J0698l6143j8805O2530l3457J3348J1991M2636o4175k4378J0716M4295
1667b0662K1721J8484R614k3854n3313J4035J3336k8308k0457k0003K8966J6734
1655d3707l0735M6321j5336N1961q0672N454M0955L2404o4082O0350l0129R959
1643a7257m0900P5671R991k7552m3008l490j0597M2757m2768J4159L4420J4886
1631F312O7631n2661k9908k3006J033L3845R428r399M650l1429J2463j0986l6154
1618e8181N7080n666J9786o455n6967J7897J4025J1108n195N642L088P697n2346
1605d8487j4331j8464k4020O4477L4892J6450k8652M3401p008j7329m1290Q273
$$ y = [14412, 47765, -13433, -27068, -34190, -51153, -35982, -20490, -29141, 11541, 6598, -54203, -39918, -29220, -65363, -84168, -21638, -55095, -41747, -29756, 12880, -51295, -75673, -64957, -20662, 1059, 19543, 29157, 5303, -48010, -33975, -20639, -48947, -69404, -89407, -60441, -43707, -74442, -28121, -43457, 8504, -72168, -66714, -25759, 6645, -57437, 2913, -27216, -17257, -58157, 17514, 27505, -47, -43055, -46545, -57142, -14385, -57153, -42994, -8574, 6312, 73943, 21282, -8626, -31632, -30599, 3246, 12674, 3275, 7925, -23504, -11041, -22027, -58181, -1101, -6767, 13019, 6564, -50403, -32506, -18481, -7373, -12568, -6926, -3838, 3859, -48487, -62818, -81282, -105302, -40825, -5933, 10517, -18135, 25266, 18258, 929, -40361, -32088]
1593c2088M5630j3257J650J5112M5325q5314K5670m3872L3807r319M302J6940
1581D586j1221k3478k115J1946J9455J3355j6106n9171P728j7359L6943k0335
1569e5772N6944k9001j1304K4967J1972l1110j7215O620L2832j2429k0449K9811
1557a4134J2336q720k914M7662j8890l8241j6619j35O2438k8246J1200J1121o3999
1544d7141n193P9517K419n6868j4138J5066Q1723o1263R071n8589M5069N0016
1532C9689k4482n61n3536M5164j7132Q2438n8280j3326n13J3282M2536j29019
1520g3740O3787q6271m04J4789j2601P6190q0106j494k3337O2392j2289O0321
1508a2763n947O817k1191o4310K7740j8477J8103l0909L4010Q9328L0536k1281
$$ y = [-32088, 13542, 285, 1935, 17047, 62372, -22942, 2728, -41144, -7337, -16656, -12354, 4586, -6635, -30113, -32228, -20282, -827, 12528, -3578, -62749, -55021, -72380, -35437, -55772, 1172, -27829, -39133, -14166, -2194, -33304, -50519, -43899, -11067, -23496, -43945, -14134, -1798, -10518, -13432, 34230, 15340, -22901, -39520, -39655, 22783, -5463, 5737, 16858, -47141, -52334, 27183, 29602, -27266, -41404, -26338, 55385, -5878, 3193, -55396, -10327, 39689, 15207, 14646, -38890, 6274, -10858, 71580, 13300, -26, -539, 12743, 55279, -73740, -9953, -96224, -96628, -81839, -94440, -18250, -98356, -99850, -123187, -60795, -73084, -12763, -18710, -11893, -33084, -97394, -69654, -88131, -70028, -100937, -66927, 22401, 52937, 31656]
1496C1656m6047l7754K8646k061N607n7211j0276R5980Q190q2111m568j3666N3129
1483c0486J009L8104o717J8793p6457O7020l5754n210m6767M414n297j1861M4278
1470d4931n3817J09349R609j0539m9448j4022k1915K9345R5277m7505J2671n6953
1458d2879J3640j7288j4674M724k2548M9640l6745K4336J1180J886J3210L1729
1446A6211o6611K3086j6068L1396k0076k4199J4385j395K1091j43M2470p9563
1434e9416J1084n3022N4598j123K7311k76L0509O444l5710M0840l7863J8693K3087
1421B5156o607o1494O5031k6883l408M705l9361M5443r5451P7236k1206L8600
1409A761o834j3310m0109O3678n1314J7809k963k9480L8792m1446K2853n7807
$$ y = [31656, -14391, -52145, -23499, -25560, -19953, -77164, -87440, 8540, 16730, -65381, -69949, -83615, -30486, -29477, 8627, 1910, 20703, -55754, 11266, -24488, -29698, -76465, -72051, -77348, -89209, -44931, -98748, 10601, 20210, 9671, -39777, -53799, -75714, -46369, 48908, 1403, 14074, -42879, -29239, -46527, -61201, -56477, -79025, -29385, -66130, -41794, -30614, -28728, -15518, 16211, -50400, -27314, -43382, -11986, -32062, -56261, -41876, -43271, -22180, -22323, 20147, -59416, -48332, -101354, -46756, -47879, -20568, -20844, 9665, 16109, -19601, 21239, -16624, 2069, 25156, 18549, -42945, 22086, -4797, -8205, -3500, -42861, 2582, -92869, -15633, -36839, 1761, -5073, -18383, -58492, 5186, -46128, -28319, -31282, -60762, -21970, -63416, -40563, -98370]
1397i8370P1986J0190L5340o6372k1929P704L7679O344k8288P4883Q337k1520
1385A5984l3959J1741K2834l3185L3478k9404n81k2062K0203m3162L1412K9246
1373B545M9467o8670r166l9630M1044l3706O6583j16116O3094p286L6111l3956
1361d9686N306N538K5394m6461p685J00795j8760O850j8777j7506j119O5125p3202
1348b4188K8487n3162M582K4779j5080k1543m842O2210o354L497n358j7518Q380
1335a6110L506L4334r2475N5986K4981P4060p1792O398n9240K4864L4069k4874
1323f293k49l1199N3383p3135L0960n7500l9228J00682j8418l5935J2436J5064
1311d9432q142K2358o312k0275j372Q2403k6960n320m2250J5041Q503Q784l7405
$$ y = [-98370, -26384, -16194, 19146, -47226, -69155, -61451, -23772, -17428, -45716, 29167, 37504, 15984, -17975, -6234, 16600, -16585, 16893, -12511, -13092, -35154, -14951, -58113, -26701, 2545, 52012, -16658, -25824, -65454, -24410, -58116, 8467, -107649, -44555, -51841, -15730, -49686, -44380, -38842, -13448, -59909, -67594, 33201, 14441, 21291, 2514, -14992, -16111, 49014, -24188, 4299, -48863, -44281, -19502, -34582, -56125, -60967, 1243, -5111, -1614, -6972, -24490, -16110, -12604, 21730, -70745, -14759, 10222, 84282, 12490, 18888, -40352, -15488, 18581, -6293, -6542, -37741, 15642, -57493, -26533, -84033, -123261, -22579, -40997, -76932, -64496, -49432, -57574, -35216, -41528, -61803, -63175, 19228, -7732, -13052, -55302, -40261, -31758, -22974, -60379]
1298f0379P6579R678l1808L8896n9674N3577p9102L1819M2539q4l8682J9879l1383
1285b8145j074L7534k2010J270J0623j5679j1191m8890M5528N095O0105J10k9245
1272D031l3719k5196k5613l78M9977P813r720J7039K557p581J4631m8475J7328
1259c7306r583N8417j8889o088o480Q819l1093N0550l0232K5788K263l3938K396
1246b5376J4663j0551L8059j8497R025k7637M1345o8573K5611j2788l212n9582
1234i7513R2074K2640o1756M7879K0886J0932k1913L1084k2327m3010K9865n3078
1222d4237n055O7032k8725k7408K452M1289k1935p718Q142N203p940O24p027j4445
1208c9748N0574k101J358j5057n568k4494L0229j0048l7572L8132l3185Q1508
$$ y = [-60379, 16200, 25878, -5930, 32966, -26708, 26869, -52233, -20414, 22125, 22041, -16641, 3238, -28145, -29219, 8315, -13695, -12425, -1802, -17481, -28672, -77562, -32034, -26939, 33166, 33276, 4031, -29688, -54884, -80497, -80875, -30898, -23085, -32805, -15766, -13209, -20790, -6159, -54634, -37306, -46889, 11528, -7361, -13449, -19929, -11110, -42203, 8347, -21885, 3903, 6166, -27772, -25376, -10713, -21264, 16795, -1702, 7323, -20314, 21031, -47542, -21931, -34719, -37931, -97513, -5439, 17201, -44555, 3324, 24210, 35142, 13229, 44313, 21986, -21024, 8841, -44237, -49292, 17740, -10985, -38393, -35941, 5348, -16587, -24305, -16163, -10960, -18900, -18276, -25303, -39748, 10826, 8725, 10083, -4974, -10542, -35036, -4807, -14855, -52427, -14295, -47480, 34028]
1196C4028q3942L2347j022M5340m9865M671O736L1966N799L4771q0361l3325M6285
1183f572K0708M0111n1856O281q81O7J5908n8356K1213j8873M9191m8028K7067
1170d020o1489L4802J7185n0006J01363l7187K878l2696J6263o484O423n2728
1158f5696J2617J9718J1530j4559J9645n6120r83N6193J6028L1115m1836K2489
1146A0141o1209O2826n4898N9509m6077N0452K3850p3186J4661k0867L4430j4855
1134a5223L7818n8904L7076o026m283L6850k6629N339o9220R5485p426J5309M873
1121D5039J0572p635m7660L686j0641J6959j7491m9896j0003M4803L4169l5404
1109b3502l2341n9196O8638N2600O2505n5834m8735L0455o3649K8272O2189j1077
$$ y = [34028, -49914, -17567, -18589, 26751, -23114, -18443, -11707, 20259, 26058, 60829, -19532, -52857, -6572, 14136, 54247, 2391, 8672, 7791, 7858, 23766, -34590, -13377, -32250, 16941, -31087, -4020, -65509, -30707, -13522, -63528, 37835, 648, 3526, -29170, -12907, -19391, -12968, -65696, -53079, -33361, -21831, -36390, -16745, -72865, -73848, -17655, -1627, 29488, -12348, 10141, -51068, 11758, -43140, 16369, -29708, 20744, 44594, -28592, -13931, -34798, -368, -15223, 22595, -36309, 767, -5259, -9542, 27308, 679, 6018, -63202, 32283, 24857, 40166, 45039, 55611, 47976, 316, 4002, -6639, 10320, -7171, -57067, -67070, -22267, 11902, -23502, -55843, -115039, -46401, 6199, 68704, 12870, -35865, -5410, -69059, -40787, 21402, 10325]
1097A0325m8496J1813n9048O1878J0520L2467j9738K7499n1720J7235j0587L9725
1085B1873m6540L4612l7766j2781J9390j4234j426M500k3240N9556k5856j9464
1073d1376K3425J2134K237q456J7329k5462O857n0827N9129m8695j1761K2964
1061d2502O7772n360l7601O214K1506Q784j5883m6296L1763J129Q680N5440m8142
1048E504l0011p343R283J196Q4565p3594M587k1427l3326L9772j7062N6065m8713
1035c0504M2141J7064k3442k0472j0528K4910o397J5964j0518P3706q7738J8277
1023B463q9680Q7592p0180L7778l362N8302k0560j3750P121k3211N3076o0481
1011c4892K9645n327O7495m0417p584J287l397P365N445j7402P217K8188J9398
$$ y = [10325, -38171, -26358, -85406, -23528, -13008, 19459, -279, 27220, -24500, -7265, -17852, 21873, -24667, 9945, -27821, -40602, -21212, -35446, -36872, -32372, -55612, 3944, -21912, -41376, -17951, -5817, -3580, -12036, 5293, -20169, -13312, -64139, -5010, -53705, -65466, -42502, 25270, 19910, -17691, -11477, 10029, 18813, 2930, -43366, -11603, -10474, -1794, 53646, 5504, -24507, -31850, -22567, -21371, 63194, -10400, -5813, -27240, -60566, -20794, -37856, 18209, -30504, 11637, 28701, 5259, -15213, -25741, -831, -7228, 8736, -1782, 71924, -15814, 2463, -87217, 375, -69805, -32027, -35389, 22913, 2353, -11397, -4276, -27487, 25589, -34892, -5247, -10574, 56921, 16504, 8920, 10207, 6810, 14175, 19620, 2218, 9435, 37623, 57021]
998E7021p7921l7058j8968L9081R313P1864n4823q793k5027J7779j624j7932J6053
985c1035M5555n2258K0725M779l2513n3590M7290k4385P126M8577O291j7195l0440
972f1073K1454m5044M0276O940K1346N4754K9054r5865P009M582L9025j7588N19
959E389j7946n941K3834j6369R447q912K6498n1646L3022K7329l6275N7228l7539
946H119r83m281J8996q5202M6679k8115L0845k0338m686J045M1908j4786n0683
933f1482P9308j6701N5654m6049M4599n8497J4225o1295Q9810p9888R3699p5296
921b1913N2243p5655j060L4927L3219j4062O098J4554L0735l3552o5684O6125
909B5975n0778O421k0313k3830L9310K136L8793l3242Q934k6554K9068L5308m1357
$$ y = [57021, -20900, -57958, -76926, -37845, -28532, 43332, -11491, -20284, -45311, -27532, -29156, -47088, -31035, 14520, -37738, -17013, -12234, -44747, -98337, -51047, -75432, -68306, -19729, -13438, -30633, -61073, -39619, -84663, -44387, -37447, -16101, 38653, 67707, -28158, -21149, -16567, 22458, 4870, 5389, -12557, -18498, 5336, -11033, -1586, -10498, 16000, -35646, -2624, 24705, -11570, 45658, 8119, 7136, 2855, 21851, -63351, -16672, -44787, -13942, -34280, -38966, -37921, 3987, -10799, -61482, 17826, 1125, 56779, 10730, 55329, -3168, 11057, -50238, 39572, -40316, 53383, -21913, 30330, -45325, -46385, -11458, 21761, 7699, 13797, 28351, 59086, 25534, -40150, 25975, -24803, -18382, -38695, -62525, -23215, -21079, 17714, -15528, -6594, -33148, -4080, 31228, -10129]
896a0129j1995L369J8910j3105K6973m3581Q3755n4548n852q027R946m271j06
883h661p443P2577l9070k9959o8583J9246j0550K3960k5031M8622M065M171M5959
870B9303p495J2131j3307n989l1554j1359M4705k0242J3268j9821J4835J563L6222
857D2260k6262K0052O533R537j1857q7767N3871q9596M3841J08N1721p933l3001
844b8493J399L5741l7408l7958K8038J7158O1320j3912k246k9740O4204n1794
832F309K0520k6351L1563p1864L8801j2684K1001k8953J7974j4827J9645M1110
820D2244K7273m2650k622l7697n2738O8434J2590K4561l2465J7619r8896N3300
808b1047n6271O5249l1545J7994M6888j9789P8818q4807M5144j1086k8264R079
$$ y = [-10129, -22124, -18755, 155, -12950, 14023, -29558, 54197, -351, -6203, -14230, -4284, -8555, -8661, -16104, 56473, 17403, -12556, -81139, -61893, -72443, -48483, -73514, -24892, -20827, -16656, 29303, 21808, 33939, 20632, 14643, -16911, -28270, 16435, -3807, 9461, -10360, 4475, 6038, 42260, 15998, 36050, 42583, 52120, 40263, -47504, 6367, -83229, -39388, -39280, 12441, 4508, -28493, -27094, 8647, -28761, -66719, -38681, -21523, 39797, 25885, 23639, -6101, 58103, 6309, 26829, 478, 32041, -39823, -1022, -13706, 7295, -21658, -3684, -18511, 1134, 42244, 69517, 26867, 24245, -13452, -66190, 2244, 14834, 39395, 6930, 24549, -74347, -21047, -77318, -12069, -43614, -25620, 21268, 1479, 80297, -4510, 40634, 29548, 1284, 10363]
$$ [...]
##END NTUPLES=NMR SPECTRUM
##END=
