##TITLE=1H_EC-3301(II-3)
 CDCl3
 8 sc, 
 26.10.2023
##JCAMPDX= 6.0         $$ Bruker NMR JCAMP-DX V2.0
##DATA TYPE= NMR SPECTRUM
##DATA CLASS= NTUPLES
##ORIGIN= UXNMR, Bruker Analytische Messtechnik GmbH
##OWNER= root
$$ XWIN-NMR		Version 3.5
$$ Thu Oct 26 14:27:42 2023 Russian Standard Time (UT+4h)  she@DPX200
##.OBSERVE FREQUENCY= 200.13135
##.OBSERVE NUCLEUS= ^1H
##.ACQUISITION MODE= SIMULTANEOUS
##.ACQUISITION SCHEME= undefined
##.AVERAGES= 8
##.DIGITISER RES= 18
##SPECTROMETER/DATA SYSTEM= spect
##.PULSE SEQUENCE= zg30
##.SOLVENT NAME= CDCl3
##.SHIFT REFERENCE= (INTERNAL, CDCl3, 0, 15.7678)
##AUDIT TRAIL= $$ (NUMBER, WHEN, WHO, WHERE, WHAT)
$$ ##TITLE= Audit trail, XWIN-NMR		Version 3.5
$$ ##JCAMPDX= 5.01
$$ ##ORIGIN= Bruker BioSpin GmbH
$$ ##OWNER= she
$$ F:/spectra/data/she/nmr/H-F/1/pdata/1/auditp.txt
$$ ##AUDIT TRAIL=  $$ (NUMBER, WHEN, WHO, WHERE, WHAT)
(   1,<2023-10-26 14:26:32.93 +0400>,<she>,<DPX200>,
      <created by zg, POWCHK disabled, PULCHK disabled
       configuration hash MD5:
       00 E9 B6 7A A2 85 ED C7 34 08 36 98 17 FE 4E 26
       data hash MD5: 16K
       FE 3E EA 05 42 99 68 3D 94 39 DD FD F9 4C 57 BE>)
(   2,<2023-10-26 14:26:35.09 +0400>,<she>,<DPX200>,
      <Start of raw data processing
       efp BC_mod = 2 LB = 0.24 FT_mod = 6 PKNL = 1 PHC0 = -23511.02 PHC1 = 14.45272 SI = 16K 
       data hash MD5: 16K
       FC C2 3B 6C 2F F7 72 1D AB 0A F8 BA F2 5D 66 FE>)
(   3,<2023-10-26 14:26:54.87 +0400>,<she>,<DPX200>,
      <pk PHC0 = 0.08391257 PHC1 = 0 
       data hash MD5: 16K
       06 2C 51 31 BD 94 99 49 BF FC 66 31 FB 3E 13 66>)
(   4,<2023-10-26 14:26:58.17 +0400>,<she>,<DPX200>,
      <abs ABSG = 5 
       data hash MD5: 16K
       D2 3F 8F 5F 64 EB A4 57 18 56 8D 32 DB AE 22 57>)
$$ ##END=
$$ 
$$ hash MD5
$$ 27 7F 3E 17 46 4D 08 61 66 72 BE 3A 6A 0E 7B 85
##$RELAX= 
##$RELAX= 
##$RELAX= 
##$RELAX= 
##$RELAX= 
##$RELAX= 
$$ Bruker specific parameters
$$ --------------------------
##$DU= <F:/spectra>
##$EXPNO= 1
##$NAME= <H-F>
##$PROCNO= 1
##$TYPE= <nmr>
##$USER= <she>
##$AMP= (0..31)
100 100 100 100 100 100 100 100 100 100 100 100 100 100 100 100 100 100 
100 100 100 100 100 100 100 100 100 100 100 100 100 100 
##$AQSEQ= 0
##$AQ_mod= 1
##$AUNM= <au_zg>
##$AUTOPOS= <>
##$BF1= 200.13
##$BF2= 200.13
##$BF3= 200.13
##$BF4= 200.13
##$BF5= 200.13
##$BF6= 200.13
##$BF7= 200.13
##$BF8= 200.13
##$BYTORDA= 1
##$CFDGTYP= 0
##$CFRGTYP= 5
##$CHEMSTR= <none>
##$CNST= (0..31)
1 1 145 1 1 1 1 1 1 1 1 1 1 1 1 1 1 1 1 1 1 1 1 1 1 1 1 1 1 1 1 1 
##$CPDPRG= <>
##$CPDPRG1= <>
##$CPDPRG2= <>
##$CPDPRG3= <>
##$CPDPRG4= <mlev>
##$CPDPRG5= <mlev>
##$CPDPRG6= <mlev>
##$CPDPRG7= <mlev>
##$CPDPRG8= <mlev>
##$CPDPRGB= <>
##$CPDPRGT= <>
##$D= (0..31)
0 1.2 0 0 0 0 0 0 0 0.06 0 0.03 0 0 0 0 0.0002 0 0 0 0 0 0 0 0 0 0 0 0 
0 0 0 
##$DATE= 1698315992
##$DBL= (0..7)
120 120 120 120 120 120 120 120 
##$DBP= (0..7)
150 150 150 150 150 150 150 150 
##$DBP07= 0
##$DBPNAM0= <>
##$DBPNAM1= <>
##$DBPNAM2= <>
##$DBPNAM3= <>
##$DBPNAM4= <>
$$ [...]
##$SUBNAM3= <"">
##$SUBNAM4= <"">
##$SUBNAM5= <"">
##$SUBNAM6= <"">
##$SUBNAM7= <"">
##$SUBNAM8= <"">
##$SUBNAM9= <"">
##$SW= 18.05172834244
##$SWIBOX= (0..15)
0 0 2 0 0 0 0 0 0 0 0 0 0 0 0 0 
##$SW_h= 3612.71676300578
##$TD= 16384
##$TD0= 1
##$TE= 0
##$TE2= 300
##$TE3= 300
##$TEG= 300
##$TL= (0..7)
0 120 120 120 120 120 120 120 
##$TP= (0..7)
150 150 150 150 150 150 150 150 
##$TP07= 0
##$TPNAME0= <>
##$TPNAME1= <>
##$TPNAME2= <>
##$TPNAME3= <>
##$TPNAME4= <>
##$TPNAME5= <>
##$TPNAME6= <>
##$TPNAME7= <>
##$TPOAL= (0..7)
0.5 0.5 0.5 0.5 0.5 0.5 0.5 0.5 
##$TPOFFS= (0..7)
0 0 0 0 0 0 0 0 
##$TUNHIN= 0
##$TUNHOUT= 0
##$TUNXOUT= 0
##$USERA1= <user>
##$USERA2= <user>
##$USERA3= <user>
##$USERA4= <user>
##$USERA5= <user>
##$V9= 5
##$VALIST= <valist>
##$VCLIST= <CCCCCCCCCCCCCCC>
##$VD= 0
##$VDLIST= <DDDDDDDDDDDDDDD>
##$VPLIST= <PPPPPPPPPPPPPPP>
##$VTLIST= <TTTTTTTTTTTTTTT>
##$WBST= 1024
##$WBSW= 4
##$XGAIN= (0..3)
0 0 0 0 
##$XL= 0
##$YL= 0
##$YMAX_a= 743890
##$YMIN_a= -920738
##$ZGOPTNS= <>
##$ZL1= 120
##$ZL2= 120
##$ZL3= 120
##$ZL4= 120
##$ABSF1= 15.75019
##$ABSF2= -2.30166
##$ABSG= 5
##$ABSL= 3
##$ALPHA= 0
##$AQORDER= 0
##$ASSFAC= 0
##$ASSFACI= 0
##$ASSFACX= 0
##$ASSWID= 0
##$AUNMP= <proc_1d>
##$AZFE= 0.1
##$AZFW= 0.1
##$BCFW= 0
##$BC_mod= 2
##$BYTORDP= 0
##$COROFFS= 0
##$CY= -3
##$DATMOD= 1
##$DC= 0
##$DFILT= <>
##$DTYPP= 0
##$F1P= 0
##$F2P= 0
##$FCOR= 1
##$FTSIZE= 16384
##$FT_mod= 6
##$GAMMA= 0
##$GB= 0
##$INTBC= 1
##$INTSCL= 3.70164e-10
##$ISEN= 128
##$LB= 0.24
##$LEV0= 0
##$LPBIN= 0
##$MAXI= 10000
##$MC2= 0
##$MEAN= 0
##$ME_mod= 0
##$MI= 1.114404
##$NCOEF= 0
##$NC_proc= -6
##$NLEV= 6
##$NOISF1= 3.799351
##$NOISF2= 2.8
##$NSP= 0
##$NTH_PI= 0
##$NZP= 0
##$OFFSET= 15.76782
##$PC= 1
##$PHC0= -23510.94
##$PHC1= 14.45272
##$PH_mod= 1
##$PKNL= yes
##$PPARMOD= 0
##$PSCAL= 0
##$PSIGN= 0
##$REVERSE= no
##$SF= 200.130000743427
##$SI= 16384
##$SIGF1= 3
##$SIGF2= 2
##$SINO= 5.538805
##$SIOLD= 16384
##$SREGLST= <1H.CDCl3>
##$SSB= 0
##$STSI= 16384
##$STSR= 0
##$SW_p= 3612.71676300578
##$SYMM= 0
##$S_DEV= 0
##$TDeff= 16384
##$TDoff= 0
##$TI= <>
##$TILT= no
##$TM1= 0
##$TM2= 0
##$TOPLEV= 0
##$USERP1= <user>
##$USERP2= <user>
##$USERP3= <user>
##$USERP4= <user>
##$USERP5= <user>
##$WDW= 1
##$XDIM= 16384
##$YMAX_p= 452754495
##$YMIN_p= -313719
$$ End of Bruker specific parameters
$$ ---------------------------------
##NTUPLES= NMR SPECTRUM
##VAR_NAME=  FREQUENCY,     SPECTRUM/REAL,   SPECTRUM/IMAG
##SYMBOL=    X,             R,               I
##VAR_TYPE=  INDEPENDENT,   DEPENDENT,       DEPENDENT
##VAR_FORM=  AFFN,          ASDF,            ASDF
##VAR_DIM=   16384,         16384,           16384
##UNITS=     HZ,            ARBITRARY UNITS, ARBITRARY UNITS
##FACTOR=    0.220516191357247, 1,           1
##FIRST=     3155.61390002407, 0,            0
##LAST=      -457.102862981707, 0,           0
##MIN=       -457.102862981707, -313719,     0
##MAX=       3155.61390002407, 452754495,    0
$$ Real data points
##PAGE= N=1
##DATA TABLE= (X++(R..R)), XYDATA
$$ [...]
7806E22174m3374o7187M1716k4937K6265M5649o2903J9557o2754k0866Q3570p1649
7794C85261L9979L2665l5300L1127J4970L9560l9476N783L9843l4032L023m5605
7782D37798j3074K1895P1390j3625k4901p0691l328M6198J22875r825l3759M9698
7770E80651k0160j4598M881L409k8996q4840N7158l3704l7383P1349l2980j00753
7758C64034N3048O0772j3679O0109P1608L3857L7403j34506m9799K457j1526J9775
7746D93553M3498J51573p78m7356j25009P0827O6988o9035L3400J8088N0058n8837
7734F26970p4084M3936k7312J3568l3682J2426N6414N2490K393K1151r7567N619
7722F02322L4921L7295j2442L9165L2862j113O8869j8509j8947o3478n3313N5882
$$ y = [522174, 478800, 411613, 453329, 428392, 454657, 500306, 437403, 456960, 394206, 373340, 456910, 385261, 425240, 457905, 422605, 453732, 468702, 508262, 468786, 474569, 514412, 480380, 483403, 437798, 424724, 446619, 518009, 504384, 479483, 408792, 405464, 451662, 574537, 564712, 530953, 580651, 560491, 545893, 550774, 554183, 525187, 440347, 497505, 463801, 426418, 497767, 464787, 364034, 417082, 477854, 464175, 524284, 595892, 629749, 667152, 532646, 482847, 485304, 473778, 493553, 537051, 688624, 687846, 640490, 515481, 586308, 653296, 584261, 617661, 635749, 685807, 626970, 552886, 596822, 569510, 583078, 549396, 561822, 618236, 670726, 673119, 694270, 596703, 602322, 637243, 674538, 662096, 701261, 734123, 733010, 801879, 783370, 764423, 700945, 647632, 703514]
7710G03514j2811r9919P3268J01566J1868n9570M9557l605K6063R6140L8481o0199
7698H64353l9224j04590M4411J3368O0174K801L538K0254J8535L0503r8509L917
7686H19531L3118M0878j07961j4728M9197j87639K4758J38421Q7667K4680J9331
7675I27253q0703r5340k7535m4740N8527j2686R3258N4132o3059n5943O0391K8182
7663H41737J06622j2487r887J1091j5428p493j2134N7924r8138K7022m107L3755
7651I18477L5226l6129J774o0351j329L2172O6911k3485r577Q425m1075o995J38537
7638A022581K2059l6245p5293P3730K7598j22841J39168j5999m603K4372r5474
7627I59053N3744L5082k1509m4895J35441k2873o5475P6851k3721K8411O1826
$$ y = [703514, 690703, 590784, 664052, 765618, 777486, 717916, 767473, 763868, 789931, 886071, 924552, 864353, 825129, 720539, 764950, 778318, 838492, 841293, 844831, 865085, 883620, 914123, 815614, 819531, 852649, 893527, 785566, 770838, 820035, 632396, 657154, 795575, 883242, 907922, 927253, 846550, 751210, 723675, 678935, 737462, 724776, 818034, 872166, 809107, 753164, 813555, 841737, 948359, 935872, 925985, 937076, 921648, 914155, 902021, 959945, 861807, 888829, 884722, 918477, 953703, 917574, 919348, 858997, 857668, 889840, 956751, 933266, 923689, 932114, 891039, 884044, 1022581, 1044640, 1008395, 933102, 1006832, 1034430, 911589, 1050757, 1034758, 1030155, 1054527, 959053, 1012797, 1047879, 1026370, 981475, 1116916, 1094043, 1028568, 1105419, 1081698, 1110109, 1171935]
7616A171935J1354L5695o2417j5552L3o4025J5482M9787K0293l313J7232N9583
7604A236087J240j4661O076L7532r7102N0512o8174o3438M1119n5238J33867l7949
7592A169871R598L3779N2872m2485K8157m4717J635N2362Q2846j2965j10969j8272
7580A201712L3261O859K3668j04646O5060j5750K0748q3764N9747Q828k4438j1023
7568A180262L0079J53008L1578j03150p6174l210K146P6124N1624O9369r0823
7557A320833J7134m8473j6019r086q2404o7358R5748N285j7674Q8056J0560j6609
7545A279993n0909j2179Q0328l7417M3286j3018L4985L5071p8451n1505m6057
7534A184127K3398j3726Q1454k818j90825J92716p0132R2460P5919j26947M7652
$$ y = [1171935, 1183289, 1218984, 1156567, 1141015, 1141048, 1077023, 1092505, 1142292, 1162585, 1159272, 1176504, 1236087, 1237327, 1222666, 1228742, 1266274, 1169172, 1219684, 1151510, 1088072, 1129191, 1073953, 1207820, 1169871, 1179469, 1213248, 1266120, 1223635, 1251792, 1207075, 1208710, 1261072, 1343918, 1330953, 1219984, 1201712, 1234973, 1241832, 1265500, 1160854, 1225914, 1210164, 1230912, 1147148, 1206895, 1215723, 1191285, 1180262, 1210341, 1363349, 1394927, 1291777, 1215603, 1212393, 1214539, 1290663, 1342287, 1411656, 1320833, 1337967, 1289494, 1273475, 1264389, 1181985, 1114627, 1210375, 1215660, 1197986, 1286042, 1296602, 1279993, 1229084, 1216905, 1297233, 1259816, 1303102, 1290084, 1325069, 1360140, 1281689, 1230184, 1184127, 1207525, 1193799, 1275253, 1272435, 1081610, 1274326, 1204194, 1296654, 1372573, 1245626, 1293278]
7523A293278l8912M4732M2993L5910m5160K3507J3310p518J26293n4511o8359
7512A365563n9533l5122M0038k355L2328j8270J5065m3762L5911L6171l949N8349
7500A420434N7462r5944q1577J8202M9822J1428m5377R0644L4298l7577J7347
7489A439162O6672p4205p0997O1454N7988m952L7574k9158l7622P380O960Q2849
7477A543105q4402k463J05958n7447o4911J0171K0610L8029M1951n5735L999P3602
7465A572467m7333O0260K5058m9689j1196m9224j8134Q6885L0702M541N3400Q0301
7453A738038j8386K33J7666J178O4791J23433q8841k5624n2672r1597J71042N6770
7441A896031n4825k6878J21594j9019n1691J2172l0997l9494k1955j2196O7677
$$ y = [1293278, 1254366, 1299098, 1342091, 1378001, 1332841, 1356348, 1369658, 1362140, 1488433, 1433922, 1365563, 1306030, 1270908, 1310946, 1308591, 1340919, 1322649, 1337714, 1293952, 1329863, 1366034, 1362085, 1420434, 1477896, 1381952, 1300375, 1318577, 1368399, 1379827, 1334450, 1425094, 1459392, 1421815, 1439162, 1505834, 1431629, 1360632, 1422086, 1480074, 1475122, 1512696, 1483538, 1445916, 1453296, 1460256, 1543105, 1458703, 1456240, 1562198, 1504751, 1439840, 1450011, 1470621, 1508650, 1550601, 1494866, 1498865, 1572467, 1525134, 1585394, 1610452, 1560763, 1549567, 1500343, 1482209, 1569094, 1599796, 1604337, 1657737, 1738038, 1719652, 1719885, 1737551, 1738729, 1803520, 1926953, 1838112, 1812488, 1759816, 1668219, 1839261, 1896031, 1841206, 1814328, 1935922, 1916903, 1865212, 1877384, 1846387, 1806893, 1784938, 1772742, 1840419]
7430A840419J3786L9999k987J8379K8429q2509Q9436j01819J1787K5732p8209
7419A802443m8538O7286Q9880l0075J3049j25406r157j0783l3388M7561l9218
7408A723654J8434J8980k7821m4250n1318J3675k0431O9482p411r4031l984K9345
7396A624324P1352J9933K2587j5965j12368m1151M0206P237j9094j2600N037R3763
7384A683261k8554M7183M6581k049J9413k328m5758n0318Q9246m6200J4229l1579
7372A693127q8247P2964J06818o922L5248M6223k7498P4656j4110o030L0678p8847
7360A838060K9037J2825P0387m931j9422j06997q2834N0330J09412J0359M7758
7349A953984l8269j12525R2172j4342p0270L3549K9974m1984N1734p4138M21Q3065
$$ y = [1840419, 1854205, 1894204, 1891217, 1909596, 1938025, 1855516, 1944952, 1843133, 1854920, 1880652, 1802443, 1753905, 1821191, 1911071, 1880996, 1894045, 1768639, 1759482, 1748699, 1715311, 1762872, 1723654, 1742088, 1761068, 1733247, 1688997, 1637679, 1651354, 1630923, 1700405, 1692994, 1598963, 1594979, 1624324, 1695676, 1715609, 1738196, 1722231, 1609863, 1568712, 1608918, 1616155, 1597061, 1584461, 1589498, 1683261, 1654707, 1701890, 1748471, 1746422, 1765835, 1763507, 1717749, 1667431, 1756677, 1710477, 1724706, 1693127, 1604880, 1677844, 1784662, 1777740, 1812988, 1859211, 1831713, 1906369, 1892259, 1886229, 1916907, 1838060, 1867097, 1879922, 1950309, 1945378, 1925956, 1818959, 1736125, 1786455, 1895867, 1906226, 1953984, 1915715, 1803190, 1895362, 1881020, 1810750, 1844299, 1874273, 1832289, 1884023, 1809885, 1810306, 1893371]
7337A893371n2369L612m991p0153j34157p4895J25172l5680l9545M419n1425q518
7325A554841L3933M1953K3547l9411k6797P3557N7828q4904j0755Q8182k6793
7314A685181l3226j4448q1201K3161j1183k3183O5303k1177L8268o9059K293L5431
7302A596160r903k2759l8139J0197j065J3482k023L2713Q685n2456p2380l0200
7290A432312J0698M3989P22O3893m5508N1311m8914j2377l9200J26165M6901j13314
7278A516678p905J7777L1517q097m1540O6546K2436r4268m7624R1989K0643l9108
7266A529044R873M9635j1178q1803K2179M6257l3625n4038N8252m5325L0675l7333
7254A482613K8487m5808N752p274L3566K5596J9524l2475K1343J19341m9274m2857
$$ y = [1893371, 1841002, 1844614, 1839623, 1769470, 1635313, 1560418, 1685590, 1649910, 1610365, 1614784, 1563359, 1554841, 1588774, 1630727, 1654274, 1614863, 1588066, 1661623, 1719451, 1634547, 1623792, 1711974, 1685181, 1651955, 1637507, 1556306, 1579467, 1568284, 1545101, 1610404, 1589227, 1627495, 1558436, 1560729, 1596160, 1586257, 1563498, 1525359, 1535556, 1534491, 1547973, 1545950, 1578663, 1587348, 1534892, 1462512, 1432312, 1443010, 1486999, 1487721, 1551614, 1506106, 1557417, 1508503, 1496126, 1456926, 1583091, 1629992, 1516678, 1508773, 1526550, 1558067, 1549970, 1508430, 1574976, 1597412, 1503144, 1455520, 1547509, 1568152, 1529044, 1538917, 1588552, 1577374, 1495571, 1517750, 1564007, 1530382, 1476344, 1534596, 1489271, 1519946, 1482613, 1511100, 1465292, 1471044, 1463770, 1497336, 1522932, 1542456, 1509981, 1531324, 1650665, 1601391, 1558534]
7242A558534k2076K15M575r0152q307R7376P1549q6057k8816N1133J11074o8237
7230A590811r8727m562O2627R4544J7077m7094r0784n2732Q5774J9571K1062j347
7218A596220j3512L8763J1026p4420m784Q6186K1896n0823J5360M2529k9432L2518
7206A671527k9318o0783L6147m2178L1811j8424M5745O1869j462m6833q6402J16742
7194A678441M3555Q0153Q8396j18013o2884j2534L2209M4896l2201N6345R2121
7183A890484L7393K4410N9034l5747J21772J02898L3493p0344k8746J1552o4192
7172B082007M4675N1157q2484O5216p0316j0039o5789j41105q0953n36j369o5482
7160A724982n1490r5794Q0206L20k9665r0740J2090J4997l5247O3894J3184K1071
$$ y = [1558534, 1536458, 1536673, 1541248, 1451096, 1442789, 1540165, 1611714, 1525657, 1496841, 1547974, 1659048, 1590811, 1492084, 1487522, 1550149, 1644693, 1661770, 1614676, 1523892, 1471160, 1556934, 1576505, 1597567, 1596220, 1582708, 1621471, 1632497, 1558077, 1553293, 1639479, 1661375, 1610552, 1625912, 1668441, 1639009, 1671527, 1642209, 1581426, 1617573, 1575395, 1607206, 1588782, 1634527, 1696396, 1694934, 1648101, 1561699, 1678441, 1721996, 1802149, 1890545, 1772532, 1709648, 1697114, 1729323, 1774219, 1742018, 1798363, 1890484, 1927877, 1952287, 2011321, 1975574, 2097346, 2200244, 2233737, 2163393, 2134647, 2146199, 2082007, 2126682, 2177839, 2095355, 2160571, 2090255, 2080216, 2014427, 1873322, 1792369, 1791833, 1790464, 1724982, 1673492, 1577698, 1657904, 1658224, 1628559, 1537819, 1549909, 1564906, 1529659, 1593553, 1606737, 1627808]
7148A627808n9973L5683l4953m1024j7220K2383K5753o6143K391q423J04636j3444
7136A577474n0009J42990j7136q0249K0843J12048R6595J7971j6369p57N7624
7125A861025L0144J23612K9204j24377k1605K2177J00518n7932K7996M2901n8109
7114A975554j74053j22468M3745k7391p7689q4034q8066L7853l1307P5863j43355
7103A384652p1355L1302K3509n2229j89563Q8579J73456o5697k14Q899o3731K1186
7091A288794O6124j0351m3413N0763k3328n7454l9423M2564k5936k2834o1866
7080A163640k6835K7545M0718n6280N1287k6218R5292j3595m2941K81K7986n3345
7068A187535l9768M8178L5554j15703Q8857J27645j11384m1489J14181n5201m0919
$$ y = [1627808, 1567835, 1603518, 1568565, 1527541, 1510321, 1532704, 1558457, 1492314, 1494705, 1486282, 1590918, 1577474, 1527465, 1670455, 1653319, 1573070, 1593913, 1705961, 1802556, 1820527, 1804158, 1803401, 1861025, 1891169, 2014781, 2043985, 1919608, 1898003, 1920180, 2020698, 1962766, 1990762, 2033663, 1975554, 1801501, 1679033, 1722778, 1695387, 1617698, 1533664, 1445598, 1483451, 1452144, 1528007, 1384652, 1313297, 1344599, 1368108, 1315879, 1126316, 1214895, 1388351, 1322654, 1322440, 1331339, 1267608, 1288794, 1354918, 1344567, 1301154, 1351917, 1328589, 1271135, 1231712, 1274276, 1248340, 1225506, 1163640, 1136805, 1164350, 1205068, 1148788, 1200075, 1173857, 1269149, 1255554, 1212613, 1212894, 1240880, 1187535, 1147767, 1195945, 1231499, 1115796, 1204653, 1332298, 1220914, 1179425, 1293606, 1238405, 1197486]
7057A197486J1194j34001j9016Q1354Q4049J6578m9431L9753J2231k5791n1664
7046A162742n7582o6828K3790J03066J8453k0953k6448m6043J0708k5556J47808
7035A223157J6282j15954p9161L0467J5579n0822K9855k620j7419N6059K670R248
7023A117341J8150j2429n0340j6770J2897J20268j1635l8727Q986M5454k3303
7012A169892j42768L914k9032k1674k2092R2681n9078O1167m9352Q2988O6336
7001A152982l4282o1596o581K3930p8814P3421R4303n6609p6066k1151M5136k0402
6989A034271k0205O8131N6489l7963m7820j1292N4259p0727j9165l0788j9778
6978I55412P7987R5204r5187K7094j10897L1718J03341o1700l3778j2481N2266
$$ y = [1197486, 1208680, 1074679, 1055663, 1137017, 1221066, 1237644, 1188213, 1227966, 1240197, 1214406, 1162742, 1105160, 1038332, 1062122, 1165188, 1183641, 1162688, 1136240, 1090197, 1100905, 1075349, 1223157, 1239439, 1123485, 1044324, 1074791, 1090370, 1039548, 1069403, 1066783, 1049364, 1105423, 1108093, 1117341, 1135491, 1123062, 1072722, 1055952, 1068849, 1189117, 1177482, 1138755, 1147741, 1193195, 1169892, 1027124, 1031038, 1002006, 980332, 958240, 1050921, 991843, 1053010, 1003658, 1086646, 1152982, 1118700, 1057104, 1050523, 1074453, 995639, 1069060, 1163363, 1106754, 1030688, 1009537, 1054673, 1034271, 1014066, 1082197, 1138686, 1100723, 1052903, 1041611, 1095870, 1025143, 1005978, 975190, 955412, 1033399, 1128603, 1033416, 1060510, 949613, 981331, 1084672, 1022972, 989194, 976713, 1028979]
6967A028979o8786K7926l3910M146M7439o9521K530K0634n662o2416K7517J47098
6955A065974r017P1019m4346q5195n3528n435J02771k1147O2232O1608o5497p1075
6943A008364M99o5445N9811k4339l4089N4156J2595m2623K4569j8350n5772R4526
6931A013902n0165j15574J1458J23994r5813K6466L9469o2941K2057P8912j9681
6920I72084J990M5949k737n1055N186N6649J0298o4464J3801K3647j6921j63525
6908H30902R6449P3539p0196n7835o8368n373J3991J46488j5212L9946l3714j8833
6896I31784J9776j16909j8981Q3341m2736J78m8447l1138n945j5554O4671j4227
6884H05813N7226J1981m041J3287j5318J0847K6480l5953n6558N6499Q2096l4607
$$ y = [1028979, 960193, 988119, 954209, 958355, 1005794, 936273, 938803, 959437, 953775, 891359, 918876, 1065974, 1056957, 1127976, 1083630, 998435, 944907, 939472, 1042243, 1021096, 1083328, 1144936, 1079439, 1008364, 1008863, 943418, 1003229, 978890, 944801, 998957, 1011552, 968929, 993498, 975148, 919376, 1013902, 963737, 848163, 859621, 983615, 887802, 914268, 953737, 890796, 912853, 991765, 972084, 974074, 1020023, 1017286, 966231, 971417, 1028066, 1038364, 973900, 987701, 1011348, 994427, 830902, 927351, 1000890, 930694, 872859, 804491, 799118, 813109, 959597, 944385, 984331, 950617, 931784, 951560, 834651, 815670, 899011, 856275, 856453, 808006, 776868, 770923, 755369, 820040, 805813, 863039, 875020, 870979, 884266, 868948, 879795, 906275, 870322, 813764, 870263, 952359, 917752]
6872I17752k5722n245J626J6235k3035p9860m0662O1743j0478J2580m7144M0091
6860H17881O0611k9486q296j0772J6463J2645l059r5368J9778O9446L3735m9468
6848H34110q713j09920M1589Q3321j379n062K7660p3024j22510J10011P9004l1872
6836H23215n6162p674N5612J4789l5014q449O7315K8160p5601J1444L7449m2381
6824H12703m319l6977o9022k35r3471J37812o254L1113N9933l7001K5502J2248
6812H32032K1604p5484L6799m4952p4206J05162j5895j10548j4862j5624M6069
6801F90095P502J1251O4305p506q496l9939J7660J10801L4731l9778l4053l5970
6789G70603n3246J52091r6286q4397M5232j831p1124l5099O3675n952n5325Q3723
$$ y = [917752, 892030, 886785, 888411, 904646, 881611, 801751, 761089, 822832, 812354, 824934, 777790, 817881, 878492, 849006, 840710, 829938, 846401, 859046, 855987, 760619, 780397, 849843, 883578, 834110, 825397, 715477, 757066, 840387, 839008, 833946, 861606, 788582, 666072, 776083, 855087, 823215, 767053, 759379, 814991, 829780, 794766, 786317, 853632, 881792, 806191, 817635, 855084, 812703, 808384, 771407, 702385, 702150, 608679, 746491, 740237, 771350, 831283, 794282, 819784, 832032, 853636, 778152, 814951, 769999, 695793, 800955, 785060, 674512, 659650, 644026, 690095, 697597, 708848, 773153, 765647, 757151, 717212, 734872, 845673, 880404, 840626, 806573, 770603, 717357, 869448, 773162, 688765, 733997, 732166, 661042, 625943, 689618, 683666, 628341, 712064]
6777G12064L8106j3213M3147k5024K8535L9921j34557k2195J25012q8411N7177
6766G60562r0090L8337J3246p2710l9564K3242J4650r737N3176n4804N105P0736
6754G12149J1826l3595L4615J8297k604J20369j6448J9601m7077j22439K752q1045
6742F16401r121k2964J11499M1507l4419j9986k6752L8638r765q9577l7238J78100
6730G36323L879n3778l0868j04430O7838N700r1544P9744N0137k159j8790l9655
6718F02397j44702O5624P112O8126O5734n7020n9337j4053O7595l0605l5420j1957
6706E23494N680O515Q9431n1739n6619q863Q3178r757R578P950j04671J4546j2889
6693D95834J9744P8167k5388Q1415j4042j07977j01673l1986J14484K9161N4343
$$ y = [712064, 750170, 736957, 780104, 755080, 783615, 823536, 688979, 666784, 791796, 703385, 760562, 670472, 708809, 722055, 649345, 609781, 633023, 647673, 637936, 691112, 636308, 641413, 712149, 723975, 690380, 724995, 743292, 740688, 861057, 844609, 864210, 817133, 694694, 697446, 616401, 607280, 584316, 695815, 737322, 702903, 682917, 656165, 694803, 685038, 595461, 558223, 736323, 740202, 686424, 655556, 551126, 618964, 624664, 533120, 612864, 663001, 660842, 642052, 602397, 457695, 523319, 530431, 598557, 664291, 607271, 547934, 533881, 601476, 570871, 535451, 523494, 529174, 535689, 625120, 573381, 516762, 507899, 591077, 581320, 590898, 598848, 494177, 508723, 495834, 515578, 593745, 568357, 649772, 635730, 527753, 426080, 394094, 508578, 537739, 592082]
6682E92082j4435l933K1415N952K1622q706L6636N1652j01548q1368N4202J3027
6670E86598J0179L486J3362k622J5093n3102K5292N925o213l1605j24120P4235
6658E16508Q4951J0338k7369l8943q723M0082o9898J0609J31026j17828M4995
6647E75748M2769q3377k8167k7565N6580p9614k6216P5078r104M8741n8166k4977
6635D61730N1687k5390R2493j3077p3198K1155M5830L78o2244j7185k5651K6320
6623D82848q3532L2950J58163k6023k9063j8605o147J3830j00597o325M3244q6449
6611C74294o044R7668m3043N4558j0626l4914l8931r8005O2421q164N0010K2779
6599D22003J720K6097J5631N2566m3082o2786O8570k8858l9809N2380j7120l9160
$$ y = [592082, 577647, 573714, 595129, 601081, 622703, 613997, 650633, 702285, 600737, 519369, 573571, 586598, 596777, 600263, 613625, 611003, 626096, 572994, 598286, 604211, 597998, 566393, 442273, 516508, 601459, 611797, 584428, 545485, 536762, 576844, 506946, 517555, 648581, 530753, 575748, 618517, 535140, 506973, 479408, 535988, 456374, 430158, 505236, 496132, 544873, 486707, 461730, 513417, 488027, 580520, 567443, 494245, 515400, 561230, 561608, 499364, 482179, 456528, 482848, 399316, 432266, 590429, 564406, 535343, 516738, 510591, 524421, 423824, 417499, 460743, 374294, 368250, 465918, 422875, 477433, 466807, 431893, 392962, 294957, 357378, 349214, 399224, 422003, 423723, 449820, 465451, 518017, 474935, 412149, 480719, 451861, 412052, 464432, 447312, 408152]
6587D08152N633L0601P5121Q8463m8699n2715j26490J4154N0326l9060j0294m599
6575C90593K5662M9208k1657m2090N0332P6616o0477k8684K3948m8640L1581Q0978
6563E27370M3910n3955q0044l3192L1754m4774n1760Q1750l5876L2579K2681R0095
6551E30538m2543o4726L3408k5641P4394p9134n4193l6013m0130O4828O6754q3359
6539C44183J24412m9001j5391O4886j0640j1241p7384N847M267L7156K761r276
6527D10579L2460o645k3733K2083R318n2374J720r5047Q7728L0238r4476J0127
6515C31978L6223R5397p2899k8623J16910j0436k6480j0339q2746M1894j0528
6504C80351j9730Q6531r2755J7478J8356J4167L2828o6155p073R9638Q412l8185
$$ y = [408152, 413785, 444386, 519507, 607970, 559271, 506556, 380066, 394220, 444546, 405486, 395192, 390593, 416255, 465463, 443806, 401716, 452048, 528664, 468187, 439503, 463451, 414811, 446392, 527370, 571280, 517325, 437281, 404089, 435843, 391069, 339309, 421059, 385183, 417762, 440443, 530538, 487995, 423269, 456677, 431036, 505430, 426296, 372103, 336090, 295960, 360788, 427542, 344183, 468595, 419594, 404203, 469089, 458449, 447208, 369824, 375671, 379938, 417094, 419855, 410579, 443039, 436394, 412661, 434744, 444062, 391688, 393408, 298361, 386089, 416327, 321851, 331978, 368201, 463598, 390699, 362076, 478986, 468550, 442070, 431731, 348985, 390879, 380351, 360621, 447152, 354397, 371875, 390231, 404398, 437226, 371071, 363998, 463636, 472048, 433863]
6492D33863o2918M2201j4553n9576J12478n9504K02J11009j72574j5854o378K7210
6480C35606L1609n6510M2678L4541k9035j665J10015r0017K2514O664k1215m5761
6468C39424J7655j0467n0685k6766K7773N357R2172m6199M3458j2926m5259O723
6456C40260m0735o352l3655K2732N3636n9869j591J46238J8471l3250R079J5137
6444D30101Q777l9268R252L9622n4444j5037K1500n4576l210K8014q5952J0206
6432B94985L1418m6069J1849L6025Q0538L3121p7261r39L094K5741q246M2576
6420D26832K2929J9331j0837P612j6053p4118J6952L4976k6884o1427N368J02596
6408D47277o5942o489L0008P4044L803j3012q6391j6815R025n124m9599j0972
$$ y = [433863, 370945, 413146, 398593, 339017, 451495, 391991, 392193, 503202, 330628, 314774, 308396, 335606, 367215, 310705, 353383, 387924, 358889, 357224, 467239, 377222, 399736, 406400, 385185, 339424, 357079, 346612, 295927, 269161, 296934, 302291, 394463, 348264, 391722, 378796, 333537, 340260, 299525, 293173, 259518, 282250, 335886, 276017, 274426, 420664, 439135, 405885, 414964, 430101, 438878, 399610, 408862, 448484, 394040, 379003, 400503, 345927, 342717, 370731, 284779, 294985, 326403, 280334, 292183, 328208, 408746, 441867, 364606, 363667, 366761, 392502, 384256, 426832, 449761, 469092, 458255, 465867, 449814, 375696, 392648, 427624, 400740, 339313, 344681, 447277, 381335, 374846, 404854, 478898, 482701, 469689, 383298, 366483, 375508, 370384, 320785, 309813]
6396C09813M5168p6520k071M1851P6828O3714j8251j09042J0232j8601n630N2302
6384C69793J06926j04739M2095l8100o9167M1031M4260l1735n3485P9430K8077
6373D14386m2961O4107r4130O3233m1450j5551n968m3532N0395k9440q3782K4451
6361B59758Q2267O5600R3187l4862K396l9671n0705L4314l5813K7284Q6511j2480
6349D77786o3906J7721L1236m9024P0516N4157o3074n8138j3166o5688l4M5530
6337C83916O7147n9471J0064j8717J03846m6377n4457L0202m7453r1666J09767
6326C86801J5015K1068j0106l3513K322l2662q649M7456N4508q971O627r6991
6314C42905N5198J09918m2256J617O4000L418k8647L5138M6148m2586l0110l9597
$$ y = [309813, 354981, 278461, 276390, 318241, 395069, 458783, 440532, 331490, 341722, 323121, 317491, 369793, 476719, 371980, 414075, 375975, 306808, 347839, 392099, 360364, 306879, 386309, 414386, 371425, 435532, 341402, 404635, 363185, 347634, 341666, 298134, 348529, 319089, 235307, 259758, 342025, 407625, 500812, 465950, 468346, 428675, 377970, 412284, 376471, 403755, 490266, 477786, 413880, 431601, 462837, 413813, 484329, 538486, 475412, 417274, 404108, 338420, 338386, 383916, 451063, 391592, 401656, 382939, 486785, 440408, 385951, 416153, 368700, 277034, 386801, 401816, 422884, 412778, 379265, 381587, 348925, 340276, 387732, 442240, 433269, 439896, 342905, 398103, 508021, 465765, 467382, 531382, 534800, 506153, 541291, 587439, 544853, 514743, 475146]
6302D75146n2574K0445r77K7861M9371j9504l0775M7800j07p316j93948k0101
6290B95321p45L7505J61397m5783k2101N3836K2898K3159p842N2649m4780q4598
6278D40916J03024j8696m504o0696M0734j7595J1849q562J881J07038R0046j12890
6266E72545J4530o9342l6003M8085P1302m8579j7756p9553O4366Q2208m439o5632
6254E31732o0351Q3716J1744P8934l5904R972o4299J4456n3345p9749L6268n0478
6242D22696J2251P4604r012p7047l8144Q0809N1474K6719n9343l6763k8658L6147
6230D55733L7580q896l8175n7670j4436J2309N1320J4157k4052r1813N1209J1679
6218C98945M3882L4712j1080j17135K9896K7013J1100j9641J832M460j12612J9209
$$ y = [475146, 422572, 443017, 442040, 469901, 519272, 499768, 468993, 516793, 516686, 509370, 315422, 295321, 294576, 332081, 493478, 447695, 425594, 479430, 502328, 525487, 517645, 570294, 525514, 440916, 543940, 525244, 520740, 460044, 500778, 483183, 495032, 486470, 488351, 595389, 685435, 572545, 587075, 517733, 481730, 529815, 601117, 552538, 534782, 455229, 519595, 601803, 597364, 531732, 471381, 555097, 566841, 645775, 609871, 619843, 555544, 570000, 516655, 436906, 473174, 422696, 434947, 509551, 500539, 423492, 385348, 466157, 517631, 544350, 485007, 448244, 419586, 455733, 493313, 484417, 446242, 388572, 374136, 386445, 437765, 451922, 427870, 336057, 387266, 398945, 442827, 477539, 466459, 349324, 379220, 406233, 417333, 397692, 399524, 403984, 291372, 310581]
6206C10581P5573R0287q0836P9793m4216p4494P396j4963L9577J9243O410L9805
6194D54156O1013l8720n625M36m3049m9992R7941J2710l0688L7949q611J1078
6182D98598j19662N9420J1477L192o823L4905j1109J3286L7481Q33l4101R6359
6170E83856l4805q7077n0088O123L1655k0653P1492L5373l648N8756o7950o8991
6158D54043p8881n5028O9474K1335P3023O1607n7696R9471P06j06708j8558J3854
6146D76642R1291p141o9937p5161N0694J05391J9201p2644N7947r4189K3090J09206
6134F14390K0557O973K971k6880J6596k176j3528N8129m0089r6854P2762N5556
6122F68407p1155o3701R6232m5151l3546P8516P5639m3629L1599L124J3326l4926
$$ y = [310581, 386154, 476441, 395605, 475398, 431182, 356688, 364084, 349121, 388698, 407941, 414351, 454156, 515169, 476449, 470824, 471260, 428211, 378219, 476160, 488870, 458182, 496131, 487520, 498598, 378936, 438356, 449833, 453025, 446202, 481107, 469998, 483284, 520765, 521598, 487497, 583856, 549051, 461974, 411886, 418009, 449664, 429011, 500503, 535876, 532228, 590984, 523034, 454043, 375162, 320134, 389608, 410943, 483966, 545573, 487877, 587348, 588054, 481346, 462788, 476642, 567933, 560792, 490855, 415694, 466388, 571779, 590980, 518336, 576283, 482094, 505184, 614390, 634947, 641920, 644891, 618011, 634607, 632431, 618903, 677032, 636943, 540089, 612851, 668407, 597252, 533551, 629783, 584632, 551086, 629602, 705241, 661612, 693211, 696335, 709661, 674735]
6110F74735p856L0180J7038J60437k4413j1891N5496j0101L0655l001J2153k6847
6098H96585r6174J9131k8360o3182O3379o6389o6234r606K0672N518n5085K2799
6086F43054J3650m9945P7717L1941j38847N0261l4358j21893J54949N2702m1798
6075F37433P4646p2885m6854m5034Q1081j8828j4616R5495j9190q4635j20420
6064D66193O8057P7386r791p5419Q4872l848L2932o018n0095K4252N1439k3951
6052F36009m7892K5796L863M0116J0523j5654l4999l1991L391M5869k0101L8338
6040F53268k1017O5043M4105o9199q19L1914p171K0432q5174N224J05836J18014
6028H60456N031o8251m1936L4926R2728Q925j01734N1186K07o1691p3520N8889
$$ y = [674735, 666879, 697059, 714097, 874534, 850121, 838230, 893726, 883625, 914280, 911279, 923432, 896585, 800411, 819542, 791182, 728000, 791379, 724990, 658756, 649150, 669822, 675340, 620255, 643054, 656704, 606759, 684476, 716417, 577570, 627831, 593473, 471580, 626529, 679231, 637433, 712079, 639194, 592340, 547306, 628387, 609559, 594943, 690438, 671248, 586613, 466193, 534250, 611636, 601845, 526426, 611298, 607450, 640382, 634364, 584269, 608521, 659960, 636009, 588117, 613913, 617776, 657892, 668415, 652761, 617762, 585771, 589162, 635031, 614930, 653268, 632251, 697294, 741399, 672200, 671381, 703295, 696124, 716556, 631382, 636606, 742442, 860456, 865487, 797236, 755300, 790226, 882954, 891879, 790145, 841331, 841538, 779847, 706327, 765216]
6016G65216M6401k4519N2451o0982k2671O1259J304L791m3424j7989N0767n6571
6004G55033k0304R4746n2839M9173r5434r531j0608N7987Q5307j12818L1916R2690
5992H65318L6036k6629n4123K2879N2690M7151N7251m8587m6377J08086o2351
5981I51344m256k7307n279o901J6056J4632L0705L3306m921R9601l9532K9163
5969A086611m6108P2782p3443M6432j5623J842J00622O4595L8114j0527k6853
5958A238444J9525J02574o8863r2209M9306m1450J3197M9722N4302J7511O2375
5947A404434l886j39662o0823J33834q9511o1784N3428J19012N657m5167N7663
5936A373195M2479m8515q900n2895k4218J68822R2367r692j2762j5614K2548P3619
$$ y = [765216, 811617, 787098, 839549, 778567, 755896, 817155, 818459, 822250, 778826, 760837, 811604, 755033, 734729, 829475, 776636, 825809, 730375, 720844, 710236, 768223, 853530, 740712, 772628, 865318, 901354, 874725, 820602, 843481, 896171, 943322, 1000573, 951986, 905609, 1013695, 951344, 947088, 919781, 914502, 907601, 923657, 938289, 968994, 1002300, 997379, 1096980, 1057448, 1086611, 1040503, 1113285, 1039842, 1086274, 1070651, 1072493, 1173115, 1237710, 1275824, 1265297, 1238444, 1257969, 1360543, 1291680, 1199471, 1248777, 1207327, 1220524, 1270246, 1324548, 1342059, 1404434, 1400548, 1260886, 1200063, 1333897, 1244386, 1182602, 1236030, 1355042, 1360699, 1315532, 1373195, 1415674, 1367159, 1358259, 1305364, 1281146, 1449968, 1542335, 1532643, 1519881, 1504267, 1526815, 1600434]
5924A600434k8119J422J8306m770M1050M9475M8350m6643J8298P3787L475M9761
5912A824826L4348L1330K044J39977N1508M766N6833n4362j589m2599l1458N0284
5900B065908l4392p7830m4301k3016m9942M1416M4521J3704J7765K3227m8338
5889A928722N159J16335n6584J1388M3040j6644j12083m0604O417K3565L1050
5878A939761K5308L8283R5636l4024L7533J36569o6611o7223p1860k1244N3054
5867B065182J14195L7784K5066N7206j00419q1364R0354J44651m0086o8627M5846
5856B289788M2233J6214n9024p2403M6833l085M9504J25548j2172j3601n5804
5845B354031N9215K2862j4151r277J600L1080L4263J3212R303n9673N2331l4257
$$ y = [1600434, 1572315, 1573737, 1592043, 1587273, 1628323, 1677798, 1726148, 1679505, 1697803, 1771590, 1775065, 1824826, 1859174, 1890504, 1892548, 2032525, 2084033, 2088799, 2145632, 2091270, 2089681, 2047082, 2015624, 2065908, 2031516, 1953686, 1909385, 1886369, 1836427, 1877843, 1922364, 1936068, 1953833, 1977060, 1928722, 1933881, 2050216, 1993632, 2005020, 2048060, 2031416, 1919333, 1878729, 1885146, 1908711, 1939761, 1965069, 2003352, 2098988, 2064964, 2102497, 2239066, 2172455, 2105232, 2033372, 2012128, 2065182, 2179377, 2217161, 2242227, 2299433, 2199014, 2117650, 2208004, 2352655, 2312569, 2243942, 2289788, 2332021, 2348235, 2289211, 2216808, 2263641, 2260556, 2310060, 2435608, 2423436, 2409835, 2354031, 2413246, 2436108, 2421957, 2412680, 2414280, 2445360, 2479623, 2492835, 2502138, 2442465, 2494796, 2460539]
5833B460539J07103L9897P4998K4114J7619m9861M2029J34665O9549j0357n1923
5822B858372P8034J30151L6255K6970J32965O8804o7025M3056K7301j3107J32861
5811C454637N2612N6143l0912J4820R3083N9594J23052k4344j4609J19568P1644
5800C975288j4531J37740O8843o3766J49343N1583O2017J37555K08980J51818
5790D864870P1610J36060J55846O8602L4573J41559J34895J16973O0460m1634
5780E743814P6053Q1022N5202J50129P3327L6941O6219J41927K31114J36847J05624
5769F898219K55588K19666J56751K83847K33486J25562o966L6051K19078K07365
5759H628647J48053K68256K27219L79954L61670K81837M51743L07160K55208K63433
$$ y = [2460539, 2567642, 2607539, 2682537, 2706651, 2724270, 2674409, 2716438, 2851103, 2920652, 2910295, 2858372, 2936406, 3066557, 3102812, 3129782, 3262747, 3331551, 3264526, 3307582, 3334883, 3321776, 3454637, 3507249, 3563392, 3532480, 3547300, 3640383, 3699977, 3823029, 3798685, 3784076, 3903644, 3975288, 3960757, 4098497, 4167340, 4103574, 4252917, 4304500, 4366517, 4504072, 4713052, 4864870, 4936480, 5072540, 5228386, 5296988, 5331561, 5473120, 5608015, 5724988, 5785448, 5743814, 5819867, 5900889, 5956091, 6106220, 6179547, 6216488, 6282707, 6424634, 6655748, 6792595, 6898219, 7153807, 7373473, 7530224, 7814071, 8047557, 8173119, 8166153, 8202204, 8421282, 8628647, 8776700, 9044956, 9272175, 9652129, 10013799, 10295636, 10747379, 11054539, 11309747, 11573180]
5749A1573180K09902J04224J63303J34002p0692r3219n5500Q0621L0087q518j6185
5738A2051205k9192K1982Q5259L2424J15880J79853L32740K36022K30536K89163
5728A3545872M64217M24438N20074O96918O14682O99050J009071Q99716R55966
5719A9830004J077736J283144J258662J254190J011023P26890M68589n3020l66933
5710B6490285n75674q64932q55167o46959o27023n14306m35992l12481l52707
5701B1305044k19238j39099J2846j37713j8862O695R1262J72154K49050K48977
5691B1571116K07635K20769L20296M28504M30910L44512M76523M66005N39365
5682B5005635O43581P16122P66281Q13664R68685J046472J222240J224037J373391
$$ y = [11573180, 11783082, 11887306, 12050609, 12184611, 12113919, 12020700, 11965200, 12045821, 12075908, 12067390, 12051205, 12022013, 12043995, 12129254, 12161678, 12277558, 12457411, 12790151, 13026173, 13256709, 13545872, 14010089, 14434527, 14954601, 15651519, 16266201, 16965251, 17974322, 18874038, 19830004, 20907740, 22190884, 23449546, 24703736, 25714759, 26441649, 26910238, 26857218, 26490285, 25914611, 25049679, 24194512, 23547553, 22920530, 22406224, 21970232, 21657751, 21305044, 21085806, 20946707, 20959553, 20821840, 20802978, 20809673, 20900935, 21073089, 21322139, 21571116, 21778751, 21999520, 22319816, 22748320, 23179230, 23523742, 24000265, 24466270, 25005635, 25649216, 26365338, 27131619, 27945283, 28913968, 29960440, 31182680, 32406717, 33780108]
5673C3780108J319146J514770J616753J573325J544551J362192R47016L36156
5665D3994017j81960r56018j560307j770599j799652j888906j651196j541323
5657C2644056j403364j061273j047499p83313n67487n17333l16155k53001p9987
5648B6614644O9431J32400K49524M44541O03187O50903P20941R19086R42947J163833
5638C2511437J261938J275195J222557J185933R89961P24350M14633K08201k34934
5629C9559271p52745p48485q66155j007098q09693p36994o42819m44725k63085
5620C3287472n0393P2763K21956L77520N44137O02443N95315N60433N92504M04900
5610C7209050L06999P1842j52254k17577k74771m29724k70544k95038k65785j73937
$$ y = [33780108, 35099254, 36614024, 38230777, 39804102, 41348653, 42710845, 43657861, 43994017, 43812057, 42856039, 41295732, 39525133, 37725481, 35836575, 34185379, 32644056, 31240692, 30179419, 29131920, 28348607, 27781120, 27263787, 26947632, 26694631, 26614644, 26684075, 26816475, 27065999, 27510540, 28113727, 28764630, 29485571, 30404657, 31347604, 32511437, 33773375, 35048570, 36271127, 37457060, 38447021, 39171371, 39586004, 39794205, 39559271, 38806526, 38058041, 37191886, 36184788, 35375095, 34638101, 33995282, 33550557, 33287472, 33237079, 33309842, 33531798, 33909318, 34453455, 35055898, 35651213, 36211646, 36804150, 37209050, 37516049, 37587891, 37435637, 37218060, 36943289, 36513565, 36243021, 35947983, 35682198, 35508261]
5600C5508261j05029m1604J40613J47088L27101L88992M07269N46446P52291Q06333
5590C8877761R57822J207403J267311J464085J524449J704868J871230K186808
5582E1061737K341215K593762K718107K882598L023092K931227K672465K294245
5574G2518448J861265J232348L50993l30986j048578j708955k108167k168946
5566F8597422k290798k312362k160382k031579j804655j720601j555239j351609
5558E3370197j100190r28780p96201o98191m35762m39017n07497l49427l87858
5549D7727274k70868j79425k08628q5502Q7056K29413N19890P69792Q93151J083640
5539E0565793J301901J374731J265927J375610J603530J206200J019893Q35550
$$ y = [35508261, 35403232, 35361628, 35502241, 35649329, 35976430, 36365422, 36772691, 37319137, 38071428, 38877761, 39835583, 41042986, 42310297, 43774382, 45298831, 47003699, 48874929, 51061737, 53402952, 55996714, 58714821, 61597419, 64620511, 67551738, 70224203, 72518448, 74379713, 75612061, 75963054, 75632068, 74583490, 72874535, 70766368, 68597422, 66306624, 63994262, 61833880, 59802301, 57997646, 56277045, 54721806, 53370197, 52270007, 51341227, 50545026, 49846835, 49411073, 48972056, 48464559, 48115132, 47727274, 47456406, 47276981, 47068353, 46982851, 47069907, 47299320, 47819210, 48589002, 49482153, 50565793, 51867694, 53242425, 54508352, 55883962, 57487492, 58693692, 59713585, 60549135]
5531F0549135M24542Q700n45383q77385j270050j539111j704313j929294k169805
5522E0947036k480043k478103k584459k668521k512792k375300k173511j976962
5514C1697345j733802j579749j293919j234875j167838j249868j184920r41290
5506B1311084p14262p21622n55943n47258m83022l09446l91551m95770l32094
5497A6760116k39894m49867l16326m40234m01572l03217l46711l74701l43998
5488A3543596k86885l05973k88981k97916l11546m39369m73271l56400l07266
5479A0475989m05741m36095k20505k47250k74052k20575k59531j79466j80301
5470H052473j79758k04343k06791r2379j59986j38124q2208j06157o9534j12587
$$ y = [60549135, 60973677, 60982377, 60436994, 59559609, 58289559, 56750448, 55046135, 53116841, 50947036, 48466993, 45988890, 43404431, 40735910, 38223118, 35847818, 33674307, 31697345, 29963543, 28383794, 27089875, 25855000, 24687162, 23437294, 22252374, 21311084, 20596822, 19875200, 19319257, 18771999, 18288977, 17979531, 17587980, 17092210, 16760116, 16520222, 16070355, 15754029, 15313795, 14912223, 14609006, 14262295, 13887594, 13543596, 13256711, 12950738, 12661757, 12363841, 12052295, 11612926, 11139655, 10783255, 10475989, 10070248, 9634153, 9413648, 9166398, 8892346, 8671771, 8412240, 8232774, 8052473, 7872715, 7668372, 7461581, 7369202, 7209216, 7071092, 6988884, 6882727, 6813193, 6700606]
5460F700606r6032j48830k6534J2851j33796j03193l8405j06355m8576j2803q2023
5449E916910o3662K9774M1792m7898q7119J7816N1044p5529k0684j03922n2335
5438E606187m5271R829j0064l5435K7919K3333O4375k7233Q5478M2423j1444K0529
5426E750626k9410j3933N8364J12548J21803Q3050L0512J96758J41123R7281R3950
5415F642672n3955J26370J23072M0984K2207l6225l5332j5623O4830j4958P391
5404F871433l6169M2284R2407j6629k635o1858M2350P3405L2851K3331q322P4655
5392G127103M537p4528P8180J64438J88116R6608J33514J06849J43850K09971
5382H178638K68261J93447L8442j39489k83829j21257j73851n1214r199L7128
$$ y = [6700606, 6604574, 6455744, 6429210, 6442061, 6308265, 6205072, 6166667, 6060312, 6011736, 5998933, 5916910, 5853248, 5883022, 5924814, 5876916, 5789797, 5807613, 5858657, 5783128, 5762444, 5658522, 5606187, 5560916, 5570745, 5560681, 5525246, 5553165, 5576498, 5640873, 5613640, 5699118, 5741541, 5730097, 5750626, 5721216, 5707283, 5765647, 5878195, 5999998, 6083048, 6113560, 6310318, 6451441, 6548722, 6642672, 6588717, 6715087, 6838159, 6879143, 6901350, 6865125, 6829793, 6814170, 6879000, 6864042, 6871433, 6835264, 6877548, 6969955, 6953326, 6950691, 6888833, 6931183, 7004588, 7037439, 7060770, 7052448, 7127103, 7131640, 7057112, 7135292, 7299730, 7487846, 7584454, 7717968, 7824817, 7968667, 8178638, 8446899, 8640346, 8678788, 8539299, 8255470, 8134213, 7960362, 7909148, 7899949, 7937077]
5372G937077L7345M0455J37869P2323O1116P2535O7401J51081J28335J77712J26013
5361I009262J61053J09130K01193K19023K54095K79956K67532L30509M31473M73581
5351A1736807M13866M44998N31740L87822J67852J85042L19103L64740N62877
5342A5114847O04092N96791P38228Q46473R56386R83913J100609J125498J081710
5333B3148547J209607J036353R84794R72060N06013L28590j7290k90667n02931
5324B7375076p45503q63578r57595r15838q08622q57935p38013p89687p28866
5315A9969439n48883m23667m17178l04971k38363j01729l7960o0664N4561J22967
5305A8013552Q1850K14570J44180K37184L40390M11475K84684K40834L71591M52707
$$ y = [7937077, 7974422, 8014877, 8152746, 8225069, 8286185, 8358720, 8426121, 8577202, 8705537, 8883249, 9009262, 9170315, 9279445, 9480638, 9699661, 9953756, 10233712, 10501244, 10831753, 11263226, 11736807, 12150673, 12595671, 13127411, 13515233, 13683085, 13868127, 14187230, 14551970, 15114847, 15718939, 16315730, 17053958, 17900431, 18856817, 19840730, 20941339, 22066837, 23148547, 24358154, 25394507, 26379301, 27351361, 27857374, 28185964, 28168674, 27878007, 27375076, 26629573, 25765995, 24808400, 23892562, 23083940, 22226005, 21487992, 20698305, 19969439, 19420556, 18996889, 18579711, 18274740, 18036377, 17934648, 17896688, 17836024, 17890585, 18013552, 18095402, 18309972, 18454152, 18691336, 19031726, 19443201, 19727885, 19968719, 20340310, 20793017]
5295B0793017N21934N49047O41036O83055P28851P87586Q98772R43459J083594
5286B7630351J188178J227814J404558J567391J926274K120322K187045K395168
5278D1647101K619074K865812L097724L319538L346640L387330L382346L061510
5270F6727075K692381K001910J367439O18033m48833j359550k070004k500171
5262F7028280k864081l098896l295056l301099l196185k747313k645434k493160
5254D3387056k174628j827418j550940j351748j151190r32573n10430m04828j81740
5245C3301561J28463K56483L35728M71989P95053J069412J171529J417803J720753
5236D0668774J888399K116885K185888K598337K713568K793311K508851K629912
$$ y = [20793017, 21314951, 21863998, 22505034, 23188089, 23916940, 24704526, 25603298, 26546757, 27630351, 28818529, 30046343, 31450901, 33018292, 34944566, 37064888, 39251933, 41647101, 44266175, 47131987, 50229711, 53549249, 56895889, 60283219, 63665565, 66727075, 69419456, 71421366, 72788805, 73406838, 72958005, 71598455, 69528451, 67028280, 64164199, 61065303, 57770247, 54469148, 51272963, 48525650, 45880216, 43387056, 41212428, 39385010, 37834070, 36482322, 35331132, 34398559, 33888129, 33483301, 33301561, 33430024, 33686507, 34022235, 34494224, 35289277, 36358689, 37530218, 38948021, 40668774, 42557173, 44674058, 46859946, 49458283, 52171851, 54965162, 57474013, 60103925]
5228F0103925K343840K121869J708341J070547L86789l78688j182726k118813
5220F4055084k361440k815978l120853l345384l478900l404528l196120l096421
5212C9235460k932769k691357k590462k208352k001870j773207j535949j325120
5204B2176374j231145j122327q57383p19619p21311o84485m95481n76255m54750
5195A5313618m60559m21414k75998m59219l61286k93817k14639j46623k67083
5186A2412980r00n2723M3115l2464J02232J45240J57463J21283L54035L12013
5176A3562274N23164M68975O10001O82860O91084Q16540Q18592Q30920P89975
5167A9794385P72510N82122N88224L62525J27052j30039m37125p42236q29503
$$ y = [60103925, 62447765, 64569634, 66277975, 67348522, 67735311, 67356623, 66173897, 64055084, 61693644, 58877666, 55756813, 52411429, 48932529, 45528001, 42331881, 39235460, 36302691, 33611334, 31020872, 28812520, 26810650, 25037443, 23501494, 22176374, 20945229, 19822902, 18965519, 18245900, 17524589, 16840104, 16344623, 15768368, 15313618, 14853059, 14431645, 14155647, 13696428, 13335142, 13041325, 12826686, 12680063, 12412980, 12412080, 12359357, 12402472, 12370008, 12472240, 12617480, 12774943, 12896226, 13250261, 13562274, 14085438, 14554413, 15164414, 15847274, 16538358, 17354898, 18173490, 19004410, 19794385, 20566895, 21149017, 21737241, 22099766, 22226818, 22096779, 21659654, 20917418, 20087915]
5158B0087915j078041r39529j056726j104621r36479j014351q81087q41845q08627
5149A1426609p82259n62893n26495n32131n03694l64951k78262l36523k84283
5140G255118k96680k01246j53710k46815k73221k16511j78354o9116n6075j65450
5130E397940r6022o2036k04917n8714q5886k5435m6376k61028q7607n3726n4983
5119D361210m6916j40221j71438j12996M693O1343O4264j1944k5083j83404j00696
5108C698812J5615j8134O4810M0285m0552j6212l1073M5281r0724O2049l6398
5097C693759o3543J02262O6982n8077r6742P4670k1555o9942L5427o6378L8081
5086C634944o4268K5578m7337k9512k2947r6230p9871m867m916J1568P8477j01912
$$ y = [20087915, 19009874, 18070345, 17013619, 15908998, 14972519, 13958168, 13077081, 12235236, 11426609, 10644350, 10081457, 9554962, 9022831, 8519137, 8154186, 7875924, 7539401, 7255118, 6958438, 6757192, 6603482, 6356667, 6083446, 5866935, 5688581, 5619465, 5563390, 5397940, 5301918, 5239882, 5034965, 4976251, 4890365, 4864930, 4818554, 4557526, 4469919, 4416193, 4361210, 4314294, 4174073, 4002635, 3889639, 3894332, 3955675, 4019939, 4007995, 3982912, 3799508, 3698812, 3714427, 3696293, 3761103, 3801388, 3760836, 3744624, 3713551, 3758832, 3668108, 3730157, 3693759, 3630216, 3732478, 3799460, 3741383, 3644641, 3719311, 3697756, 3627814, 3663241, 3596863, 3634944, 3570676, 3596254, 3548917, 3519405, 3496458, 3400228, 3320357, 3315490, 3310574, 3322142, 3400619, 3298707]
5074C298707N0986Q4572k0132j14221j06090M9970k5650J22600M0654n3949N8332
5063C385779p8420K8613k9350n8340j24135r2589M1649L8025p1921L9651q9965
5052B988997K255Q2063P0820N3973m5572J05398J21740J14098J57212K34951K48046
5041D133981L26348K39289R0534M5934k24465l60359k62329k98438k05375q3401
5031C401719j88164q631r1328p3358P3186j6636m6960m0063r0266j1551q0395
5020B827553J6785M4238o7225n0335R1650p270Q706O920k3242J32161K084j52787
5008B829238l118J663M7091q64k7046N5273k7297j5635L1632L1020M722N5140
4996B981819o8542j19022m3678P5182J38095L2768O5103Q0527p714Q3884K9341
$$ y = [3298707, 3349693, 3434265, 3414133, 3299912, 3193822, 3243792, 3218142, 3340742, 3381396, 3327447, 3385779, 3307359, 3335972, 3306622, 3248282, 3124147, 3031558, 3073207, 3111232, 3039311, 3078962, 2988997, 2991252, 3073315, 3144135, 3198108, 3152536, 3257934, 3379674, 3493772, 3650984, 3885935, 4133981, 4460329, 4699618, 4790152, 4836086, 4611621, 4251262, 3988933, 3690495, 3485120, 3401719, 3213555, 3204924, 3113596, 3040238, 3113424, 3096788, 3049828, 3009765, 2919499, 2907948, 2827553, 2844338, 2888576, 2821351, 2771016, 2862666, 2855396, 2864102, 2871022, 2847780, 2979941, 2982025, 2829238, 2826120, 2827783, 2874874, 2874010, 2846964, 2902237, 2874940, 2859305, 2890937, 2921957, 2926679, 2981819, 2913277, 2794255, 2750577, 2825759, 2963854, 2996622, 3061725, 3142252, 3134538, 3218422, 3247763]
4985C247763J40964R8454J03874J53198J14721K74615L21991K68579J00752j25430
4975D699481j2687m8509l09933k41246m8080j40446j56884L3329P8295p4000k7142
4964C752178J6723n9618Q2863n0551j52048l6062J9434j0260q7380j23033j54305
4953C197941o990J0260j2422l9072p6339k420o3077M4655R6130R1785J03291m0865
4941C302877n0356L8934N8404K1763m6791M710m5436m3189R0393K7743J250J5425
4929C375727K4583R3212N8264j37730l4168J74549J38434O7418J07170L1597k3877
4918C875179O3923O5049Q044M3815N8102P6018J42481Q7111J34362M6537J11222
4907D711843o455Q8696J39168L2190K6405r8798o2364j48697j99153j64242n0407
$$ y = [3247763, 3388727, 3487181, 3591055, 3744253, 3858974, 4133589, 4455580, 4724159, 4824911, 4699481, 4686794, 4638285, 4328352, 4087106, 4039026, 3898580, 3741696, 3775025, 3853320, 3779320, 3752178, 3768901, 3709283, 3792146, 3741595, 3589547, 3553485, 3572919, 3562659, 3475279, 3352246, 3197941, 3190951, 3201211, 3188789, 3149717, 3073378, 3070958, 3007881, 3052536, 3148666, 3240451, 3343742, 3302877, 3252521, 3291455, 3349859, 3371622, 3324831, 3329541, 3284105, 3240916, 3331309, 3359052, 3360302, 3375727, 3400310, 3493522, 3551786, 3414056, 3379888, 3554437, 3692871, 3760289, 3867459, 3899056, 3875179, 3939102, 4004151, 4012195, 4056010, 4114112, 4190130, 4332611, 4419722, 4554084, 4600621, 4711843, 4705388, 4794084, 4933252, 4965442, 4991847, 4893049, 4830685, 4681988, 4482835, 4318593, 4268186]
4896D268186p0190l9062r3024J2113r586r0482m7409M0001J8771K8397J70380
4885D188095Q6609J38382J31214P1564Q4993J14404J29085J7272J7670K7385J6603
4874E023276r609k3543L1832m9895j719Q2377R1595P9048J15135K99371R6146
4863E734014K5559J14858J19620J36581J86301O9577j9205J58842J82853J09648
4853F818648j8606R9756J18712J0948J52304J74915J43780K32586K20844O6980
4843H020867O6050Q5086Q0257P1821P613j7278j6283r8161P979N0935j19820O6315
4831H205381J47491o586M3829K43869J59861K09418K72054K43496L68184J69879
4821A0056876K14731K05686K60344J79319K87437K37972K48448Q1309J94173J95888
$$ y = [4268186, 4197996, 4158934, 4065910, 4078023, 4068437, 3977955, 3930546, 3970547, 3989318, 4017715, 4188095, 4274704, 4413086, 4544300, 4615864, 4700857, 4815261, 4944346, 4961618, 4979288, 5006673, 5023276, 5013667, 4990124, 5021956, 4972061, 4970342, 5052719, 5144314, 5223362, 5338497, 5637868, 5734014, 5759573, 5874431, 5994051, 6130632, 6316933, 6386510, 6367305, 6526147, 6709000, 6818648, 6800042, 6899798, 7018510, 7029458, 7181762, 7356677, 7500457, 7733043, 7953887, 8020867, 8086917, 8172003, 8252260, 8324081, 8331694, 8314416, 8298133, 8199972, 8207951, 8258886, 8139066, 8205381, 8352872, 8346286, 8390115, 8633984, 8793845, 9003263, 9275317, 9518813, 9886997, 10056876, 10271607, 10477293, 10737637, 10916956, 11204393, 11442365, 11690813, 11772122, 11966295, 12162183]
4811A2162183K59582K90580K49690J12818K85184L62460L05499N21573M55962
4802A5005531M50899L62376N22813L96460L33536K19286J94807L05597M44418
4793A8235723L51372M32806L01641L05066L22969L30034K64494L25134L67912
4784B1237151O03080O44586O28471O17403N90475N83440N45168M56552M51076
4775B6357402P15556P87657Q15930R80758J040452J029574R84972J112442J048961
4766C4873704R48932J046102R26550R94860J126078J230448J180639J170166J250696
4757D4748175J239488J340067J344688J661004K135209K451931K713068K916318
4749F0549948L034640L106138K819595L176349L778867M395028N140332O366541
$$ y = [12162183, 12421765, 12712345, 12962035, 13074853, 13360037, 13722497, 14027996, 14549569, 15005531, 15456430, 15818806, 16341619, 16738079, 17071615, 17290901, 17485708, 17791305, 18235723, 18587095, 19019901, 19321542, 19626608, 19949577, 20279611, 20544105, 20869239, 21237151, 21840231, 22484817, 23113288, 23730691, 24321166, 24904606, 25449774, 25906326, 26357402, 27072958, 27860615, 28676545, 29657303, 30697755, 31727329, 32712301, 33824743, 34873704, 35822636, 36868738, 37795288, 38790148, 39916226, 41146674, 42327313, 43497479, 44748175, 45987663, 47327730, 48672418, 50333422, 52468631, 54920562, 57633630, 60549948, 63584588, 66690726, 69510321, 72686670, 76465537, 80860565, 86000897, 92367438]
4741I2367438P547428R239877J0987804J3204914J5440914J9335259K5282233
4734A93405867L2510415M0129145M8448946N6602514N5267633K6389975q119071
4727D44635424m1259368o8895247o6461483n1024326l5785248k5605210j8977848
4720A36626694j5294220j2287782j0054527p809754o487589n441123m589841l743602
4712G0918256l084123k454438j859232j340850o71111p7269K71488M21645J71667
4703F2296033k2522k23465k62439k29876k02510r3071K35412M14391L28367M40971
4693F2681291N10046P06740J034436J261853J601256K010097K299289K653231
4685G4758239K644718K629005K787454L062355L201677L688838M566658N764708
$$ y = [92367438, 99914866, 109154743, 120142547, 133347461, 148788375, 168123634, 193405867, 225916282, 266045427, 314494373, 371096887, 426364520, 452754495, 444635424, 403376056, 334480809, 268019326, 216995000, 181209752, 155604542, 136626694, 121332474, 109044692, 98990165, 91180411, 84692822, 79251699, 74661858, 70918256, 67834133, 65379695, 63520463, 62179613, 61508502, 61431233, 61702721, 62124366, 62296033, 62273511, 62050046, 61787607, 61557731, 61355221, 61262150, 61497562, 61911953, 62240320, 62681291, 63191337, 63898077, 64932513, 66194366, 67795622, 69805719, 72105008, 74758239, 77402957, 80031962, 82819416, 85881771, 89083448, 92772286, 97338944, 103103652]
4677A03103652O913433Q407857J0350425J2738400J5519637K0066867K6369911
4670B03470182L2340903L8963594M7615823N5292096M1328505M958658j0969744
4663D13000017k6206433n6016814o2846537n0986957l7163167k6295327j9682225
4656A33802557j5649401j2585652j0120711q160739o588677n353338m554588l974210
4648F6815241l560532k973003k371039j933189j427850j081741p97085p15348
4640E1955454o69512p05566p90205r49713j103016q21148q09965p17407n83236
4631D4805686o58327o04136n92592o68312o47472o17427n07425m90579l83192
4622C9636224k67421k49384j38235p216K6584J86374L49165J89095L49655N69740
$$ y = [103103652, 110017085, 118424942, 128775367, 141513767, 157033404, 177100271, 203470182, 235811085, 274774679, 322390502, 377682598, 419011103, 423969761, 413000017, 386793584, 330776770, 267930233, 216943276, 179780109, 153484782, 133802557, 118153156, 105567504, 95446793, 87286054, 80697377, 75344039, 70789451, 66815241, 63254709, 60281706, 57910667, 55977478, 54549628, 53467887, 52670802, 51955454, 51285942, 50580376, 49790171, 48840458, 47737442, 46916294, 46106329, 45388922, 44805686, 44147359, 43543223, 42950631, 42282319, 41634847, 41017420, 40509995, 40019416, 39636224, 39368803, 39119419, 38981184, 38973968, 39000552, 39186926, 39536091, 39725186, 40074841, 40644581]
4612D0644581O73301O66596P24494P10382P37326N12152L44748L04714O8809j13239
4602D5273864l75356l41607l22004o29794p32440q40980q64469q47165q76359
4593C9443690q21025o26321n41292n08266m22967m33079n49553n71194o08199
4584C4361794m63869m71470l60094m59114j61558n3152m333J09414J57710Q4796
4574C2740124O3246M5741k4742j35505l59897l81479l84458l35307n48755o38911
4564C0040057n82100n23229n01387m71206n31657m49195l67016l40746k30999
4555B6042522j67236j49201l820L03685K73885K97990L22032P02815M83437L66487
4545B8472596N34860L77322M60600N23485M03864L58589M56446L98619L80838
$$ y = [40644581, 41317882, 41984478, 42708972, 43419354, 44156680, 44668832, 45013580, 45318294, 45387103, 45273864, 44898508, 44556901, 44234897, 43605103, 42872663, 42031683, 41167214, 40320049, 39443690, 38622665, 37996344, 37455052, 36946786, 36523819, 36090740, 35541187, 34969993, 34361794, 33897925, 33426455, 33066361, 32607247, 32445689, 32392537, 32388204, 32497618, 32655328, 32740124, 32803370, 32849111, 32824369, 32688864, 32328967, 31947488, 31563030, 31227723, 30678968, 30040057, 29457957, 28934728, 28433341, 27962135, 27430478, 26981283, 26614267, 26273521, 26042522, 25875286, 25726085, 25722265, 26025950, 26299835, 26597825, 26919857, 27622672, 28106109, 28472596, 29007456, 29384778, 29845378, 30368863, 30772727, 31131316, 31587762, 31986381, 32367219]
4536C2367219M03658L56544M10693M83420N11675O45658N49745P14478Q30816
4527C7273906R74870R46217Q86675Q93782R58427Q91166P48877O50564N29619
4518D4754103M19348J62147J20954k8504m61663l52144m26831n34926o14548n95657
4508D2442279n74395n59151m01575m22023m34857k83087j88861o3405m5798p6779
4498C9392348J50376K40798j26715j75437k50583k86183m38699l90296m72875
4489C7642734m87400l92622m53421m80158m09084k34710k19824k55875j70929
4480C4538711k08843k29078r0798l2232J7031J79881J99215L05810K99705M69663
4470C5449065O55108P45760P23549P61454R46387R23333P74058Q36815P21247
$$ y = [32367219, 32770877, 33127421, 33538114, 34021534, 34533209, 35178867, 35728612, 36443090, 37273906, 38248776, 39194993, 40081668, 40975450, 41933877, 42825043, 43573920, 44224484, 44754103, 45173451, 45335598, 45456552, 45428048, 44966385, 44614241, 44187410, 43652484, 43037936, 42442279, 41867884, 41308733, 40907158, 40485135, 40050278, 39767191, 39578330, 39514925, 39469127, 39392348, 39542724, 39783522, 39656807, 39481370, 39230787, 38944604, 38505905, 38115609, 37642734, 37155334, 36762712, 36309291, 35829133, 35420049, 35185339, 34965515, 34709640, 34538711, 34329868, 34100790, 34009992, 33977760, 33994791, 34174672, 34373887, 34679697, 34979402, 35449065, 36104173, 36849933, 37573482, 38334936, 39281323, 40204656, 40978714, 41815529, 42536776]
4461D2536776O93203N69398O24932P59748P43439Q43150R01883R99379J048567
4452D9720475R73321J055752J127613R45243Q64472Q17311Q02039O47468O42263
4443E7595957O26241N78146P40162O53866O85183P98716P18411O06988N35477
4434F3539147O49686L52910J01956L9100L3359j51298k0306J25026L94015O82943
4424F5746538J004910J204702J661235J945144K151471K499982K685371K608008
4416H1507361K803991K523528K150424J937341J356238J035902Q59105O00709
4408I4774599O54401N59749P73281R27851J127563J139409J301759J264271J150296
4399A03673179Q84006L33188P8819m57996r59599j199846j415566j375835j411158
$$ y = [42536776, 43229979, 43799377, 44424309, 45184057, 45927496, 46770646, 47672529, 48671908, 49720475, 50693796, 51749548, 52877161, 53822404, 54686876, 55504187, 56306226, 56953694, 57595957, 58222198, 58800344, 59540506, 60194372, 60879555, 61678271, 62396682, 63003670, 63539147, 64188833, 64541743, 64643699, 64682799, 64716158, 64564860, 64544554, 64669580, 65063595, 65746538, 66751448, 67956150, 69617385, 71562529, 73714000, 76213982, 78899353, 81507361, 84311352, 86834880, 88985304, 90922645, 92278883, 93314785, 94173890, 94774599, 95429000, 95988749, 96762030, 97689881, 98817444, 99956853, 101258612, 102522883, 103673179, 104557185, 104890373, 104969192, 104511196, 103551597, 102351751, 100936185, 99560350, 98149192]
4390I8149192j375408j375073j301574j509345j434083j421088j460593j277490
4382H6994538j222798j049612q66552q57887p03586n59838o13922n19808n23849
4373H0076686n54301n09056m78559l86102l32729l46210l27274k91270l46770
4364G6504415j49073j17593j90393L0508P0158K68846Q438Q4463n2749j73386
4354G6283634m31967o12639o34173o76851j131394j146241j056327j128999j081236
4345F8383807q71731q79044p16429o80042o56651o78700q11439q94884r81021
4336F1213866j084077j028778j163004j151471j201058j027677q30396q67121
4328E2860284n53169l61458k47875j45785K7892K35351L39913M52328P75764J018814
$$ y = [98149192, 96773784, 95398711, 94097137, 92587792, 91153709, 89732621, 88272028, 86994538, 85771740, 84722128, 83855576, 82997689, 82294103, 81734265, 81120343, 80600535, 80076686, 79522385, 79013329, 78534770, 78148668, 77815939, 77469729, 77142455, 76851185, 76504415, 76355342, 76237749, 76047356, 76077864, 76148022, 76416868, 76425306, 76509769, 76457020, 76283634, 75851667, 75239028, 74604855, 73928004, 72796610, 71650369, 70594042, 69465043, 68383807, 67512076, 66633032, 65916603, 65236561, 64579910, 63901210, 63089771, 62194887, 61213866, 60129789, 59101011, 57938007, 56786536, 55585478, 54557801, 53727405, 52860284, 52307115, 51945657, 51697782, 51551997, 51579889, 51815240, 52155153, 52607481, 53383245, 54402059]
4318E4402059R38857J261730J481846J236667J122466Q15879P12081L80257j77841
4309F2174001o40590r87595j362271j557122j598538j812564j864459j783416
4301E0567446j638459j456564j377188j146526r17718p78249m88869l41555j82492
4292D2239826n4938O7203R7394R4336J20352J57810n496l23153n50938p22663
4282D1119733r13005r29988j043469j007865r01439q36146q55228o80323o51798
4273C3300472n99822k56388l32652k97683n2619J35800K4842K01244J84403K52154
4263C2559751L16984L88345L10182J89881J13403K6700m7915r1103l60781m50044
4253C2955403l58497l29720m82857k98049j60959j61349k29945o1104J2239Q8960
$$ y = [54402059, 55340916, 56602646, 58084492, 59321159, 60443625, 61259504, 61971585, 62351842, 62174001, 61533411, 60545816, 59183545, 57626423, 56027885, 54215321, 52350862, 50567446, 48928987, 47472423, 46095235, 44948709, 44030991, 43252742, 42763873, 42422318, 42239826, 42184888, 42252091, 42349485, 42443821, 42564173, 42721983, 42716487, 42393334, 41842396, 41119733, 40206728, 39276740, 38233271, 37225406, 36323967, 35487821, 34632593, 33952270, 33300472, 32700650, 32444262, 32111610, 31813927, 31761308, 31897108, 31921950, 32123194, 32307597, 32559751, 32876735, 33265080, 33575262, 33765143, 33878546, 33905246, 33857331, 33766228, 33405447, 32955403, 32596906, 32267186, 31784329, 31486280, 31325321, 31163972, 30934027, 30872923, 30885162, 30974122]
4243C0974122R0725J13456J98315L00419L82625M45593M69965M37807L83833K85737
4233C4082597M25078K71053K64685Q1736j3271J55838K35751L59395L60332M38971
4223C6662165N07472O67822P21918Q28725Q34409Q40870Q95540Q79419R49391
4214D3787731J032363J109116J091496J348173J260766J512705J586429J758571
4206E4487350J879399K131376K369074K538365K825533L052974L313830L584686
4198G6182587L936028M248091M722744N415650O016618O922567Q112378Q971170
4190A24527833J0358439J1921062J3745610J5650531J7675333J9632134K1024746
4183B34535688K1251986J9586381J5399477P907658k517108j3122936k0795514
$$ y = [30974122, 31064847, 31178303, 31376618, 31677037, 32059662, 32505255, 32975220, 33413027, 33796860, 34082597, 34507675, 34778728, 35043413, 35125149, 35111878, 35267716, 35503467, 35862862, 36223194, 36662165, 37169637, 37837459, 38559377, 39388102, 40222511, 41063381, 41958921, 42838340, 43787731, 44820094, 45929210, 47020706, 48368879, 49629645, 51142350, 52728779, 54487350, 56366749, 58498125, 60867199, 63405564, 66231097, 69284071, 72597901, 76182587, 80118615, 84366706, 89089450, 94505100, 100521718, 107444285, 115556663, 124527833, 134886272, 146807334, 160552944, 176203475, 193878808, 213510942, 234535688, 255787674, 275374055, 290773532, 298681190, 296164082, 283041146, 262245632]
4176B62245632k4497821k4677712k2946676k0497728j7806023j5530083j3314338
4169A22975251j1469206r931451q684405p578442o561105n772093n086184m536735
4161F3355630l963603l428282k897451k620399k277559k190346k004324j822078
4153D2151588j622994j671302j562141j291914j217581j066774j000357r64858
4145C1753667p89574r28136o94867o17561p64753p85298p83609p23036q93614
4136B4773219p14547q36534q23757p94307p65516o62437o66238o66359o14850
4127A8228674m90800n59892l65470l65113m39115m14324k60146k91978k34449
4118A4807387k42306l25741k33816k13422j21141k56758k84622j73058j41289
$$ y = [262245632, 237747811, 213070099, 190123423, 169625695, 151819672, 136289589, 122975251, 111506045, 101574594, 92890189, 85311747, 78750642, 72978549, 67892365, 63355630, 59392027, 55963745, 53066294, 50445895, 48168336, 45977990, 43973666, 42151588, 40528594, 38857292, 37295151, 36003237, 34785656, 33718882, 32718525, 31753667, 30964093, 30035957, 29341090, 28723529, 27958776, 27173478, 26389869, 25666833, 24773219, 24058672, 23222138, 22398381, 21604074, 20838558, 20176121, 19509883, 18843524, 18228674, 17737874, 17177982, 16812512, 16447399, 16008284, 15593960, 15333814, 15041836, 14807387, 14565081, 14239340, 14005524, 13792102, 13670961, 13414203, 13129581, 12956523, 12815234]
4109A2815234j51831q1774j02675n5209p5497o2290M6327P794j8101J7740Q6861
4098A2426579q8501J67716J46951L7132J30708N1948M1017q1899j95021l43157
4088A2293473j69062m68354m27568l47900k79684j64334k92230k63086k36650
4079I644605j40542j22616j63281r7895j56885j61014l410n8317k01094k4618
4069H514933j25324j06258o0130n4657N3899m9287m8400l7610l3023l2149l8537
4058G983457j8697n7495j11886m2991p0889o901p6146o9568j602R7864o6730O2434
4046G620850j4234L9885M7860N4562J59739n145p7630l0541Q8854n7110l5078
4035G792012L2139M8086N6206p5983m4820N3892j01437j7575m6300q2310O8584
$$ y = [12815234, 12663403, 12581629, 12478954, 12423745, 12348248, 12285958, 12332285, 12340079, 12321978, 12339718, 12426579, 12338078, 12505794, 12652745, 12689877, 12820585, 12872533, 12913550, 12831651, 12636630, 12293473, 12124411, 11656057, 11228489, 10880589, 10600905, 10436571, 10144341, 9881255, 9644605, 9504063, 9381447, 9218166, 9120271, 8963386, 8802372, 8798962, 8740645, 8539551, 8514933, 8389609, 8283351, 8223221, 8168564, 8222463, 8173176, 8124776, 8087166, 8054143, 8021994, 7983457, 7964760, 7907265, 7795379, 7752388, 7681499, 7674598, 7598452, 7528884, 7527282, 7625146, 7558416, 7620850, 7606616, 7646501, 7694361, 7748923, 7908662, 7903517, 7825887, 7795346, 7884200, 7827090, 7792012, 7824151, 7872237, 7928443, 7852460, 7807640, 7861532, 7760095, 7742520, 7696220, 7613910, 7682494]
4024G682494J34006l573M5421R6224K1561n9223j5290K7232J0793N9071N7494
4013H056210Q2040K876N9735m5259M8996L33m0468L2822J03148J09509R2367P4151
4001H576460J21308J03491J21323J04486J29273K83165J05457K29313K30751L28205
3991A0333232J84733K60352J82238K08475L21697L02854J15493J44077K32110
3982A2285261J84001K33135L04549L01722K47942J95493K79497L26947L62126
3973A4720673K38100K21222K54710L04162L55356L70437L77776M57354L65621
3964A7665411L10323L21759K98277N74359N29973L29554L26794L46224N21118
3955B1223792M06272L96785M93855L68271M61493M24800N04897M01124N29241
$$ y = [7682494, 7816500, 7812927, 7858348, 7954572, 7976133, 7916910, 7901620, 7928852, 7939645, 7998716, 8056210, 8138250, 8141126, 8200861, 8155602, 8204598, 8204931, 8164463, 8197285, 8300433, 8409942, 8502309, 8576460, 8697768, 8801259, 8922582, 9027068, 9156341, 9439506, 9544963, 9774276, 10005027, 10333232, 10517965, 10778317, 10960555, 11169030, 11490727, 11793581, 11909074, 12053151, 12285261, 12469262, 12702397, 13006946, 13308668, 13556610, 13752103, 14031600, 14358547, 14720673, 14958773, 15179995, 15434705, 15738867, 16094223, 16464660, 16842436, 17299790, 17665411, 17975734, 18297493, 18595770, 19170129, 19700102, 20029656, 20356450, 20702674, 21223792, 21630064, 22026849, 22520704, 22888975, 23350468, 23775268, 24280165, 24681289, 25210530]
3946B5210530M64131N46595M29483M32083N00598N86176M41714N93854N64620
3937B9769784N39309N74301O56716O43052O79228P05403P58801Q52074Q10353
3928C5989021Q35788R00531R30977R20340J104697J120741J232046J329611J402224
3919D5765976J594248J658738J612310J687839J817408J931391K133394K185035
3911F0386339K271771K420490K561411K653332K731161K811013K900361L057538
3903H1793416L024541L065345L230144L221903L345489L294162L378508L525685
3895A07879193L466008L404828L221668L140089K998482K870781K784688K544517
3887A32310254K248677K131433J870271J985463J676630J515881J304673J073074
$$ y = [25210530, 25674661, 26221256, 26650739, 27082822, 27583420, 28169596, 28611310, 29205164, 29769784, 30309093, 30883394, 31540110, 32183162, 32862390, 33567793, 34326594, 35178668, 35989021, 36824809, 37725340, 38656317, 39576657, 40681354, 41802095, 43034141, 44363752, 45765976, 47360224, 49018962, 50631272, 52319111, 54136519, 56067910, 58201304, 60386339, 62658110, 65078600, 67640011, 70293343, 73024504, 75835517, 78735878, 81793416, 84817957, 87883302, 91113446, 94335349, 97680838, 100975000, 104353508, 107879193, 111345201, 114750029, 117971697, 121111786, 124110268, 126981049, 129765737, 132310254, 134558931, 136690364, 138560635, 140546098, 142222728, 143738609, 145043282, 146116356]
3879A46116356Q48568M43475M8366m22932p27757j093837j565246j792890k033267
3870A39820836k052868k144133k491668k720366k752095k937282l068064l371488
3862A18282872l542640l617880l777009l850386l913418l812865l737557l747332
3854H8283785l713861l557155l469648l376922l423049l316206l224177l174578
3846F1028189l072932k867579k844354k644539k502597k561307k302527k119683
3838D0112671j920561j963975j888373j620277j495199j420334j322576j233335
3830B7248041j233567j087693j022148r37319r27653r02006p92909o65677q23543
3821A8855526p09296n79039o12303m12560m65182m14802m13668m57964m20321
$$ y = [146116356, 146964924, 147408399, 147456765, 147033833, 146306076, 145212239, 143646993, 141854103, 139820836, 137767968, 135623835, 133132167, 130411801, 127659706, 124722424, 121654360, 118282872, 114740232, 111122352, 107345343, 103494957, 99581539, 95768674, 92031117, 88283785, 84569924, 81012769, 77543121, 74166199, 70743150, 67426944, 64202767, 61028189, 57955257, 55087678, 52243324, 49598785, 47096188, 44534881, 42232354, 40112671, 38192110, 36228135, 34339762, 32719485, 31224286, 29803952, 28481376, 27248041, 26014474, 24926781, 23904633, 22967314, 22039661, 21137655, 20344746, 19679069, 18855526, 18146230, 17567191, 16954888, 16542328, 16077146, 15662344, 15248676, 14790712, 14370391]
3812A4370391k26928l11582m09902k80013m08133k48052k68691k44477k69345
3803A1703268k37789j13106j73100k62650k30009j73779n4435k86291j62390l0735
3793I978984j74511k00164j96931m1892p1290j38058j44738r2299j30393m1693
3783H747015m8673j75686j10835J7212l6252m9593j10937J8114q3206j34155K1492
3772H054496l1001j5985n4302r2262m5800m9933k4821j27540o8813l2275p1386
3761G440378o5795J7078j6587L6760j96421l5917L4335n0574k7466R7982l8142
3750G195631j71236j4125K106m5559j3040K5695l0918k0315l7713n1253m1207
3739F798066R8677p311L1316n4328J8092m838k2209k0771P7121Q085N9795P5821
$$ y = [14370391, 14143463, 13831881, 13421979, 13141966, 12733833, 12485781, 12217090, 11972613, 11703268, 11465479, 11352373, 11179273, 10916623, 10686614, 10512835, 10458400, 10172109, 10009719, 9978984, 9804473, 9604309, 9407378, 9365486, 9294196, 9156138, 9011400, 8919101, 8788708, 8747015, 8698342, 8522656, 8411821, 8429033, 8392781, 8343188, 8232251, 8250365, 8167159, 8033004, 8054496, 8023495, 8007510, 7953208, 7860946, 7815146, 7765213, 7740392, 7612852, 7544039, 7511764, 7440378, 7374583, 7391661, 7375074, 7411834, 7215413, 7179496, 7213831, 7163257, 7135791, 7233773, 7195631, 7024395, 7010270, 7012376, 6966817, 6953777, 6979472, 6948554, 6928239, 6890526, 6839273, 6798066, 6896743, 6889432, 6920748, 6866420, 6884512, 6879674, 6857465, 6836694, 6913815, 6921900, 6981695, 7057516]
3727G057516o3538R025J39365j14352L8235R4489m8579O1230M5765M4310J59464
3716G422930J5611o2177J45861Q4237K1932L7539N4726L6024J21866N595N8471
3705G942615q135n0828R177Q9910J34813P3118M9851L4026P0539M4460R267J8613
3693H417426J28086J4683L9354J15892P3565R3825P3361J16451O3712R064J06658
3682I252077R2424J19974J93053N4400L6233J64611Q7036K13769J73978J11685
3672A0499240N6077J83316J87262P3677J92133J98967K03570J38439J45762K24611
3662A2103054J26156Q2943Q4589K28986L45040K53597K23082K46851J69055J96727
3652A4060080K60455K32701K39563K88324K52610K31918L29126L45440K47046
$$ y = [7057516, 6993978, 7003003, 7142368, 7028016, 7066251, 7160740, 7112161, 7173391, 7219156, 7263466, 7422930, 7438541, 7376364, 7522225, 7606462, 7628394, 7665933, 7720659, 7756683, 7878549, 7884144, 7942615, 7934480, 7883652, 7892829, 7982739, 8117552, 8190670, 8240521, 8274547, 8345086, 8389546, 8398813, 8417426, 8545512, 8560195, 8599549, 8715441, 8789006, 8882831, 8956192, 9072643, 9136355, 9145419, 9252077, 9344501, 9464475, 9657528, 9711928, 9748161, 9912772, 9999808, 10213577, 10387555, 10499240, 10555317, 10738633, 10925895, 10999572, 11191705, 11390672, 11594242, 11732681, 11878443, 12103054, 12229210, 12312153, 12396742, 12625728, 12970768, 13224365, 13447447, 13694298, 13863353, 14060080, 14320535, 14553236, 14792799, 15081123, 15333733, 15565651, 15894777, 16240217, 16487263]
3643A6487263K71654L61863L01102L05064K08862M25780M57334L48726L80096
3634A9547744L42755L80119M44839M37933M30517L91262M42686L37356M94483
3625B3249694N68084M73810M28014N18373N50611N40159M58002M73206O39704
3616B7899657O63293P19077O82798O48515O73167P14384Q13246Q07784Q83003
3607C4504924J077155J099164J044108J095679J271251J232146J457676J489261
3599D4271364J532799J692297J676262J812824J837929J879459J666460J741543
3591E8110937J817557J763432J626952J561463J626874J558301J455529J481849
3583G1002894J436949J304003J207847J123107R77948Q14015O92084M34239J88966
$$ y = [16487263, 16758917, 17120780, 17421882, 17726946, 17935808, 18361588, 18818922, 19167648, 19547744, 19890499, 20270618, 20715457, 21153390, 21583907, 21975169, 22417855, 22755211, 23249694, 23817778, 24291588, 24719602, 25237975, 25788586, 26328745, 26786747, 27259953, 27899657, 28562950, 29282027, 29964825, 30613340, 31286507, 32000891, 32814137, 33621921, 34504924, 35582079, 36681243, 37725351, 38821030, 40092281, 41324427, 42782103, 44271364, 45804163, 47496460, 49172722, 50985546, 52823475, 54702934, 56369394, 58110937, 59928494, 61691926, 63318878, 64880341, 66507215, 68065516, 69521045, 71002894, 72439843, 73743846, 74951693, 76074800, 77052748, 77866763, 78558847, 78993086, 79182052]
3574G9182052J82342J19101m5103o6598q6126j48922j49867k10395J1745O3582
3564G8851811n5885L1775J07001R0787K76429L24823L86135O74169P58521R87802
3554H2433368J075161J359414J615139J902364K165178K398268K687835K888927
3546I8525654L238296L556801L816239M073899M324052M437153M706252M657762
3538A31336108M549679M744162M582228M355742M292210M080050L934769L776116
3530A65651064L494512L385060L079491K830032K515429K063056J478789J151993
3522A85649426M98426j15079n83292j170413j649954j878690k257713k590923
3514A75901788k474190k562626k646064k580880k652437k626357k587799k491198
$$ y = [79182052, 79364394, 79483495, 79438392, 79371794, 79285668, 79136746, 78986879, 78776484, 78788229, 78851811, 78795926, 78827701, 78934702, 79025489, 79301918, 79626741, 80012876, 80687045, 81445566, 82433368, 83508529, 84867943, 86483082, 88385446, 90550624, 92948892, 95636727, 98525654, 101763950, 105320751, 109136990, 113210889, 117534941, 121972094, 126678346, 131336108, 135885787, 140629949, 145212177, 149567919, 153860129, 157940179, 161874948, 165651064, 169145576, 172530636, 175610127, 178440159, 180955588, 183018644, 184497433, 185649426, 186147852, 186032773, 185449481, 184279068, 182629114, 180750424, 178492711, 175901788, 173427598, 170864972, 168218908, 165638028, 162985591, 160359234, 157771435, 155280237]
3506A55280237k140132k097584j930539j591913j248074p55890l93381J7512L29940
3497A45470176O47254R52289J136508J333423J548787J605092J763078J710832
3489A56167439J671531J576233J452714J646396J739665J570920J363245J166519
3481A68354662Q58720N02467R0927l83889j011642j494252j934934k457147k852825
3472A59672087l154069l472296l738955l954151l885700l872378m038995l896884
3464A29658659l952222m066599m020309l981846m075972m073834m043585l793472
3456I7650820l706976l441763l226003k836015k497032k257899j823090j433346
3448G6428696j172351p23041m17697l22925n9505K22199N74073N24589M98264
$$ y = [155280237, 153140105, 151042521, 149111982, 147520069, 146271995, 145516105, 145122724, 145140236, 145470176, 146117430, 147069719, 148206227, 149539650, 151088437, 152693529, 154456607, 156167439, 157838970, 159415203, 160867917, 162514313, 164253978, 165824898, 167188143, 168354662, 169213382, 169715849, 169806776, 169422887, 168411245, 166916993, 164982059, 162524912, 159672087, 156518018, 153045722, 149306767, 145352616, 141466916, 137594538, 133555543, 129658659, 125706437, 121639838, 117619529, 113637683, 109561711, 105487877, 101444292, 97650820, 93943844, 90502081, 87276078, 84440063, 81943031, 79685132, 77862042, 76428696, 75256345, 74533304, 74115607, 73792682, 73733177, 73955376, 74529449, 75054038, 75552302]
3439G5552302M91277O49089O11458M97770M26004M85056L94545M17409N35039
3430H0059949N06104N33093N44447M27925L99784K10712O648m1407l77926l72063
3420H1897266n84032q36177q56153p60069q24874p96808q89032q90676o61916
3411G4797529q37995p05725p06647n89808n88917p30926p13331o85900p92168
3402F8446112n50712o73866n53064m24960m59735l58683j89251j23747k9362K7383
3392F5110115K00494J87696K49007K98617M09717N94794O31358O16116Q66606
3383F9164520Q38530Q05871Q30602J050274J095857J224187J370080J388080J641385
3374G9409386J709849J837296K182157K410444K526287K785213L178578L479968
$$ y = [75552302, 76043579, 76692668, 77304126, 77801896, 78227900, 78712956, 79107501, 79524910, 80059949, 80566053, 81099146, 81643593, 82071518, 82471302, 82682014, 82688662, 82647255, 82269329, 81897266, 81313234, 80477057, 79620904, 78860835, 78035961, 77239153, 76350121, 75459445, 74797529, 73959534, 73253809, 72547162, 71957354, 71368437, 70637511, 69924180, 69238280, 68446112, 67895400, 67221534, 66668470, 66243510, 65783775, 65425092, 65235841, 65112094, 65082732, 65110115, 65310609, 65498305, 65747312, 66045929, 66455646, 67050440, 67681798, 68297914, 69164520, 70003050, 70808921, 71639523, 72689797, 73785654, 75009841, 76379921, 77768001, 79409386, 81119235, 82956531, 85138688, 87549132, 90075419, 92860632, 96039210, 99519178]
3366I9519178L703491M104462M661995N147008N583704O179461O814481P506257
3358A43220037Q243540R244623J0098005J0964363J2031194J2946189J3872813
3351B20620764J4614980J4994323J5126555J4935184J4373741J3131986J1770498
3344C19568031J0032544Q221434O233424M409376K687803J304158k1685j040814
3336C51394271k008497k976113l841831m887883o283385p704119r212491j0831964
3328C03647988j2247313j3677898j4677537j5484837j5648058j5514257j5235233
3321B01162855j4571062j3756669j2807176j1873389j0784495r794719q891144
3314A18684201q006870p123479o611552n823105n271478m772086m179725l746678
$$ y = [99519178, 103222669, 107327131, 111989126, 117136134, 122719838, 128899299, 135713780, 143220037, 151463577, 160708200, 170806205, 181770568, 193801762, 206747951, 220620764, 235235744, 250230067, 265356622, 280291806, 294665547, 307797533, 319568031, 329600575, 337822009, 344055433, 348464809, 351152612, 352456770, 352435085, 351394271, 349385774, 346409661, 342567830, 337679947, 331396562, 323692443, 314479952, 303647988, 291400675, 277722777, 263045240, 247560403, 231912345, 216398088, 201162855, 186591793, 172835124, 160027948, 148154559, 137370064, 127575345, 118684201, 110677331, 103553852, 96942300, 91119195, 85847717, 81075631, 76895906, 73149228]
3306G3149228l453488l002254k829837k485848k257200k009596j842674j679106
3298E3589225j452008j342119j293737j076995r95991j071677q66100q94786q67348
3289D3728464o38027o62953n95540p48940p53442p40026p95231o08860o97681
3280C7487764o29067o75941o40382o83525n76472n96099n57981n98317o30394
3271C1899586o20355o25253o10451o06027n90673o09053p24924o52353n20287
3262B6340210n90026n78008n52691n38447n38887m18001l82963m37748m53458
3253B1849981l34526m12328l16381l01995l88469l02906l30183l78467k82625
3244A8802101m17412l30778k96529k49893k56610m62890l23743m06088l43966
$$ y = [73149228, 69695740, 66693486, 63863649, 61377801, 59120601, 57111005, 55268331, 53589225, 52137217, 50795098, 49501361, 48424366, 47428375, 46356698, 45490598, 44595812, 43728464, 43090437, 42427484, 41831944, 41083004, 40329562, 39589536, 38794305, 38185445, 37487764, 36858697, 36182756, 35542374, 34858849, 34282377, 33686278, 33128297, 32529980, 31899586, 31279231, 30653978, 30043527, 29437500, 28846827, 28237774, 27512850, 26860497, 26340210, 25750184, 25172176, 24619485, 24081038, 23542151, 23124150, 22741187, 22303439, 21849981, 21515455, 21103127, 20786746, 20484751, 20096282, 19793376, 19463193, 19084726, 18802101, 18384689, 18053911, 17757382, 17507489, 17250879, 16787989, 16464246, 16058158, 15714192]
3235A5714192l69425k34773k49203j66636k74235k19559j28646j76291j50677
3226A3744747j93889j23310j51152p7346j15422j78909m7744j7746l4408n3920
3216A2750901J0246o5764n856r050j34366j45286o2768j73878j61094l78110k63712
3205A1361263j48432k80326j84179j18060j54390k35290j76931j07035j08283
3196I848337j02969q4919j12486j53777j31413k5886o7254j36835j8046R191q216
3185I015727j32433r7841k087K5374P298L8969O263M89M735L4639j30785k82422
3173H487926l11522l70021l08986j51773k34978k07817j25623j00693j65935j47702
3163F362876l1059p7018j67412o8106n3772P95J6149l1804j4349n2064M1743J18285
$$ y = [15714192, 15344767, 15109994, 14860791, 14694155, 14419920, 14200361, 14071715, 13895424, 13744747, 13550858, 13427548, 13276396, 13199050, 13083628, 12904719, 12856975, 12839229, 12804821, 12750901, 12761147, 12695383, 12689527, 12680477, 12546111, 12400825, 12338057, 12164179, 12003085, 11624975, 11361263, 11212831, 10932505, 10748326, 10630266, 10475876, 10240586, 10063655, 9956620, 9848337, 9745368, 9660449, 9547963, 9394186, 9262773, 9236887, 9169633, 9032798, 9014752, 9023943, 9015727, 8883294, 8785453, 8783366, 8808740, 8816038, 8855007, 8861270, 8861759, 8866494, 8901133, 8770348, 8487926, 8176404, 7806383, 7497397, 7345624, 7110646, 6902829, 6777206, 6676513, 6510578, 6362876, 6331817, 6254799, 6087387, 6019281, 5965509, 5966304, 5982453, 5950649, 5936300, 5884236, 5925979, 6044264]
3151F044264K07863J32105J09380K46405L54342L83762L15314J66121k99438m75071
3141G185047l24546k75380k65209k68817n8994p1364j11297j2769r4985j54243
3131E547443o1252q2148j4291m6859p9133o295P0725p734j02977j48470J40903
3120E209912N6438Q79J495M5473J30105J34694L8603L40635K4337j62214l08321
3109E512036k74003k17225k15483j5238j16730j31985j20185m7521m4536P567
3099D336697R1204r1431p0481K7986j5562k3289o8918p2794N729o8998L2621O2849
3087D145613K4020n1242j9820l649L3052j1480m6393P082Q0358L0164L7766n0220
3075D175251M3548J4342r3850K7796N8996K7651k5053K9752K3349J12445L4549
$$ y = [6044264, 6252127, 6384232, 6493612, 6740017, 7094359, 7478121, 7793435, 7959556, 7660118, 7185047, 6860501, 6585121, 6319912, 6051095, 5992101, 5920737, 5809440, 5796671, 5701686, 5547443, 5486191, 5404043, 5389752, 5342893, 5263760, 5257465, 5328190, 5320456, 5217479, 5069009, 5209912, 5266350, 5267229, 5268724, 5314197, 5444302, 5578996, 5617599, 5958234, 5982571, 5820357, 5512036, 5238033, 5020808, 4805325, 4790087, 4673357, 4541372, 4421187, 4373666, 4329130, 4336697, 4427901, 4336470, 4265989, 4293975, 4278413, 4255124, 4186206, 4113412, 4119141, 4050143, 4082764, 4145613, 4169633, 4118391, 4098571, 4094922, 4127974, 4116494, 4070101, 4077183, 4157541, 4187705, 4225471, 4175251, 4218799, 4233141, 4139291, 4167087, 4226083, 4253734, 4228681, 4258433, 4281782, 4394227, 4428776]
3064D428776L1860o739J5591J06138j3546K4770J9558L5752J17452n2163M3063
3053D750512l6811M1360P3201O1073K430r4753j33990K0897j8222j09676n4552
3042D501469r3829O4054o1505q9108o1689k02297n8462o6394p4214j45737m9744
3031C662544j01977l4998m2174q5200o275p2309q3538j6010M2538o5126o5290
3020C132185J6063j37897k2663k4689j23701j7339Q8440l7743K4562J40374k7700
3009C009892k7234p8678K2166r1592j08782j9838o408J20509o0155O8937l2805
2998B796012o0010m2413J81869m0993j63690L2101j5462j9503N3886J51n8896
2987B663052n7721j4983n939N3439K2647L7272K3501j01606p0565P5689r740J5276
$$ y = [4428776, 4460636, 4453897, 4469488, 4575626, 4562080, 4586850, 4606408, 4642160, 4759612, 4707449, 4750512, 4713701, 4755061, 4828262, 4889335, 4891765, 4797012, 4663022, 4683919, 4665697, 4556021, 4501469, 4407640, 4471694, 4410189, 4321081, 4259392, 4057095, 3998633, 3932239, 3858025, 3712288, 3662544, 3560567, 3525569, 3483395, 3398195, 3391920, 3319611, 3236073, 3220063, 3262601, 3197475, 3132185, 3148248, 3010351, 2987688, 2962999, 2839298, 2821959, 2910399, 2872656, 2897218, 3037592, 3009892, 2982658, 2903980, 2926146, 2834554, 2725772, 2705934, 2699526, 2820035, 2759880, 2828817, 2796012, 2736002, 2693589, 2875458, 2834465, 2670775, 2702876, 2687414, 2667911, 2721797, 2721948, 2663052, 2605331, 2590348, 2584409, 2637848, 2660495, 2697767, 2721268, 2619662, 2549097, 2624786, 2615046, 2630322]
2975B630322p736l963K4026j12799j5351m817L222l4609J11611Q518J2758r0557
2963B520625m0788r4816m908J57317j06455K0708o343j0145m115r5641K2688J03541
2951B461668M6998q9066o4176m1385n705l0374m8651j3443L3248P4315j2237N0166
2939B361358K7448J1218l0935p5005O9894J6979n6640J7045R4886N5419r4923
2928B396744n1352o0178O164m8318L2548Q4650l0015J1822J289k8767K4696O2788
2916B402071r1158M5037p890m8106Q8257N6944o7083j8899j43880N9748j1560
2905B263481L8748o1471P3972j7190L5078R1135p3441k9707Q3520j03848n5116
2894B245161J6610J8509K1444m8828m710L6454K3890O7950p5487O2374J7019o7179
$$ y = [2630322, 2622586, 2618623, 2642649, 2529850, 2514499, 2509682, 2512904, 2478295, 2589906, 2598424, 2611182, 2520625, 2479837, 2385021, 2380113, 2537430, 2430975, 2451683, 2445340, 2435195, 2431080, 2335439, 2358127, 2461668, 2508666, 2419600, 2355424, 2314039, 2308334, 2277960, 2229309, 2215866, 2249114, 2323429, 2311192, 2361358, 2388806, 2400024, 2369089, 2294084, 2363978, 2380957, 2324317, 2341362, 2436248, 2491667, 2396744, 2345392, 2285214, 2291378, 2243060, 2275608, 2360258, 2330243, 2342065, 2343354, 2314587, 2339283, 2402071, 2310913, 2355950, 2348060, 2299954, 2388211, 2445155, 2378072, 2359173, 2215293, 2275041, 2263481, 2302229, 2240758, 2314730, 2297540, 2332618, 2423753, 2350312, 2320605, 2404125, 2300277, 2245161, 2261771, 2280280, 2301724, 2252896, 2248186, 2284640, 2308530, 2376480, 2300993, 2363367, 2380386, 2313207]
2882B313207N1960m4403O1811O7821K5300k8796M9919q458L1462P3180l0460p9438
2870B483105L6598q2674n071j9538o4558M9558k8492R9269j031r0719j6031j9000
2858B341416p0285Q2881n4596n3499J07743q2727O4428q2592l8245l8518L2784
2847B208790n9768Q5453L9295Q121N6635q0447R4487j5722k1104n499j50267o7844
2835B092130j8924K407K0706o9753m6387O9435O8130R395l0156l9054n2765R617
2823B014781o1565N7615J8725j70949l1211J32793O0349j10117l1799J3859l3050
2812A859431J4892n8923k4975O5444l5507o8765m008K4079M3697k3684l3889M2246
2800A800038j5622n0670P6906N0915j3739m1357l7051j04658K3378Q2856M878
$$ y = [2313207, 2365167, 2320764, 2382575, 2450396, 2475696, 2446900, 2496819, 2488361, 2519823, 2593003, 2562543, 2483105, 2519703, 2437029, 2431958, 2412420, 2347862, 2397420, 2368928, 2468197, 2467166, 2376447, 2360416, 2341416, 2271131, 2354012, 2299416, 2245917, 2353660, 2270933, 2335361, 2252769, 2214524, 2176006, 2208790, 2149022, 2234475, 2273770, 2281891, 2338526, 2258079, 2352566, 2336844, 2315740, 2310241, 2159974, 2092130, 2073206, 2075613, 2096319, 2026566, 1980179, 2049614, 2117744, 2127139, 2096983, 2057929, 2005164, 2014781, 1953216, 2010831, 2029556, 1858607, 1827396, 1960189, 2020538, 1910421, 1878622, 1892481, 1859431, 1874323, 1815400, 1790425, 1855869, 1820362, 1751597, 1747589, 1771668, 1815365, 1791681, 1757792, 1800038, 1784416, 1733746, 1810652, 1861567, 1847828, 1806471, 1769420, 1664762, 1688140, 1770996, 1775874]
2789A775874q0012Q596K0818j98M3973q1411J6864K0132q0213n639R864P819J3687
2776A670154o7799q3752R7340k5503L3052j12207K1740l5112p3245O2744o775
2765A480637O2604M9286j4415j27853n0169J4817o0570M3819n9304N0279J24718
2754A513849j7809P9078j02283k0548p933l3665J6870P468k3216j5463q1420K709
2742A317637k1575Q668n9895N3756L8494R4486l6615j59081l331N5904L4215q9006
2730A233657j03152J4794J01897J08255j167n8241J5191o8391R0451L43l4568
2719A299069l2456j9975j3316O71j2444k7127K6481K9863n4148K2358R1456j17639
2707A192793k8492J3615K0694K2675K2350M543L2797o5371l0330m0073J25912
$$ y = [1775874, 1695862, 1704458, 1725276, 1725078, 1769051, 1687640, 1704504, 1724636, 1644423, 1638784, 1648648, 1656467, 1670154, 1602355, 1518603, 1615943, 1590440, 1623492, 1511285, 1533025, 1497913, 1424668, 1487412, 1480637, 1543241, 1592527, 1578112, 1450259, 1400090, 1414907, 1354337, 1398156, 1338852, 1389131, 1513849, 1496040, 1575118, 1472835, 1452287, 1444354, 1410689, 1427559, 1435027, 1411811, 1396348, 1314928, 1317637, 1296062, 1304730, 1244835, 1298591, 1337085, 1431571, 1394956, 1235875, 1232544, 1288448, 1322663, 1233657, 1130505, 1145299, 1247196, 1355451, 1354284, 1296043, 1311234, 1242843, 1333294, 1333637, 1299069, 1266613, 1246638, 1233322, 1233993, 1221549, 1194422, 1220903, 1250766, 1196618, 1218976, 1310432, 1192793, 1164301, 1177916, 1198610, 1221285, 1243635, 1248178, 1280975, 1215604, 1185274, 1145201, 1271113]
2696A271113q2944j07341j9309J1667M6937L0989q7269L3556K2615m7606P2972
2685A145380k4433o7815K2685J401p6736M6785N5143M6588k125j06237M0167K2234
2673A103037n0141p5571J55027J7977m9967l0075k7514M1308o4402O383j876L807
2661A027993j13877O0483R904P9920j05653k5672J00352L6207l1421j8222K7346
2650A047360n5783P8665K5821l3633j9820o045O9391l8408J3321o1789L7748M8642
2638A105470j05281q1012Q3167j1968p8838N2635N69J15262q9637l0067q968K2182
2626I73514n495K0883K844n8832p350k7672n671n1487k3463O7471k106k7240O695
2613H62091O9982l1026m1276N7645M6669P7697l5926l2372k7199k4659N4927l2335
$$ y = [1271113, 1188169, 1080828, 1061519, 1073186, 1120123, 1151112, 1063843, 1097399, 1120014, 1072408, 1145380, 1120947, 1053132, 1075817, 1077218, 1000482, 1047267, 1102410, 1148998, 1146873, 1040636, 1080803, 1103037, 1052896, 977325, 1132352, 1150329, 1100362, 1070287, 1042773, 1084081, 1019679, 1026062, 1024186, 1027993, 914116, 974599, 984503, 1064423, 958770, 933098, 1033450, 1069657, 1038236, 1020014, 1047360, 991577, 1070242, 1096063, 1062430, 1042610, 1036565, 1105956, 1067548, 1080869, 1019080, 1056828, 1105470, 1000189, 919177, 1002344, 990376, 911538, 964173, 964742, 1080004, 990367, 960300, 951332, 973514, 968019, 988902, 991746, 932914, 925564, 897892, 892221, 840734, 817271, 884742, 882636, 855396, 862091, 932073, 901047, 859771, 917416, 964085, 1041782, 1005856, 973484, 946285, 921626, 976553, 944218]
2601I44218k40033k1745O8364n667L0132Q7727j5731N0960k5338L571p3470l7254
2589G65734L1605M0648K6884k6531o6341m269L8862L1047k7421j3136M8663j16852
2577G28893l7967j2325M4008j2186P2189P8872q8998l6246L2364j6936l9008P2317
2565G84977J9447o3879p1920M1985n5678J8679O9290P1920k645Q0715j10554p4534
2553G07803L8942j0031L9876O6131r5852j07496L7540L3822J5577J4987k6848
2542G14451m0855N5052l4005n5539K6684Q9323j03681Q0378K960m0134J3206N2222
2530G60062q070q6648P0007k8510j16764N7334k5897L3972l7026K324j1390l7218
2518E72176q831L6204l8049P5028J9830q086p846p0033l0147K4406L0701P0924
$$ y = [944218, 704185, 682440, 750804, 745137, 775269, 862996, 847265, 898225, 872887, 876458, 802988, 765734, 797339, 837987, 864871, 838340, 771999, 767730, 806592, 837639, 810218, 797082, 845745, 728893, 690926, 678601, 722609, 710423, 782612, 861484, 772486, 736240, 768604, 751668, 712660, 784977, 804424, 740545, 668625, 710610, 654932, 673611, 742901, 814821, 812176, 892891, 782337, 707803, 746745, 736714, 776590, 842721, 746869, 639373, 676913, 710735, 726312, 741299, 714451, 673596, 728648, 694643, 639104, 665788, 755111, 651430, 731808, 734768, 694634, 707840, 760062, 751992, 665344, 735351, 706841, 590077, 647411, 621514, 655486, 618460, 620784, 609394, 572176, 563345, 599549, 561500, 636528, 656358, 648272, 640426, 570393, 540246, 564652, 595353, 666277]
2506F66277n5171n468n228K1308j4302l8241K2900J3793q305m4751N3025p896
2494E97941Q1707j15868p5022m407R0724M4846J3513l2850k8984n4439O3499J18898
2482F99558m4284m064l7359k1870J24073o9907j30002L9066p3766J18742K1035
2471F21222j24108m2366k501k8003j09206K2231R0107j4321O2073k735m0233L5377
2459D67537k8589M6164k1854j6831r4709j79K7251l1129L0909L9019K899L4527
2447D55015l2675p2550l6970J3882N1804N3523k0851L9988L4807j15954J9299
2436C89318M6041M4620j5698m4413J9292J2764J4083K1783J3037q6128r6711O0419
2424C78407L4371J6769k6388o180k3337n283K008k5709M2740J8457O5964q9654
$$ y = [666277, 611106, 605638, 600410, 621718, 607416, 569175, 592075, 605868, 597563, 552812, 605837, 597941, 679648, 563780, 488758, 484351, 575075, 619921, 633434, 600584, 571600, 517161, 580660, 699558, 655274, 651210, 613851, 591981, 716054, 646147, 516145, 555211, 481445, 600187, 621222, 497114, 454748, 452247, 424244, 315038, 337269, 427376, 413055, 475128, 472393, 432160, 467537, 438948, 485112, 463258, 446427, 351718, 351539, 378790, 347661, 378570, 417589, 420488, 455015, 422340, 349790, 312820, 326702, 378506, 432029, 411178, 451166, 485973, 370019, 389318, 435359, 479979, 464281, 419868, 439160, 451924, 466007, 487790, 500827, 414699, 317988, 378407, 412778, 429547, 403159, 396979, 373642, 368359, 370367, 344658, 387398, 405855, 471819, 382165]
2412C82165J2497p621L5767L6818q737k5667n0153Q1189p5861l5213J29862L0942
2400E05988J7892o7003m6400K3605J2350l9640M2989q5962m0760K3913Q3733j6090
2388D14615j05213M3629n9389Q6655o8764P535j054k0122L4542M2215K4232L3355
2376D32236m074k7331L325r8040p2662K17799j7738l8986j2765j1830P7907M0985
2364D88826j8862r749n7424k1298N5142j07681j2979J02681l5149K6834o9074
2353C41267m8211Q5682K9358K9779n7283J06720k1372o0760L7112M2248l4132
2342D50408l221O7665O87m62j00981K1946l0947n608o4444q108J9065R081q2030
2329B73051j7254K0353L8884j2418l5448J07152p1092j2592K4898K727k9944j2143
$$ y = [382165, 394662, 387041, 422808, 459626, 450889, 425222, 375069, 456258, 380397, 345184, 475046, 505988, 523880, 456877, 410477, 434082, 446432, 406792, 449781, 363819, 323059, 346972, 430705, 414615, 309402, 353031, 293642, 380297, 311533, 319068, 318014, 297892, 332434, 374649, 398881, 432236, 428162, 400831, 404156, 306116, 233454, 451253, 433515, 394529, 381764, 369934, 447841, 488826, 469964, 460215, 402791, 381493, 436635, 328954, 315975, 418656, 383507, 410341, 341267, 293056, 378738, 408096, 437875, 380592, 487312, 465940, 405180, 442292, 484540, 450408, 447187, 514852, 515539, 515077, 414096, 436042, 405095, 399487, 335043, 326935, 346000, 355081, 273051, 255797, 276150, 315034, 302616, 267168, 374320, 303228, 290636, 315534, 318261, 288317, 276174]
2317B76174M4761J09707k7494O5038o8577O2487j7080k4153q3668j8077K5730
2306C44848l8555q1093L1990o0184N1360Q6906l8807j01434m7601N2707J5592
2295B15729P4178L0592K6497l3535o2641m4775m8566O7116R1923P058l0366M1248
2283C34458L0855K7036n4024K4728J2660j16189N9279O1884q2414J5277K0017
2272C33567r9797J3992K2882J6833M9869J47467r8831q3375K18k3815N099n1929
2260B32180o2059J04426M0996j2750Q6242J7639q9877J02001J5725J3091m2216
2249D05398o9627L117o2733P741l1191m6712m7352j4737J17617j01809P010L5000
2237B01722m3490J2462n59R030n059L757J1359m4010M3684Q4499r27M0057J16935
$$ y = [276174, 320935, 430642, 403148, 468186, 399609, 462096, 445016, 420863, 337195, 319118, 344848, 306293, 225200, 257190, 197006, 248366, 335272, 296465, 195031, 147430, 200137, 215729, 289907, 320499, 346996, 313461, 250820, 206045, 157479, 224595, 316518, 323576, 293210, 334458, 365313, 392349, 338325, 363053, 375713, 259524, 318803, 380687, 298273, 313550, 333567, 233770, 247762, 270644, 287477, 337346, 484813, 385982, 302607, 302825, 279010, 284109, 232180, 170121, 274547, 315543, 302793, 389035, 406674, 316797, 418798, 434523, 447614, 405398, 335771, 338888, 276155, 283896, 252705, 205993, 158641, 143904, 261521, 159712, 166722, 201722, 158232, 170694, 170135, 179165, 174106, 177863, 189222, 145212, 188896, 273395, 272468, 312525, 429460]
2224D29460q0611m0106K6426l1703J5709l8494K9406L4767M5894l8724q5984R554
2212B75594n553n6741N582K2944K9971n9153N507Q8574L8246k0654M0456o5630
2200B99143j9279k2479J34673K0587n9059N9959k1524q8146L4032J24876J1887
2189D74670J796j8958R86O0449r392r3243l4651O2510M3462l121j793l556N1983
2176E31142j4316o7361J6416N1383m1802p527q866N5643P6648M4279j3103K7111
2164F49647j440K4740q8529L2055j08119j3450K8266j2252M2258Q9753L5773R2972
2152G71674N7623l2125j26430m4315J27527O8599N6642m5419m7696N8537R5703
2141I40320k9140K1857O0301l3135N0726J13154j03570K7800l4035l1280Q6469
$$ y = [429460, 348849, 308743, 335169, 303466, 319175, 280681, 310087, 344854, 390748, 352024, 266040, 275594, 270041, 213300, 218882, 241826, 271797, 212644, 218151, 306725, 344971, 324317, 364773, 299143, 279864, 257385, 392058, 412645, 353586, 413545, 392021, 303875, 337907, 462783, 474670, 476466, 457508, 458494, 518943, 509551, 416308, 381657, 444167, 487629, 484508, 482715, 479159, 531142, 516826, 449465, 465881, 517264, 475462, 467935, 459069, 514712, 591360, 635639, 622536, 649647, 648207, 672947, 584418, 616473, 508354, 494904, 523170, 510918, 553176, 642929, 678702, 771674, 829297, 797172, 670742, 626427, 753954, 822553, 879195, 833776, 786080, 844617, 940320, 911180, 933037, 993338, 960203, 1010929, 1124083, 1020513, 1048313, 1014278, 982998, 1069467]
2130A069467J75964K4072l2634P1969J7911j9388Q5142L8247q1333M6547J04740
2119A500704L4601J2319Q7522o83M0047J07667L5721P4615L5848L5616J85291
2108B149268J16271k8439K3393R7043R7849J1750J10324Q5612N8825J56003J15228
2097B993127J61063K80031K46238K97513K70607K49748J64261M49930M84618K08309
2087E805445K09989L62972M96145P70489O67908J019330J421348J737041K466634
2078A4957301L284608L700180M043109M887092M915738k144574p128588o077117
2070B0437749m541270k826739k081903j578002j371403j036692r10205o52583
2062E438952m73583j80772k57321k25462l14292m22718m67935l02103k93015j28216
$$ y = [1069467, 1245431, 1269503, 1236869, 1308838, 1326749, 1307361, 1392503, 1430750, 1349417, 1395964, 1500704, 1535305, 1547624, 1635146, 1634463, 1674510, 1782177, 1817898, 1892513, 1928361, 1963977, 2149268, 2265539, 2237100, 2260493, 2357536, 2455385, 2467135, 2577459, 2663071, 2721896, 2877899, 2993127, 3154190, 3434221, 3680459, 3977972, 4248579, 4498327, 4662588, 5112518, 5597136, 5805445, 6015434, 6378406, 6874551, 7645040, 8312948, 9332278, 10753626, 12490667, 14957301, 18241909, 21942089, 25985198, 30872290, 35788028, 33643454, 26514866, 20437749, 15896479, 13069740, 10987837, 9409835, 8038432, 7001740, 6091535, 5438952, 4965369, 4784597, 4527276, 4301814, 3987522, 3564804, 3096869, 2794766, 2501751, 2373535]
2052B373535o3849j11155p5682J4956p2113o8928j18848r2789j81348j45188L772
2041A462363l4304p5244l611q261j00128p7308j47548p7210L6992j6004k7665
2030I32072n4212Q1342p9509l9022r3744J0869o8699j04956K2640R0100o6536
2019F30345p3551j0909o8208j4875N8221j41575J7548Q0894l6206j8318M0543
2008D63909M5769o9799q3749L4082L1231r9830O5952O8824p0153o1723k8300k7624
1996B68589J2053K7696O9842p9709k9815N1303N5409j5982j26170m2813O1444
1985B51847k7088m4160L2601n9510O2710J47510p8426j01184K5782j6666O4518
1974B57934k9394l6647k6006J8526M6754r9538L6440L9555L9155k3476m6372M8107
$$ y = [2373535, 2309686, 2198531, 2122849, 2137805, 2065692, 1996764, 1877916, 1785127, 1603779, 1458591, 1462363, 1428059, 1352815, 1349204, 1340943, 1240815, 1163507, 1015959, 938749, 975741, 959737, 932072, 877860, 959202, 879693, 840671, 746927, 757796, 689097, 584141, 606781, 696881, 630345, 556794, 545885, 477677, 462802, 521023, 379448, 396996, 477890, 441684, 423366, 463909, 509678, 439879, 356130, 390212, 421443, 321613, 387565, 456389, 386236, 324513, 296213, 268589, 280642, 308338, 378180, 298471, 268656, 319959, 375368, 359386, 233216, 190403, 251847, 224759, 180599, 213200, 153690, 216400, 363910, 285484, 184300, 210082, 193416, 257934, 228540, 191893, 165887, 184413, 231167, 131629, 168069, 207624, 246779, 223303, 176931, 225038]
1962B25038K1806j20734l6713l3433Q5668m0840J40182O648o5595k1127L4149
1951A95049m7754p8145L7208M0274Q572N8856m8798j40894Q188j2244L1691J875
1939E3878l0621M4351L4456j09216K532P3163J3437N6462M5620k8475q676o9488
1927G7423p6886L5213N8952k1365n1538k9446L0466L7393J255l2779M9535J1131
1915H9354p0587J7837k680M5984n1336r273m5336N2935l4844j4951P3117j4399
$$ y = [225038, 246844, 126110, 89397, 55964, 141632, 100792, 240974, 247622, 182027, 160900, 195049, 147295, 69150, 106358, 146632, 155204, 214060, 165262, 24368, 32556, 20312, 52003, 53878, 23257, 67608, 102064, -7152, -4620, 68543, 81980, 138442, 184062, 155587, 146911, 77423, 537, 35750, 94702, 73337, 21799, -7647, 22819, 60212, 61467, 28688, 78223, 89354, 18767, 36604, 33924, 79908, 28572, 19299, -26037, 26898, -7946, -22897, 50220, 35821]
$$ [...]
##END NTUPLES=NMR SPECTRUM
##END=
