##TITLE=1H_EC-3301(4)
 CDCl3
 8 sc, 
 23.10.2023
##JCAMPDX= 6.0         $$ Bruker NMR JCAMP-DX V2.0
##DATA TYPE= NMR SPECTRUM
##DATA CLASS= NTUPLES
##ORIGIN= UXNMR, Bruker Analytische Messtechnik GmbH
##OWNER= root
$$ XWIN-NMR		Version 3.5
$$ Mon Oct 23 14:00:16 2023 Russian Standard Time (UT+4h)  she@DPX200
##.OBSERVE FREQUENCY= 200.13135
##.OBSERVE NUCLEUS= ^1H
##.ACQUISITION MODE= SIMULTANEOUS
##.ACQUISITION SCHEME= undefined
##.AVERAGES= 8
##.DIGITISER RES= 18
##SPECTROMETER/DATA SYSTEM= spect
##.PULSE SEQUENCE= zg30
##.SOLVENT NAME= CDCl3
##.SHIFT REFERENCE= (INTERNAL, CDCl3, 0, 15.7315)
##AUDIT TRAIL= $$ (NUMBER, WHEN, WHO, WHERE, WHAT)
$$ ##TITLE= Audit trail, XWIN-NMR		Version 3.5
$$ ##JCAMPDX= 5.01
$$ ##ORIGIN= Bruker BioSpin GmbH
$$ ##OWNER= she
$$ F:/spectra/data/she/nmr/H-F/1/pdata/1/auditp.txt
$$ ##AUDIT TRAIL=  $$ (NUMBER, WHEN, WHO, WHERE, WHAT)
(   1,<2023-10-23 13:58:56.40 +0400>,<she>,<DPX200>,
      <created by zg, POWCHK disabled, PULCHK disabled
       configuration hash MD5:
       00 E9 B6 7A A2 85 ED C7 34 08 36 98 17 FE 4E 26
       data hash MD5: 16K
       87 D1 53 13 5D 56 D1 F7 5B 54 84 06 DF 5B A7 41>)
(   2,<2023-10-23 13:58:59.71 +0400>,<she>,<DPX200>,
      <Start of raw data processing
       efp BC_mod = 2 LB = 0.24 FT_mod = 6 PKNL = 1 PHC0 = -22941.5 PHC1 = 7.452711 SI = 16K 
       data hash MD5: 16K
       35 2F 02 6D 18 FB A1 92 1E 26 25 1D 5C 5B 7A B9>)
(   3,<2023-10-23 13:59:21.26 +0400>,<she>,<DPX200>,
      <pk PHC0 = -114.1294 PHC1 = 1.4 
       data hash MD5: 16K
       F8 B7 2F 71 51 99 F5 EF CC 0A 54 48 53 20 B6 12>)
(   4,<2023-10-23 13:59:25.07 +0400>,<she>,<DPX200>,
      <abs ABSG = 5 
       data hash MD5: 16K
       B7 47 52 51 8D D5 DD A9 EC A9 E7 46 D6 61 28 BA>)
$$ ##END=
$$ 
$$ hash MD5
$$ 95 8B 62 7B 8B FE 24 37 82 42 50 8F 70 40 29 B9
##$RELAX= 
##$RELAX= 
##$RELAX= 
##$RELAX= 
##$RELAX= 
##$RELAX= 
$$ Bruker specific parameters
$$ --------------------------
##$DU= <F:/spectra>
##$EXPNO= 1
##$NAME= <H-F>
##$PROCNO= 1
##$TYPE= <nmr>
##$USER= <she>
##$AMP= (0..31)
100 100 100 100 100 100 100 100 100 100 100 100 100 100 100 100 100 100 
100 100 100 100 100 100 100 100 100 100 100 100 100 100 
##$AQSEQ= 0
##$AQ_mod= 1
##$AUNM= <au_zg>
##$AUTOPOS= <>
##$BF1= 200.13
##$BF2= 200.13
##$BF3= 200.13
##$BF4= 200.13
##$BF5= 200.13
##$BF6= 200.13
##$BF7= 200.13
##$BF8= 200.13
##$BYTORDA= 1
##$CFDGTYP= 0
##$CFRGTYP= 5
##$CHEMSTR= <none>
##$CNST= (0..31)
1 1 145 1 1 1 1 1 1 1 1 1 1 1 1 1 1 1 1 1 1 1 1 1 1 1 1 1 1 1 1 1 
##$CPDPRG= <>
##$CPDPRG1= <>
##$CPDPRG2= <>
##$CPDPRG3= <>
##$CPDPRG4= <mlev>
##$CPDPRG5= <mlev>
##$CPDPRG6= <mlev>
##$CPDPRG7= <mlev>
##$CPDPRG8= <mlev>
##$CPDPRGB= <>
##$CPDPRGT= <>
##$D= (0..31)
0 1.2 0 0 0 0 0 0 0 0.06 0 0.03 0 0 0 0 0.0002 0 0 0 0 0 0 0 0 0 0 0 0 
0 0 0 
##$DATE= 1698055135
##$DBL= (0..7)
120 120 120 120 120 120 120 120 
##$DBP= (0..7)
150 150 150 150 150 150 150 150 
##$DBP07= 0
##$DBPNAM0= <>
##$DBPNAM1= <>
##$DBPNAM2= <>
##$DBPNAM3= <>
##$DBPNAM4= <>
$$ [...]
##$SUBNAM3= <"">
##$SUBNAM4= <"">
##$SUBNAM5= <"">
##$SUBNAM6= <"">
##$SUBNAM7= <"">
##$SUBNAM8= <"">
##$SUBNAM9= <"">
##$SW= 18.05172834244
##$SWIBOX= (0..15)
0 0 2 0 0 0 0 0 0 0 0 0 0 0 0 0 
##$SW_h= 3612.71676300578
##$TD= 16384
##$TD0= 1
##$TE= 0
##$TE2= 300
##$TE3= 300
##$TEG= 300
##$TL= (0..7)
0 120 120 120 120 120 120 120 
##$TP= (0..7)
150 150 150 150 150 150 150 150 
##$TP07= 0
##$TPNAME0= <>
##$TPNAME1= <>
##$TPNAME2= <>
##$TPNAME3= <>
##$TPNAME4= <>
##$TPNAME5= <>
##$TPNAME6= <>
##$TPNAME7= <>
##$TPOAL= (0..7)
0.5 0.5 0.5 0.5 0.5 0.5 0.5 0.5 
##$TPOFFS= (0..7)
0 0 0 0 0 0 0 0 
##$TUNHIN= 0
##$TUNHOUT= 0
##$TUNXOUT= 0
##$USERA1= <user>
##$USERA2= <user>
##$USERA3= <user>
##$USERA4= <user>
##$USERA5= <user>
##$V9= 5
##$VALIST= <valist>
##$VCLIST= <CCCCCCCCCCCCCCC>
##$VD= 0
##$VDLIST= <DDDDDDDDDDDDDDD>
##$VPLIST= <PPPPPPPPPPPPPPP>
##$VTLIST= <TTTTTTTTTTTTTTT>
##$WBST= 1024
##$WBSW= 4
##$XGAIN= (0..3)
0 0 0 0 
##$XL= 0
##$YL= 0
##$YMAX_a= 178458
##$YMIN_a= -241602
##$ZGOPTNS= <>
##$ZL1= 120
##$ZL2= 120
##$ZL3= 120
##$ZL4= 120
##$ABSF1= 15.7568
##$ABSF2= -2.29505
##$ABSG= 5
##$ABSL= 3
##$ALPHA= 0
##$AQORDER= 0
##$ASSFAC= 0
##$ASSFACI= 0
##$ASSFACX= 0
##$ASSWID= 0
##$AUNMP= <proc_1d>
##$AZFE= 0.1
##$AZFW= 0.1
##$BCFW= 0
##$BC_mod= 2
##$BYTORDP= 0
##$COROFFS= 0
##$CY= -3
##$DATMOD= 1
##$DC= 0
##$DFILT= <>
##$DTYPP= 0
##$F1P= 0
##$F2P= 0
##$FCOR= 1
##$FTSIZE= 16384
##$FT_mod= 6
##$GAMMA= 0
##$GB= 0
##$INTBC= 1
##$INTSCL= 3.70164e-10
##$ISEN= 128
##$LB= 0.24
##$LEV0= 0
##$LPBIN= 0
##$MAXI= 10000
##$MC2= 0
##$MEAN= 0
##$ME_mod= 0
##$MI= 1.114404
##$NCOEF= 0
##$NC_proc= -8
##$NLEV= 6
##$NOISF1= 3.799351
##$NOISF2= 2.8
##$NSP= 0
##$NTH_PI= 0
##$NZP= 0
##$OFFSET= 15.73146
##$PC= 1
##$PHC0= -23055.63
##$PHC1= 8.852711
##$PH_mod= 1
##$PKNL= yes
##$PPARMOD= 0
##$PSCAL= 0
##$PSIGN= 0
##$REVERSE= no
##$SF= 200.130008019905
##$SI= 16384
##$SIGF1= 3
##$SIGF2= 2
##$SINO= 5.538805
##$SIOLD= 16384
##$SREGLST= <1H.CDCl3>
##$SSB= 0
##$STSI= 16384
##$STSR= 0
##$SW_p= 3612.71676300578
##$SYMM= 0
##$S_DEV= 0
##$TDeff= 16384
##$TDoff= 0
##$TI= <>
##$TILT= no
##$TM1= 0
##$TM2= 0
##$TOPLEV= 0
##$USERP1= <user>
##$USERP2= <user>
##$USERP3= <user>
##$USERP4= <user>
##$USERP5= <user>
##$WDW= 1
##$XDIM= 16384
##$YMAX_p= 497956165
##$YMIN_p= -776380
$$ End of Bruker specific parameters
$$ ---------------------------------
##NTUPLES= NMR SPECTRUM
##VAR_NAME=  FREQUENCY,     SPECTRUM/REAL,   SPECTRUM/IMAG
##SYMBOL=    X,             R,               I
##VAR_TYPE=  INDEPENDENT,   DEPENDENT,       DEPENDENT
##VAR_FORM=  AFFN,          ASDF,            ASDF
##VAR_DIM=   16384,         16384,           16384
##UNITS=     HZ,            ARBITRARY UNITS, ARBITRARY UNITS
##FACTOR=    0.220516191357247, 1,           1
##FIRST=     3148.33713943805, 0,            0
##LAST=      -464.379623567729, 0,           0
##MIN=       -464.379623567729, -776380,     0
##MAX=       3148.33713943805, 497956165,    0
$$ Real data points
##PAGE= N=1
##DATA TABLE= (X++(R..R)), XYDATA
$$ [...]
12061e67k3837J1024j8972k8652l6756Q9401Q453n5690q115R7137J8122n865j440
$$ -567 -24404 -13380 -32352 -61004 -97760 -8359 94 -55596 -63711 33426 51548 45683 44243
12048D4243n3928n3170P0128R9488J1782l4747k9198M6304o1385j00698N7348
$$ 44243 -9685 -62855 7273 106761 118543 83796 54598 100902 39517 -61181 -3833
12037c833N1751l5168J6877L5080j6733l9027L3154K7645Q335j190q1373m6648
$$ -3833 47918 12750 29627 64707 47974 8947 42101 69746 78081 76891 -4482 -51130
12025e1130K6497j6956P183p51P7993P729K5424l235p970l6953l3577m1456j9
$$ -51130 -24633 -41589 -34406 -35157 42836 50565 75989 72754 64784 27831 -5746 -47202 -47221
12012d7221Q3348K9019n7474k2084P7553n1585O0912j6695m1874k2434q247K2490
$$ -47221 36127 65146 7672 -14412 63141 11556 72468 55773 13899 -8535 -16782 5708
12000E708n543K4883P886m3460J9702m9556p3318M9888J4177n0784M7497M5964
$$ 5708 165 25048 32934 -10526 9176 -40380 -113698 -63810 -49633 -100417 -52920 -6956
11988f956J5706k6067K4014M9279N39k7080l5107O1J7214j8784Q059j1007j3123
$$ -6956 8750 -17317 6697 55976 56515 29435 -5672 -5611 11603 -7181 878 -10129 -23252
11975b3252O7217L5451n0323r31P278k3522j3962J6585r346l9420k3997P6955
$$ -23252 43965 79416 29093 28162 35440 11918 -2044 14541 5195 -34225 -58222 18733
11963A8733k0818k4310p8612M3351K5430N5919j1882J2889j8085O12J6279j7176
$$ 18733 -2085 -26395 -105007 -61656 -36226 19693 7811 20700 2615 3227 19506 2330
11951B330J4943L5878o9212L0258M4206K7115k5260o2330J9061J0226j968j0185
$$ 2330 17273 53151 -16061 14197 58403 85518 60258 -2072 16989 27215 25247 15062
11939A5062K3339l0974J698J4362N7272q7676L3719N649K01J3127R054o0991K9792
$$ 15062 38401 7427 9125 23487 80759 -6917 26802 32451 32652 45779 54833 -6158 23634
11926B3634L204K9970k6806L9999L3110l4741n1294N258M8998k4447j3335q45
$$ 23634 26838 56808 30002 70001 103111 68370 17076 22334 71332 46885 33550 32705
11914C2705k5301J8916l7674n633J4396L0500j810l024j2598L4618L8048m5569
$$ 32705 7404 26320 -11354 -16987 -2591 27909 26099 23075 10477 45095 83143 37574
11902C7574k3578l4197N354M5965J0754n654l4729j646K614M499N1819M8984k7358
$$ 37574 13996 -20201 -14847 31118 41872 36218 1489 -157 2457 6956 58775 107759 80401
11889H0401n8868k1165O9113L1791m5589n1996k2675R796M7878K0111j1951L3441
$$ 80401 21533 368 69481 101272 55683 3687 -18988 -9192 38686 58797 46846 80287
11877H0287l5960M7303k6087k4426K1283k9928k8479L4548Q859k3911L3749m787
$$ 80287 44327 91630 65543 41117 62400 32472 3993 38541 47400 23489 57238 52451
11865E2451o087J6573j9442r27N666M7769j9721k7277J1865K3662m634P096l652
$$ 52451 46364 62937 43495 42568 48234 96003 76282 49005 60870 84532 79898 86994 83342
11852H3342j1731l222n402M524k1849R760J1829K0227P14k4544l0237M5512J352
$$ 83342 71611 68389 62987 67511 45662 55422 67251 87478 88192 63648 33411 78923 80275
11839H0275m5012o9121J23529K5330n4998K0704M4896N28n5729M4889m4110m0938
$$ 80275 35263 -33858 89671 115001 60003 80707 125603 126131 70402 115291 71181 30243
11827C0243L853M7702m8580P840L3412J196N1615n0852p1121J8948q638N6729
$$ 30243 34096 81798 33218 41058 74470 75666 127281 76429 5308 24256 15618 72347
11815G2347N4410m4029p1757K4486M9232q1929p328O9500m799M8680P175p1159
$$ 72347 126757 82728 10971 35457 84689 2760 -4568 64932 60133 108813 115988 44829
11803D4829k1575j5278k3684L2236J1994m0691k6902J5057P1184j2198n0051L0012
$$ 44829 23254 7976 -15708 16528 28522 -12169 -39071 -24014 47170 34972 -15079 14933
11791A4933o363q302M5600k6692j8022J0291k5413J1244M3183n781M4441j741
$$ 14933 8570 268 45868 19176 1154 11445 -13968 -2724 40459 34678 79119 77378
11779G7378k8751o312J9602p512n6877j692k9160N2062J1601O3230p5600p096
$$ 77378 48627 42315 61917 54405 -2472 -4164 -33324 18738 30339 93569 17969 10873
11767A0873L1887k8527R379l8784j7535M6333L7680k9748p123K9500K1506l8402
$$ 10873 42760 14233 23612 -15172 -32707 13626 51306 21558 14435 43935 65441 27039
11755B7039L8313l6197j04039M6969J2016j2048K2748l6735M308K3378K4625j7680
$$ 27039 65352 29155 -74884 -27915 -15899 -27947 -5199 -41934 -37626 -14248 10377 -7303
11743g303k5587l4450O9577K7870k7640N5702k4994j2256M4002j9829j4068J4070
$$ -7303 -32890 -67340 2237 30107 2467 58169 33175 20919 64921 45092 31024 45094
11731D5094q8157J19008J2347j12741n6012O8091j0529L6793N0731p0237L2769
$$ 45094 -43063 75945 88292 -24449 -80461 -12370 -22899 13894 64625 -5612 27157
11720B7157K6050O9327n0887l5702l4384K4450n7726K7303M1570j1664m5103Q0974
$$ 27157 53207 122534 71647 35945 1561 26011 -31715 -4412 37158 25494 -19609 61365
11708F1365O736j3952K492p324k8680J1856k7054k5607j5667J0639m698N7434
$$ 61365 68101 54149 56641 49317 20637 32493 5439 -20168 -35835 -25196 -29894 27540
11696B7540J5279r580k2415p8389K1928K2433j6896O4853J6725p0207m932L0261
$$ 27540 42819 33239 10824 -67565 -45637 -23204 -40100 24753 41478 -28729 -33661 -3400
11684c400L5309j8520m6128k7459M6754J5784P680R700K3788M0806l306o2996
$$ -3400 31909 13389 -32739 -60198 -13444 2340 10020 19720 43508 84314 81008 18012
11672A8012K3170Q327j1240m9726j5749k1069K3865j1489L0538K4115k7340L3938
$$ 18012 41182 49509 38269 -11457 -27206 -48275 -24410 -35899 -5361 18754 -8586 25352
11660B5352O7551l373m6610p2024j1207j8162l10P226m9429P6922M6571l5177
$$ 25352 92903 89530 42920 -29104 -40311 -58473 -58783 -51557 -100986 -24064 22507 -12670
11648a2670N51N281l3973K0563K7207m265k6391K088N4921o2076l4324m0229J26084
$$ -12670 -12119 -6838 -40811 -20248 6959 2694 -23697 -21609 33312 -28764 -63088 -103317 22767
11635B2767p295m4005j6713O6785k7062Q603Q861J7495n1898L8992L0486j8631
$$ 22767 15472 -28533 -45246 21539 -5523 3080 11941 29436 -22462 16530 47016 28385
11623B8385P1930m0956l6400j7169j8529j7964n9400Q2147J03243m3694m495M0539
$$ 28385 100315 59359 22959 5790 -12739 -30703 -90103 -7956 95287 51593 47098 87637
11611H7637l8358Q755l9891J7740o5004l7571O2380n7774N2205P5331N6833l8677
$$ 87637 49279 58034 18143 35883 -29121 -66692 -4312 -62086 -9881 65450 122283 83606
11599H3606k3093p8065N6869k1812M430q4318R4631j7559o5997L375J2627m358
$$ 83606 60513 -17552 39317 17505 21935 -62383 32248 14689 -51308 -47933 -35306 -39664
11587c9664L8878J8423m1483J9789Q5049n1690j2566M5017l337k5538K7046k442
$$ -39664 -786 17637 -23846 -4057 80992 29302 16736 61753 58416 32878 59924 57482
11575E7482r2803j1211K9433K0003p672l3992M8597L0405K7825r3775m9357O8169
$$ 57482 -35321 -46532 -17099 2904 -4768 -38760 9837 40242 68067 -25708 -75065 -6896
11563f896K5573l3880r113L687J0896j203Q583K8009m6636k1086O6831L7116l6724
$$ -6896 18677 -15203 -24316 -20629 -9733 -10936 -2353 25656 -20980 -42066 24765 61881 25157
11550B5157j6817o8065N8087M6106l6843K8249l9237R423j895j9357j1297K6973
$$ 25157 8340 -59725 -1638 44468 7625 35874 -3363 6060 4165 -15192 -26489 484
11538D84M5467n7398k6031l075L9825K5783p1906m3357O4937m0140k0904L4768
$$ 484 45951 -11447 -37478 -40553 -728 25055 -46851 -90208 -25271 -65411 -86315 -51547
11526e1547K308J6576o098J0375L5796m5471o7491j381L0691P9200l8634R504
$$ -51547 -49239 -32663 -38761 -28386 7410 -38061 -105552 -106933 -76242 2958 -35676 -26172
11514b6172K3456q5092l4210N270m2051N281N9915L7286J5860j3276O2881M539
$$ -26172 -2716 -87808 -122018 -116748 -158799 -153518 -93603 -56317 -40457 -53733 9148 13687
11502A3687n2435l6221N1061j4392J4634k4568L0945J1901K1565j7209k8323j1519
$$ 13687 -38748 -74969 -23908 -38300 -23666 -48234 -17289 -5388 16177 -1032 -29355 -40874
11490d0874k2096o5638M7806M8828N7255k6220j5622q212K5991l7954p334L9694
$$ -40874 -62970 -128608 -80802 -31974 25281 -939 -16561 -24773 1218 -36736 -44070 -4376
11478d376o5118P1285l984q9701M9304M1173k28p006K2384L2733J2563q3577o0804
$$ -4376 -69494 1791 -2193 -91894 -42590 -1417 -1645 -8651 13733 46466 59029 -24548 -85352
11465h5352O6399J0716l9237P3038n9616j7555p898J5169J8065k7609j8700N3326
$$ -85352 -18953 -8237 -47474 25564 -34052 -51607 -59505 -44336 -26271 -53880 -72580 -19254
11453a9254M5040m2353k5935Q451L5947m2638J1310M6539L5312j7974k602j8447
$$ -19254 25786 -16567 -42502 -34051 1896 -40742 -29432 17107 52419 34445 31843 13396
11441A3396n8446J4050q90m7217K7135l6953R864L757J1296k3680M4533K1661
$$ 13396 -45050 -31000 -31890 -79107 -51972 -88925 -79061 -75304 -64008 -87688 -43155 -21494
11429b1494M9233p1763L86J0395l0367K4029p842r918K2125o16l930l2769O0514
$$ -21494 27739 -44024 -43638 -33243 -63610 -39581 -47423 -57341 -35216 -35832 -39762 -72531 -12017
11416a2017n2549K9865n975l190R827l0668N5164K2841j3945k3145J7706L9016
$$ -12017 -64566 -34701 -40676 -43866 -34039 -64707 -9543 13298 -647 -23792 -6086 32930
11404C2930J2619n6198J6804n0020K6341l5609L3073O6764o723K4213m9851p7920
$$ 32930 45549 -10649 6155 -43865 -17524 -53133 -20060 46704 39981 64194 14343 -63577
11392f3577J6332L0805j9259n0810J9605Q812m2482N9052K3616o114L3448k1377
$$ -63577 -47245 -16440 -35699 -86509 -66904 -58092 -100574 -41522 -17906 -24020 9428 -11949
11380a1949L202N5961j3416l1771J4540J3727m9708M0511q838M591k2249R423
$$ -11949 -8747 47214 33798 2027 16567 30294 -19414 21097 12259 16850 -5399 4024
11368D024j3898l6247K997p89J9472Q022n8517n0872P4551j6465j4815L942N5801
$$ 4024 -9874 -46121 -43124 -43913 -24441 -16419 -74936 -125808 -51257 -67722 -82537 -78595 -22794
11355b2794r605N0733J6400n5235N5673n4489L2270L507o1031j3311J3981P4393
$$ -22794 -32399 18334 34734 -20501 35172 -19317 12953 16460 -44571 -57882 -43901 30492
11343C0492l115L5130j7213m1311j6720M9054N1058o3892Q918J3997N4862m967
$$ 30492 27377 62507 45294 3983 -12737 36317 87375 23483 32401 46398 101260 96293
11331I6293m2887n3705p340n423l4160L9340p859j559R447o958K4727N690o5107
$$ 96293 53406 -299 -7639 -13062 -47222 -7882 -15741 -17300 -7853 -14811 9916 15606 -49501
11318d9501N92k4722L8461J6899J5098q269J7746J5778l7828m0209l9359k402
$$ -49501 -48909 -73631 -35170 -18271 -3173 -11442 6304 22082 -15746 -55955 -95314 -97716
11306i7716R979j7776J6240L3545j2287K4721P2660J0734j5531j1762Q478k726
$$ -97716 -87737 -105513 -89273 -55728 -68015 -43294 29366 40100 24569 12807 21285 18559
11294A8559l2948N992M3700P858l883O096j1076o960j3573J4784k6071l8840o872
$$ 18559 -14389 -8397 35303 43161 39278 45374 34298 27338 13765 28549 2478 -36362 -43234
11281d3234Q2522O2987m117j27485R623N0307j5406q019k4087n6360N5041J003
$$ -43234 39288 102275 98158 -29327 -19704 30603 15197 7178 -16909 -73269 -18228 -17225
11269a7225m2429K7173O3940K7655j8753k0663j4066N7420L1618m4490p3936J2703
$$ -17225 -59654 -32481 31459 59114 40361 19698 5632 63052 94670 50180 -23756 -11053
11257a1053J7462L4428j0262M0307R172l978l3852K0402p1012P3308K2239m8843
$$ -11053 6409 40837 30575 70882 80054 76076 42224 62626 -8386 64922 87161 38318
11245C8318p947r406R031J5089J3886J3374N276l2913M1790p6248M4410L7864
$$ 38318 30371 20965 29996 45085 58971 72345 77621 44708 86498 10250 54660 92524
11233I2524p4919m2155K597N7901L4809P2537j8076Pr8520k0706K3465m6216N7352
$$ 92524 17605 -24550 -21953 35948 70757 143294 125218 125225 26705 5999 29464 -16752 40600
11220D0600l534k6660k3682j4173n470P4814M1692K921l9663m3656L5391l7313
$$ 40600 37066 10406 -13276 -27449 -32919 41895 83587 86508 46845 3189 38580 1267
11208A267K990L4626j6527N0290n5046k3984k3448j1730M22k501N3806K0767j4859
$$ 1267 4257 38883 22356 72646 17600 -6384 -29832 -41562 -41140 -43641 10165 30932 16073
11195A6073K2696j3045J3490l3650j7749M8417L7215N6997P5326K5287k892L3218
$$ 16073 38769 25724 39214 5564 -12185 36232 73447 130444 205770 231057 228165 261383
11183B61383k683o0484M5871m4817p2011q4284k0786O0948n3933L5135K4969k640
$$ 261383 258700 198216 244087 199270 127259 42975 22189 83137 29204 64339 89308 86668
11171H6668j6515L4623Q5736L0784q3591M848N7730l606l4200J8902K7751M042
$$ 86668 70153 104776 190512 221296 137705 142553 200283 196677 162477 181379 209130 213172
11159B13172p4907k035m0298k1406M6l8646r550k2313J4908L890L637N3746O665
$$ 213172 138265 136230 95932 74526 74572 35926 26376 4063 18971 22861 26498 80244 86909
11146H6909N3589N5623l3065o3076J4163L3609o300O7378k7494j7139K3094J7366
$$ 86909 140498 196121 163056 99980 114143 147752 141452 208830 181336 164197 187291 204657
11134B04657m0866J1929k3612M2969P2273J6961k7541o9731p229R0557p4427J1319
$$ 204657 163791 175720 152108 195077 267350 284311 256770 187039 179810 270367 195940 207259
11122B07259K2981m0916j7828J7452L8194l0061o0506m8291J1426M4808J3604
$$ 207259 230240 189324 171496 188948 227142 197081 136575 88284 99710 144518 158122
11111A58122K6841Q985K8869K2751L1711O182k3422L7436k9461j9303L3725j3883
$$ 158122 184963 193948 222817 245568 277279 283461 260039 297475 268014 248711 282436 268553
11099B68553r6730Q6922j9826k8372M8268J9012R894j5429n673j1607L3241O312
$$ 268553 171823 258745 238919 210547 258815 277827 287721 272292 266619 255012 288253 294565
11087B94565L1516L2436n348o7172k4330K8711q83j2986N5496K1311l2595N4197
$$ 294565 326081 358517 353169 285997 261667 290378 289495 276509 332005 353316 320721 374918
11075C74918l5907n8302K282K618J9993J286N4977J1592j0731J3687K9K1956j2831
$$ 374918 339011 280709 282991 285609 305602 306888 361865 373457 362726 376413 376442 398398 385567
11062C85567J5776J20248Q7154l7277Q56N488M1913o8529n5835n3709M8715K0494
$$ 385567 401343 521591 608745 571468 572324 577812 619725 551196 495361 441652 490367 510861
11050E10861M847k5827j3652K2289N7684J3051Q4850N3227m8295M212K8131K6402
$$ 510861 515708 489881 476229 498518 556202 569253 654103 707330 659035 663247 691378 717780
11038G17780O7457N7776l8778q7345Q253Q7302p275r660m358M2916j7764l1818
$$ 717780 785237 843013 804235 716890 725143 812445 805170 795510 791152 834068 816304 784486
11026G84486N4018j092K6751N3343k9820M7912m6699l338K9751o850P6287K9355
$$ 784486 838504 837412 864163 917506 887686 935598 888899 885561 915312 908462 984749 1014104
11014A014104N8714P0126r7584l3196J1618L977k8248Q4457K5435j4725J3426
$$ 1014104 1072818 1142944 1045360 1012164 1023782 1027759 999511 1083968 1109403 1094678 1108104
11003A108104J3740M5541K800L7967k7182J6505M9078N611M0059K7582L9701L1908
$$ 1108104 1121844 1167385 1170185 1208152 1180970 1197475 1246553 1252164 1292223 1319805 1359506 1391414
10991A391414k6849P3153N7904m7151J105M0678N0380M3984L6973J2847J6092
$$ 1391414 1364565 1437718 1495622 1448471 1449576 1490254 1540634 1584618 1621591 1634438 1650530
10980A650530L6695P3288N0206J23499K1569O458O230M1834j0217L5511L117M211
$$ 1650530 1687225 1760513 1810719 1934218 1955787 1962245 1968475 2010309 2000092 2035603 2038720 2042931
10968B042931N2906J01086M7456O0227P3187P1731M2012K1949N5405M7921K0565
$$ 2042931 2095837 2196923 2244379 2304606 2377793 2449524 2491536 2513485 2568890 2616811 2637376
10957B637376J0596J41107R9573N9051O5200J08419M9758Q4061k753M2993J04771
$$ 2637376 2647972 2789079 2888652 2947703 3012903 3121322 3171080 3255141 3252388 3295381 3400152
10946C400152J19427N8034N5472L9897J49071J30254M6550O6423O1171N446J77532
$$ 3400152 3519579 3577613 3633085 3672982 3822053 3952307 3998857 4065280 4126451 4131897 4309429
10935D309429P8334j7191N0153J14592L6779J16603P1875n879P9990K9598L9305
$$ 4309429 4387763 4370572 4420725 4535317 4572096 4688699 4760574 4754695 4834685 4864283 4903588
10924D903588J09991j0291M5812J05725Q0475P2611K9971J16011J7562J9913P8189
$$ 4903588 5013579 5003288 5049100 5154825 5235300 5307911 5337882 5453893 5471455 5491368 5569557
10913E569557N5943N246k3113p5485l2433r022o6648N7255M7815M694N7937k681
$$ 5569557 5625500 5630746 5607633 5532148 5499715 5490693 5424045 5481300 5529115 5533809 5591746 5589065
10901E589065K4138M199r632P211J3578j6329M1663n0697j04777n2983o0770n0152
$$ 5589065 5613203 5617402 5607770 5614981 5628559 5612230 5653893 5603196 5498419 5445436 5384666 5334514
10889E334514o5361p1293j05828J7913n6973q9076q5073q8373l2182p6860o4189
$$ 5334514 5269153 5197860 5092032 5109945 5052972 4963896 4878823 4790450 4758268 4681408 4617219
10878D617219m897m4302n445R994m7984L4934q7430L5338j3217j5449J4091m6239
$$ 4617219 4612322 4568020 4562575 4572569 4524585 4559519 4472089 4507427 4494210 4478761 4492852 4446613
10866D446613K7265M2348N7014M3625q8921Q235P3065j6002l4500K0506L2295
$$ 4446613 4473878 4516226 4573240 4616865 4527944 4536179 4609244 4593242 4558742 4579248 4611543
10855D611543m0258q727K1932J2079O937p0068n1537J6049l6261m4306K1941l0056
$$ 4611543 4571285 4562558 4584490 4596569 4603506 4533438 4481901 4497950 4461689 4417383 4439324 4409268
10843D409268l476m4346m8193q3160l5044m5094j00462q4294j01364o8142q6588
$$ 4409268 4405792 4361446 4313253 4230093 4195049 4149955 4049493 3965199 3863835 3795693 3709105
10832C709105p9819k7959r7264j6419j26036j25341j12172p2596J7539n3968p6476
$$ 3709105 3629286 3601327 3504063 3487644 3361608 3236267 3124095 3051499 3069038 3015070 2938594
10821B938594l4894o9477l3740q9058j08017m0677o7682n6767r0054k1426j01594
$$ 2938594 2903700 2834223 2800483 2711425 2603408 2562731 2495049 2438282 2348228 2326802 2225208
10810B225208j04573m2025p8685l1188j1099q1600n9565o0812p8137j9784j2567
$$ 2225208 2120635 2078610 1999925 1968737 1957638 1876038 1816473 1755661 1677524 1657740 1645173
10799A645173M0045o1942j26279L8018o2351l2628n5592q5869k1900O1026q5872
$$ 1645173 1685218 1623276 1496997 1535015 1472664 1440036 1384444 1298575 1276675 1337701 1251829
10788A251829n2213l9139p1084R421O5925J8668q4393k9851N059J1606k9241k9786
$$ 1251829 1199616 1160477 1089393 1098814 1164739 1183407 1099014 1069163 1074222 1085828 1056587 1026801
10776A026801l3267J8594N191n1553M6186M967r732n6938q5615j9613q04P5775
$$ 1026801 993534 1012128 1017319 965766 1011952 1016919 1007187 950249 864634 845021 844217 919992
10764I19992n4230p9880K8381q9091K1576k2663m4358r191O172J236L7744l474
$$ 919992 865762 785882 814263 725172 746748 724085 679727 670536 676708 677944 715688 712214
10752G12214r428L637P8273l1728q208l3900l8750m4436n7759K7348l922o7854
$$ 712214 702786 706423 784696 752968 744760 710860 672110 627674 569915 597263 593341 525487
10740E25487L6401K3187J564l2237j22671L57L7708Q320p0045k3521J4477N2119
$$ 525487 561888 585075 586639 554402 431731 432088 469796 478116 408071 384550 399027 451146
10728D51146p5758K6707M8313N6831n3351k0434m5549l0521K2138K4338J8466
$$ 451146 375388 402095 450408 507239 453888 433454 387905 357384 379522 403860 422326
10717D22326L28m5869l6857N8530n3115l961o1630m3387K8370L0299J2742J2617
$$ 422326 422654 376785 339928 398458 345343 341382 279752 236365 264735 295034 307776 320393
10705C20393j8098k871K5671N0464M8629K3373k4997o3526o9740N597K9464N490
$$ 320393 302295 299424 325095 375559 424188 447561 422564 359038 289298 294895 324359 329849
10693C29849J8063n771m5263k1468j341r394k3276n0051L131l1359L9442r150
$$ 329849 347912 342141 296878 275410 274069 264675 241399 191348 194479 163120 202562 193412
10681A93412o5644P0116O7537m1862m3831J0483M878k737j6963k2918K111L1210
$$ 193412 127768 197884 265421 223559 179728 190211 195089 192352 175389 152471 154582 185792
10669A85792m2744r292k8977l0852M5405K8068p845k8731J4068L0060j6840J954
$$ 185792 143048 133756 104779 73927 119332 147400 139555 110824 124892 154952 138112 140066
10657A40066L5910k5603k5162r780L8481K1554L0510l6966n4132J769L5016l380
$$ 140066 175976 150373 125211 115431 153912 175466 205976 169010 114878 116647 151663 148283
10645A48283r3396p152O0784n3238P3007j4120l9448L3268M8811n3726J5289k1030
$$ 148283 54887 47735 108519 55281 128288 114168 74720 107988 156799 103073 118362 97332
10633I7332J2161n4326j4277K9529M0614K010n5372j0630o680K7227P904k6336
$$ 97332 109493 55167 40890 70419 111033 113043 57671 47041 40361 67588 75492 49156
10621D9156m5957m5168j7393M8984j0301O7152K2880j910j7798j8184O9404M331
$$ 49156 3199 -41969 -59362 -10378 -20679 46473 69353 67443 49645 31461 100865 105196
10609A05196k9544l6660l1705k6226P6166N978q4995k0630L7510O663n9769M5272
$$ 105196 75652 38992 7287 -18939 57227 63205 -21790 -42420 -4910 1753 -58016 -12744
10597a2744L270l8764k7470l7426Q2788R5076l2059l4470j2703k5396N1991L3008
$$ -12744 -9474 -48238 -75708 -113134 -30346 64730 32671 -1799 -14502 -39898 12093 45101
10585D5101m7849r669n2671Q6614J6698J4950M4407l2910j44o6123n2527j3405
$$ 45101 -2748 -12417 -65088 21526 38224 53174 97581 64671 64527 -1596 -54123 -67528
10573f7528j4399O1647j3572m0020M88N340J3487J8604k9472L9952K4495j4987
$$ -67528 -81927 -20280 -33852 -73872 -73384 -68044 -54557 -35953 -65425 -25473 -978 -15965
10561a5965m6183O3965L7817q63j8891o55O7793l5767p0088N339L960K775J2549
$$ -15965 -62148 1817 39634 38771 19880 19225 87018 51251 -18837 -13498 -9538 -6763 5786
10548E786J4008k202m2794l2493J307N7082J5419m3002J1743J835r4780k0479
$$ 5786 19794 17592 -25202 -57695 -56388 694 16113 -26889 -15146 -13311 -108091 -128570
10536a28570J34746j6584l5243L0246p024n0897o1519M8081j3718j6889r440P6647
$$ -128570 6176 -10408 -45651 -15405 -22429 -73326 -134845 -86764 -100482 -117371 -126811 -50164
10524e0164P2334j7118n5230L5528K6310n9942l6115j4587O4824M639l9288K2855
$$ -50164 22170 5052 -50178 -14650 11660 -48282 -84397 -98984 -34160 -29521 -68809 -45954
10512d5954Q5858m3314l8305j1095L2651j2748J3825L4514j5093l5670n8560N6772
$$ -45954 39904 -3410 -41715 -52810 -20159 -32907 -19082 15432 339 -35331 -93891 -37119
10500c7119J9888L8734j5408j6622O8231j13958j6441L0188K6556P61M0410K2612
$$ -37119 -17231 21503 6095 -10527 57704 -56254 -72695 -42507 -15951 -15190 25220 47832
10488D7832q5741m2531P1030m0732Q922N9568l1540K7957j9930l0833K9577L0756
$$ 47832 -37909 -80440 -9410 -50142 -41220 18348 -13192 14765 -5165 -35998 -6421 24335
10476B4335R910o2583p5948O4930Q034R916p0624J2846k1375L9119l3421L6006
$$ 24335 34245 -28338 -104286 -39356 -31322 -21406 -92030 -79184 -100559 -61440 -94861 -58855
10464e8855J2442o6950j513l0453L4547M8258K6089k5431N5616M2144k9300l2287
$$ -58855 -46413 -113363 -114876 -145329 -110782 -62524 -36435 -61866 -6250 35894 6594 -25693
10452b5693L9841k8280M4428k034j0625n4688p6208o9550M4103R6529J7871j7198
$$ -25693 14148 -14132 30296 28262 17637 -37051 -113259 -182809 -138706 -42177 -24306 -41504
10440d1504P077J2911j3151L7218n6700N7206J3369j7857j7396J6657k5416m2147
$$ -41504 -34427 -21516 -34667 2551 -54149 3057 16426 -1431 -18827 -2170 -27586 -69733
10428f9733m4520J7723k6622L7997O7264j9316l182k3294j0885K4317n310O7101
$$ -69733 -114253 -96530 -123152 -85155 -17891 -37207 -40389 -63683 -74568 -50251 -55561 11540
10416A1540l4518n521J12391l3095o1578M2479M1617n9143k6642q675o6101J7393
$$ 11540 -22978 -28499 83892 50797 -10781 31698 73315 14172 -12470 -21145 -87246 -69853
10404f9853J4984L1764l8151j8969k0821R3047J8146m5800p8818O418R3692m337
$$ -69853 -54869 -23105 -61256 -80225 -101046 -7999 10147 -35653 -114471 -108053 -14361 -18698
10392a8698m2438o8346l3362O4217q915P0103j8747j9630L8724l2514q669L8837
$$ -18698 -61136 -129482 -162844 -98627 -107542 -37439 -56186 -75816 -37092 -69606 -78275 -39438
10380c9438J4169r463L5229l0402J8837o4013m2005o525Q6763m4137j229M3336
$$ -39438 -25269 -34732 497 -29905 -11068 -75081 -117086 -123611 -36848 -80985 -82214 -38878
10368c8878J4154K2823J3624m0696l6122J8949L0776k4346o9877N7085N3859j6214
$$ -38878 -24724 -1901 11723 -28973 -65095 -46146 -15370 -39716 -109593 -52508 1351 -14863
10356a4863m407k4889N196j3181j8746K8709M0696o5289J9934J7075q9634L4957
$$ -14863 -19270 -44159 -38963 -52144 -70890 -42181 -1485 -66774 -46840 -29765 -119399 -84442
10344h4442M380l7614L0138L4066J7316k3096K1925j234l2675n20L1360q8027
$$ -84442 -80062 -117676 -87538 -53472 -36156 -59252 -37327 -38561 -71236 -71756 -40396 -128423
10332a28423k1021M8387J3170K508P105O731O96j3926l999j8069N8765k302o4290
$$ -128423 -149444 -101057 -87887 -85379 -78274 -71543 -70847 -84773 -88772 -106841 -48076 -50378 -114668
10319a14668J8089J2432j3547Q0253q1044M733L8520m3382J4254M652j1467l5652
$$ -114668 -96579 -84147 -97694 -17441 -98485 -93752 -55232 -98614 -84360 -79708 -91175 -126827
10307a26827J4373L0791j6568J6338M5754L367o1248n590j7877Q366L8730j3645
$$ -126827 -112454 -81663 -98231 -81893 -36139 -32772 -94020 -99610 -117487 -109121 -70391 -84036
10295h4036L2525m3810j107r77k4106l8974J8754M1552M4660k2243J1725N4159
$$ -84036 -51511 -95321 -96428 -97405 -121511 -160485 -141731 -100179 -55519 -77762 -66037 -11878
10283a1878k2378j8378L364o0889m2588J03539J7102n1026L7353j841j1958m7457
$$ -11878 -34256 -52634 -49270 -110159 -152747 -49208 -32106 -83132 -45779 -47620 -59578 -107035
10271a07035m558q76j255P9317o294J1916o1444M5461m345L7248K294l7184k5043
$$ -107035 -111593 -112469 -113724 -34407 -40701 -28785 -90229 -44768 -49113 -11865 -9571 -46755 -71798
10258g1798n6877N2180N4157m6812L381M0062l228r438P266k0962j2160M144K3517
$$ -71798 -128675 -76495 -22338 -69150 -65769 -25707 -28935 -38373 -31107 -52069 -64229 -60085 -36568
10245c6568j9424l7201O7656K2451j1262j06539M1741j8867j5825M7853k0831
$$ -36568 -55992 -93193 -25537 -3086 -14348 -120887 -79146 -98013 -113838 -65985 -86816
10234h6816L2131k2687j2160N8489l4853p82L3928M631p8911l2103Q1584j8050
$$ -86816 -54685 -77372 -89532 -31043 -65896 -66678 -32750 -28119 -107030 -139133 -57549 -75599
10222g5599M415J7889j6333K0318l9861j559o0175O749k0777j6562o740J02628
$$ -75599 -71184 -53295 -69628 -49310 -89171 -90730 -150905 -144156 -164933 -181495 -188235 -85607
10210h5607n783M8854l6458n5553P6176j893n6853M0948l5745J1763M3067k5738
$$ -85607 -91390 -42536 -78994 -134547 -58371 -60264 -117117 -76169 -111914 -100151 -57084 -82822
10198h2822j0344k5102L893J6949Q988n3117O5048N749M1017Q988m677o9505n2776
$$ -82822 -93166 -118268 -114375 -97426 -88438 -141555 -76507 -70758 -29741 -20753 -25430 -94935 -147711
10185a47711K7220Q2975J1330o1177L0759j7133O531j0804k3555M4041p377k7495
$$ -147711 -120491 -37516 -26186 -87363 -56604 -73737 -67206 -78010 -101565 -57524 -64901 -92396
10173i2396N8990M7539q581k9066k5379m0091K4108M2p4015R043j0274M7750Q9870
$$ -92396 -33406 14133 5552 -23514 -48893 -88984 -64876 -64834 -138849 -129806 -140080 -92330 -2460
10160b460q658k119o9423j945l3122L7805N3565p4720r4648P9815K9357o3478
$$ -2460 -11118 -13237 -82660 -84605 -117727 -79922 -26357 -101077 -195725 -115910 -86553 -150031
10148a50031N0133J1387M650l4775m427K1655j6061Q4151j3937q4349K6266L4469
$$ -150031 -99898 -88511 -83861 -118636 -123063 -101408 -117469 -33318 -47255 -131604 -105338 -70869
10136g0869N5441j3794n7670m128m5426P057N9547n2759O177n540J4362M112m543
$$ -70869 -15428 -29222 -86892 -91020 -136446 -129389 -69842 -122601 -116424 -121964 -107602 -103490 -108033
10123a08033k7147l767L6974k8272p7856M8114J21170m9920k9167K3216R4997
$$ -108033 -135180 -138947 -101973 -130245 -208101 -159987 -38817 -88737 -117904 -94688 309
10112C09M8045o7511J2144o2297m123K1099N9337k6846p5949m9150j9047n1626
$$ 309 48354 -19157 -7013 -69310 -73433 -52334 7003 -19843 -95792 -144942 -163989 -215615
10100b15615O8073N3685n15P21J0793k224l412k1400J0985k4706m3721J8961K3312
$$ -215615 -147542 -93857 -94372 -93651 -82858 -85082 -88494 -109894 -98909 -123615 -167336 -148375 -125063
10087a25063L0309K7184l2270J8524O5910J0598j6379l5522n9825r340M2230m8420
$$ -125063 -94754 -67570 -99840 -81316 -15406 -4808 -21187 -56709 -116534 -125874 -83644 -132064
10075a32064J5660R9740N315N300M1635q2871n3112K5527L1742J8907K290M9186
$$ -132064 -116404 -16664 -11349 -6049 35586 -47285 -100397 -74870 -43128 -24221 -21931 27255
10063B7255k3861k3882m4463O604R678R255o984m2121K7946K3989L5558q885k3142
$$ 27255 3394 -20488 -64951 -58347 -48669 -39414 -46398 -88519 -60573 -36584 -1026 -9911 -33053
10050c3053j8017l00L8656J2530p0354j7838K9709L2477p071k0227O12j9406M561
$$ -33053 -51070 -51370 -12714 -184 -70538 -88376 -58667 -26190 -33261 -53488 -52876 -72282 -67721
10037f7721L4842m8659N4233k8258m5591O1567K1958o04j1032j7520k8282J0295
$$ -67721 -32879 -81538 -27305 -55563 -101154 -39587 -17629 -18233 -29265 -46785 -75067 -64772
10025f4772l5131Q588M5764M2099m4879K8116l6389j4359J3552J781Q123L460
$$ -64772 -99903 -91315 -45551 -3452 -48331 -20215 -56604 -70963 -57411 -55630 -47507 -44047
10013d4047l4838l8717L9462K2336L209J8714M362m3539Q537J401Q303O373k2219
$$ -44047 -78885 -117602 -78140 -55804 -52595 -33881 -29519 -73058 -64521 -63120 -54817 -48444 -70663
10000g0663k2567K4201K7497j3042j032m985o180p4123M522L8132k5924M8980
$$ -70663 -93230 -69029 -41532 -54574 -55606 -60591 -66771 -140894 -136372 -98240 -124164 -75184
9988g5184O7449K1366o5502K595j5916O1871O019l5275n9774o007K0810M5272
$$ -75184 -7735 13631 -51871 -49276 -65192 -3321 2698 -32577 -92351 -98358 -77548 -32276
9976c2276k3881l0997J367N8579l565l3729j5700J7093L371P2672n0534m8702
$$ -32276 -56157 -87154 -85787 -27208 -30773 -64502 -80202 -63109 -59738 12934 -37600 -86302
9964h6302J5509K596K9857p1457L443P982L5969R592j0620k001r954M521J3567
$$ -86302 -70793 -68197 -38340 -109797 -106354 -98372 -62403 -52811 -63431 -65432 -75386 -70865 -57298
9951e7298O9616J6740n2329o6535M7004n4349o258K5847l9035K1862O3556k8945
$$ -57298 12318 29058 -23271 -89806 -42802 -97151 -103409 -77562 -116597 -94735 -31179 -60124
9939f0124j7885M5092p3288k2203L1780k2204j6424J6498O227N2660K6070n0125
$$ -60124 -78009 -32917 -106205 -128408 -96628 -118832 -135256 -118758 -112531 -59871 -33801 -83926
9927h3926L112L5631K5617j1001p4521k7845K7207O5373O062J7735J1857k9698
$$ -83926 -80814 -45183 -19566 -30567 -105088 -132933 -105726 -40353 -34291 -16556 -4699 -34397
9915c4397J4529k6256j6259j109o7433m5663L7880N3527j3713J6646Q18L4597
$$ -34397 -19868 -46124 -62383 -63492 -130925 -176588 -138708 -85181 -98894 -82248 -81430 -46833
9903d6833N9769p617l5543L9994l512n67l5309K643p517m6324L6028l3514m7920
$$ -46833 12936 5319 -30224 9770 6258 5691 -29618 -26975 -34492 -80816 -44788 -78302 -126222
9890a26222M7174M9711p0768k862j0451L8590L5555m9545k4305m7007N2740K8809
$$ -126222 -79048 -29337 -100105 -102967 -113418 -74828 -39273 -88818 -113123 -160130 -107390 -78581
9878g8581l14M5464l7319j9055L8104O668Q364m5570p114j1035J3175J8929K4542
$$ -78581 -78895 -33431 -70750 -89805 -51701 -45033 -36669 -82239 -89353 -100388 -87213 -68284 -43742
9865d3742j358l6104M9827K2305n6293r100J9409M692k0313L2896R765K3594l1718
$$ -43742 -45100 -81204 -31377 -9072 -65365 -74465 -55056 -50364 -70677 -37781 -28016 -4422 -36140
9852c6140l8904k3267k8358N3552J3841l7526R144J1441L628k6713J3792p078
$$ -36140 -75044 -98311 -126669 -73117 -59276 -96802 -87658 -76217 -72589 -99302 -85510 -92588
9840i2588K4850P739m2029m4804L3784Q4876j306m5556O6197l5309j7604L339
$$ -92588 -67738 -59999 -102028 -146832 -113048 -28172 -29478 -75034 -8837 -44146 -61750 -58411
9828e8411J9365q641n6645L0477p1942k0909J08307r940l39o133M7077J375l3890
$$ -58411 -39046 -47687 -104332 -73855 -145797 -166706 -58399 -68339 -68678 -74811 -27734 -26359 -60249
9815f0249l1078J8836R209j405K2715o4149N0976R6667o5096k8829L442k9560
$$ -60249 -91327 -72491 -63282 -64687 -41972 -106121 -55145 41522 -23574 -52403 -48961 -78521
9803g8521J1404m489J7343k3706O3994L9560l7417m0822l4811K9182J8035o0854
$$ -78521 -67117 -71606 -54263 -77969 -13975 25585 -11832 -52654 -87465 -58283 -40248 -101102
9791a01102n1905N2699K5203j820O3021P826l1270l8495K6856l1528k2569l5822
$$ -101102 -153007 -100308 -75105 -76925 -13904 -6078 -37348 -75843 -48987 -80515 -103084 -138906
9779a38906O7035J899n773m495q210K1273K153q21J5293l8257j2207O194r620
$$ -138906 -71871 -69972 -75745 -80240 -88450 -67177 -65024 -65845 -50552 -88809 -101016 -94822 -104442
9766a04442R9713L3552j3244n1156k8809P842j2675O9562n9701K8127O3946R214
$$ -104442 -4729 28823 15579 -35577 -64386 -56544 -69219 343 -59358 -31231 32715 41929
9754D1929m279o2669o788k9377j2705r020K2004K8411M0449n790J8370K0843p0687
$$ 41929 37650 -25019 -31807 -61184 -73889 -82909 -60905 -32494 7955 2165 20535 41378 -29309
9741b9309J7842P180j7916O615k7769j2946J0238k0448J0914K3169n713l9133
$$ -29309 -11467 -4287 -22203 -15588 -43357 -56303 -46065 -66513 -55599 -32430 -38143 -77276
9729g7276M2055N242O1527j7065O667n1712j2809J652J1426M4466j0718R444l6767
$$ -77276 -35221 -29979 31548 14483 21150 -30562 -43371 -41719 -30293 14173 3455 12899 -23868
9716b3868l8113M4730k5341J913K7955k4872L2791L2354k3811o5428k7300L4314
$$ -23868 -61981 -17251 -42592 -40679 -12724 -37596 -4805 27549 3738 -61690 -88990 -54676
9704e4676O3819O1669m5618j09243K4616M4158M435j9986k7850J6113Q170o3087
$$ -54676 9143 70812 25194 -84049 -59433 -15275 -10840 -30826 -58676 -42563 -34393 -97480
9692i7480k3448L4303L7782M4242J8688J9493l4327p8175M5334K3393m984j130
$$ -97480 -120928 -86625 -48843 -4601 14087 33580 -747 -78922 -33588 -10195 -15179 -16309
9680a6309N200O809K4463p0226M0756J5584k1171J3639L2312l4327Q056L0481
$$ -16309 -11109 -4300 20163 -50063 -9307 6277 -14894 -1255 31057 -3270 4786 35267
9668C5267k1831J0296J1300l0154n0757N517m6497l8571O3880O3786J8355r320
$$ 35267 13436 23732 35032 4878 -45879 -40362 -86859 -125430 -61550 2236 20591 11271
9656A1271l4469k9296N658J694l0208P0642l6647J2649j5283k5914J927K202n609
$$ 11271 -23198 -52494 -46836 -45142 -75350 -4708 -41355 -28706 -43989 -69903 -67976 -65774 -71383
9643g1383j4406L2243l7585m1615M0928N7331o380N5705J558n1929M2452J8423
$$ -71383 -85789 -53546 -91131 -132746 -91818 -34487 -40867 14838 16396 -35533 6919 25342
9631B5342o543K5983l7486q0566M4847O2832q150Q96j7264n1990m069L7300M9120
$$ 25342 18799 44782 7296 -73270 -28423 34409 26259 27155 9891 -42099 -46168 -8868 40252
9618D0252J707k2948M3446l8709k5761k0781J9318j9597K6106N5286J7275r633
$$ 40252 41959 19011 62457 23748 -2013 -22794 -3476 -23073 3033 58319 75594 65961
9606F5961j4721M0543J00991n5686L5503q589o803M5875k2039p743M7507k8477
$$ 65961 51240 91783 192774 137088 172591 164002 157199 203074 181035 173292 220799 192322
9594A92322m6439K355O362j6445j3947J6733o6238q6025j2907O721q006l3810
$$ 192322 145883 148238 154600 138155 124208 140941 74703 -11322 -24229 -17508 -25514 -59324
9582e9324O8261J604L1982j0599l4740m4716M840k4266N1474N9180J1368m2378
$$ -59324 8937 10541 42523 31924 -2816 -47532 -42692 -66958 -15484 43696 55064 12686
9570A2686L1644K111m5677o190K8495K9247l2392K8555p515L5472k1530N690o782
$$ 12686 44330 46441 764 -5426 23069 52316 19924 48479 40964 76436 54906 60596 53814
9557E3814p764J8110M2461k5634j0061P0664p3671j2005N9942J6494q668l9353
$$ 53814 46050 64160 106621 80987 70926 141590 67919 55914 115856 132350 123682 84329
9545H4329l7574k6974L7512m0944j7052l2361K6749M7265j8679j02742P8358K5429
$$ 84329 46755 19781 57293 16349 -703 -33064 -6315 40950 22271 -80471 -2113 23316
9533B3316j6768n2149O3148J9677r0860j3664o1471l8909L8700N9586K2654J1391
$$ 23316 6548 -45601 17547 37224 -53636 -67300 -128771 -167680 -128980 -69394 -46740 -35349
9521c5349n7054M9700k1181j3732M5755K7657k9395m2104P2200k6317O3275p5438
$$ -35349 -92403 -42703 -63884 -77616 -31861 -4204 -33599 -75703 -3503 -29820 33455 -41983
9509d1983j7241Q853L1492J9768o2140J5391J2931k3786M3848K2624M5802k2312
$$ -41983 -59224 -50371 -18879 889 -61251 -45860 -32929 -56715 -12867 9757 55559 33247
9497C3247n877J4041j069l2628P92M1504l0554k8866j517N2786J8160M3805N6561
$$ 33247 27370 41411 40342 7714 8506 50010 19456 -9410 -10927 41859 60019 103824 160385
9484A60385o1183J4214q0859J5863J3385P271Q834N016p1807K286j7873p089m3806
$$ 160385 99202 113416 32557 48420 61805 69076 77910 82926 11119 13405 -4468 -11557 -55363
9471e5363Q3046M7680K9790K2879l2130J8447k0048q989j3254K7057n7359O02
$$ -55363 27683 75363 105153 128032 95902 114349 94301 85312 72058 99115 41756 42358
9459D2358K5586M1588K1069L4209p5770L9234L5677M310K0604L3298K9685l6909
$$ 42358 67944 109532 130601 164810 89040 128274 163951 168261 188865 222163 251848 214939
9447B14939J1910J2471K6824J28424J3848l6590k8876q6501K2992j4275K9328
$$ 214939 226849 239320 266144 394568 408416 371826 342950 256449 279441 265166 294494
9436B94494Q9019j1190K9208J2651j948k7385k7554N615M628O207q9741j48237
$$ 294494 383513 372323 401531 414182 412234 384849 357295 362910 367538 373745 284004 135767
9424A35767L6985k1670q294K0569m9522P5496K2349o629L3611p8657J7601L7513
$$ 135767 172752 151082 142788 163357 113835 189331 211680 205051 238662 160005 177606 215119
9412B15119k3197j2430M7960o4500J5486J3123M9719j5209L1566N586N7762P2186
$$ 215119 191922 179492 227452 162952 178438 191561 241280 226071 257637 263223 320985 393171
9400C93171J9147L4633J0958j41163j3353J2761J9318o8643M034O0680P197Q543
$$ 393171 412318 446951 457909 316746 303393 316154 335472 266829 270863 331543 338740 347283
9388C47283N5216k2303o807k0417m3584n8330l9332j9796L1580m2948p9488N3352
$$ 347283 402499 380196 373389 352972 309388 251058 211726 191930 223510 180562 101074 154426
9376A54426L1979j1758l6254j1387j0257j7292o1272J7873j2958K3628j7774L4442
$$ 154426 186405 174647 138393 127006 116749 99457 38185 56058 43100 66728 48954 83396
9364H3396m5891N305J9174R288P6087J1694l688k9153k5351M9685r534j1396k6960
$$ 83396 37505 42810 61984 71272 147359 159053 155365 126212 100861 150546 141012 129616 102656
9351A02656K2015o5628m2406K8090k5060M4879M2973m1047n1818J2192M0610R99
$$ 102656 124671 59043 16637 44727 19667 64546 107519 66472 14654 26846 67456 68455
9339F8455R578j9360L102M4256l9198K0262n7115Q731K4311N326K415o106j9416
$$ 68455 78033 58673 61775 106031 66833 87095 29980 38711 63022 68348 70763 64657 45241
9326D5241N3383J34459o7035K0479l3387K5343n333m2932m0665K4711M3469m2016
$$ 45241 98624 233083 166048 186527 153140 178483 173150 130218 89553 114264 157733 115717
9314A15717l6409K720O2790K5389J0230o4859R860J2354K3201R593L9497L2117
$$ 115717 79308 82028 144818 170207 180437 115578 125438 137792 160993 170586 210083 242200
9302B42200M0198k9685n3923J5802O928M0965K8686n540l4263k9955L1452N5021
$$ 242200 282398 252713 198790 214592 221520 262485 291171 285631 251368 221413 252865 307886
9290C07886N9742K916p9891m5564O4477M1991j691j1074K993m8960K5584N5086
$$ 307886 367628 370544 290653 245089 309566 351557 349866 338792 341785 292825 318409 373495
9278C73495q4211l8674l616J7795l0672J794L911O5611k6254L2424k2327N934
$$ 373495 289284 250610 246994 264789 234117 235911 239822 305433 279179 311603 289276 295210
9266B95210l1626m0913k2180k5119Q6k8720J2557L1034j4024K9956J3494K2512
$$ 295210 263584 222671 200491 175372 175458 146738 159295 190329 176305 206261 219755 242267
9254B42267Q928o1344j6058J5270n0795L5626J8596K152K8295m0453k6774O0867
$$ 242267 251195 189851 173793 189063 138268 173894 192490 194642 222937 182484 155710 216577
9242B16577n3447L8457m2937K1662K1606l6457o5215n7284J7736K2841j5641P3756
$$ 216577 163130 201587 158650 180312 201918 165461 100246 42962 60698 83539 67898 141654
9230A41654M3654k9744J6506N2470R777l0724n3354k7563K1093L8485O5567o1595
$$ 141654 185308 155564 172070 224540 234317 203593 150239 122676 143769 182254 247821 186226
9218A86226p696n63M0943J3073k3832p4887L3810R2976M6381J6203m8758J2171
$$ 186226 178530 177967 218910 231983 208151 133264 167074 260050 306431 322634 273876 286047
9206B86047K6122J6537n9620J5178K6645L4100J7878k9002R443L7786L5619L4866
$$ 286047 312169 328706 269086 284264 310909 345009 362887 333885 343328 381114 416733 451599
9194D51599N488l4336L9485l1722o3116N7275J17920n136J475L9027J20030J08402
$$ 451599 457087 422751 462236 430514 367398 424673 542593 537457 538932 577959 697989 806391
9182H06391R9411K47032K68984L01860N46258M92381n6419m03166m85432m00758
$$ 806391 905802 1152834 1421818 1723678 2269936 2762317 2705898 2302732 1817300 1416542
9172A416542l12655k05155j11606p6248j18069k0761n9216m0113n6491k5847M9320
$$ 1416542 1103887 898732 787126 710878 592809 572048 512832 472719 416228 390381 439701
9161D39701j5099M6331k7465k2016r043J8127o6881n137m2724M5055k3358K6714
$$ 439701 424602 470933 443468 421452 412409 430536 363655 358518 315794 360849 337491 364205
9149C64205o1122N421m8304J473m8784O3132k3373n3776J0661O5949l160M1977
$$ 364205 303083 308504 260200 261673 212889 276021 252648 198872 209533 275482 272322 314299
9137C14299j714M8887k8965k4103m0567K0533q814J6490o2518K872K3599M8840
$$ 314299 312585 361472 332507 308404 267837 288370 279556 296046 233528 236400 259999 308839
9125C08839j0447J6224l0390n4469m8650l4864Q4039O2456o651M541l2330N5081
$$ 308839 298392 314616 284226 229757 181107 146243 230282 292738 286087 290628 258298 313379
9113C13379k352j717M3230N0582M0116o9581n6876L1268l5462l5300l606q2750
$$ 313379 311027 309310 352540 403122 443238 373657 316781 348049 312587 277287 273681 190931
9101A90931j1533R661J31773N4673j3726l7603M3913K653Q135o254M7190M5033
$$ 190931 179398 189059 320832 375505 361779 324176 368089 370742 378877 372623 419813 464846
9089D64846j6973m55l4890J7628J9596k7226j8059J980M8132o6649j2994K5277
$$ 464846 447873 447418 412528 430156 449752 422526 404467 406447 454579 387930 374936 400213
9077D00213K1337K9677n319m965M8541k6173P794l2015O052o1603J00639L6351
$$ 400213 421550 451227 445908 440943 489484 463311 471105 439090 445142 383539 484178 520529
9065E20529m2523m9960M0172m2771M9402M2217K0532k0712L119o40M4707J2151
$$ 520529 478006 428046 468218 425447 474849 517066 537598 516886 520005 519365 564072 576223
9053E76223J8773n2212Q218n693Q0846k2862N986j4861L1281m2889p2067N2916
$$ 576223 594996 542784 551002 545309 626155 603293 609279 594418 625699 582810 510743 563659
9041E63659Q2118p2720j8004m5789L1470K5511N0520K7238m587p263Q675K5472
$$ 563659 645777 573057 555053 509264 540734 566245 616765 644003 639416 632153 640828 666300
9029F66300M1089K4493L411k8837M5490Q4648l5546j3612o689O8251J4735L8222
$$ 666300 707389 731882 735293 706456 751946 836594 801048 787436 780747 848998 863733 901955
9017I01955N6206j1720l2877j2513j347m5554L0780Q103q7379k9190K5461j2516
$$ 901955 958161 946441 913564 901051 899704 854150 884930 893033 805654 776464 801925 789409
9005G89409N8077j9301N074J2030N850M9433O0142N3353l730n7573K1055m6064
$$ 789409 847486 828185 833259 845289 851139 900572 960714 1014067 1010337 952764 973819 927755
8993I27755m3322m1339l1289P033j7493j050J2359j6348N7581L0212p312k5782
$$ 927755 884433 843094 811805 818838 801345 800295 812654 796306 853887 884099 876787 851005
8981H51005L1607L4416j3650j1060J15591L4761M6226J7527q0932K6229l2758
$$ 851005 882612 917028 903378 892318 1007909 1042670 1088896 1106423 1025491 1051720 1018962
8970A018962k4708l2225J3515j8413M766o6013Q2832J3406k0730J7052J631L7786
$$ 1018962 994254 962029 975544 957131 961897 895884 978716 992122 971392 988444 990075 1027861
8958A027861Q0558k1048q593r0355m4437K5958P9784M7176M4316l9038J7564o9936
$$ 1027861 1108419 1087371 1078778 988423 943986 969944 1049728 1096904 1141220 1102182 1119746 1049810
8946A049810k8723k6908K9423M2905P8943q5571P5767o3041q224j9076L5587M1727
$$ 1049810 1021087 994179 1023602 1066507 1145450 1059879 1135646 1072605 1064381 1045305 1080892 1122619
8934A122619N8961n2175k4171n2811r4182j22089M9806O7987P3768R6819M7948
$$ 1122619 1181580 1129405 1105234 1052423 958241 836152 885958 953945 1027713 1124532 1172480
8923A172480L0334P7171R0083P437o6717L4077O3382J35874L9238R4820M1483
$$ 1172480 1202814 1279985 1370068 1377505 1310788 1344865 1408247 1544121 1583359 1678179 1719662
8912A719662O8723o1391O412n2866l6570K0038l0024j9100K6077P4029o688k5416
$$ 1719662 1788385 1726994 1733406 1680540 1643970 1664008 1633984 1614884 1640961 1714990 1708302 1682886
8900A682886M143l7191k0780l7736M2813J0195k983K9533R9788Q3050J4501n0881
$$ 1682886 1687029 1649838 1629058 1591322 1634135 1644330 1641347 1670880 1770668 1853718 1868219 1817338
8888A817338j4536k531Q1502M388O4803R0740k2392N115J13535J72334J82855
$$ 1817338 1802802 1800271 1881773 1886161 1950964 2041704 2019312 2024427 2137962 2310296 2493151
8877B493151L5699r2079o8414k2642m1664o0604j00239k1116j9291l6676L8357
$$ 2493151 2528850 2436771 2368357 2345715 2304051 2243447 2143208 2122092 2102801 2066125 2104482
8866B104482M2841N3062R184M9938m8795n379N7778N216m8913L9802P2895k3373
$$ 2104482 2147323 2200385 2209569 2259507 2210712 2205333 2263111 2268327 2219414 2259216 2332111 2308738
8854B308738j08108O0331R9261Q3616P5777Q3011N5158K8406n18J02842k7726
$$ 2308738 2200630 2260961 2360222 2443838 2519615 2602626 2657784 2686190 2685672 2788514 2760788
8843B760788P877O1820K9179J0201P6360q9452L5895L2303J17893K2027J02345
$$ 2760788 2768665 2830485 2859664 2869865 2946225 2856773 2892668 2924971 3042864 3064891 3167236
8832C167236L032L0620P615J43089O891P2424L9892J34271J08972P3587J2011
$$ 3167236 3170268 3200888 3208503 3351592 3358483 3430907 3470799 3605070 3714042 3787629 3799640
8821C799640K9426P437R4528j12659O1953J13422J02897M5582J82285J39268J45000
$$ 3799640 3829066 3836503 3931031 3818372 3880325 3993747 4096644 4142226 4324511 4463779 4608779
8810D608779J25713J92137M6143K60889R9872K47626J51310L12348K57999J37673
$$ 4608779 4734492 4926629 4972772 5233661 5333533 5581159 5732469 6044817 6302816 6440489
8800F440489N3511J31382Q2864J08022r910J19235j8557J17641J37085K74666
$$ 6440489 6494000 6625382 6708246 6816268 6806358 6925593 6907036 7024677 7161762 7436428
8790G436428J12845J10648p338J0966j6303P6969K01628L66802K62029K94259
$$ 7436428 7549273 7659921 7652583 7663549 7647246 7724215 7925843 8292645 8554674 8848933
8780H848933J87887K69791J09485P3977j0012K09293J69474K45136J88982L24885
$$ 8848933 9036820 9306611 9416096 9490073 9480061 9689354 9858828 10103964 10292946 10617831
8770A0617831K53850K63561L14500J49397J05982J35206J87796K61956K83309
$$ 10617831 10871681 11135242 11449742 11599139 11705121 11840327 12028123 12290079 12573388
8761A2573388L55249L76099M76465M46551L90958M66598L56778M99752O00871
$$ 12573388 12928637 13304736 13781201 14227752 14618710 15085308 15442086 15941838 16542709
8752A6542709O19706N46534M66357M40110O40299M87527M67242L62839N14444
$$ 16542709 17162415 17708949 18175306 18615416 19255715 19743242 20210484 20573323 21087767
8743B1087767O80918R13727Q75394J186016J262437J381372R67711O72689L06021
$$ 21087767 21768685 22682412 23557806 24743822 26006259 27387631 28355342 29028031 29334052
8734B9334052N69632K16318L65575K33129P80598Q51405J599677J931798K452323
$$ 29334052 29903684 30120002 30485577 30718706 31499304 32350709 33950386 35882184 38334507
8725C8334507J857993J995533J894753K421914K331968L031450L318585M197260
$$ 38334507 40192500 42188033 44082786 46504700 48836668 51868118 55186703 59383963
8717E9383963M001725N474176O160841P738763R059576J2780671J3618382J6837952
$$ 59383963 63385688 68859864 75020705 82759468 91819044 104599715 118218097 135056049
8709A35056049K0195286K7472089L4517888N2440181P6405492J09329785M2539395
$$ 135056049 155251335 182723424 217241312 269681493 346086985 455416770 497956165
8702D97956165o0942477q8774186q8767460o2831613m3463820k8976638k0975132
$$ 497956165 437013688 348239502 259472042 196640429 153176609 124199971 103224839
8695A03224839j3818809j0349412p300464o623542m817457m464253l467832l488921
$$ 103224839 89406030 79056618 71756154 65132612 60315155 55850902 52383070 48894149
8687D8894149k409511k736433k076394k057693j493882j727211j086109p44526
$$ 48894149 46484638 43748205 41671811 39614118 38120236 36393025 35306916 34562390
8679C4562390o5217l67547l94993r86251j071342j339118j023490r25962n60953
$$ 34562390 34497173 34129626 33734633 32748382 31677040 30337922 29314432 28388470 27827517
8670B7827517p81541j45729K69020P23225P34512Q27644P33225R40886R25150
$$ 27827517 27045976 26900247 27169267 27892492 28627004 29454648 30187873 31128759 32053909
8661C2053909J160449J347253J666319K093487K427787K622810K282243J937013
$$ 32053909 33214358 34561611 36227930 38321417 40749204 43372014 45654257 47591270
8653D7591270J191698O5963r82370j902943k232926k184144j793549j291532q70662
$$ 47591270 48782968 48848931 47866561 45963618 43730692 41546548 39752999 38461467 37590805
8644C7590805n16574k8564L89628O82715J138211J455225J903023K057922K311415
$$ 37590805 37074231 37045667 37435295 38118010 39256221 40711446 42614469 44672391 46983806
8635D6983806K194788J578151N07265n51465j736153k529436k752614k545020
$$ 46983806 49178594 50756745 51264010 50712545 48976392 46446956 43694342 41149322
8627D1149322k099186j389871q13203k12101K05315N76717R42366J319914J577992
$$ 41149322 39050136 37660265 36847062 36634961 36840276 37416993 38359359 39679273 41257265
8618D1257265K058582K401913K750093K778004K479291J381142M5589j491908
$$ 41257265 43315847 45717760 48467853 51245857 53725148 55106290 55151879 53659971
8610E3659971k553169l239541l239986l040422k374813j692881r75893m02851
$$ 53659971 51106802 47867261 44627275 41586853 39212040 37519159 36543266 36140415
8602C6140415K43048N63609J034597J380202J780579J940584K127841J934870
$$ 36140415 36383463 36947072 37981669 39361871 41142450 43083034 45210875 47145745
8594D7145745J396882K97372j201793k617550l488465l884071l772929l628090
$$ 47145745 48542627 48839999 47638206 45020656 41532191 37648120 33875191 30247101
8586C0247101l109597k511580k201573j645411j430546j037432j080491p28039
$$ 30247101 27137504 24625924 22424351 20778940 19348394 18310962 17230471 16502432
8578A6502432j814295r56273M02626o12952l20419n32143k46468m09888k46913
$$ 16502432 14688137 13731864 14134490 13521538 13201119 12668976 12422508 12012620 11765707
8569A1765707l82723j98070l55548l11459l12232j36456k70503k05467k14030
$$ 11765707 11382984 11184914 10829366 10517907 10205675 10069219 9798716 9593249 9379219
8560I379219j79728k05615j37110j08755M1887n5139K3058j7798j6692j81438
$$ 9379219 9199491 8993876 8856766 8748011 8789898 8734759 8757817 8740019 8723327 8541889
8550H541889j89888n4487k7568n3760r828j04887n2910l9542M4591k4735K5775
$$ 8541889 8352001 8297514 8269946 8216186 8206358 8101471 8048561 8009019 8053610 8028875 8054650
8539H054650K5010j5215j4257j1750j4735L913K993k4827l2874J8809M0616J24788
$$ 8054650 8079660 8064445 8050188 8038438 8023703 8027616 8030609 8005782 7972908 7991717 8032333 8157121
8527H157121J68967K34699J98025P5750J09614J63044K22079J88509R2860M1501
$$ 8157121 8326088 8560787 8758812 8834562 8944176 9107220 9329299 9517808 9610668 9652169
8517I652169R4735L1268J84471K91797K78955J94757K70550K47842K80710J30624
$$ 9652169 9746904 9778172 9962643 10254440 10533395 10728152 10998702 11246544 11527254 11657878
8507A1657878J81700K14975J93719K99953L36401L37328M39646M27760M29770
$$ 11657878 11839578 12054553 12248272 12548225 12884626 13221954 13661600 14089360 14519130
8498A4519130L88294N30686M63666N65186O85995O98877P86175R80510J105299
$$ 14519130 14907424 15438110 15901776 16466962 17152957 17851834 18638009 19618519 20723818
8489B0723818J166094J356173J710652J841515K065352K373703K877365L235936
$$ 20723818 21889912 23246085 24956737 26798252 28863604 31237307 34114672 37350608
8481C7350608L666356L930744M216434M017202L117724J619052k03144j350068
$$ 37350608 41016964 44947708 49164142 53181344 56299068 57918120 57714976 56364908
8473E6364908j499723j093651j88507P79327J621877K167521K247484J341203
$$ 56364908 54865185 53771534 53583027 54362354 55984231 58151752 60399236 61740439
8465F1740439k75727k257084l749046m461642m327952l616784k764273j924761
$$ 61740439 61464712 59207628 55458582 50996940 46668988 43052204 40287931 38363170
8457C8363170j206193o07118j26015K60661N25927M20123M86511J43860M2740
$$ 38363170 37156977 36549859 36423844 36684505 37210432 37630555 38117066 38260926 38303666
8448C8303666J9578J00686L91488P83584J173578J599861K024181K343848K335519
$$ 38303666 38323244 38423930 38815418 39599002 40772580 42372441 44396622 46740470 49075989
8439D9075989K475930K526282K632709K704363K803259K156800Q25496q79801
$$ 49075989 51551919 54078201 56710910 59415273 62218532 64375332 65200828 64321027
8431F4321027k231202k520175k022553j132181o2341Q40731J465555J726464J188856
$$ 64321027 62089825 59569650 57547097 56414916 56352575 57193306 58658861 60385325 61574181
8422F1574181l10945k159521l772578m547825m527763m014888l133979k246172
$$ 61574181 61263236 59103715 55331137 50783312 46255549 42240661 39106682 36860510
8414C6860510j496079r79032n63727j95026N7680L19065L55584P4127j32399m67170
$$ 36860510 35364431 34385399 33821672 33626646 33684326 34003391 34358975 34433102 34300703 33833533
8404C3833533o32129o39849o69731m06982j61679n7254K0242p4738l31082p03587
$$ 33833533 33201404 32561555 31891824 31484842 31323163 31265909 31286151 31211413 30880331 30176744
8394C0176744j103771j340837j340732j357423j108034q98327o43982k43625j10144
$$ 30176744 29072973 27732136 26391404 25033981 23925947 23027620 22383638 22140013 22029869
8385B2029869l7521n895j10959j12873q6605j26029j69355p1855L872K6720J74270
$$ 22029869 21992348 21986453 21875494 21762621 21676016 21549987 21380632 21308777 21312649 21339369 21513639
8374B1513639J15421Q0475K46394K39670K80211M31350N64369O27277P29350O14646
$$ 21513639 21629060 21709535 21955929 22195599 22475810 22907160 23471529 24098806 24828156 25442802
8364B5442802N38314M75171L29089M54977N30590M72752O50296Q26273R99099
$$ 25442802 25981116 26456287 26785376 27240353 27770943 28243695 28893991 29720264 30719363
8355C0719363J059376J183515J447839J727443J881309K097758K279885K301895
$$ 30719363 31778739 32962254 34410093 36137536 38018845 40116603 42396488 44698383
8347D4698383J653696P51054m22112j094711j288570j174529q91787l11471m3600
$$ 44698383 46352079 47103133 46681021 45586310 44297740 43123211 42231424 41919953 41876353
8338D1876353J38253K80756m2204q47862j714894k259852k434039k395830k039306
$$ 41876353 42014606 42295362 42253158 41405296 39690402 37430550 34996511 32600681 30561375
8329C0561375j635534j246132r97755p66640n65703l22222j69003R0433J53273
$$ 30561375 28925841 27679709 26681954 25915314 25349611 25027389 24858386 24948819 25102092
8320B5102092M11699N76184P12170J007143J137250J410257J845632K194203K507358
$$ 25102092 25513791 26089975 26802145 27809288 28946538 30356795 32202427 34396630 36903988
8311C6903988K799209L263855L554516L680355L252671K418829J240940k38634
$$ 36903988 39703197 42967052 46521568 50201923 53454594 55873423 57114363 56875729
8303E6875729j483950k156057k008253j487560o87741Q4612M58496N25633P7392
$$ 56875729 55391779 53235722 51227469 49739909 49052168 49136780 49595276 50120909 50198301
8294E0198301p69635j894117k904677l502601l591011l376683k873672k413680
$$ 50198301 49428666 47534549 44629872 41127271 37536260 34159577 31285905 28872225
8286B8872225j897751j468161j245247r94356p89411n76281m29022k16770j63212
$$ 28872225 26974474 25506313 24261066 23266710 22477299 21901018 21471996 21255226 21092014
8277B1092014n9254N6946K47093L97048O14942P86694R87677J152526J459547
$$ 21092014 21032760 21089706 21336799 21733847 22348789 23135483 24123160 25275686 26735233
8268B6735233J713439J825653J949656J545398P88159j03356p53093r02816o31010
$$ 26735233 28448672 30274325 32223981 33769379 34557538 34454182 33701089 32798273 32167263
8259C2167263j78790J13761J99900K85566K65932J1263m04365j180558j855993
$$ 32167263 31988473 32102234 32302134 32587700 32853632 32864895 32460530 31279972 29423979
8250B9423979k169915j890941j615197j402355j284141j181905j171355j098677
$$ 29423979 27254064 25363123 23747926 22345571 21061430 19879525 18708170 17609493
8242A7609493j060635j040923r10905p19934o26297n97117m89983l79312k91127
$$ 17609493 16548858 15507935 14597030 13877096 13250799 12653682 12163699 11784387 11493260
8233A1493260j25706p654j6557j9157K47084L89466O21004P43596O99383J39190
$$ 11493260 11367554 11359900 11343343 11324186 11571270 11960736 12581740 13325336 14024719 14163909
8223A4163909r6697Q443J79744L99970N74888O28195N34684M05700J69851j40285
$$ 14163909 14067212 14075655 14255399 14655369 15230257 15858452 16393136 16798836 16968687 16828402
8213A6828402l79056m97704m23611l33817k46723k36454n2557r7664j56731k98206
$$ 16828402 16449346 15951642 15528031 15194214 14947491 14711037 14658480 14560816 14404085 14105879
8203A4105879m97274r29526q40700q84140o70756p62122q75184m44323k53385
$$ 14105879 13608605 12679079 11838379 10954239 10283483 9521361 8646177 8201854 7948469
8194G948469o67329J25112K89467j241359o01640J62444J7722l9211p4682j6778
$$ 7948469 7281140 7406252 7695719 6454360 5852720 6015164 6032886 5993675 5918993 5902215
8184E902215J23724J0385R5675J89094J86948K74527L04987J83473K09741L16875
$$ 5902215 6025939 6036324 6131999 6321093 6508041 6782568 7087555 7271028 7480769 7797644
8174G797644r0238k12527j82599l00896j97320j03969j23455j05482Q6181K897
$$ 7797644 7707406 7494879 7312280 7011384 6814064 6710095 6586640 6481158 6567339 6570236
8164F570236j69689k10798k52484m31161m55593m75769k48519l37919k90064j77667
$$ 6570236 6400547 6189749 5937265 5506104 5050511 4574742 4326223 3988304 3698240 3520573
8154C520573p6228j91985k58516j66700j17631o0357m4706L1022m4692j48024
$$ 3520573 3444345 3252360 2993844 2827144 2709513 2649156 2604450 2635472 2590780 2442756
8144B442756j44177m4765q0608J8113j6026j42415r9589K0921r8154m8766L0455
$$ 2442756 2298579 2253814 2173206 2191319 2175293 2032878 1933289 1954210 1856056 1807290 1837745
8133A837745o0528k1966k5493k7126j8559l3599R975r1522n2776O3618j06182
$$ 1837745 1777217 1755251 1729758 1702632 1684073 1650474 1660449 1568927 1516151 1579769 1473587
8122A473587K1598K7481j7158M0252l4365k8954J4877L8210K8297q5442k2425
$$ 1473587 1495185 1522666 1505508 1545760 1511395 1482441 1497318 1535528 1563825 1478383 1455958
8111A455958k6019n6476n7433j0680N181j0393o131R77o234O9181M3923n8114
$$ 1455958 1429939 1373463 1316030 1305350 1310531 1300138 1294007 1294984 1288750 1357931 1401854 1343740
8099A343740j43028N1363k4095n5204L0827l3954l6293o6995J3041o6432k0532
$$ 1343740 1200712 1252075 1227980 1172776 1203603 1169649 1133356 1066361 1079402 1012970 992438
8088I92438O6370k3874r603q2921N3216n2410k822P4385M1132j36199J6908P4330
$$ 992438 1058808 1034934 1025331 942410 995626 943216 940394 1014779 1055911 919712 936620 1010950
8076A010950R233M3190j8195J7309K9637K5072j9725K609k0574l6198p0323j5044
$$ 1010950 1020183 1063373 1045178 1062487 1092124 1117196 1097471 1100080 1079506 1043308 972985 957941
8064I57941L1111l6486m8607K1827J0394j8572M6615K327o4411l6019l2938l3582
$$ 957941 989052 952566 903959 925786 936180 917608 964223 966550 902139 866120 833182 799600
8052G99600N6160m1592p5191K5979m604j1301j3996P847k160o3243o3851L6836
$$ 799600 855760 814168 738977 764956 760352 749051 735055 742902 740742 677499 613648 650484
8040F50484Q0432n067Q20n7727J2371K3998r1776k1393L101m36L7413n1189k2066
$$ 650484 730916 725849 726669 668942 681313 705311 613535 592142 595243 594807 632220 581031 558965
8027E58965J09957M3744k2301L5982p2343q1021J5303k3495K0886L2250J0768
$$ 558965 668922 712666 690365 726347 654004 572983 588286 564791 585677 617927 628695
8016F28695l1527p135K0949K2373k0046n1218J5291O8051R504r9443O6936N0083
$$ 628695 597168 590033 610982 633355 613309 562091 577382 645433 654937 555494 622430 672513
8004F72513q4082l8271n6512O1556k6654K0485o1457J2841L0366K453N2015J6704
$$ 672513 588431 550160 493648 555204 528550 549035 487578 500419 530785 533238 585253 601957
7992F01957j3606M7962k0948o5045m39j9909p779n266q736M1522j2817q843O01
$$ 601957 588351 636313 615365 550320 549881 529972 522193 516927 508191 549713 536896 528053 528654
7979E28654M5860J6229m5203n1043N3148K8376K2254m3987l216J6903l0434n9587
$$ 528654 574514 590743 545540 494497 547645 576021 598275 554288 551072 567975 537541 477954
7967D77954j1490R9761p816o4613k8824k5652J02289R289K5087n9876p0449M9019
$$ 477954 466464 566225 558409 493796 464972 439320 541609 550898 575985 516109 445660 494679
7955D94679j0880L0334Q0479l6111m1475J1454L3788L4336J2960K1672O9791l6127
$$ 494679 483799 514133 594612 558501 517026 528480 562268 596604 609564 631236 701027 664900
7943F64900K185k7652J7780P76j3022m5032M7541l4232J5334l6469p971M0765
$$ 664900 667085 639433 657213 657989 644967 599935 647476 613244 628578 592109 584138 624903
7931F24903l9622M9091l5067l7560K5321M2035K861K9479l5780q7538l2069O3190
$$ 624903 585281 634372 599305 561745 587066 629101 631962 661441 625661 538123 506054 569244
7919E69244k9441j8741j0992L1610N7514n9185l6682K7890k3528j5041k3907j6531
$$ 569244 539803 521062 510070 541680 599194 540009 503327 531217 507689 492648 468741 452210
7907D52210j1195L360j517N8247j6073k3068M4026L5324q069J12134p150l7467
$$ 452210 441015 444375 442858 501105 485032 461964 505990 541314 533245 645379 638229 600762
7895F00762L6858j2428k0005O0281M0388L3935q078J6241k9661o5553j0951k4385
$$ 600762 637620 625192 605187 665468 705856 739791 731713 747954 718293 652740 641789 617404
7883F17404J1310n0904m2514l2289J8431j4213r5635J6918k5453L8665K6909J1074
$$ 617404 628714 577810 535296 503007 521438 507225 411590 428508 403055 441720 468629 479703
7871D79703J5800q638k330L4367k2191O660K1715m0372J1327J5629R768l1527
$$ 479703 495503 486865 484535 518902 496711 503371 525086 484714 496041 511670 521438 489911
7859D89911r499o58k6771L9760k0098k667p263L3800M4011m155r3658J3648k2849
$$ 489911 480412 479754 452983 492743 472645 469978 462715 496515 540526 536371 442713 456361 433512
7846D33512R689O5087m2549k9405k3683n3918j6751P1691j4892N1273K060J4444
$$ 433512 443201 508288 465739 436334 412651 358733 341982 413673 398781 450054 452114 466558
7834D66558m3481l5298L0884N1404k0620n9663J32307k8625j9003N698N8681o7373
$$ 466558 423077 387779 418663 470067 449447 389784 522091 493466 474463 480161 538842 471469
7822D71469m595n6847J4269o0598L7401j5307N8500j01106P9094o0453R7150j00665
$$ 471469 466874 410027 424296 363698 401099 385792 444292 343186 422280 361827 458977 358312
7810C58312P3332j85466J05888j125993k453J273891j52070J12953j27243R3533
$$ 358312 431644 246178 352066 -773927 -776380 497511 345441 458394 331151 424684
7800D24684M125j2679m9708P8686l5450P8690n5399l7277K8142P3414m6236M0873
$$ 424684 428809 416130 366422 445108 409658 488348 432949 395672 423814 497228 450992 491865
7788D91865l5573M3024p0584j6765L90M7943m614M0879p4937M9812m9816m7711
$$ 491865 456292 499316 428732 411967 412357 460300 455686 496565 421628 471440 421624 373913
7776C73913K530R5641n4914m0806j9715R146J2652O956J5070J8798K957n3582
$$ 373913 376443 472084 417170 376364 356649 365795 378447 385403 400473 419271 422228 368646
7764C68646m7080P1251L3812l7739M6108L1271l5847k4991K143M3340J468j1173
$$ 368646 321566 392817 426629 388890 434998 466269 430422 405431 407574 450914 452382 441209
7752D41209j4630k585j1074M0094L9208l086k1275p703K5570M0097k9965q922
$$ 441209 426579 423994 412920 453014 492222 489136 467861 460158 485728 525825 495860 486938
7740D86938j0296o7927j6333P1535k5496M5200l737p2312K9564L4934p411R931
$$ 486938 476642 408715 392382 463917 438421 483621 479884 407572 437136 472070 464659 474590
7728D74590q716j1626J1739j1516o650P8909K8725p4388J3863K1985q4180n5390
$$ 474590 465874 454248 465987 454471 447821 526730 555455 481067 494930 516915 432735 377345
7716C77345K0772L6143J2138k250m708m6187K3368M8761o1633o8235q290k0661
$$ 377345 398117 434260 446398 444148 439440 393253 416621 465382 403749 335514 327224 306563
7704C06563O975M3271M7202p1454N3759N173l8710q214K7112M7563j3268N9087
$$ 306563 313538 356809 404011 332557 386316 391489 352779 344565 371677 419240 405972 465059
7692D65059N1164l5768J0848M3622J8909m280M318o5630M0386o5232n282m1825
$$ 465059 516223 480455 491303 534925 553834 549554 553872 488242 528628 463396 458114 416289
7680D16289M3672J0359M12p0723L8054R361J2632l3166J2963L6273j8871M6166
$$ 416289 459961 470320 470732 400009 438063 447424 460056 426890 439853 476126 457255 503421
7668E03421P929l5312P504J9966k3383m2220P8099J3299j407l0126m794j1741
$$ 503421 511350 476038 483542 503508 480125 437905 516004 529303 527896 497770 492976 481235
7656D81235r707j362P847m80K7687l1985J3782k2196l7471K4314L0405J5493k0957
$$ 481235 471528 470166 478013 477533 505220 473235 487017 464821 427350 451664 482069 497562 476605
7643D76605l758R262K289j4261Q190M937l1953L6810P6235k7381j0412K7365o689
$$ 476605 472847 482109 484398 470137 478327 483264 451311 488121 564356 536975 526563 553928 547239
7630E47239q3070K7020N0870J6378j2201m4272R370J9335p0766N4534J5136n670
$$ 547239 464169 491189 542059 558437 546236 501964 511334 530669 459903 514437 529573 523903
7618E23903L8150k2006n4429R501L3111k1867j6022J4976P9713n6949l8711K2229
$$ 523903 562053 540047 485618 495119 528230 506363 490341 505317 585030 528081 489370 511599
7606E11599k2636K508K4988k678J0705K1264j5490l6447k6919m7336J4724K4706
$$ 511599 488963 491471 516459 513781 524486 545750 530260 493813 466894 419558 434282 458988
7594D58988R567K3878m3993N126O6189j7717M230l2577M825M8218n0153M8560
$$ 458988 468555 492433 448440 453566 519755 502038 506268 473691 478516 526734 476581 525141
7582E25141M943L988l2899K9949M634m4840j6189K8366K094J1518L1700m7601
$$ 525141 530084 534072 501173 531122 535756 490916 474727 503093 505187 516705 548405 500804
7570E00804k8126j7046K657M429K2589k5454k1640K0438l3199M671k4295N2078
$$ 500804 472678 455632 458289 462718 485307 459853 438213 458651 425452 430123 405828 457906
7558D57906K9471k5666L4400K9504q0393L8419K1596N2809m1825L1114k1193M0109
$$ 457906 487377 461711 496111 525615 445222 483641 505237 558046 516221 547335 526142 566251
7546E66251j1133j5379j3012k1394j451O2536O256Q49R864q0963M6433J8944o1166
$$ 566251 555118 539739 526727 505333 503882 566418 572674 573523 583387 502424 548857 567801 506635
7533E06635P159N3974j043m9694m6434N869J045Q6048m7176L4685j330k278p370
$$ 506635 513794 567768 566725 517031 470597 476466 477511 563559 516383 551068 549738 547460 540090
7520E40090J1664J214l6008j3587M1866P8301p3514J4376Q8579n8268o1915K9392
$$ 540090 551754 552968 516960 503373 545239 623540 550026 564402 652981 594713 532798 562190
7508E62190L3824j8284j6014j562N3067k158N248M6154o1219j8082j00600O6857
$$ 562190 596014 577730 561716 560154 613221 611063 616311 662465 601246 583164 482564 549421
7496E49421K786M7821j8208j4299P7613l9608k4063R675J4179n3308j2681J4295
$$ 549421 552207 600028 581820 567521 645134 605526 581463 591138 605317 552009 539328 553623
7484E53623P776k1277M691N6891L9253k2982L4288P834L6679M2775n6193l6915
$$ 553623 561399 540122 544813 601704 640957 617975 652263 660097 696776 739551 683358 646443
7472F46443k6706Q332N669p913n644J1929K1980o6183M1112Q7576m3992R157P535
$$ 646443 619737 628069 633738 625825 620181 632110 654090 587907 629019 716595 672603 681760 689295
7459F89295M5266n4840J4514J10925l1091l1603r1438O8603N4646n779l3184j5673
$$ 689295 734561 679721 694235 805160 774069 742466 651028 719631 774277 768498 735314 719641
7447G19641j8223j3564J0694L7113l5924L8945L0135m4843O5584M436J6187m4330
$$ 719641 701418 687854 698548 735661 699737 738682 768817 723974 789558 793994 810181 765851
7435G65851N98k9795p481L349j00286Q0480O1894L3704k1801l3784J4019K8108
$$ 765851 766449 736654 729173 732522 632236 712716 774610 808314 786513 752729 766748 794856
7423G94856p6964O6904J0008j4828M8344N4596m6061P844k1706j0535R0379O7401
$$ 794856 717892 784796 794804 779976 828320 882916 836855 844699 822993 812458 902837 970238
7411I70238l270n0626M3713K3175j8837L4857K7143L0441j359M9672L8599L1565
$$ 970238 966968 916342 960055 983230 964393 999250 1026393 1056834 1055475 1105147 1143746 1175311
7399A175311O2806n2802j4687R760L229P023l5540m6902J0189K3217m3893P0571
$$ 1175311 1238117 1185315 1170628 1180388 1183617 1190640 1155100 1108198 1118387 1141604 1097711 1168282
7387A168282N6632j8744k5637o290k1754l3830l7308p6745k7359J6373L1605J6938
$$ 1168282 1224914 1206170 1180533 1174243 1152489 1118659 1081351 1004606 977247 993620 1025225 1042163
7375A042163m1574n8852m5675k3421r257j6497p10r6695O7818J6419K7034J4965
$$ 1042163 1000589 941737 896062 872641 863384 846887 846177 749482 817300 833719 860753 875718
7363H75718o0901M7161n9968K9109J9067J6344l1487l2776q4338K596L0288K666
$$ 875718 814817 861978 802010 831119 850186 866530 835043 802267 717929 720525 750813 753479
7351G53479N3951O1389j4012p2676M8869N782l6162k4818L80m2717R8160j5709
$$ 753479 807430 868819 854807 782131 831000 836782 800620 775802 776182 733465 831625 815916
7339H15916j4552M585o626j2602k6516J391L9917o3699Q3086k0516l2274M7784
$$ 815916 801364 805949 799323 786721 760205 761596 801513 737814 820900 800384 768110 815894
7327H15894q969k2906K0923O635J3212m6981n5744j1462M4803L5963l6470j964
$$ 815894 806925 784019 804942 811577 824789 777808 722064 710602 755405 791368 754898 752934
7315G52934k176L2281J07762M3553m0636k5022Q905j6514j3390m1033k4398K1601
$$ 752934 750758 783039 890801 934354 893718 868696 877601 861087 847697 806664 782266 803867
7303H03867O7809l168K49j0330l8271K4711r586p089L6040L1170m490j2144o009
$$ 803867 871676 868508 868757 858427 820156 844867 835281 828192 864232 895402 890912 878768 872759
7290H72759K2548j4934j4073k8909l290p0731n4489O9265M1837K8184N951r44
$$ 872759 895307 880373 866300 837391 834101 763370 708881 778146 819983 848167 854118 853174
7278H53174k1458m7727N5669K8760K6576o1615j000K781L4097j5389r1487K1350
$$ 853174 831716 783989 839658 868418 894994 833379 832379 835160 869257 853868 762381 783731
7266G83731K708J5805l4260l0778M5056n0880j0039M6186k7629j1485P0370J870
$$ 783731 786439 802244 767984 737206 782262 731382 721343 767529 739900 728415 798785 800655
7254H00655j2499l8890j8217J0899j6832K889j2710K7664q57J2570N493l0158
$$ 800655 788156 749266 731049 741948 725116 728005 715295 742959 742102 754672 760165 730007
7242G30007l0776L992N0277L2220l4601n0114P1453J2311J2324j1654o1235j4445
$$ 730007 699231 703223 753500 785720 751119 701005 772458 784769 797093 785439 724204 709759
7230G09759L065Q8151N0700n7617j5512O201p1614j9129M7551Q3404m2484m406
$$ 709759 712824 800975 851675 794058 778546 784747 713133 694004 741555 824959 782475 778069
7218G78069K4020l5902J3082K0334k8739k9235o246N1888j6882k0875N331M504
$$ 778069 802089 766187 779269 799603 770864 741629 735383 787271 770389 749514 754845 759349
7206G59349k8584p2201M3021P2472K3829k3079J4684l9010K4125J3343k892L8108
$$ 759349 730765 658564 701585 774057 797886 774807 789491 750481 774606 787949 785057 823165
7194H23165L8330m0552k8769N5968M1527L524N6549K990j9109k6231P3855N0541
$$ 823165 861495 820943 792174 848142 889669 893193 949742 952732 933623 907392 981247 1031788
7182A031788J1129n5253r7991p5786L8690L9975k7534m2743Q082j229m985L6492
$$ 1031788 1042917 987664 889673 813887 852577 892552 865018 822275 830357 829128 824143 860635
7170H60635K5098N9187o2442M5229O711o4232l6740K6059K1770j932M5918l3641
$$ 860635 885733 944920 882478 927707 934418 870186 833446 859505 881275 879343 925261 891620
7158H91620k1249p1416J2813M5964K1491M846Q247r846o254K4816m5635J8727
$$ 891620 870371 798955 811768 857732 879223 884069 892316 882470 876216 901032 855397 874124
7146H74124l4964k1998L6855K1317m474K8807k0832J4641M1050J7997L3341N0125
$$ 874124 839160 817162 854017 875334 870860 899667 878835 893476 934526 952523 985864 1035989
7134A035989q0659o1383J9223j7848P2272k2610P966j3118N8027N6858o1962k1867
$$ 1035989 955330 893947 913170 895322 967594 944984 952950 939832 997859 1054717 992755 970888
7122I70888n7875L498J8770K1407N653k475o3559p763J8453L1151j8746L2409
$$ 970888 913013 916511 935281 956688 962341 959866 896307 888544 906997 938148 919402 951811
7110I51811j0176j02852j562N6323n766J7675q952m6197k7957O5096k9014n9794
$$ 951811 941635 838783 837221 893544 887778 905453 896501 850304 822347 887443 858429 798635
7098G98635J7676L1841J4684j15910J4910Q0136J0543k6247M0177k4142m2039
$$ 798635 816311 848152 862836 746926 761836 841972 852515 826268 866445 842303 800264
7087H00264Q345Q2766K5186l7670m6207N2354r899m6821L4465K5186K5095m6628
$$ 800264 808609 891375 916561 878891 832684 885038 875139 828318 862783 887969 913064 866436
7075H66436j6186L302L0830o534k5684K6873M0307j884m2448n556m844M4393K9815
$$ 866436 850250 853552 884382 877848 852164 879037 919344 917460 875012 869456 864612 909005 938820
7062I38820k3234J1294k3989J8652K4723r0335L7207l1671j6301K7341j1657K4110
$$ 938820 915586 926880 902891 921543 946266 855931 893138 861467 845166 872507 860850 884960
7050H84960L9581J3468m8395l6546k0606n282M9285j5519M3183o362k8380N2258
$$ 884960 924541 938009 889614 853068 832462 827180 876465 860946 904129 897767 869387 921645
7038I21645l5633o7318j7217J09245m0002K5537o2952m7472L4296K6418N5299
$$ 921645 886012 818694 801477 910722 870720 896257 833305 785833 820129 846547 901846
7027I01846K7941n5275J0789Q2295M0879j1916m0352o1948p288L6441Q260p0815
$$ 901846 929787 874512 885301 967596 1008475 996559 956207 894259 886971 923412 931672 860857
7015H60857N4527P4003n2999p489M4408k9284k1791q93o897K7514J8044J2159
$$ 860857 915384 989387 936388 928899 973307 944023 922232 921339 914442 941956 960000 972159
7003I72159p2588o2531K5376J8871N428R557J7090K8457l937k7875J17288K0770
$$ 972159 899571 837040 862416 881287 886715 896272 913362 941819 937882 910007 1027295 1048065
6991A048065o4547k7159O8965o158m346N281n9692j5766q738K1088l4581o869
$$ 1048065 983518 956359 1025324 1019166 1014820 1020101 960409 944643 935905 956993 922412 915543
6979I15543k0201K2650P471M9853j254r649J0507r288N7364K3518m6658l0566
$$ 915543 895342 917992 925463 975316 974062 964413 974920 965632 1022996 1046514 999856 969290
6967I69290L2919l5317l5080O5506n447L6197j9681J400l4994l3710L4130K1198
$$ 969290 1002209 966892 931812 997318 991871 1028068 1008387 1009787 974793 941083 975213 996411
6955I96411J6875J8335p470m4084J4425O3005p6733K662L8764o491n3122n2969
$$ 996411 1013286 1031621 1024151 980067 994492 1057497 980764 983426 1022190 1015699 962577 909608
6943I09608j4567n759J3696J02469L5442n5622J3547k2929r4954Q1263L204l3113
$$ 909608 895041 889282 902978 1005447 1040889 985267 998814 975885 880931 962194 965398 932285
6931I32285l6559J9963J04278j6996J2915L702j9508n1233K1886M5107j4702n9014
$$ 932285 895726 915689 1019967 1002971 1015886 1019588 1000080 948847 970733 1015840 1001138 942124
6919I42124L1598l4726q366O162J2742J111K4623J0574n9592K6101L7957K5092
$$ 942124 973722 938996 930630 936792 949534 950645 975268 985842 926250 952351 990308 1015400
6907A015400o738M2979L4867m9356n4988P14m8873J6377K0183q864q116J3677
$$ 1015400 1008662 1051641 1086508 1037152 982164 982878 934005 950382 970565 961701 953585 967262
6895I67262O3140K8480K1580m6071k3883n138M6218l8012p5148m5311O7616N9600
$$ 967262 1030402 1058882 1080462 1034391 1010508 1005370 1051588 1013576 938428 893117 960733 1020333
6883A020333m5284k2062J5504K1487l1443J9430O2866L1484m5928L944o857N4610
$$ 1020333 975049 952987 968491 989978 958535 977965 1040831 1072315 1026387 1030331 1023474 1078084
6871A078084l3785l9969n7648K5781R6268q069K1386K6499l1449j601N82J5746
$$ 1078084 1044299 1004330 946682 972463 1068731 1060662 1082048 1108547 1077098 1075497 1076079 1091825
6859A091825j5392q0562o932J4878k1630L5729M2792J4887r1563k2612P1625P5660
$$ 1091825 1076433 995871 988939 1003817 982187 1017916 1060708 1075595 984032 961420 1033045 1108705
6847A108705n2667m8765P9295N5191q2732m3077O8845l3652L5861l2491j5005
$$ 1108705 1056038 1007273 1086568 1141759 1059027 1015950 1084795 1051143 1087004 1054513 1039508
6836A039508J0432Q3957o9682n025M3018p7033k8260M2097M1337l2386l9515K712
$$ 1039508 1049940 1133897 1064215 1059190 1102208 1025175 996915 1039012 1080349 1047963 1008448 1011160
6824A011160K5055Q3192j8187j6042m0467N926j1415N9255j1490J6699M0069j2656
$$ 1011160 1036215 1119407 1101220 1085178 1044711 1050637 1039222 1098477 1086987 1103686 1143755 1131099
6812A131099l6478r554L9768k9421k1421J2383n3537m9604J151N4591k3745M1160
$$ 1131099 1094621 1085067 1124835 1095414 1073993 1086376 1032839 983235 984386 1038977 1015232 1056392
6800A056392R058R449q773J9376q540p3714M4461n085j4171M8120r665M063O107
$$ 1056392 1065450 1074899 1066126 1085502 1076962 1003248 1047709 1042624 1028453 1076573 1066908 1070971 1077078
6787A077078L0531P2654n3842j3813k1852N2841n3019J2420j9939j9026m6581
$$ 1077078 1107609 1180263 1126421 1112608 1090756 1143597 1090578 1102998 1083059 1064033 1017452
6776A017452k0740R856M629K1138m9816M1740J4692m7994N5123P5573O0230J5203
$$ 1017452 996712 1006568 1011197 1032335 982519 1024259 1038951 990957 1046080 1121653 1181883 1197086
6764A197086p226K2102l1581M623M3229l979M2818o6317n5419m1051j6531k7242
$$ 1197086 1189860 1211962 1180381 1185004 1228233 1224254 1267072 1200755 1145336 1104285 1087754 1060512
6752A060512L4693k1208j3666J10630J4718Q376M6909Q4135P2442m202l395L4961
$$ 1060512 1095205 1073997 1060331 1170961 1185679 1194055 1240964 1325099 1397541 1393339 1389944 1424905
6740A424905K1486j5574j0065m1546o9628n7692j11112k6321M13p808M8478l7814
$$ 1424905 1446391 1430817 1420752 1379206 1309578 1251886 1140774 1114453 1114866 1107058 1155536 1117722
6728A117722P134j162j3419M6145m0357j9508M2545k5188O2839n135n1038m2242
$$ 1117722 1124856 1123694 1110275 1156420 1116063 1096555 1139100 1113912 1176751 1171616 1120578 1078336
6716A078336o3426O2583N1420k5844j09309O177P2150j3348r407O8480K8694j3669
$$ 1078336 1014910 1077493 1128913 1103069 993760 999937 1072087 1058739 1049332 1117812 1146506 1132837
6704A132837K0379O2260p8896k0831j6669L700k4370j5682N6879K8111L1970O731
$$ 1132837 1153216 1215476 1136580 1115749 1099080 1102780 1078410 1062728 1119607 1147718 1179688 1186419
6692A186419l6857n5383n51J4391R440q0577K0128k8804l6285J9798N179j6478
$$ 1186419 1149562 1094179 1093628 1108019 1117459 1036882 1057010 1028206 991921 1011719 1016898 1000420
6680A000420Q882O2622N0172j8099p1Q0619O1192L7560Q423m3261j0043J3399
$$ 1000420 1009302 1071924 1122096 1103997 1103926 1184545 1245737 1283297 1291720 1248459 1238416 1251815
6668A251815l2702p0787J8819p0315j46131q1142j09972J9621N8804J29137J09889
$$ 1251815 1219113 1148326 1167145 1096830 950699 869557 759585 779206 838010 967147 1077036
6657A077036l555J6184K7627P5750R0711M6133k2840l2423n6349k1599k715m657
$$ 1077036 1073481 1089665 1117292 1193042 1283753 1329886 1307046 1274623 1218274 1196675 1193960 1189303
6645A189303n8024N340m533m4670j6179r988j9098J5888n742P8230K1840q3502
$$ 1189303 1131279 1136619 1132086 1087416 1071237 1061249 1042151 1058039 1052297 1130527 1152367 1068865
6633A068865L0161K7121N8545j3260L696l4000n828K363J3284K6037j3006l1663
$$ 1068865 1099026 1126147 1184692 1171432 1175128 1141128 1135300 1137663 1150947 1176984 1163978 1132315
6621A132315r7641P6691Q681j1330j0670o849L4747p283o1776K2021K4906L9907
$$ 1132315 1034674 1111365 1120046 1108716 1098046 1091197 1125944 1118661 1056885 1078906 1103812 1143719
6609A143719k0294P073n0616l6783O9297O7333J2302l0863k8748K3620O177L737
$$ 1143719 1123425 1130498 1079882 1043099 1112396 1179729 1192031 1161168 1132420 1156040 1162217 1165954
6597A165954M4202k4885l5963o3159P0807k4221k3967k5727O3610N8792j9614
$$ 1165954 1210156 1185271 1149308 1086149 1156956 1132735 1108768 1083041 1146651 1205443 1185829
6586A185829R065k7448m9207K9619m7521L5343j1872L2546L034J7625l7681q612
$$ 1185829 1194894 1167446 1118239 1147858 1100337 1135680 1123808 1156354 1159388 1177013 1139332 1130720
6574A130720O2138M9535q3071n9987N83L9001r722P1583o8187q0517k3998L8468
$$ 1130720 1192858 1242393 1159322 1099335 1099918 1138919 1129197 1200780 1132593 1052076 1028078 1066546
6562A066546N9061J7360M1997Q636J5863m4950J0130J0695M122M852J8077J4088
$$ 1066546 1125607 1142967 1184964 1193600 1209463 1164513 1174643 1185338 1189460 1194312 1212389 1226477
6550A226477k4651j1094m556J9265L1737j3254l000l732m1300K5538k2819J126
$$ 1226477 1201826 1190732 1186176 1205441 1237178 1223924 1220924 1217192 1175892 1201430 1178611 1179737
6538A179737Q2582k5497K1059K31N220j9222j4959k8917m1086L3545k478m4221
$$ 1179737 1262319 1236822 1257881 1258112 1263332 1244110 1229151 1200234 1159148 1192693 1190215 1145994
6526A145994M1074K2916j5012L0204J7948j3067q2216l822M7040k1766L0500r393
$$ 1145994 1187068 1209984 1194972 1225176 1243124 1230057 1147841 1144019 1191059 1169293 1199793 1190400
6514A190400K2748J8194O4612m2232j0085k5672O7767K3579j1116k2064q1045
$$ 1190400 1213148 1231342 1295954 1253722 1243637 1217965 1285732 1309311 1298195 1276131 1195086
6503A195086L7651L5427p9045j4466q393k883K4019k139r295k365P4076j2555
$$ 1195086 1232737 1268164 1189119 1174653 1166260 1163377 1187396 1185257 1175962 1173597 1247673 1235118
6491A235118j41237L2455j780p458k7128L4321R7476N5356l9162n1560m5535L366
$$ 1235118 1093881 1126336 1124556 1117098 1089970 1124291 1221767 1277123 1237961 1186401 1140866 1144232
6479A144232J4776M8866K3556K2185q2227L686J8015k2228O6257j4079o511M243
$$ 1144232 1159008 1207874 1231430 1253615 1171388 1175074 1193089 1170861 1237118 1223039 1216528 1220771
6467A220771K4114k1353K0202j3334j214k2755L9988m8106K8364M0030j3709p4764
$$ 1220771 1244885 1223532 1243734 1230400 1229186 1206431 1246419 1198313 1226677 1266707 1252998 1178234
6455A178234j338K4683K55M7589k8351k5476O0252j3325m6263n105p704L3242
$$ 1178234 1176896 1201579 1201834 1249423 1221072 1195596 1255848 1242523 1196260 1191155 1183451 1216693
6443A216693J1188M9461k8579K992K9285k0151K6868l1065o224N3991p5870n1827
$$ 1216693 1227881 1277342 1248763 1251755 1281040 1260889 1287757 1256692 1250468 1304459 1228589 1176762
6431A176762k8508K7211P4994K7695m4624J3813J5605q426K8015K1579R763m0174
$$ 1176762 1148254 1175465 1250459 1278154 1233530 1247343 1262948 1254522 1282537 1304116 1313879 1273705
6419A273705J8574j7188j7364K0318l9668M559K6397k456M85l9893j3692j377
$$ 1273705 1292279 1275091 1257727 1278045 1238377 1242936 1269333 1266877 1267362 1227469 1213777 1212400
6407A212400P8602P300L371L6312j9797n1900j457K5620K0437m1781n5726Q9537
$$ 1212400 1291002 1298302 1301673 1337985 1318188 1266288 1264831 1290451 1310888 1269107 1213381 1302918
6395A302918J2521L592m41k4303P3850m1592k7468k4975j5577r738J0087R801
$$ 1302918 1315439 1319031 1318590 1294287 1368137 1326545 1299077 1274102 1258525 1248787 1258874 1268675
6383A268675L4497J5504J2779L7386q7231k3931J6692j5212p937J1953J3164P745
$$ 1268675 1303172 1318676 1331455 1368841 1281610 1257679 1274371 1259159 1251222 1263175 1276339 1284084
6371A284084Q084n691J1279m5300M802M6855L9433j1573J843o7140M0253L1037
$$ 1284084 1292168 1286477 1297756 1252456 1257258 1304113 1343546 1331973 1333816 1266676 1306929 1337966
6359A337966k109k5786R355q365Q083L4090j1389J1160k676l3005n2782P188m065
$$ 1337966 1335857 1310071 1319426 1311061 1319144 1353234 1341845 1353005 1350329 1317324 1264542 1271730 1267665
6346A267665M0205M57j5223j5952M7630N3778m6081J5458k9804r94O9180j4605
$$ 1267665 1307870 1308327 1293104 1277152 1324782 1378560 1332479 1347937 1318133 1317139 1386319 1371714
6334A371714O9321l3336L63p940l8439M757L0060l1757P95J1315O7198k8656j8535
$$ 1371714 1441035 1407699 1408062 1400122 1361683 1366440 1396500 1364743 1365538 1376853 1444051 1415395 1396860
6321A396860l1358k8344L0849J2994K9843q9621L4660j8499O9302Q164o0949m8918
$$ 1396860 1365502 1337158 1368007 1381001 1410844 1321223 1355883 1337384 1406686 1414850 1353901 1304983
6309A304983J6671k4725M7063P9966p52o4728J5737P1458J0304m1110J3622J839
$$ 1304983 1321654 1296929 1343992 1423958 1423206 1358478 1374215 1445673 1455977 1414867 1428489 1430328
6297A430328n072j1953l0238M2880k0822M6627O990L3310l5409N0610k2583r348
$$ 1430328 1425256 1413303 1383065 1425945 1405123 1451750 1458740 1492050 1456641 1507251 1484668 1475320
6285A475320j1952J5097L4781L6921p9276j0482J01569l3068M877L2353M0084
$$ 1475320 1463368 1478465 1513246 1550167 1470891 1460409 1561978 1528910 1533787 1566140 1606224
6274A606224n5582r362l9609k5790O0480n1825K5427M3873m0475L4932J0795j6545
$$ 1606224 1550642 1541280 1501671 1475881 1536361 1484536 1509963 1553836 1513361 1548293 1559088 1542543
6262A542543l8713q920j5313N0960k1629J4444N4126J7232K2585r1650n1579L670
$$ 1542543 1503830 1494910 1479597 1530557 1508928 1523372 1577498 1594730 1617315 1525665 1474086 1477756
6250A477756L2890j4009M8564j4260k0738l9416j0267l399K9442M0289k6870K3448
$$ 1477756 1510646 1496637 1545201 1530941 1510203 1470787 1460520 1457121 1486563 1526852 1499982 1523430
6238A523430k3178M9681k692L5005o6272o135P1168q3514O146J4692j05965k5864
$$ 1523430 1500252 1549933 1547241 1582246 1515974 1509839 1581007 1497493 1503639 1518331 1412366 1386502
6226A386502O2476m8313K2203m3251r932n676O0212l2015P804k208N3025k4038
$$ 1386502 1448978 1400665 1422868 1379617 1369685 1364009 1424221 1392206 1400010 1397802 1450827 1426789
6214A426789l0436J6936K4400L5662n099P3474Q607r271m0608K285J4160j5745
$$ 1426789 1396353 1413289 1437689 1473351 1468252 1541726 1550333 1541062 1500454 1502739 1516899 1501154
6202A501154L9067o2792l5855L3603j3335m3324m460K6583j7363p792n979O7495
$$ 1501154 1540221 1477429 1441574 1475177 1461842 1418518 1414058 1440641 1423278 1415486 1409507 1477002
6190A477002l1186J233l0745l9365P0107P1525r619l1812L3228n6361r9947J19543
$$ 1477002 1445816 1447049 1416304 1376939 1447046 1518571 1508952 1477140 1510368 1454007 1354060 1473603
6178A473603L9268o2820l1072J3724M9965k9780l4532J6905m1683n911N0875Q2894
$$ 1473603 1512871 1450051 1418979 1432703 1482668 1452888 1418356 1435261 1393578 1387667 1438542 1521436
6166A521436K4138k6383L183M642o337R325l6298k851P388K5262K0316k6523M0432
$$ 1521436 1545574 1519191 1522374 1527016 1520679 1530004 1493706 1490855 1498243 1523505 1543821 1517298 1557730
6153A557730j6127L4640m6116m0134j810k395P6008k5763M5887L2129k353q3650
$$ 1557730 1541603 1576243 1530127 1489993 1488183 1485788 1561796 1536033 1581920 1614049 1611696 1528046
6141A528046N630Q9850K7079o1454R775o574l98L3135J6663o7114k1152O5968
$$ 1528046 1533676 1623526 1650605 1589151 1598926 1592352 1591954 1625089 1641752 1574638 1553486 1619454
6129A619454K8573l7925j0743M4123l13n8762M8936L5341l8443O2540k675o6477
$$ 1619454 1648027 1610102 1599359 1643482 1643169 1584407 1633343 1668684 1630241 1692781 1690106 1623629
6117A623629L3510j8403P9771l230L4832M0725L0962m8915j252L9401j0874j1759
$$ 1623629 1657139 1638736 1718507 1715277 1750109 1790834 1821796 1772881 1771629 1811030 1800156 1788397
6105A788397k2118R26l8527O6766K5754p5207l7750M3810l9084j1633J1578q32
$$ 1788397 1766279 1767205 1728678 1795444 1821198 1745991 1708241 1752051 1712967 1701334 1712912 1712080
6093A712080o8329M2235P5533n7498j17383O4633k7147O0137j8945q866l1911
$$ 1712080 1643751 1685986 1761519 1704021 1586638 1651271 1624124 1684261 1665316 1656450 1624539
6082A624539L7729k805j6111k2160l8015l0462l3214N9830P4407k7104R680J5074
$$ 1624539 1662268 1659463 1643352 1621192 1583177 1552715 1519501 1579331 1653738 1626634 1636314 1651388
6070A651388j4737j3203J0331J6987r982j9990l4653M800Q704J2954j7862L0094
$$ 1651388 1636651 1623448 1633779 1650766 1640784 1620794 1586141 1590941 1599645 1612599 1594737 1624831
6058A624831N2145j0645k8677J18464n5962j9519j2966j3222M3020K001J6973
$$ 1624831 1676976 1666331 1637654 1756118 1700156 1680637 1667671 1654449 1697469 1699470 1716443
6047A716443J494P878k2614j7682K6824r960K5121J4708k6797j7551M3485R5866
$$ 1716443 1717937 1725815 1703201 1685519 1712343 1702383 1727504 1742212 1715415 1697864 1741349 1837215
6035A837215p0256k4598L0536N0117j5257q649M442N085M565j5606K5211K0941
$$ 1837215 1766959 1742361 1772897 1823014 1807757 1799108 1803550 1808635 1813200 1797594 1822805 1843746
6023A843746J0421n484j3381q664o3415P844N4716J8440L0756k7728K2818k1575
$$ 1843746 1854167 1848683 1835302 1826638 1763223 1771067 1825783 1844223 1874979 1847251 1870069 1848494
6011A848494r374J8047J02202k9889M4180K4558l6707O667o2023Q312N924j0833
$$ 1848494 1839120 1857167 1959369 1929480 1973660 1998218 1961511 1968178 1906155 1914467 1920391 1909558
5999A909558j9132J8072M2077N5081m751l1632L4120L0445J0193M2450n0778j2301
$$ 1909558 1890426 1908498 1950575 2005656 2000905 1969273 2003393 2033838 2044031 2086481 2035703 2023402
5987B023402l335o7635m1545J49488Q434l3112L5572L2023j7741q592P0029k3236
$$ 2023402 2020067 1952432 1910887 2060375 2068809 2035697 2071269 2103292 2085551 2076959 2146988 2123752
5975B123752J0344J3029K9739J3374J8063k3981J5117K8583j7369K3963j7025
$$ 2123752 2134096 2147125 2176864 2190238 2208301 2184320 2199437 2228020 2210651 2234614 2217589
5964B217589K30M1163Q550L2378m971K9729N5768K2737L0642R96M3286k7371k4446
$$ 2217589 2217819 2258982 2267532 2299910 2294939 2324668 2380436 2403173 2433815 2434811 2478097 2450726 2426280
5951B426280M3298O2190J8467m0983K2518l5316o706Q1500k0452o939K4817L8925
$$ 2426280 2469578 2531768 2550235 2509252 2531770 2496454 2489748 2571248 2550796 2543857 2568674 2607599
5939B607599P1150o4994l7853L2796J7781j2787l1846j2508j134N452L8913J2672
$$ 2607599 2678749 2613755 2575902 2608698 2626479 2613692 2581846 2569338 2568204 2573656 2612569 2625241
5927B625241o047J8283j589j1749k0510L6720O3864p6835m5910O479Q5039K0290
$$ 2625241 2619194 2637477 2635888 2624139 2603629 2640349 2704213 2627378 2581468 2587947 2672986 2693276
5915B693276L5195p1604k008O4017j4208K5351P0492L5933L6422j3229O2827O4519
$$ 2693276 2728471 2656867 2654859 2718876 2704668 2730019 2800511 2836444 2872866 2859637 2922464 2986983
5903B986983o2304m5838O1994L4073q1365j9627L2904N9878j2438j0680O6717
$$ 2986983 2924679 2878841 2940835 2974908 2893543 2873916 2906820 2966698 2954260 2943580 3010297
5892C010297M8629J9126j7310m2304K9085K8409K8091M3683j5931J7252K3794
$$ 3010297 3058926 3078052 3060742 3018438 3047523 3075932 3104023 3147706 3131775 3149027 3172821
5881C172821k6754R693M2879P2842L150m0183P9407J5493k2543M2434L5798J0112
$$ 3172821 3146067 3155760 3198639 3271481 3274631 3234448 3313855 3329348 3306805 3349239 3385037 3395149
5869C395149k9797J1213K7655J12157L293K1709K9344L9170O4686R2054P7923
$$ 3395149 3365352 3376565 3404220 3516377 3519670 3541379 3570723 3609893 3674579 3766633 3844556
5858C844556O5910P7663J00629P8735P1812K12956J35115J42195K52688J42804
$$ 3844556 3910466 3988129 4088758 4167493 4239305 4452261 4587376 4729571 4982259 5125063
5848E125063P9487J54285K55661J03999J01398J1666k0685r9852j71124j13058
$$ 5125063 5204550 5358835 5614496 5718495 5819893 5831559 5810874 5711022 5539898 5426840
5838E426840k15214j87635k10826j57080j27246j18011p8070n7123r9110n6037
$$ 5426840 5211626 5023991 4813165 4656085 4528839 4410828 4332758 4275635 4176525 4120488
5828D120488p3l9450O8457l3996k5990M301J3343n7691K0604J8595K3196K0321
$$ 4120488 4120415 4080965 4149422 4115426 4089436 4093737 4107080 4049389 4069993 4088588 4111784 4132105
5816D132105o1681j4108P0482K8755K1811m571o26o6093M297Q9973j0989r445
$$ 4132105 4070424 4056316 4126798 4155553 4177364 4172793 4172167 4106074 4110371 4200344 4189355 4179910
5804D179910J6489J4836M2250L110l7392N8448J2768Q5358P4695Q9438P5283K1126
$$ 4179910 4196399 4211235 4253485 4256595 4219203 4277651 4290419 4375777 4450472 4539910 4615193 4636319
5792D636319K2806K2204N3137R7606K6762L9746L4269L5550Q2642J25138k2886
$$ 4636319 4659125 4681329 4734466 4832072 4858834 4898580 4932849 4968399 5051041 5176179 5153293
5781E153293O0878O7928M7176J14339O7787O0450J47633J29861J37392J31406
$$ 5153293 5214171 5282099 5329275 5443614 5511401 5571851 5719484 5849345 5986737 6118143
5771F118143J26533J14730J94542K83731K10949O3544k842L4167R247Q048n694
$$ 6118143 6244676 6359406 6553948 6837679 7048628 7112172 7109330 7143497 7152744 7160792 7155098
5760G155098l4253N8597R370J48510J10710J12284J69771J22343J53885J49386
$$ 7155098 7120845 7179442 7188812 7337322 7448032 7560316 7730087 7852430 8006315 8155701
5750H155701R3957J78043K15697J59672J87463J66680K25478J70182K42119K62486
$$ 8155701 8249658 8427701 8643398 8803070 8990533 9157213 9382691 9552873 9794992 10057478
5740A0057478K58428L54103L23737K06711K94312L69694K94187K53724K70255
$$ 10057478 10315906 10670009 10993746 11200457 11494769 11864463 12158650 12412374 12682629
5731A2682629K75515K71282Q7464J20575J61901Q2288J41184P6302O3487J34621
$$ 12682629 12958144 13229426 13316890 13437465 13599366 13681654 13822838 13899140 13962627 14097248
5721A4097248Q3328K17183J86819J85047K52462K60427L75688L16144M13318M45256
$$ 14097248 14180576 14397759 14584578 14769625 15022087 15282514 15658202 15974346 16387664 16832920
5711A6832920M81161N99077O92558O57536P71904Q57440Q97200Q88871R23074
$$ 16832920 17314081 17913158 18605716 19263252 20035156 20892596 21789796 22678667 23601741
5702B3601741J036090J014293J035962R72783P73362N85276N11548L01371L6480
$$ 23601741 24637831 25652124 26688086 27660869 28434231 29019507 29531055 29832426 29868906
5693B9868906k30165k81478l95329n14592n05804m51994m02613l19621k81164
$$ 29868906 29638741 29357263 28961934 28447342 27941538 27489544 27086931 26767310 26486146
5684B6486146k23234j99397j62574p2900K8800M6608N1307O0817J78414K11986
$$ 26486146 26262912 26063515 25900941 25828041 25856841 25903449 25954756 26015573 26193987 26405973
5674B6405973J95492L21000K94939L25771L70738M05404M71387N39419N36729
$$ 26405973 26601465 26922465 27217404 27543175 27913913 28319317 28790704 29330123 29866852
5665B9866852N88590O64022O17391P94226Q84555Q22465Q99051R69688R94123
$$ 29866852 30455442 31119464 31736855 32531081 33415636 34238101 35137152 36106840 37100963
5656C7100963J077017J026771J126398J127168R83259Q56816P67622N38113K41664
$$ 37100963 38177980 39204751 40331149 41458317 42441576 43298392 44066014 44604127 44845791
5647D4845791q6824m31493o61021q95448j128014j246588j324444j210348j159838
$$ 44845791 44758967 44327474 43666453 42771005 41642991 40396403 39071959 37861611 36701773
5638C6701773j082986j012572q88974o83571o00391m54457l74773k16370j40094
$$ 36701773 35618787 34606215 33717241 33033670 32433279 31978822 31604049 31387679 31247585
5629C1247585O5719J17692J46280L00925L88632N43434N61575N51124N91474P15281
$$ 31247585 31313304 31430996 31577276 31878201 32266833 32810267 33371842 33922966 34514440 35229721
5619C5229721O34748N64676N87646M43005L53089J65074N6265j63696l06681m14979
$$ 35229721 35864469 36429145 37016791 37459796 37812885 37977959 38034224 37870528 37563847 37148868
5609C7148868n53225o06735n52601n39416n22653n25997m61587k98715k35236
$$ 37148868 36595643 35988908 35436307 34896891 34374238 33848241 33386654 33087939 32852703
5600C2852703j61013j36269k2082J84530K29698K95387K92272L55888M13723M50546
$$ 32852703 32691690 32555421 32533339 32717869 32947567 33242954 33535226 33891114 34304837 34755383
5590C4755383N44576N12536N40509N37402M84615M22414M27578L43217L02032
$$ 34755383 35299959 35812495 36353004 36890406 37375021 37797435 38225013 38568230 38870262
5581C8870262K99099J73208J23920J05812J02204Q6221R8318J60240K57536K95992
$$ 38870262 39169361 39342569 39466489 39572301 39674505 39760726 39859044 40019284 40276820 40572812
5571D0572812L33862M09586N62301O11231Q22570Q68301J086928J124639J242059
$$ 40572812 40906674 41316260 41878561 42489792 43312362 44180663 45267591 46392230 47634289
$$ [...]
##END NTUPLES=NMR SPECTRUM
##END=
