##TITLE=1H_EC-3301(3)
 CDCl3
 8 sc, 
 23.10.2023
##JCAMPDX= 6.0         $$ Bruker NMR JCAMP-DX V2.0
##DATA TYPE= NMR SPECTRUM
##DATA CLASS= NTUPLES
##ORIGIN= UXNMR, Bruker Analytische Messtechnik GmbH
##OWNER= root
$$ XWIN-NMR		Version 3.5
$$ Mon Oct 23 13:53:31 2023 Russian Standard Time (UT+4h)  she@DPX200
##.OBSERVE FREQUENCY= 200.13135
##.OBSERVE NUCLEUS= ^1H
##.ACQUISITION MODE= SIMULTANEOUS
##.ACQUISITION SCHEME= undefined
##.AVERAGES= 8
##.DIGITISER RES= 18
##SPECTROMETER/DATA SYSTEM= spect
##.PULSE SEQUENCE= zg30
##.SOLVENT NAME= CDCl3
##.SHIFT REFERENCE= (INTERNAL, CDCl3, 0, 15.7568)
##AUDIT TRAIL= $$ (NUMBER, WHEN, WHO, WHERE, WHAT)
$$ ##TITLE= Audit trail, XWIN-NMR		Version 3.5
$$ ##JCAMPDX= 5.01
$$ ##ORIGIN= Bruker BioSpin GmbH
$$ ##OWNER= she
$$ F:/spectra/data/she/nmr/H-F/1/pdata/1/auditp.txt
$$ ##AUDIT TRAIL=  $$ (NUMBER, WHEN, WHO, WHERE, WHAT)
(   1,<2023-10-23 13:51:40.85 +0400>,<she>,<DPX200>,
      <created by zg, POWCHK disabled, PULCHK disabled
       configuration hash MD5:
       00 E9 B6 7A A2 85 ED C7 34 08 36 98 17 FE 4E 26
       data hash MD5: 16K
       0D 4F 4D 07 2F AA 61 D3 72 B9 58 88 ED F4 D9 62>)
(   2,<2023-10-23 13:51:43.85 +0400>,<she>,<DPX200>,
      <Start of raw data processing
       efp BC_mod = 2 LB = 0.24 FT_mod = 6 PKNL = 1 PHC0 = -22783.78 PHC1 = 7.452711 SI = 16K 
       data hash MD5: 16K
       84 16 10 8B B2 BF 2F 2E BC 6B D5 7F 79 DE EF 10>)
(   3,<2023-10-23 13:52:02.29 +0400>,<she>,<DPX200>,
      <pk PHC0 = -157.5298 PHC1 = 0 
       data hash MD5: 16K
       49 0B 33 3D 02 FF 05 B8 4C BA 70 37 8B A0 20 05>)
(   4,<2023-10-23 13:52:05.87 +0400>,<she>,<DPX200>,
      <abs ABSG = 5 
       data hash MD5: 16K
       03 7E 41 0D 09 E3 F0 8E 87 E4 44 B3 B4 C5 84 94>)
(   5,<2023-10-23 13:52:20.17 +0400>,<she>,<DPX200>,
      <pk PHC0 = -0.1871371 PHC1 = 0 
       data hash MD5: 16K
       C7 35 F8 FD DC 04 A0 AF E8 C7 85 23 0F 95 46 40>)
(   6,<2023-10-23 13:52:23.46 +0400>,<she>,<DPX200>,
      <abs ABSG = 5 
       data hash MD5: 16K
       D2 9C 6E 3D 59 AD C8 D0 AD 39 E8 68 92 0E CE 40>)
$$ ##END=
$$ 
$$ hash MD5
$$ 5D 3F EA 72 53 2E 44 97 C0 9A 0A C8 D5 E2 F4 19
##$RELAX= 
##$RELAX= 
##$RELAX= 
##$RELAX= 
##$RELAX= 
##$RELAX= 
$$ Bruker specific parameters
$$ --------------------------
##$DU= <F:/spectra>
##$EXPNO= 1
##$NAME= <H-F>
##$PROCNO= 1
##$TYPE= <nmr>
##$USER= <she>
##$AMP= (0..31)
100 100 100 100 100 100 100 100 100 100 100 100 100 100 100 100 100 100 
100 100 100 100 100 100 100 100 100 100 100 100 100 100 
##$AQSEQ= 0
##$AQ_mod= 1
##$AUNM= <au_zg>
##$AUTOPOS= <>
##$BF1= 200.13
##$BF2= 200.13
##$BF3= 200.13
##$BF4= 200.13
##$BF5= 200.13
##$BF6= 200.13
##$BF7= 200.13
##$BF8= 200.13
##$BYTORDA= 1
##$CFDGTYP= 0
##$CFRGTYP= 5
##$CHEMSTR= <none>
##$CNST= (0..31)
1 1 145 1 1 1 1 1 1 1 1 1 1 1 1 1 1 1 1 1 1 1 1 1 1 1 1 1 1 1 1 1 
##$CPDPRG= <>
##$CPDPRG1= <>
##$CPDPRG2= <>
##$CPDPRG3= <>
##$CPDPRG4= <mlev>
##$CPDPRG5= <mlev>
##$CPDPRG6= <mlev>
##$CPDPRG7= <mlev>
##$CPDPRG8= <mlev>
$$ [...]
##$SUBNAM3= <"">
##$SUBNAM4= <"">
##$SUBNAM5= <"">
##$SUBNAM6= <"">
##$SUBNAM7= <"">
##$SUBNAM8= <"">
##$SUBNAM9= <"">
##$SW= 18.05172834244
##$SWIBOX= (0..15)
0 0 2 0 0 0 0 0 0 0 0 0 0 0 0 0 
##$SW_h= 3612.71676300578
##$TD= 16384
##$TD0= 1
##$TE= 0
##$TE2= 300
##$TE3= 300
##$TEG= 300
##$TL= (0..7)
0 120 120 120 120 120 120 120 
##$TP= (0..7)
150 150 150 150 150 150 150 150 
##$TP07= 0
##$TPNAME0= <>
##$TPNAME1= <>
##$TPNAME2= <>
##$TPNAME3= <>
##$TPNAME4= <>
##$TPNAME5= <>
##$TPNAME6= <>
##$TPNAME7= <>
##$TPOAL= (0..7)
0.5 0.5 0.5 0.5 0.5 0.5 0.5 0.5 
##$TPOFFS= (0..7)
0 0 0 0 0 0 0 0 
##$TUNHIN= 0
##$TUNHOUT= 0
##$TUNXOUT= 0
##$USERA1= <user>
##$USERA2= <user>
##$USERA3= <user>
##$USERA4= <user>
##$USERA5= <user>
##$V9= 5
##$VALIST= <valist>
##$VCLIST= <CCCCCCCCCCCCCCC>
##$VD= 0
##$VDLIST= <DDDDDDDDDDDDDDD>
##$VPLIST= <PPPPPPPPPPPPPPP>
##$VTLIST= <TTTTTTTTTTTTTTT>
##$WBST= 1024
##$WBSW= 4
##$XGAIN= (0..3)
0 0 0 0 
##$XL= 0
##$YL= 0
##$YMAX_a= 352732
##$YMIN_a= -332504
##$ZGOPTNS= <>
##$ZL1= 120
##$ZL2= 120
##$ZL3= 120
##$ZL4= 120
##$ABSF1= 15.74469
##$ABSF2= -2.307159
##$ABSG= 5
##$ABSL= 3
##$ALPHA= 0
##$AQORDER= 0
##$ASSFAC= 0
##$ASSFACI= 0
##$ASSFACX= 0
##$ASSWID= 0
##$AUNMP= <proc_1d>
##$AZFE= 0.1
##$AZFW= 0.1
##$BCFW= 0
##$BC_mod= 2
##$BYTORDP= 0
##$COROFFS= 0
##$CY= -3
##$DATMOD= 1
##$DC= 0
##$DFILT= <>
##$DTYPP= 0
##$F1P= 0
##$F2P= 0
##$FCOR= 1
##$FTSIZE= 16384
##$FT_mod= 6
##$GAMMA= 0
##$GB= 0
##$INTBC= 1
##$INTSCL= 3.70164e-10
##$ISEN= 128
##$LB= 0.24
##$LEV0= 0
##$LPBIN= 0
##$MAXI= 10000
##$MC2= 0
##$MEAN= 0
##$ME_mod= 0
##$MI= 1.114404
##$NCOEF= 0
##$NC_proc= -7
##$NLEV= 6
##$NOISF1= 3.799351
##$NOISF2= 2.8
##$NSP= 0
##$NTH_PI= 0
##$NZP= 0
##$OFFSET= 15.75681
##$PC= 1
##$PHC0= -22941.5
##$PHC1= 7.452711
##$PH_mod= 1
##$PKNL= yes
##$PPARMOD= 0
##$PSCAL= 0
##$PSIGN= 0
##$REVERSE= no
##$SF= 200.130002949544
##$SI= 16384
##$SIGF1= 3
##$SIGF2= 2
##$SINO= 5.538805
##$SIOLD= 16384
##$SREGLST= <1H.CDCl3>
##$SSB= 0
##$STSI= 16384
##$STSR= 0
##$SW_p= 3612.71676300578
##$SYMM= 0
##$S_DEV= 0
##$TDeff= 16384
##$TDoff= 0
##$TI= <>
##$TILT= no
##$TM1= 0
##$TM2= 0
##$TOPLEV= 0
##$USERP1= <user>
##$USERP2= <user>
##$USERP3= <user>
##$USERP4= <user>
##$USERP5= <user>
##$WDW= 1
##$XDIM= 16384
##$YMAX_p= 366572796
##$YMIN_p= -389456
$$ End of Bruker specific parameters
$$ ---------------------------------
##NTUPLES= NMR SPECTRUM
##VAR_NAME=  FREQUENCY,     SPECTRUM/REAL,   SPECTRUM/IMAG
##SYMBOL=    X,             R,               I
##VAR_TYPE=  INDEPENDENT,   DEPENDENT,       DEPENDENT
##VAR_FORM=  AFFN,          ASDF,            ASDF
##VAR_DIM=   16384,         16384,           16384
##UNITS=     HZ,            ARBITRARY UNITS, ARBITRARY UNITS
##FACTOR=    0.220516191357247, 1,           1
##FIRST=     3153.41046945857, 0,            0
##LAST=      -459.306293547206, 0,           0
##MIN=       -459.306293547206, -389456,     0
##MAX=       3153.41046945857, 366572796,    0
$$ Real data points
##PAGE= N=1
##DATA TABLE= (X++(R..R)), XYDATA
$$ [...]
6054E24523l3203l4571L5012M6066j281r17n4813K518n033k2411R1135J9796k2560
6041E44261m353L2931J8271o8262P809j2192N9942L4079j8993m1137m8459L5943
6029E39840L2046M1672k9334K7730n265J514J2145j1083j2751P001J3488J7526
6017F34529l582J577Q8081O3783n129k0211j8107L673j4706N2123J6268p9811
6005G18488q4341K7970R085J1094m4332N6971J1910j480p5427K6873j051m2364
5993F13396O3231O0486J3030K0204k7676L0509R834N0156j134o9456l0344j7598
5981G14638N8738k6112M6679K7769k9576J7998J5231J7093k3122J7772N2332j3553
5969H75887J064L9757j9682K8118J1528m5771M5622J5425O666J4423M3715K3376
$$ plain form
6054 524523 491320 456749 491761 537827 536546 535629 480816 483334 478301 455890 547025 566821 544261
6041 544261 539908 572839 591110 522848 530657 518465 578407 612486 593493 552356 503897 539840
6029 539840 571886 613558 584224 611954 606689 608203 620348 609265 596514 603515 617003 634529
6017 634529 630947 632524 720605 784388 779259 759048 740941 744614 729908 782031 798299 718488
6005 718488 634147 662117 671202 682296 637964 694935 706845 705365 629938 656811 655760 613396
5993 613396 676627 737113 750143 770347 742671 773180 783014 833170 832036 762580 732236 714638
5981 714638 773376 747264 793943 821712 792136 810134 825365 842458 819336 837108 889440 875887
5969 875887 876951 916708 897026 925144 936672 890901 936523 951948 958614 973037 1016752 1040128
5957A040128j0274K3528M4122L6354j3732n5616J5969L1292N1572k954J7674q63
5945A177200p403J9285j929m5859K8721r5Q6148O3889j9032n0199k1124m3471
5933A186131k638O2139r862n1935O5682N1293n1879Q280L8191L6358K0492l0892
5921A321360l0240J8299J2456M1763Q5353K6833j8074o5667N1615J04924L996
5910A552618Q6806K5537j1987L0264l4644N4548P3823O995K5087k1003K9498P3737
5898A891279j347j08182k4902O6968K5101k8865l886K967l0121O4033K9699l0026
5886A852718j3270j4546J7449J8551Q1215M3280k3301J07n6109J9391O4720O7552
5874B057757K7459L5699K382J8146m7758k8898K7877K9147O2957N9838K2259L386
$$ plain form
5957 1040128 1029854 1053382 1097504 1133858 1120126 1064510 1080479 1111771 1163343 1160389 1178063 1177200
5945 1177200 1169797 1189082 1187153 1141294 1170015 1169920 1256068 1319957 1300925 1250726 1229602 1186131
5933 1186131 1183493 1245632 1235770 1183835 1249517 1300810 1248931 1257211 1295402 1331760 1352252 1321360
5921 1321360 1291120 1309419 1321875 1363638 1448991 1475824 1457750 1392083 1443698 1548622 1552618
5910 1552618 1639424 1664961 1652974 1683238 1648594 1703142 1776965 1783960 1809047 1788044 1817542 1891279
5898 1891279 1889932 1781750 1756848 1823816 1848917 1820052 1816166 1819133 1789012 1853045 1882744 1852718
5886 1852718 1839448 1824902 1842351 1860902 1942117 1985397 1962096 1962203 1906094 1925485 1990205 2057757
5874 2057757 2085216 2120915 2123297 2141443 2093685 2064787 2092664 2121811 2184768 2244606 2266865 2270251
5862B270251N0760O0253J47324L6108J19746J21969L0068J45716J57330J24622
5852C264147J25159J24117N0299m3063j68653j08549j79333p4443j36371q7059
5842B766251n0058r512l2422l2678m511l4595k614Q164k6793l4324L8451N1536
5830B636895l8385K8246P6642J0774O9044n684N2861O0850M7160k3548l0812N3523
5818B937566K4835l4345K9080j5085O1486l3400M972P5851N9940K1152m3613M1624
5806C130063J18557N882L2092L9968J01939J7873j5558J3718N6206M8709J00875
5795C650324J16266P9874Q167L4803L8082K6645M215L6605J17720P9199J02848
5784D294748J07441N9930Q9479P9203K5128J15389J27960Q8852Q1416J26006J47738
$$ plain form
5862 2270251 2321011 2381264 2528588 2564696 2684442 2806411 2836479 2982195 3139525 3264147
5852 3264147 3389306 3513423 3563722 3520659 3352006 3243457 3064124 2989681 2853310 2766251
5842 2766251 2716193 2706681 2674259 2641581 2637070 2602475 2599861 2608025 2581232 2546908 2585359 2636895
5830 2636895 2598510 2626756 2703398 2714172 2783216 2777532 2830393 2891243 2938403 2914855 2884043 2937566
5818 2937566 2962401 2928056 2957136 2942051 3003537 2970137 2975109 3050960 3110900 3132052 3088439 3130063
5806 3130063 3248620 3254502 3286594 3326562 3428501 3446374 3430816 3444534 3500740 3549449 3650324
5795 3650324 3766590 3846464 3854631 3889434 3927516 3954161 3958376 3994981 4112701 4191900 4294748
5784 4294748 4402189 4462119 4551598 4630801 4655929 4771318 4899278 4988130 5069546 5195552 5343290
5773E343290J38188Q7629J15733J83437K7526P7867J58344R2256J62910J72194
5763F559374J73696J94836J46164J80409L423l7703Q4144R3632K26437J38458
5753G762870J46900J99718J84545K97524L15854L28748L39626L31051L36939K94775
5743A0538550L93819L13492L41413K64828K44362J87284J24749Q0802o4538j21157
5733A2303604m4707p1112p1644K51Q815j7441R8142J52275J65700J36153J69650
5722A2829686K82149L19343L41069M28711N56215M94950O07271O59485P47431
5713A7266310Q77448R76221J093062J125624J249551J300987J332133J262674
5705B6484010J044883O65465K52374q9425m40911p03917q81594p74515p48033
$$ plain form
5773 5343290 5481478 5569107 5684840 5868277 5895803 5973670 6132014 6224270 6387180 6559374
5763 6559374 6733070 6927906 7074070 7254479 7257902 7220199 7304343 7397975 7624412 7762870
5753 7762870 7909770 8109488 8294033 8591557 8907411 9236159 9575785 9906836 10243775 10538550
5743 10538550 10932369 11245861 11587274 11852102 12096464 12283748 12408497 12489299 12424761 12303604
5733 12303604 12258897 12187785 12116141 12116392 12125207 12107766 12205908 12358183 12523883 12660036 12829686
5722 12829686 13111835 13431178 13772247 14200958 14757173 15252123 15859394 16518879 17266310
5713 17266310 18143758 19119979 20213041 21338665 22588216 23889203 25221336 26484010
5705 26484010 27528893 28194358 28446732 28357307 27916396 27212479 26330885 25556370 24808337
5696B4808337o36646n13825m81150k93586k55097k74579j58902q2077O0754K6432
5686B2199661J17908J92191K29925J77002J63496K00024J77899K56722L06423
5677B4021251K72826J52709L24956L92934M23968N22776N86092O99666Q20295
5668B8217473Q28088Q68302Q87077J062514J179753J247584J278984J271686J230563
5659C8072024J197457J055720O87924K37894k04408p25917j124066j449033j618200
5650C6129395j537909j548944j309576j289967j058593r18787p76686o29393n21748
5641B6537792l12917k40822j4137L657J3470J75955L58959L87330M96223N65456
5631B7970966O33988O95959Q29562Q34037P75420Q24065P89419O71411N31083
$$ plain form
5696 24808337 24171691 23657866 23176716 22883130 22628033 22353454 22194552 22112475 22173229 22199661
5686 22199661 22317569 22509760 22739685 22916687 23080183 23280207 23458106 23714828 24021251
5677 24021251 24294077 24446786 24771742 25164676 25588644 26111420 26697512 27397178 28217473
5668 28217473 29045561 29913863 30800940 31863454 33043207 34290791 35569775 36841461 38072024
5659 38072024 39269481 40325201 41013125 41251019 41046611 40320694 39196628 37747595 36129395
5650 36129395 34591486 33042542 31732966 30442999 29384406 28465619 27688933 27059540 26537792
5641 26537792 26224875 25984053 25969916 25973573 25987043 26162998 26521957 26909287 27405510 27970966
5631 27970966 28604954 29300913 30130475 30964512 31739932 32563997 33353416 34024827 34555910
5622C4555910L02813J51747j3625l04454m41647m75854n42055o59108o12062n86757
5612C1374908m73122m53015l63448k65934j96252l6130J9288J87383K45542L31382
5602C0370602L90111M00064N24835N73853N14113N69646M84958M60384M04757
5593C4693323L68712L34294L39356K67933J57494N8889O5228J54752R6505J48744
5583C6685230K46904L48909L76995M33337M75933O35696Q10188R18417R92096
5574D1923705J145018J356761J478501J593615J902998K025255K235684K467945
5566E6129482K611092K724076K819106K826917K882099K692868K598618K421051
5558G7705309K029990J756579J351915R22841M32717j34050o34277j052215j598471
$$ plain form
5622 34555910 34858723 35010470 34996845 34692391 34250744 33774890 33232835 32573727 31961665 31374908
5612 31374908 30901786 30448771 30085323 29819389 29623137 29587007 29606295 29793678 30039220 30370602
5602 30370602 30760713 31160777 31685612 32259465 32773578 33343224 33828182 34288566 34693323
5593 34693323 35062035 35396329 35735685 36003618 36161112 36220001 36285229 36439981 36536486 36685230
5583 36685230 36932134 37281043 37658038 38091375 38567308 39203004 40013192 40931609 41923705
5574 41923705 43068723 44425484 45903985 47497600 49400598 51425853 53661537 56129482
5566 56129482 58740574 61464650 64283756 67110673 69992772 72685640 75284258 77705309
5558 77705309 79735299 81491878 82843793 83766634 84199351 84065301 83431024 82378809 80780338
5549H0780338j851660k106377k324550k358237k226028k148719k097478j920817
5541F3746472j733570j510980j429208j155368r43596q90898p42418o50663o59971
5532E4029800n87858n43146n98114n55391n56990n22298n46292m70056m52516
5523D9197139l24259j90498r332K44414K97110L42804N82969P48424P12685P34107
5513E2335563O24304L96950N331m87637j119123j677003k250189k671604k760499
5504D2396093k723230k565601k413488k136724j917947j733449j524955j425990
5496B5954709j261921j088247r47372r39791q24670o78074n68898n68330m96270
5487A8581136m05663m04924l57221l35074l11789k76319j78060j59977r7322j96905
$$ plain form
5549 80780338 78928678 76822301 74497751 72139514 69913486 67764767 65667289 63746472
5541 63746472 62012902 60501922 59072714 57917346 56973750 56082852 55340434 54689771 54029800
5532 54029800 53441942 52898796 52300682 51745291 51188301 50666003 50119711 49649655 49197139
5523 49197139 48872880 48682382 48673050 48917464 49214574 49557378 50140347 50888771 51601456 52335563
5513 52335563 52959867 53356817 53362148 52874511 51755388 50078385 47828196 45156592 42396093
5504 42396093 39672863 37107262 34693774 32557050 30639103 28905654 27380699 25954709
5496 25954709 24692788 23604541 22657169 21717378 20892708 20214634 19645736 19077406 18581136
5487 18581136 18175473 17770549 17413328 17078254 16766465 16490146 16312086 16152109 16054787 15857882
5477A5857882k35185j68696j02946j64499k47935k71444l14031m78288m86824
5468A3388034m60618n33223m57863m69768m30589m00293l51087k86423k78537
5459I719633l12500k41407k91542j39048k10678j46835k08366j28636j84095k13372
5449G643154k8910j66280q6776p2176r5623j19707r3030j6947o0338j04175n3226
5438F745966m6154o3043o0214k4798j570j05856o8718L2784N0065q3834j779K2375
5426F395224M5576L1375j6757j7540l9480N5560M0669L3334O1803p535P9924O7240
5414F729393J502N3102k7535P9900M3660L8350j4352K8873M3121J07354R5880
5403G179248q051l6585J05704J3124J15432J53590J11744J44366J63116M7967
$$ plain form
5477 15857882 15622697 15454001 15351055 15186556 14938621 14667177 14353146 13874858 13388034
5468 13388034 12927416 12394193 11936330 11466562 11035973 10635680 10284593 9998170 9719633
5459 9719633 9407133 9165726 8874184 8735136 8524458 8377623 8169257 8040621 7856526 7643154
5449 7643154 7614244 7447964 7361188 7289012 7193389 7073682 6980652 6963705 6903367 6799192 6745966
5438 6745966 6699812 6636769 6576555 6551757 6550187 6444331 6375613 6408397 6458462 6374628 6372849 6395224
5426 6395224 6440800 6472175 6455418 6437878 6398398 6453958 6494627 6527961 6589764 6582229 6662153 6729393
5414 6729393 6730895 6783997 6756462 6836362 6880022 6918372 6904020 6932893 6976014 7083368 7179248
5403 7179248 7171197 7134612 7240316 7253440 7368872 7522462 7634206 7778572 7941688 7989655
5393G989655j75032j35860j3809j08880m1899m4259l0311k8960o6293L5540M367
5382G384259L3994J8772m8059L4138J3097O3044M5616R5533O5580J28395J67705
5371H002074J47391J66768K21184K43823L11764L65761M41102L81359M39392J72616
5361A0893234j65291l31165k09587j15537j23187L1093m7500Q1991J84867J28944
5351A0327862J87879K08000K07821L73853K58754K81717M53176L37300M47907
5342A3084269M83268M45504O11595O78874Q42780Q46130R09487R83936J192055
5333B0077898J361756J413893J450231J165908R08530R17829R49237R45735Q20823
5324C0011840O34838L01827N8788l31431n96623q73861j082879j140530j077692
$$ plain form
5393 7989655 7814623 7678763 7664954 7556074 7514175 7469916 7439605 7410645 7344352 7379892 7384259
5382 7384259 7418253 7437025 7388966 7423104 7436201 7499245 7544861 7640394 7705974 7834369 8002074
5371 8002074 8149465 8316233 8537417 8781240 9093004 9458765 9899867 10281226 10720618 10893234
5361 10893234 10727943 10396778 10187191 10071654 9948467 9979560 9932060 10014051 10198918 10327862
5351 10327862 10515741 10723741 10931562 11305415 11564169 11845886 12299062 12636362 13084269
5342 13084269 13567537 14013041 14624636 15303510 16146290 16992420 17901907 18885843 20077898
5333 20077898 21439654 22853547 24303778 25469686 26378216 27296045 28245282 29191017 30011840
5324 30011840 30646678 30948505 31007293 30675862 30079239 29205378 28122499 26981969 25904277
5315B5904277j193410j105535j075160r31384q45876o70665o10983n08055l66783
5306A8596426l16537j69966p2384k6920N4255J44790K45799J91828L3345j0983
5296A8669653N5976O5209J66223J93056K81296K54107K74385L83925N15102N56672
5286B1415604O10228O69724P59595R08845J098584J158512J220810J372308J543164
5277C0757374J799402J895291K023887K277233K469074K755463K804918K998217
5269D9780859L186620L145758L232847L009719K681672K221469J635570P78672
5261F9673186j18356r58630j670830k266107k733258l057586l207568l169745
5253E2491106l092659l058312k843841k609747k304116k136593j840321j540766
$$ plain form
5315 25904277 24710867 23605332 22530172 21598788 20752912 20082247 19471264 18963209 18596426
5306 18596426 18279889 18109923 18037539 18010619 18064874 18209664 18455463 18647291 18680636 18669653
5296 18669653 18725629 18790838 18957061 19150117 19431413 19685520 19959905 20343830 20858932 21415604
5286 21415604 22025832 22695556 23455151 24363996 25462580 26621092 27841902 29214210 30757374
5277 30757374 32556776 34452067 36475954 38753187 41222261 43977724 46782642 49780859
5269 49780859 52967479 56113237 59346084 62355803 65037475 67258944 68894514 69673186
5261 69673186 69554830 68596200 66925370 64659263 61926005 58868419 55660851 52491106
5253 52491106 49398447 46340135 43496294 40886547 38582431 36445838 34605517 33064751
5245C3064751j350065j238524j017111r35430p20076m85641m58051m18840k85238
5236B6155775j45179m7229J1771J95690K12932L68879N67990O63023P73567R05040
5226B9662259J038959J232691J386596J646489J829520J977753K174190K408503
5218D3356960K522449K597387K720956K705077K700970K539446K258381J852233
5210F3253859J313703Q02830M2245o54173j317672j881662k387320k783723l023166
5201E3364921l083541l124982l135275l068996k843255k594134k453265k257814
5193C0803659k063764j782426j631116j448309j288231j121937j004276q72158
5185A9591442q28509p94494o62101n74733n85553n71811l39343m01801l87211
$$ plain form
5245 33064751 31714686 30476162 29459051 28523621 27803545 27317904 26859853 26441013 26155775
5236 26155775 26010596 25963367 25975138 26170828 26383760 26752639 27320629 27983652 28757219 29662259
5226 29662259 30701218 31933909 33320505 34966994 36796514 38774267 40948457 43356960
5218 43356960 45879409 48476796 51197752 53902829 56603799 59143245 61401626 63253859
5210 63253859 64567562 65370392 65412637 64758464 63440792 61559130 59171810 56388087 53364921
5201 53364921 50281380 47156398 44021123 40952127 38108872 35514738 33061473 30803659
5193 30803659 28739895 26957469 25326353 23878044 22589813 21467876 20463600 19591442
5185 19591442 18762933 17968439 17306338 16731605 16146052 15574241 15234898 14833097 14445886
5176A4445886l14194l56188k40040j67268j77187j44777L2710m3001N8455J83878
5166A3278274J16723K35371K52021L43480M00607M05464O11323P23422O85214
5157A7051899Q25187R31032R35384R74096J007763R18420Q22104O98128M98366
5148B4662379K74778n9365l71383o29040q55518r48434j092618j283030j265788
5139A8431981j165270j115040j161111r48739r85005q11909p79258p03565o45203
5130A0116881n41014n13643m07565l99559l27293l16545k90349k41960k54138
5121F824815k09168j84786k00211k98887j53128j42805j00721j53197j93962j25354
5111E062596j06414j71081q0953j29233p9137j12038o7952j07925j03147J0193
$$ plain form
5176 14445886 14131692 13775504 13535464 13368196 13191009 13046232 13078942 13035941 13094396 13278274
5166 13278274 13394997 13630368 13882389 14225869 14626476 15031940 15643263 16366685 17051899
5157 17051899 17877086 18808118 19743502 20717598 21725361 22643781 23465885 24164013 24662379
5148 24662379 24937157 24877792 24506409 23877369 23021851 22073417 20980799 19697769 18431981
5139 18431981 17266711 16151671 14990560 14041821 13056816 12244907 11465649 10762084 10116881
5130 10116881 9575867 9062224 8654659 8255100 7927807 7611262 7320913 7078953 6824815
5121 6824815 6615647 6430861 6230650 5931763 5778635 5635830 5535109 5381912 5187950 5062596
5111 5062596 4956182 4785101 4704148 4574915 4495778 4383740 4315788 4207863 4104716 4114909
5101D114909q9954q4132l6979m6189j34344q0166j2628q2198j16573l5944o6144
5090C329658j11194o6806j5288j1720k3977p4904O3014m872l5566n3629n9103
5079B935613l9890M8748p1505q6553j1777O9254n5341L3527k2139q3944M6838
5068B762831k8446q8565m7436J8255l1781j0475l5807j6417p4350L0463k8767
5057B449505n9914M9822o957p6300N6932R998J759k7538k7497J9675N5408k6676
5045B418217L0230k9724r033M2634J02632N410J3332K1338m8177p9776K2682P7938
5033B567703R3916P1913J01845R2066J10315J34264J1222k7211j80618j35784
5023B839631j19840q6592o5610j42890m6227K4101l766k45l6948L1382L2384l4901
$$ plain form
5101 4114909 4024955 3940823 3903844 3857655 3723311 3643145 3630517 3548319 3431746 3395802 3329658
5090 3329658 3218464 3151658 3136370 3124650 3100673 3025769 3088783 3083911 3048345 2994716 2935613
5079 2935613 2895723 2944471 2872966 2786413 2774636 2843890 2788549 2822076 2799937 2715993 2762831
5068 2762831 2734385 2645820 2598384 2616639 2584858 2574383 2538576 2522159 2447809 2478272 2449505
5057 2449505 2389591 2439413 2432456 2356156 2413088 2423086 2424845 2397307 2369810 2389485 2444893 2418217
5045 2418217 2448447 2418723 2409690 2452324 2554956 2560366 2573698 2595036 2546859 2467083 2489765 2567703
5033 2567703 2661619 2733532 2835377 2927443 3037758 3172022 3183244 3156033 2975415 2839631
5023 2839631 2719791 2633199 2567589 2424699 2378472 2402573 2398807 2398562 2361614 2392996 2425380 2390479
5011B390479K607m2826l4420L9902o3872n3049k6759k0655L8494m541j8086j1841
4999B195433l9289j7332K2974O588o0163M2104K3105k1434o71K7188K982j5492
4987B165993P7445M8209J3620M776K4500J9869j8644O2048K5323N4468R7368J4488
4975B589463J43302M8144J40025J02046k5489j5112m1912m5185j11537j20992
4965B662753q4258l9699j6179J5827J2299L7125l442N8525k1866M9948L3383j3195
4953B691221J0001j3414r4p1534o993J3945j0679k6590p3686o6915K7353j6977
4941B455638O183j7307M3422o8047n1984N6406o0256o8215J4849N7654L4788K6095
4929B429226q416L1708l357J0424k9652j7101k7595J4284j4764K9234o758P2301
$$ plain form
5011 2390479 2393086 2350260 2315840 2355742 2291870 2238821 2212062 2191407 2229901 2225360 2207274 2195433
4999 2195433 2156144 2138812 2161786 2168374 2108211 2150315 2173420 2151986 2151315 2178503 2181485 2165993
4987 2165993 2243438 2291647 2305267 2310043 2334543 2354412 2335768 2397816 2423139 2477607 2574975 2589463
4975 2589463 2732765 2780909 2920934 3022980 2997491 2982379 2940467 2895282 2783745 2662753
4965 2662753 2578495 2538796 2522617 2538444 2550743 2587868 2584426 2642951 2621085 2671033 2704416 2691221
4953 2691221 2701222 2687808 2687714 2616180 2609187 2623132 2612453 2585863 2512177 2445262 2472615 2455638
4941 2455638 2461821 2444514 2487936 2419889 2367905 2424311 2364055 2295840 2310689 2368343 2403131 2429226
4929 2429226 2420810 2452518 2449161 2459585 2429933 2412832 2385237 2399521 2384757 2413991 2407233 2479534
4917B479534L3719n6327K4827N698L282J1205j1091Q7955J5535J0418M2150J8069
4905B664974J9741N0947L9789k7461J1094l1737K6658N1074M5574k1439K7803
4894B857017n2779L5720J04348P7621l4812L6204J1823k7453m909j4689N8382
4883C046473M2331l219J9344L9581m7596K2321K8160L6480K4642K5639k6960N688
4871C212884J1085K7475R7940j5216M1776j1073N8719L8221o3219J693L0982r1167
4859C340100j8239O0989l139L8228j3847N3077M7008k044J3016L8129J6031j2961
4847C556348l5058N1242K2558L4498J15909L8759k897L0777P4646j2851m6767
4836C827164P3362J16634R3107L8517R2151J12198J8552J129K0926O3557K4354
$$ plain form
4917 2479534 2513253 2456926 2481753 2487451 2490733 2501938 2490847 2578802 2594337 2604755 2646905 2664974
4905 2664974 2684715 2735662 2775451 2747990 2759084 2727347 2754005 2805079 2850653 2829214 2857017
4894 2857017 2804238 2839958 2944306 3021927 2987115 3023319 3035142 3007689 3002780 2988091 3046473
4883 3046473 3088804 3085585 3104929 3144510 3096914 3119235 3147395 3183875 3208517 3234156 3207196 3212884
4871 3212884 3223969 3251444 3349384 3334168 3375944 3364871 3423590 3461811 3398592 3400285 3431267 3340100
4859 3340100 3321861 3382850 3379711 3417939 3404092 3457169 3504177 3502133 3515149 3553278 3569309 3556348
4847 3556348 3521290 3572532 3595090 3629588 3745497 3784256 3781359 3812136 3886782 3873931 3827164
4836 3827164 3900526 4017160 4110267 4148784 4240935 4353133 4371685 4372814 4393740 4457297 4481651
4825D481651k6521O8795P9409M051M5916Q4301N0448m142N4465O3433j1999J06116
4813D995923J08233J45981O8982J01568Q1220J06170J43702J19426M4338J56678
4803F072221J53978J15676P3518N7734Q8841P3086K7007J9767P9674Q8476J15887
4792F965865J55231O7465J21798J82561R2192Q9960R2431J30363R8936J14949
4782H111751Q7865J55564R2047O1254R8895P5601J08419M1293K1097J70342J75953
4771I200081K03458K03627K48486K94260L43042L57864L45909L83189L69155L50487
4761A2299558K86843L21323L61070K77559K99215M00017N09144M88326N97349
4752A5840404N51733M95234M41107L60125L63179L36894L44932L16501M43756
$$ plain form
4825 4481651 4455130 4523925 4603334 4607385 4653301 4737602 4788050 4783908 4838373 4901806 4889807 4995923
4813 4995923 5104156 5250137 5319119 5420687 5501907 5608077 5751779 5871205 5915543 6072221
4803 6072221 6226199 6341875 6415393 6473127 6561968 6635054 6662061 6681828 6761502 6849978 6965865
4792 6965865 7121096 7188561 7310359 7492920 7585112 7675072 7767503 7897866 7996802 8111751
4782 8111751 8199616 8355180 8447227 8508481 8607376 8682977 8791396 8832689 8853786 9024128 9200081
4771 9200081 9403539 9607166 9855652 10149912 10492954 10850818 11196727 11579916 11949071 12299558
4761 12299558 12586401 12907724 13268794 13546353 13845568 14245585 14754729 15243055 15840404
4752 15840404 16392137 16887371 17328478 17688603 18051782 18388676 18733608 19050109 19493865
4743A9493865O13822O36605O80166P07270P91160Q65836J025332J166407J490107
4734B7470570J693648J948047K205838K668292K984217L387390M028762M602144
4726E0988908N183734O276220Q067271J0638106J4004690J8292715K1417284K3589602
4718A58458530J5988239J666886j1160117k4138074k7560905k2905951j6574297
4711G3774311j1289805p802394n663634m199749l389353k625255j913092j584214
4703C5306815j051728o16934n26869l04893o2914j18286o8193l3287J24715O7165
4693C2715591L9510O0191q9728q5104j25697j26265l4642k5255J56087L22078
4683C2806766M10762O33861P05349R34083J080698J234162J476540J843167K092648
$$ plain form
4743 19493865 20107687 20744292 21424458 22131728 22922888 23788724 24814056 25980463 27470570
4734 27470570 29164218 31112265 33318103 35986395 38970612 42358002 46386764 50988908
4726 50988908 56172642 62448862 70516133 81154239 95158929 113451644 134868928 158458530
4718 158458530 174446769 176113655 164953538 140815464 113254559 90348608 73774311
4711 73774311 62484506 54682112 49018478 44818729 41429376 38804121 36891029 35306815
4703 35306815 34255087 33638153 33111284 32806391 32743477 32625191 32556998 32523711 32648426 32715591
4693 32715591 32755101 32815292 32725564 32640460 32514763 32388498 32353856 32328601 32484688 32806766
4683 32806766 33217528 33851389 34556738 35490821 36571519 37805681 39282221 41125388 43218036
4674D3218036K448781K888551L275507L721868M338620N064879O156781P635211
4666G8748234R746539J2603791J6805929K0227155K1855721J5212456J856732
4659A77056557n011455j3579862k3792819k4797780k0054896j4351661j0071627
4652F5396457p300583n541329m396138l476164k755534k066239j588191j183865
4644C7088414q88140o64204n38543m19191l66569m35315m47064k92885k93000
4635C2743503l88937l16105k19396k77115k61748k48101k27168j77837j13687
4626C0513409j04778P9904J03695Q5854Q5012J20425J19951N5757L7431l8520
4616C1058140k0895n9220j702L3084J1144M1007J01985J24515J97064K33469K78031
$$ plain form
4674 43218036 45666817 48555368 51830875 55552743 59891363 64956242 71113023 78748234
4666 78748234 88494773 101098564 117904493 138131648 159987369 175199825 177056557
4659 177056557 172045102 158465240 134672421 109874641 89819745 75468084 65396457
4652 65396457 58095874 52554545 48158407 44682243 41926709 39860470 38272279 37088414
4644 37088414 36200274 35536070 34997527 34578336 34211767 33776452 33329388 33036503 32743503
4635 32743503 32354566 32038461 31819065 31541950 31280202 31032101 30804933 30627096 30513409
4626 30513409 30408631 30488535 30592230 30678084 30763096 30883521 31003472 31059229 31096660 31058140
4616 31058140 31037245 30978025 30976323 31009407 31020551 31061558 31163543 31288058 31485122 31718591 31996622
4605C1996622L10764L27870N26552M91448O13512O81684O72334P07919P41964
4596C7070669P33103O98078N75373N32926M37025K95864O5237n7389k10506l97279
4586C9743101m21538n03382n67853p83272o89694p76875p07268o59346p96836
4577C3837037n98654n25238m41538l51336m16036l87721l53244l44372l63568
4568C0055330m13614l95224l21386k97332k52111k46688j46014o5197n9331o8051
4558B7790382l9876j26337k57634j81853l84256m37779l96397m82828n36909m02267
4548B4544246m18321m70735l55749l39814k90238j95848j81449k03352r2733k6545
4538B1969462p2547K3652J81924N9089J63929K23724K77422K89554M02789L84790
$$ plain form
4605 31996622 32307386 32635256 33161808 33653256 34266768 34948452 35620786 36328705 37070669
4596 37070669 37803772 38501850 39077223 39610149 40047174 40343038 40408275 40350886 40140380 39743101
4586 39743101 39321563 38818181 38250328 37467056 36777362 36000487 35293219 34633873 33837037
4577 33837037 33238383 32713145 32271607 31920271 31504235 31116514 30763270 30418898 30055330
4568 30055330 29641716 29246492 28925106 28627774 28375663 28128975 27982961 27917764 27858433 27790382
4558 27790382 27750506 27624169 27366535 27184682 26800426 26362647 25966250 25483422 24946513 24544246
4548 24544246 24125925 23655190 23299441 22959627 22669389 22473541 22292092 22088740 21996007 21969462
4538 21969462 21896915 21920567 22102491 22161580 22325509 22549233 22826655 23116209 23518998 23903788
4528B3903788M07714N65829N79379N21475N59634M88788N50920N75605N92247
4519B8745379N98695N00946M36271M60295M81324L85722L85096M98821M10552
4510C2903101M62923N61522O17089O72273P70259Q57071Q65096R41166R39737
4501C9590237Q86610R07512R18802Q44633P22390N40771M08461K71690L8965l5612
4491D5094459j97492m62835m79534n05614m98499n36747l94441m45902m03930
4482D1169465l22027j13213j99194j05939j1311O4848J63623J94643J28385J37269
4472D1106549R6860L999k341j32680j92693k61901k38915k76601k88879k73202
4462C9540196k56836j80709j45998j41695n3649M0000Q3827P8459J83107K42802
$$ plain form
4528 23903788 24311502 24877331 25456710 25978185 26537819 27026607 27577527 28153132 28745379
4519 28745379 29344074 29845020 30281291 30741586 31222910 31608632 31993728 32492549 32903101
4510 32903101 33366024 33927546 34544635 35216908 35987167 36844238 37709334 38650500 39590237
4501 39590237 40476847 41384359 42303161 43147794 43870184 44410955 44819416 45091106 45130071 45094459
4491 45094459 44896967 44434132 43954598 43448984 42950485 42413738 42019297 41573395 41169465
4482 41169465 40847438 40734225 40535031 40429092 40417781 40482629 40646252 40840895 40969280 41106549
4472 41106549 41203409 41207408 41205067 41072387 40879694 40617793 40378878 40102277 39813398 39540196
4462 39540196 39283360 39102651 38956653 38814958 38761309 38801309 38885136 38963595 39146702 39389504
4452C9389504J86940K82457L12103K17073K83911L65327L60029M33272N05630
4443D2336246N92488O21452O91418P07524O23029O36345O53687M94835M97384
4434D7854408N19955N36054M51953N38144O91218P64692R16939J001122J162104
4425E4436589J323637J383630J461190J648037J752628J806059J982436K085120
4417F7879326K168348K268274K330997K377761K414560K488717K598377K730888
4409H7257248K717840K702591K734618K719502K616016K443619K104278J867997
4401A07163709J472096J259797J219467J092996R42504Q95233Q88349P20766O73002
4392A16327919O54063M68712Q4231l22563p81697j341542j716806k170990k531284
$$ plain form
4452 39389504 39576444 39858901 40171004 40388077 40671988 41037315 41397344 41830616 42336246
4443 42336246 42928734 43550186 44241604 44949128 45572157 46208502 46862189 47357024 47854408
4434 47854408 48374363 48910417 49362370 49900514 50591732 51356424 52273363 53274485 54436589
4425 54436589 55760226 57143856 58605046 60253083 62005711 63811770 65794206 67879326
4417 67879326 70047674 72315948 74646945 77024706 79439266 81927983 84526360 87257248
4409 87257248 89975088 92677679 95412297 98131799 100747815 103191434 105295712 107163709
4401 107163709 108635805 109895602 111115069 112208065 113150569 114045802 114934151 115654917 116327919
4392 116327919 116981982 117450694 117534925 117212362 116430665 115089123 113372317 111201327 108670043
4383A08670043k633729k726553k661990k509997k406614k073512j636739j260473
4375I0760436j074871q40110o81221m87377l62775l73294k81823m01872m60557
4366H5796536m62028m47592m08481l93024l19702l11591l50161m89754n27110
4357H2087093o40489p62481r34747r53106q82743r04273p48290o79337o34659
4348G4946968o35075o60888p78641r72857j085979j143534j167074j253562j258794
4339F5990564j360165j388929j439730j520243j482705j380619j429214j262181
4331E4726778j122376j009527p98365p50379o45049n30653m55035k81440j46358
4322D8987596j43399J831k3260O2116J56273N5659K2714Q2908P4293L6387M1993
$$ plain form
4383 108670043 106036314 103309761 100647771 98137774 95731160 93657648 92020909 90760436
4375 90760436 89685565 88845455 88164234 87676857 87314082 86940788 86658965 86257093 85796536
4366 85796536 85334508 84886916 84478435 84085411 83765709 83454118 83103957 82614203 82087093
4357 82087093 81446604 80684123 79749376 78796270 77913527 77009254 76260964 75581627 74946968
4348 74946968 74311893 73651005 72872364 71899507 70813528 69669994 68502920 67249358 65990564
4339 65990564 64630399 63241470 61801740 60281497 58798792 57418173 55988959 54726778
4331 54726778 53604402 52594875 51796510 51046131 50401082 49870429 49415394 49133954 48987596
4322 48987596 48844197 48846028 48822768 48884884 49041157 49096816 49119530 49202438 49276731 49313118 49355111
4311D9355111J7514J22598O2979Q70j45312j85644k63266m02853n04110o28604
4301D7429283p03472p09095n73610m99312m47782l98740l13031k47250j92237
4292D3344754m4298O6649P4242L05267L11147L08191M40261N10288O29099Q11941
4282D6757541Q02642Q57616Q67401P92021P49766N84671K82899j0285k68377n99141
4272E0816754q97037j072919j250582j313298j256309j235350j128036r42140
4264D1721083q41497o19103m81161k59648j66585n1339Q6929K58282L42719M02503
4254D0392183M48513L82360L62219L16132J74810J1075j82214l91379o58195o21420
4244D0234084p42399p33130p06496p14273n84128m92650l43143l44631k49625
$$ plain form
4311 49355111 49372625 49495223 49558202 49559072 49413760 49228116 48964850 48561997 48057887 47429283
4301 47429283 46725811 46016716 45443106 44943794 44496012 44097272 43784241 43536991 43344754
4292 43344754 43300456 43367105 43441347 43746614 44057761 44365952 44806213 45316501 45945600 46757541
4282 46757541 47560183 48417799 49285200 50077221 50826987 51411658 51694557 51684272 51415895 50816754
4272 50816754 49919717 48846798 47596216 46282918 45026609 43791259 42663223 41721083
4264 41721083 40879586 40260483 39779322 39519674 39353089 39301750 39388679 39646961 39989680 40392183
4254 40392183 40840696 41223056 41585275 41901407 42076217 42087292 41905078 41513699 40855504 40234084
4244 40234084 39491685 38758555 38052059 37337786 36753658 36261008 35917865 35573234 35323609
4235C5323609p8278L5080J03914J48853K24636K79547L37359K65009K44413L13420
4225C7197562K52758J66375R4810J28673K7837r7284j89598l09588l59532k34343
4215C6677670k81606k46301j51991p8075M170K41914L64652M11437N20488N53742
4205C8016100N82230P57880P76975P92411Q36343P80923Q14562Q85712Q54103
4196D5097239Q26628Q58569Q79765J020680J058040J017343J120450J117410J185710
4187E4181834J291273J387272J546568J711334J908898K197540K526737K783849
4179F9535305L126421L594550M014666M611150N146462N716683O455948P151828
4171A09353013P970981R016290J0121389J1273265J2684946J4393416J6027098
$$ plain form
4235 35323609 35245331 35280411 35384325 35533178 35757814 36037361 36374720 36639729 36884142 37197562
4225 37197562 37450320 37616695 37711505 37840178 37868015 37770731 37581133 37271545 36912013 36677670
4215 36677670 36396064 36149763 35997772 35919697 35923867 36165781 36530433 36941870 37462358 38016100
4205 38016100 38598330 39356210 40133185 40925596 41761939 42542862 43357424 44243136 45097239
4196 45097239 45923867 46782436 47662201 48682881 49740921 50758264 51878714 52996124 54181834
4187 54181834 55473107 56860379 58406947 60118281 62027179 64224719 66751456 69535305
4179 69535305 72661726 76256276 80270942 84882092 90028554 95745237 102201185 109353013
4171 109353013 117323994 126340284 136461673 147734938 160419884 174813300 190840398
4164A90840398J7675706J9169484J9952484J9407697J7011625J1901197M346760
4157C00305351m762160j3569841j9977146k3186691k3590157k2144219j9958531
4150A73116606j7597117j5136624j2982630j1100872r467430q227272o969344
4143I1635317n927051n117969m446579l948327l401866l039690k932494k864777
4135E9956564k828050k871408k825053k711618k565885k389894k269677k086157
4127C9408822j835238j775627j621611j377993j374632j245429j082187r77340
4119B8118765q40563q46151p97049q01223o30450n99215n78768n04123l52897
4110B2168326l74965l92748l66823l30558k86924l01483l82466l62711l34058
$$ plain form
4164 190840398 208516104 227685588 247638072 267045769 284057394 295958591 300305351
4157 300305351 295543191 281973350 261996204 238809513 215219356 193075137 173116606
4150 173116606 155519489 140382865 127400235 116299363 106831933 98604661 91635317
4143 91635317 85708266 80590297 76143718 72195391 68793525 65753835 62821341 59956564
4135 59956564 57128514 54257106 51432053 48720435 46154550 43764656 41494979 39408822
4127 39408822 37573584 35797957 34176346 32798353 31423721 30178292 29096105 28118765
4119 28118765 27278202 26432051 25635002 24833779 24203329 23604114 23025346 22521223 22168326
4110 22168326 21793361 21400613 21033790 20703232 20416308 20114825 19732359 19369648 19035590
4101A9035590k73270k90286k52908k09252j61161o4287n2223n648j09671l32447
4091A7284437m28203n64999n31398m93930m70790l51503k93504l64732l58430
4082A3426948k26304j80350k50773k72602k40898k19462j90498j93415k15224
4073A1437422j59358n9686q4986r3965j19248j69072j05558n6948j04373n2093
4063A0432135p1404n8767p8595l0158l1646L5040n3216K246J960n8785j6042k239
4051A0070529O0621J4567N9678J15836K148M2778M8829j3231L09j27692r9849
4040A0174523j38632j16231j32834j43255j29775j01635j34228r4609p0774o7835
4030I044715l6688j06344l3458k9119q5673n2024p0217m9830p0562k4858O0650
$$ plain form
4101 19035590 18762320 18472034 18219126 18009874 17848713 17784426 17732203 17726555 17616884 17284437
4091 17284437 16856234 16291235 15759837 15265907 14795117 14443614 14150110 13785378 13426948
4082 13426948 13200644 13020294 12769521 12496919 12256021 12036559 11846061 11652646 11437422
4073 11437422 11278064 11218378 11133392 11039427 10920179 10751107 10645549 10588601 10484228 10432135
4063 10432135 10360731 10301964 10223369 10193211 10161565 10196605 10143389 10145635 10147595 10088810 10072768 10070529
4051 10070529 10131150 10145717 10205395 10321231 10323379 10366157 10414986 10401755 10402064 10274372 10174523
4040 10174523 10035891 9919660 9786826 9643571 9513796 9412161 9277933 9183324 9112550 9044715
4030 9044715 9008027 8901683 8868225 8839106 8753433 8701409 8631192 8581362 8510800 8485942 8546592
4019H546592j5623m4375J3967O3379N0053L956m1198O7347m165k9204O1066N5718
4007H727513L0338O4105M9282Q1782J04781J25420N4309R2855L3860K8681J27621
3996I520547J18030J44475P2548J22720J60096J57519J83768J49162J97146J09755
3986A0935766J85493K88458J84947K46119K54001K27955K65112K56841K86080
3977A3130772K56988J96261K67874K34354K83916K74456K61595K66140K68304
3968A5440660K59425L02513L22774K88223K52472L26541L90814K61919K87652
3959A8132993L06898L59328L62583L93536L58525L35284L38798L12438M22091
3950B1322474L97469M13664M50322M53616M73876M95565M36751M34761N06296
$$ plain form
4019 8546592 8530969 8486594 8500561 8563940 8613993 8617949 8576751 8644098 8639933 8610729 8671795 8727513
4007 8727513 8757851 8821956 8871238 8953020 9057801 9183221 9237530 9330385 9364245 9392926 9520547
3996 9520547 9638577 9783052 9855600 9978320 10138416 10295935 10479703 10628865 10826011 10935766
3986 10935766 11121259 11409717 11594664 11840783 12094784 12322739 12587851 12844692 13130772
3977 13130772 13387760 13584021 13851895 14086249 14370165 14644621 14906216 15172356 15440660
3968 15440660 15700085 16002598 16325372 16613595 16866067 17192608 17583422 17845341 18132993
3959 18132993 18439891 18799219 19161802 19555338 19913863 20249147 20587945 20900383 21322474
3950 21322474 21719943 22133607 22583929 23037545 23511421 24006986 24443737 24878498 25384794
3941B5384794N03646N48667O28621N21411N68720N37479N32532O77341P18657
3932C0621868O78989Q18627Q04517Q60819R01491R53766J027021J024945J214392
3923C8906435J211463J316332J405604J552412J601859J626793J829420J833160
3915E1283478J922241K035950K203465K329618K419546K606955K693021K815086
3907G0309360K892967K991524L127614L240250L293531L303852L422420L572143
3899I6153661L598621L586747L706082L702866L661789L649633L556330L426228
3891A25041957L321814L107696K994066K757705K459807K350037K147511K024146
3883A46204739J750599J589409J356981J112273Q09985M37474Q854m03979p85147
$$ plain form
3941 25384794 25888440 26437107 27065728 27587139 28155859 28693338 29225870 29903211 30621868
3932 30621868 31300857 32119484 32924001 33784820 34686311 35640077 36667098 37692043 38906435
3923 38906435 40117898 41434230 42839834 44392246 45994105 47620898 49450318 51283478
3915 51283478 53205719 55241669 57445134 59774752 62194298 64801253 67494274 70309360
3907 70309360 73202327 76193851 79321465 82561715 85855246 89159098 92581518 96153661
3899 96153661 99752282 103339029 107045111 110747977 114409766 118059399 121615729 125041957
3891 125041957 128363771 131471467 134465533 137223238 139683045 142033082 144180593 146204739
3883 146204739 147955338 149544747 150901728 152014001 152823986 153261460 153270314 152866335 152081188
3874A52081188j173874j410560j662181j931004k129220k307736k428879k644199
3866A36393535k816283k971923l164446l370657l593056l783665l804846l915513
3858A08973146l951581l976500l808032l820238l833209l750415l740404l722620
3850G8370147l568801l472345l383236l346377l219064k988768k913250k806672
3842E2671634k671078k501446k317670k198966k132344j883219j779013j737656
3834C5450242j658347j520658j414399j241022j248745j123901j089161j041598
3826B5112411r91080q85972q58484p64898p26005p23282o56971o44835n19142
3817A8341742n22940n38730n15269m93305l88063l68519l93041l17398m21607
$$ plain form
3874 152081188 150907314 149496754 147834573 145903569 143774349 141466613 139037734 136393535
3866 136393535 133577252 130605329 127440883 124070226 120477170 116693505 112888659 108973146
3858 108973146 105021565 101045065 97237033 93416795 89583586 85833171 82092767 78370147
3850 78370147 74801346 71329001 67945765 64599388 61380324 58391556 55478306 52671634
3842 52671634 50000556 47499110 45181440 42982474 40850130 38966911 37187898 35450242
3834 35450242 33791895 32271237 30856838 29615816 28367071 27243170 26154009 25112411
3826 25112411 24121331 23235359 22376875 21611977 20885972 20162690 19505719 18860884 18341742
3817 18341742 17818802 17280072 16764803 16271498 15883435 15514916 15121875 14804477 14382870
3808A4382870l69349l16098l02441k96493l31399k79772k42465k53186k39129
3799A1752538j75896k11120k51579k63095j79939j68858j68183j24462j30645
3790A0078761j18017k00815p3776q8670j20966o9089j58162j86839j26602r4578
3780H841247q7342l4055o2720j08097p6516m4609m6685n0241m5611q4918p0651
3769H129802o7205r2088R732o9440j40686p3011j283n1051J5269j5600j8928o9740
3757G555771q5815n6294N9977l1746k3665m5814r9982n6757j1390j2882L4099
3746G225502n3643p6304M4516L2556j9752l1218k0036P4971N6924m97k4227l1543
3734G177249n2226K2262K7272O2164n1756k7001m978k8375O8499j2672j2252P8189
$$ plain form
3808 14382870 14013521 13697423 13394982 13098489 12767090 12487318 12244853 11991667 11752538
3799 11752538 11576642 11365522 11113943 10850848 10670909 10502051 10333868 10209406 10078761
3790 10078761 9960744 9759929 9686153 9597483 9476517 9407428 9249266 9062427 8935825 8841247
3780 8841247 8753905 8719850 8657130 8549033 8472517 8427908 8381223 8330982 8285371 8200453 8129802
3769 8129802 8062597 7970509 7980241 7910801 7770115 7697104 7695821 7644770 7660039 7644439 7625511 7555771
3757 7555771 7469956 7413662 7473639 7441893 7418228 7372414 7272432 7215675 7204285 7191403 7225502
3746 7225502 7171859 7095555 7140071 7172627 7152875 7121657 7101621 7176592 7233516 7233019 7208792 7177249
3734 7177249 7125023 7147285 7174557 7236721 7184965 7157964 7152986 7124611 7193110 7180438 7168186 7246375
3722G246375N3077n501N9821l4320L7833O0294L0369M8526J3088P2943P7964N8128
3710G718597J06176j8625Q9205P7946R5489J9989M5046K5431L8634M8312J05239
3699H351439J22021J04728K3751J49243N0241O2688R4617L7954J28937N6891J9102
3688I201612P8191J16925Q9099Q1342J05839Q2816R7729J30671Q1128R9135J05099
3677A0269586R7754J09907R8034R8158J32722J66224J50326J60196O5514J05071
3667A1453492J01852J38657J32896J52446J36486J89202J47023J09020K26620
3658A2787694K12397J90153J22496J42136J90539K00768K61596J90766K37558
3649A4536103K50779K15085K84521J84736K69443K45616K71764K46306K52027
$$ plain form
3722 7246375 7299452 7293951 7353772 7319452 7357285 7417579 7447948 7496474 7509562 7582505 7660469 7718597
3710 7718597 7824773 7806148 7895353 7973299 8068788 8088777 8133823 8159254 8197888 8246200 8351439
3699 8351439 8473460 8578188 8601939 8751182 8801423 8864111 8958728 8996682 9125619 9182510 9201612
3688 9201612 9279803 9396728 9485827 9567169 9673008 9755824 9853553 9984224 10065352 10164487 10269586
3677 10269586 10367340 10477247 10575281 10673439 10806161 10972385 11122711 11282907 11348421 11453492
3667 11453492 11555344 11694001 11826897 11979343 12115829 12305031 12452054 12561074 12787694
3658 12787694 13000091 13190244 13312740 13454876 13645415 13846183 14107779 14298545 14536103
3649 14536103 14786882 15001967 15286488 15471224 15740667 15986283 16258047 16504353 16756380
3640A6756380K74370L89521K93970L29746L38432L39733L52705L91385M67656
3631A9933898L48756L72254N31477N27877N06212N47707N36535N03585N12655
3622B4320956O21704O23005P49666O36602O17212P46252P84969P67486Q10880
3613C0678732Q23797R33922Q91668R06424J184807J155373J152102J192135J330895
3604D0249855J432762J528159J538741J654789J719106J688067J754812J827820
3596E3394111J767661J700298J779132J714153J656748J542452J476240J389305
3588F6420100J426126J418873J373400J226490J181841J050532Q42235Q20062
3580G5759659N81165M48984K16435N9010l9226p7741k02250k18608j97768j92328
$$ plain form
3640 16756380 17030750 17420271 17714241 18043987 18382419 18722152 19074857 19466242 19933898
3631 19933898 20282654 20654908 21186385 21714262 22220474 22768181 23304716 23808301 24320956
3622 24320956 24942660 25565665 26315331 26951933 27569145 28315397 29100366 29867852 30678732
3613 30678732 31502529 32436451 33328119 34234543 35419350 36574723 37726825 38918960 40249855
3604 40249855 41682617 43210776 44749517 46404306 48123412 49811479 51566291 53394111
3596 53394111 55161772 56862070 58641202 60355355 62012103 63554555 65030795 66420100
3588 66420100 67846226 69265099 70638499 71864989 73046830 74097362 74939597 75759659
3580 75759659 76340824 76789808 77006243 77065253 77026027 76948286 76746036 76527428 76329660 76137332
3570G6137332j40422j21507j60671j04672L46o4106J1338J74573K12603L78726
3560G6323540M94107O65524Q93106J123563J271145J542718J784326K048104K297076
3551H8443209K616023K860473L148270L405048L705417M003605M228272M443806
3543A16854123M619249M785193M787093M738657M678570M548434M434794M235826
3535A53681939L930914L875342L598100L343013L232268K951239K655857K242314
3527A79510986J851465J263599O59356J08908l77981r42465j517074j875880k165407
3518A76515507k449933k516683k613535k664764k688912k618273k616826k638960
3510A55707621k470901k350148k104012j991532j705014j322310r64598n74154
$$ plain form
3570 76137332 75996910 75875403 75714732 75610060 75610406 75546300 75557638 75732211 75944814 76323540
3560 76323540 76817647 77483171 78376277 79499840 80770985 82313703 84098029 86146133 88443209
3551 88443209 91059232 93919705 97067975 100473023 104178440 108182045 112410317 116854123
3543 116854123 121473372 126258565 131045658 135784315 140462885 145011319 149446113 153681939
3535 153681939 157612853 161488195 165086295 168429308 171661576 174612815 177268672 179510986
3527 179510986 181362451 182626050 183285406 183394314 183016333 182073868 180556794 178680914 176515507
3518 176515507 174065574 171548891 168935356 166270592 163581680 160963407 158346581 155707621
3510 155707621 153236720 150886572 148782560 146791028 145086014 143763704 142799106 142224952
3502A42224952j06961J96011O65929R86493J299589J493965J776224J915012J963785
3493A52414999K039447K006186J969333J900255J906048J927747J855696J745362
3485A67765073J515653J359666J074385P11590K71703j64073p55299j245248j803483
3476A68729967k275180k650993l099350l452506l709607l847420m027247m123109
3468A41544555m132316m184958m259004m153410m210186m258258m275481m333069
3460A07737873m232479m161240m012626l788402l575515l175585k886689k586941
3452G9318396k228660j862336j463688j136890p94541m94744k10945n575K21270
3443G1342287L95226N60427O04912O38875O50682N73522M90615M38608M18341
$$ plain form
3502 142224952 142117991 142314002 142979931 143966424 145266013 146759978 148536202 150451214 152414999
3493 152414999 154454446 156460632 158429965 160330220 162236268 164164015 166019711 167765073
3485 167765073 169280726 170640392 171714777 172426367 172698070 172533997 171778698 170533450 168729967
3476 168729967 166454787 163803794 160704444 157251938 153542331 149694911 145667664 141544555
3468 141544555 137412239 133227281 128968277 124814867 120604681 116346423 112070942 107737873
3460 107737873 103505394 99344154 95331528 91543126 87967611 84792026 81905337 79318396
3452 79318396 77089736 75227400 73763712 72626822 71832281 71337537 71126592 71121017 71342287
3443 71342287 71737513 72297940 72902852 73541727 74192409 74765931 75256546 75695154 76113495
3434G6113495M23030M99212N23081M32026M72913N01964M29391K84885Q9681o8683
3424G9700995k36922m53468p11671q92660j050539j217899j321493j437263j357280
3415G1021800j266662j346457j251228j246653j188203j139114j174705j181638
3407F1227140j108656j122918j113674r77278r64620q98268o98818n93557n32709
3398E3216642m45977k76655j01442k3889p3681K7329R3922K43575K63903K48354
3388E3172081L44174L31342L37565M45456N43129N50506N06656P07406P37661
3379E7675976P60631P45589P45623Q71424Q71892J029614J054257J095184J133889
3370F5984079J154229J299408J355099J470484J611010J757721J773407J992018
$$ plain form
3434 76113495 76536525 77035737 77558818 77990844 78463757 78965721 79395112 79679997 79769678 79700995
3424 79700995 79464073 79010605 78298934 77406274 76355735 75137836 73816343 72379080 71021800
3415 71021800 69755138 68408681 67157453 65910800 64722597 63583483 62408778 61227140
3407 61227140 60118484 58995566 57881892 56904614 55939994 55041726 54342908 53749351 53216642
3398 53216642 52770665 52494010 52392568 52368679 52294998 52322327 52416249 52659824 52923727 53172081
3388 53172081 53516255 53847597 54185162 54630618 55173747 55724253 56230909 56938315 57675976
3379 57675976 58436607 59182196 59927819 60799243 61671135 62700749 63755006 64850190 65984079
3370 65984079 67138308 68437716 69792815 71263299 72874309 74632030 76405437 78397455
3362G8397455K166188K217862K567239K832864L004627L282145L651012M027770
3354A02147162M418057M828316N328089N908478O558544P285661Q018746Q726085
3346A53219138R649467J0602528J1418322J2485659J3468174J4401528J5143657
3339B40388473J5657238J5950528J5839334J5196101J4180699J2759800J0986507
3332C40958680R016713O908837M991586L095800J478936J22244r73051j851958
3324C63747787k726048l711924m827689o004311p378848q969627j0581309j2193215
3316C07354816j3698384j4921271j5732376j6090715j6216621j5906377j5276912
3309A99512160j4360609j3499003j2540593j1371767j0354163r358919q489395
$$ plain form
3362 78397455 80563643 82781505 85348744 88181608 91186235 94468380 98119392 102147162
3354 102147162 106565219 111393535 116721624 122630102 129188646 136474307 144493053 153219138
3346 153219138 162868605 173471133 184889455 197375114 210843288 225244816 240388473
3339 240388473 256045711 271996239 287835573 303031674 317212373 329972173 340958680
3332 340958680 349975393 356884230 361875816 364971616 366450552 366572796 365599745 363747787
3324 363747787 361021739 357309815 352482126 346477815 339098967 330129340 319548031 307354816
3316 307354816 293656432 278735161 263002785 246912070 230695449 214789072 199512160
3309 199512160 185151551 171652548 159111955 147740188 137386025 128027106 119537711
3302A19537711p685812o938067o285741n593526n093633m658365m210063l848301
3294G5224203l460195l142730k820728k574251k387642k134506j952468j852750
3286E4898933j662486j531899j351246j333941j169518j112885j005906r63660
3278D4767392r56261r12565q89327q37716q84985q45200p20429o79920p68336
3269C7272653o79731p74683p17504o23485o86008p00585o52646o14207o55171
3260C1168633o59074o25067n58615o55750o66634o24962o04510n82637o45155
3251B5546229n11699n48204n54059m52507n36473m17551m13895l64727l06822
3242B1440292k87076l27815l82174l22449k77659k93068k37207k66331k82190
$$ plain form
3302 119537711 111851899 104913832 98628091 93034565 87940932 83282567 79072504 75224203
3294 75224203 71764008 68621278 65800550 63226299 60838657 58704151 56751683 54898933
3286 54898933 53236447 51704548 50353302 49019361 47849843 46736958 45731052 44767392
3278 44767392 43811131 42898566 42009239 41171523 40286538 39441338 38720909 38040989 37272653
3269 37272653 36592922 35818239 35100735 34477250 33791242 33090657 32438011 31823804 31168633
3260 31168633 30509559 29884492 29325877 28670127 28003493 27378531 26774021 26191384 25546229
3251 25546229 25034530 24486326 23932267 23479760 22943287 22525736 22111841 21747114 21440292
3242 21440292 21153216 20825401 20443227 20120778 19843119 19550051 19312844 19046513 18764323
3233A8764323j96862j72496k53672j86481j71051k02523j23527k37909k27536
3224A6992266j71193k13043k32171k60140j78153j95495k17549l57456l03083
3215A4863983k29418k22351k49055k42340l18585k16555k64147l10710k94064
3206A2516758l30020k26760k56821j58993k57314k93223k80703j36637j93883
3197A0382404k00847j47456j92487j50604j53026j73531j63028j16564j02142
3188H982719q0568p4484j13492j17490j08941p8488j23061l6365k3112p4907o4717
3177H087094j9452l0909P4909O8012J02467J57024K21791L13406L23006J44339
3167I441687j28334l97141n62358m51602m05142l00483j72705p7433j27469j55853
$$ plain form
3233 18764323 18567461 18394965 18141293 17954812 17783761 17581238 17457711 17219802 16992266
3224 16992266 16821073 16608030 16375859 16115719 15937566 15742071 15524522 15167066 14863983
3215 14863983 14634565 14412214 14163159 13920819 13602234 13385679 13121532 12810822 12516758
3206 12516758 12186738 11959978 11703157 11544164 11286850 10993627 10712924 10576287 10382404
3197 10382404 10181557 10034101 9841614 9691010 9537984 9364453 9201425 9084861 8982719
3188 8982719 8902151 8827667 8714175 8596685 8487744 8409256 8286195 8249830 8226718 8151811 8087094
3177 8087094 8067642 8036733 8111642 8179654 8282121 8439145 8660936 8974342 9297348 9441687
3167 9441687 9313353 8916212 8353854 7902252 7497110 7196627 7023922 6946489 6819020 6663167
3157F663167p1429j8090k0888k5976N2765K8042K1647j9268N021J32997Q5447
3146F833435Q5510J20061J85367J47202J72555L22194M24055N72999O32756P33811
3136A0229945N51334l55358r37819r12225q02295o07246m18020k92281k87087
3127F168948j75031j32503j20324j38897r5636m5113p6276r8571j8230m6853K6404
3116E247918J2254J2269K0231Q9565J2717L1848J40754J02795J77537L00284L77897
3105F526069K76571J60708j90115m84527m29112l25385k59169j59003j87173j45533
3095D783331p4844l5915l7417o8297o6630J7233j8397l8118j2560P8897k8365
3084D498918q2244P218l4731k488l0985o6868m1128L6820j3551n2647l1090K9589
$$ plain form
3157 6663167 6591738 6573648 6552760 6526784 6579549 6607591 6629238 6609970 6614991 6747988 6833435
3146 6833435 6918945 7039006 7224373 7371575 7544130 7866324 8290379 8863378 9496134 10229945
3136 10229945 10781279 10425921 9488102 8575877 7773582 7166336 6748316 6456035 6168948
3127 6168948 5993917 5861414 5741090 5602193 5506557 5461444 5385168 5286597 5268367 5221514 5247918
3116 5247918 5260172 5272441 5292672 5382237 5394954 5426802 5567556 5670351 5847888 6148172 6526069
3105 6526069 6802640 6963348 6773233 6288706 5859594 5534209 5275040 5116037 4928864 4783331
3095 4783331 4708487 4672572 4635155 4566858 4500228 4517461 4499064 4460946 4448386 4527283 4498918
3084 4498918 4416674 4423892 4389161 4386673 4355688 4288820 4247692 4284512 4270961 4218314 4187224 4216813
3072D216813N4545m4079K3350j7928l378P7116l9874L262K0598N2569L3814J2932
3060D389740P7012L4686k918N6001O3000k7085J18403J00087M7425J5788N1825
3049D923964J7467L6655M7933L7716N8068l1186o2685K3287L1673Q8531L1361
3038E202784K4067q4135j5178J9371m8349o5316k7605L6633j02519j11869j34685
3027D693199j6438j13868j9681m3608j25376j14140j7148j1773j30671p4705k0149
3016D005642j01464l4407j5795m9064j9485p3443p5240o2043m0294l0541l9613
3005C464253m4952N1763O0166o721J4570n0608q3191o133o8264N0606N973K5693
2993C413155N188m3400j3173l8895n37J7578k5998l7332l0621L7620L9031j7180
$$ plain form
3072 4216813 4271358 4227279 4250629 4232701 4229323 4306439 4266565 4269827 4290425 4342994 4376808 4389740
3060 4389740 4466752 4501438 4498520 4554521 4617521 4590436 4708839 4808926 4856351 4872139 4923964
3049 4923964 4941431 4978086 5026019 5063735 5121803 5090617 5027932 5051219 5082892 5171423 5202784
3038 5202784 5226851 5142716 5127538 5146909 5098560 5033244 5005639 5042272 4939753 4827884 4693199
3027 4693199 4676761 4562893 4543212 4499604 4374228 4260088 4242940 4231167 4100496 4025791 4005642
3016 4005642 3904178 3869771 3853976 3804912 3785427 3711984 3636744 3574701 3534407 3503866 3464253
3005 3464253 3419301 3471064 3531230 3524509 3539079 3488471 3405280 3399147 3330883 3381489 3387462 3413155
2993 3413155 3418343 3374943 3361770 3322875 3322338 3339916 3313918 3276586 3245965 3283585 3322616 3305436
2981C305436M0685o7997m5648p8103Q44P7392l8686K587K1524j2445k6973K9800
2969C208416j1446k2453J5899l4088l4410P553J1077j2097j4487K8608j542o3284
2957C077746K2950L4822l7200K2821O2099L6959m4727m9012J8416N3027m6859
2946C151042k9275K7396k0108k870j9478n9102N3474K3923o2613j1912M29k6783
2934C024123k7017j9765K9936p930l2963M0920k0868L1549l6743j6295O5928l4821
2922B996054p723N1637Q874n76p3972K1152N4109j0302k7138K3793M2856J1669
2910C090433O656J7678n6150j1103p012j7404O26J8496P244J5083K5756m6117
2898C044186o759L2081k2232k7639n9565K952N3875K2722q7585o3444N8023L8186
$$ plain form
2981 3305436 3346121 3278124 3232476 3154373 3155217 3232609 3193923 3196510 3218034 3205589 3178616 3208416
2969 3208416 3196970 3174517 3190416 3156328 3121918 3129471 3140548 3128451 3113964 3142572 3141030 3077746
2957 3077746 3100696 3135518 3098318 3121139 3183238 3220197 3175470 3126458 3144874 3197901 3151042
2946 3151042 3121767 3149163 3129055 3126185 3106707 3047605 3101079 3125002 3062389 3050477 3050906 3024123
2934 3024123 2997106 2977341 3007277 2999347 2966384 3007304 2986436 3017985 2981242 2964947 3030875 2996054
2922 2996054 2988331 3039968 3048842 3048266 2974294 2995446 3049555 3039253 3012115 3035908 3078764 3090433
2910 3090433 3097089 3114767 3058617 3047514 3040502 3023098 3023724 3042220 3049464 3064547 3090303 3044186
2898 3044186 3037427 3069508 3047276 3019637 2960072 2963024 3016899 3039621 2952036 2888592 2946615 2984801
2886B984801L8486j9841j85L413L0238j4906j9834k2546L9495R48k5348L171l179
2873B994713M4122m334L263r1452N30k2093j4540L1288j813J0717n2981L4137
2861B931557L0126l0154N256Q6156l0293l5124J7622r712J3678l1546n3614j0509
2849B883443Q1422o963p0546m1071j6937L8538q337J2675m271j8567p317J0396
2837B852465j760m9009K4303k3098k7528j5370L6034J6603j8968O226j7489L7553
2825B819962r348m6563k0640m3651p310m3826k5711N0700M9665k9958o0766o73
2813B631881L6245M7219K2564k6414N4527k6723n1563k597J7108l4931J1782J4727
2801B693825n65P4821m5750k2708m0541J2372j7913L2035m171M686L1043m3944
$$ plain form
2886 2984801 3023287 3003446 3003261 3006674 3036912 3022006 3002172 2979626 3019121 3020069 2994721 2997892 2994713
2873 2994713 3038835 3034501 3037764 2946312 2946842 2924749 2910209 2941497 2939684 2950401 2897420 2931557
2861 2931557 2961683 2931529 2936785 3022941 2992648 2957524 2975146 2965434 2979112 2947566 2893952 2883443
2849 2883443 2964865 2957902 2887356 2846285 2829348 2867886 2859549 2872224 2867953 2849386 2842069 2852465
2837 2852465 2850705 2801696 2825999 2802901 2775373 2760003 2796037 2812640 2793672 2799898 2782409 2819962
2825 2819962 2810614 2764051 2743411 2699760 2692450 2648624 2622913 2673613 2723278 2693320 2632554 2631881
2813 2631881 2668126 2715345 2737909 2711495 2766022 2739299 2687736 2685139 2702247 2667316 2679098 2693825
2801 2693825 2693260 2768081 2722331 2699623 2659082 2671454 2653541 2685576 2681405 2686091 2717134 2673190
2789B673190p3090L8289j9022l0755P5911M2363n1268r5976o7016J277K0718O1445
2777B576066j45147J1791J0380R602L3053l6419j8114k4365J6525L995k48l8540
2765B398579J653m7410n7190k9191o295L2110J4281j5222j2561K4357j0381n2860
2753B239870j3472j889k0183P756N5157n0383m6236M3548m0714K8970l9509n2787
2741B110128O8966m5718J3901k2507l0660K0581K129K73j8016j5550L4959J5121
2729B133607p8187q2197O6233p89n5989l2598N4373j5857J8601j9985k3155k0806
2717A943251Q5345L2452m2159o2455O2711J172r3553J9606M5249l9203q9435J8171
2705A881152K0561m938N6133O576m5764j0075J8730L4972j01787N2696J5433N0061
$$ plain form
2789 2673190 2600100 2638389 2619367 2588612 2664523 2706886 2655618 2559642 2492626 2493903 2514621 2576066
2777 2576066 2430919 2442710 2453090 2462692 2495745 2459326 2441212 2416847 2433372 2437367 2437119 2398579
2765 2398579 2400232 2352822 2295632 2266441 2260146 2292256 2306537 2291315 2278754 2303111 2292730 2239870
2753 2239870 2226398 2224509 2204326 2212082 2267239 2216856 2170620 2214168 2173454 2202424 2162915 2110128
2741 2110128 2179094 2133376 2147277 2124770 2094110 2114691 2116820 2117093 2099077 2083527 2118486 2133607
2729 2133607 2055420 1973223 2039456 2038667 1982678 1950080 2004453 1988596 2007197 1987212 1964057 1943251
2717 1943251 2028596 2061048 2018889 1956434 2019145 2020317 1926764 1946370 1991619 1952416 1862981 1881152
2705 1881152 1901713 1896775 1952908 1959484 1913720 1903645 1922375 1957347 1855560 1908256 1923689 1973750
2693A973750J5978j02758n3179J8994L1412l3863n1539K9813K3886n454n96m376
2681A842068K1210k5485J4471L3090j3606k2272m0372K5241k3632L2430l5539
2670A807604q9462J4830j0417q713p874q054L8423j5447l697K7085l3170l211
2658A707897n3033N741o205L4278K535l5865q8593L5002M3610K5113m3155P277
2646A634602n467l8129L0801l0418N16l0188p981p0365Q4662J3500k6124r111
2634A546298p5554M5883k298l703K9575m266q9697k2075O2548j0147m5110m5061
2622A386393L7611K3618o7452j2628O2005J0064L896n2118n114N1755l2660j8403
2610A386967p0238L2690L9259p3197K8175L0617o690Q637K4975j2417k0430n411
$$ plain form
2693 1973750 1989728 1886970 1833791 1852785 1884197 1850334 1798795 1828608 1852494 1847040 1846444 1842068
2681 1842068 1863278 1837793 1852264 1885354 1871748 1849476 1809104 1834345 1810713 1843143 1807604
2670 1807604 1718142 1732972 1722555 1713842 1705968 1697914 1736337 1720890 1717193 1744278 1711108 1707897
2658 1707897 1654864 1660605 1654400 1688678 1691213 1655348 1566755 1601757 1645367 1670480 1627325 1634602
2646 1634602 1629135 1591006 1621807 1591389 1591905 1561717 1553736 1483371 1568033 1581533 1555409 1546298
2634 1546298 1470744 1516627 1514329 1510626 1540201 1535935 1446238 1424163 1486711 1476564 1431454 1386393
2622 1386393 1424004 1447622 1380170 1367542 1429547 1439611 1443507 1391389 1386275 1438030 1405370 1386967
2610 1386967 1316729 1349419 1388678 1315481 1343656 1374273 1367583 1376220 1401195 1388778 1368348 1362937
2598A362937j6918J955n567L4376m9969l3726M4588k8394j6850k2349L1179k6511
2586A274751K7258K2620j3585n8116j531r81o1071l3118k551k084M1043L2325
2574A224960J8316o9142N695J3048n0285K0159N062n9962l1172L9597q4923J5042
2562A046395O6782K9083K180M1098l3319o2561k8753J2616J6812q966J6747j4436
2550A083678l9932l0438N3506K231j3115P792l8935L7848L8628l131q8571q3024
2538I26537O1722L4921k2144j9647K1991K5123p9051K5554O545l0621M0942n2717
2526I39155K8714k0594Q69k4721m6902M9305N7606l9429J3784o3718j2684p634
2514H73751j0325N3387L9446p850o1802j2889m493M8275k6008L1119m3507L5674
$$ plain form
2598 1362937 1346019 1347974 1342407 1376783 1326814 1293088 1337676 1309282 1292432 1270083 1301262 1274751
2586 1274751 1302009 1324629 1311044 1252928 1251397 1250416 1189345 1156227 1153676 1151592 1192635 1224960
2574 1224960 1243276 1174134 1179829 1192877 1142592 1162751 1167813 1107851 1076679 1116276 1031353 1046395
2562 1046395 1113177 1142260 1144440 1185538 1152219 1089658 1060905 1073521 1090333 1081367 1098114 1083678
2550 1083678 1043746 1013308 1066814 1069045 1055930 1063722 1024787 1062635 1101263 1098132 1009561 926537
2538 926537 988259 1023180 1001036 981389 1003380 1028503 949452 975006 981551 950930 991872 939155
2526 939155 967869 947275 948144 923423 876521 925826 983432 944003 957787 894069 881385 873751
2514 873751 863426 916813 956259 948409 886607 873718 869225 917500 891492 922611 879104 914778
2502I14778N2657M4895k6356J0689n1463N314Q5761q1219m3506M933L0617K461
2490I49561K3488l4875p567O526m0809J4016o4425j1365O028L1780J2511k6487
2478H58382L38K2190M29k3464q2256m0102L5878J7206q815l1541N3297P991l6336
2465G73197j4382K3930K5364q9538j479K2162m9518P1256M0003p9396J1662l3465
2453F99796o5884P7551N2340m8352l6409K234k2237J7001n250K1492n6600k4833
2441F10849K0473K2803L4450j5582R633l1779P093l959l5740K7823J0553n342
2429F51275m6008M6776M613j8272j9868L5627k3998m134r787J463q639R252m2821
2416E75479J966M3687k7853m2331j6129n747J1081L7778p4687N2536k7223J8780
$$ plain form
2502 914778 967435 1012330 985974 996663 945200 950514 1036275 955056 911550 916483 947100 949561
2490 949561 973049 938174 930607 937133 896324 910340 845915 834550 840578 872358 884869 858382
2478 858382 858720 880910 881339 857875 775619 735517 771395 788601 779786 748245 801542 809533 773197
2465 773197 758815 782745 808109 718571 717092 739254 689736 760992 800995 721599 733261 699796
2453 699796 633912 711463 763803 715451 679042 681276 659039 676040 670790 692282 635682 610849
2441 610849 631322 654125 688575 672993 682626 650847 657940 653981 618241 646064 656617 651275
2429 651275 605267 652043 656656 638384 618516 654143 630145 626011 616224 617687 609048 618300 575479
2416 575479 577445 621132 593279 550948 534819 529072 540153 577931 503244 555780 528557 547337
2404E47337M3480J1286m5344O477N2039L4797n2600k6262l2251M3969J5268J6456
2392F14652J4754k2744m5650n8056j2923N5623L7626k1615l1843K0888L1803m6255
2380E36260J47o306L7076j6246n6170N9497m0723q1352O7322N3822l9736L1889
2368E45480l6742J7667K7904m0324m8942j0823Q0771n966N145j1647M1156j1529
2356E52150l0554n7141j420M2585j6308K6126L8097k4763L3467k7861k7416L1
2344E06993k6562m0890K9417m9055L6122l3938J3780K2648L1097l3776k8783J5495
2332D42548p1469J6891M1233j6090k3104j52J9443L7805j0500j585k0794K7048
2320D41274k2277o2574l729R657J0210M5089j6944j0918l5250o658K4195j6311
$$ plain form
2404 547337 590817 602103 556759 563236 615275 650072 597472 571210 538959 582928 598196 614652
2392 614652 629406 606662 561012 502956 490033 545656 583282 561667 529824 550712 582515 536260
2380 536260 536407 530101 567177 550931 494761 554258 513535 432183 499505 553327 513591 545480
2368 545480 508738 526405 554309 513985 465043 454220 534991 529025 534170 522523 563679 552150
2356 552150 521596 464455 463035 505620 489312 515438 553535 528772 562239 534378 506962 506993
2344 506993 480431 439541 468958 419903 456025 422087 435867 458515 489612 455836 427053 442548
2332 442548 371079 387970 429203 413113 390009 389857 409300 447105 436605 435020 414226 441274
2320 441274 418997 356423 352694 362351 372561 417650 400706 389788 354538 347880 372075 355764
2308C55764m1549J8782N2266m5183m498p731l7299N4816K3991n8462R635K7589
2296C48121l0486L6813l5910Q2756m7027J4920K2324K6915n3423j4529k142j2666
2284C35666K6991J7770J1834j72l1550k8441J9829J7192l183K2688o0671q5292
2272B42661j902J09323J11722o1904J423j09462l310Q5562M3072p5207K1522O9575
2260D33075p0190o3270Q115K3972J9482n3495K2078l0455J8985K6820j9517N5844
2248C71444j7215r390j8811k7008L2114O540K699r275l3012J7256J0108j7883
2236C07567l6862J9152K2876n5502O546m3187K7751O0212K5804l0403M4231K9938
2224C78123J8839r8157j23731J1080N067Q5566Q1726o556p9699K0003L2062J4933
$$ plain form
2308 355764 314215 332997 385263 340080 335582 327851 290552 345368 369359 310897 320532 348121
2296 348121 317635 354448 318538 401294 354267 369187 391511 418426 365003 350474 348332 335666
2284 335666 362657 380427 392261 392089 360539 332098 351927 369119 365936 388624 327953 242661
2272 242661 240759 350082 461804 399900 401323 291861 288551 374113 417185 341978 363500 433075
2260 433075 362885 299615 307730 331702 351184 297689 319767 289312 308297 335117 315600 371444
2248 371444 354229 344839 326028 299020 331134 337674 340373 331098 298086 315342 325450 307567
2236 307567 270705 289857 312733 257231 263777 220590 248341 308553 334357 303954 348185 378123
2224 378123 396962 298805 175074 186154 191221 276787 358513 351957 272258 292261 324323 339256
2212C39256K2776J154k4405m4596N8978j9428J3481m1747J3935j5296N206m9695
2200B59619R0848K414j8435K0833k0218M425l2587Q189o9614O9992J26934m102
2188D38298j19541M4294j6471k1208M4460m5648k5065J13985o748j9208K2K1555
2176D08725K964k5731m3023L3604J4235K5038M638J2500q7846L1225j252L1689
2164D06766L5201M1606K5160k8756q754j8191m256K6290n1385R1499J5785l3737
2152D97228o50P0481Q777l4265P5034K2101k795l894j9862n623J4695P180l7794
2139E90613J3919k9453j1984R0058O771Q5141J810J7016Q7051L7412J5624R199
2127I13177l5856N2391J551M2130J6853M9089P3868O7112q901L8711M606R7647
$$ plain form
2212 339256 362032 363186 338781 294185 353163 333735 347216 305469 319404 304108 309314 259619
2200 259619 350467 352881 334446 355279 335061 339486 306899 315088 245474 315466 442400 438298
2188 438298 318757 363051 346580 325372 369832 324184 299119 413104 406356 387148 387170 408725
2176 408725 411689 385958 342935 376539 390774 415812 420450 432950 345104 376329 375077 406766
2164 406766 441967 483573 508733 479977 471223 453032 448776 475066 423681 515180 530965 497228
2152 497228 496578 567059 575836 541571 616605 638706 635911 632017 612155 606532 621227 628407 590613
2139 590613 604532 575079 563095 653153 659924 745065 746875 763891 850942 888354 903978 913177
2127 913177 877321 929712 931263 973393 990246 1039335 1113203 1180315 1171414 1210125 1214731 1312378
2115A312378J1144L2148N7161l7439R0959O3697M6142O4490N7201N8781J43548
2104A900210N0552J86739J95408K14131K49727L17988J69170J24568K34222K66800
2094C909515L93850L44000N53039O55450R00386J186817J457437J983277K813408
2085A4197179M098351L265827p45250m043704m387286l002971j937558j402793
2077F041795r59165q21478o14385m39388l13252k03495j88021m2624n1418j90130
2067B218439k02823j01503j75750j20233p8317r0711j02420m8729n0861j18979
2057A128113j17756m0465p7238n2748o2298j0400r360q336n6694o6396j973n8156
2045E66293o364q881o299m231p4780L410o0905L3275K4642r019l7244J0564R337
$$ plain form
2115 1312378 1323522 1355670 1412831 1375392 1466351 1530048 1576190 1640680 1697881 1756662 1900210
2104 1900210 1950762 2137501 2332909 2547040 2796767 3114755 3283925 3408493 3642715 3909515
2094 3909515 4303365 4647365 5200404 5855854 6756240 7943057 9400494 11383771 14197179
2085 14197179 18295530 21561357 20816107 16772403 12385117 9382146 7444588 6041795
2077 6041795 5082630 4261152 3646767 3207379 2894127 2690632 2502611 2459987 2408569 2218439
2067 2218439 2015616 1914113 1738363 1618130 1539813 1449102 1346682 1297953 1247092 1128113
2057 1128113 1010357 969892 892654 839906 777608 767208 757848 749512 692818 626422 624449 566293
2045 566293 559929 551048 544749 540518 465738 469148 408243 441518 466160 457141 419897 430461 439798
2032D39798m3886L5414k2066o6919l6807K1881M6795k1357j1704o6046k5556J5342
2020B64889L7804j8656o868J013q9267J17732M1907n6137j02978J2430n153q575
2008A88141r517J4861j2629L3129o4128m4338k0580k0107J2990K9011N0523J9599
1996A76955k3159l4830M148R155l9978k6709m7557N1016L433l2299L7500p877
1984F9798J4844j0524J4393J5097K0123k2998l5125k8713j349J7875j8204k1098
1972A4119J2995M4057L2207k0001J333K2148k4191N314k1997n1102l8550j071
1960b4739L6275Q3931q0558j4682k1692j6178m2883J4987j8896l8501N1959L1883
1948c9094j7445L4262L2799o693K076o4207L1526J8889J7715L5504J2339o031
$$ plain form
2032 439798 395912 431326 409260 342341 305534 327415 374210 352853 341149 275103 249547 264889
2020 264889 302693 284037 277169 278182 188915 306647 348554 292417 189439 201869 196716 188141
2008 188141 178624 193485 180856 213985 149857 105519 84939 64832 77822 106833 157356 176955
1996 176955 153796 118966 123114 132269 92291 65582 18025 69041 72474 40175 77675 69798
1984 69798 84642 74118 88511 103608 123731 100733 65608 36895 35546 53421 35217 14119
1972 14119 27114 71171 103378 83377 84710 106858 82667 87981 65984 14882 -23668 -24739
1960 -24739 11536 95467 14909 227 -21465 -37643 -80526 -65539 -84435 -122936 -70977 -39094
1948 -39094 -56539 -22277 10522 3829 5905 -58302 -26776 -7887 9828 45332 57671 51640
1936E1640j9900N465k2448J0155J1086n8431j3509N2341l6193N4962M227K0686
1924F0081j3745q2514j1781n871K6892o0426J9510L3312L2886J0868k337l1304
1912b4429j0662L4300J2547r399k2605m7581K2909O764l489j6831k2420R470j7629
1899h9055P859J9353l8771p204K0713P5950k6708l9987Q1857Q451j07228J3239
1887h1531P0225m647M0760q1191j1794L4780j1841o5391M6138O8743j8956o3822
1875g8527K3193J3304J3297L1564j03448k0495O4918M6258l2964M6208O678L5560
1863D5546p2039n2014j0232Q5354l9947J3787j3976N171j3744J7016M2953j6738
1851h863K929M5041k0251n7001L9694J7116J0945J3843p0604l2594o1833J00771
$$ plain form
1936 51640 31740 37205 14757 24912 35998 -22433 -35942 16399 -19794 35168 39395 60081
1924 60081 46336 -36178 -47959 -53830 -26938 -87364 -67854 -34542 -1656 9212 6875 -24429
1912 -24429 -35091 -791 11756 2357 -20248 -67829 -44920 -38156 -41645 -58476 -80896 -71426 -89055
1899 -89055 -81196 -61843 -100614 -107818 -87105 -11155 -37863 -77850 4007 12458 -94770 -81531
1887 -81531 -11306 -15953 24807 -56384 -68178 -33398 -45239 -110630 -64492 4251 -14705 -78527
1875 -78527 -55334 -42030 -28733 2831 -100617 -121112 -56194 -9936 -42900 3308 9986 45546
1863 45546 -26493 -78507 -88739 -3385 -43332 -29545 -43521 -38350 -52094 -35078 7875 -8863
1851 -8863 -5934 39107 18856 -38145 1549 18665 29610 43453 -27151 -59745 -121578 -20807
1839b0807Q182n7214P9834j0220l4245K5545L4048J2974J362q5264q101J7305
1827c6601M09l6793M102O5748k5585n0225P9600k1530n3326N5697p9121m393Q9156
1814a2862J8658M8193l6987l5142K3441n949n236K7541m2203J1168j5173o7953
1802i2504n8915O4847j232o7655k297P6782k01l1936k1861L8790J2455l9820O3185
1789f0362m7452j6579M5679K4247L0930o5338p074k8118R046J7704K8506K1263
1777d7548L461l2694Q5207j92k8243j9535j6319k5880k8844J00430n1431k4963
1765h6551J0322J6411J9423l4912r168K8003m7988p079O3854l5643l6382L6166
1753h3544K5293j9230j666J0525R521Q1391O7776p3745L0552M866j45165l9191
$$ plain form
1839 -20807 -12625 -69839 9995 -225 -34470 -8925 25123 38097 39459 -45805 -53906 -36601
1827 -36601 -36192 -72985 -68883 -3135 -28720 -78945 655 -20875 -74201 -18504 -97625 -102018 -12862
1814 -12862 5796 53989 17002 -18140 5301 -648 -5884 21657 -20546 -9378 -24551 -92504
1802 -92504 -151419 -86572 -87804 -155459 -157756 -80974 -81175 -113111 -134972 -96182 -83727 -123547 -60362
1789 -60362 -107814 -124393 -78714 -54467 -23537 -88875 -95949 -124067 -115021 -97317 -68811 -47548
1777 -47548 -44087 -76781 8426 8234 -20009 -39544 -55863 -81743 -110587 -10157 -61588 -86551
1765 -86551 -76229 -59818 -40395 -75307 -84475 -56472 -104460 -111539 -47685 -83328 -119710 -83544
1753 -83544 -58251 -77481 -79147 -68622 -59101 22290 90066 16321 46873 51739 -93426 -132617
1741a32617K4915k6918M1780K968M97j7770l4042j1377K6461Q7841K7735n5574
1729f6101K8686p665k7404o9276K0735m3891M603O8598J0247k7584p306J5640
1717a00718O950M2421l7231j6088p524l0371P4293l7352M2110r885j4038J024
1705h6409m9076J7800o456P3888q3091O7604M9747P699j6144n6602K6641n158
1693e9557l7884R7444l9878k2439J016O1514n3786l9885L9621L2198j7701k4673
1681f4010P287o5066k9517J2833p150j7946M3404K9997K4895N3340l1911o1530
1669a05374k7416j4130M5327M4528k3315K495J6465J3225l5869l3819P5103K2793
1657a9987r795J8723k9158n5136Q954K2069m1361M6129Q3349n2678p3509o91L243
$$ plain form
1741 -132617 -107702 -134620 -92840 -89872 -89375 -107145 -141187 -152564 -126103 -38262 -10527 -66101
1729 -66101 -37415 -45080 -72484 -141760 -121025 -164916 -160313 -91715 -81468 -109052 -116358 -100718
1717 -100718 -93768 -51347 -88578 -104666 -112190 -142561 -68268 -105620 -63510 -73395 -87433 -86409
1705 -86409 -135485 -117685 -124141 -50253 -133344 -65740 -15993 -8294 -24438 -81040 -54399 -59557
1693 -59557 -97441 3 -39875 -62314 -61298 216 -53570 -93455 -53834 -21636 -39337 -64010
1681 -64010 -56723 -121789 -151306 -138473 -145623 -163569 -120165 -90168 -65273 -11933 -43844 -105374
1669 -105374 -132790 -146920 -101593 -57065 -80380 -77885 -61420 -48195 -84064 -117883 -42780 -19987
1657 -19987 -29782 -11059 -40217 -95353 -86399 -64330 -105691 -59562 23787 -28891 -102400 -103091 -99848
1644i9848Q5458J5992k4449j5437J8645l0904L7920J6345n9432K0372N7474m6131
1632b3995r1851O490L6061l7396J5172m530J949L9804j8166K342m0459l6969L4112
1619a17436m0917o126O5503J3372J6888l5774M355l4500j9944Q8882r279l9454
1607a14430J1506l7730j0705N5023M2263m288k0898O287k1901j7252Q5516J895
1595b4714O232l7519j7569J6825R564J2912k2525j9170l1184P2292m3272l5062
1583a13190N3278l7013k1362Q0766j1161o4900j0523J8915M3951m1708M6055P282
1571d9610J8274K861J5661m2634l266o714K6913K4309r0042j4792N3022L4439
1559c1579p1676m609P3639j3376j3766j6500M037p6963k7093N2153K7403J0604
$$ plain form
1644 -99848 -14390 1602 -22847 -38284 -19639 -50543 -12623 3722 -55710 -35338 22136 -23995
1632 -23995 -115846 -109356 -73295 -110691 -95519 -100049 -98100 -58296 -76462 -74120 -114579 -151548 -117436
1619 -117436 -158353 -164479 -98976 -85604 -68716 -104490 -100135 -134635 -154579 -65697 -74976 -114430
1607 -114430 -102924 -140654 -151359 -96336 -54073 -58361 -79259 -72972 -94873 -112125 -26609 -24714
1595 -24714 -18482 -56001 -73570 -56745 -47181 -34269 -56794 -75964 -107148 -34856 -78128 -113190
1583 -113190 -59912 -96925 -118287 -37521 -48682 -113582 -124105 -105190 -61239 -102947 -56892 -49610
1571 -49610 -31336 -28475 -12814 -55448 -58714 -65428 -38515 -14206 -104248 -119040 -66018 -31579
1559 -31579 -103255 -107864 -34225 -47601 -61367 -77867 -73830 -150793 -177886 -125733 -98330 -87726
1547h7726K4848L7595L5133k1060m0510m120J960j7655M0653J488k5579k7594
1535h2567K6921J1522l9150K8275k9358K1806Q3374l2429m1003m6781L5654j4281
1523g8017K8810L5336M7984n8405r4537q820P8451n0671L2539K4285l3063L965
1511g2143O783M3873m7215j2023P293O8393p3387K1908N5672N9704j34907o924
1499h2973Q0878j09397R854j5063m63O9387K5061J5828j3202P879K6403j3802
1487C90p8599L6962J0641r772j1542m3093R216J3478k7555O2356o5135N6427J022
1474d5204r3382M6826N7270p2130J3313O1744k8844J0718L7758k1914o2183j7880
1462a13908r871O5963J2026m4136j2455l622R1170R908m6279J9413K3290j7766
$$ plain form
1547 -87726 -62878 -25283 9850 -11210 -51720 -55840 -53880 -71535 -30882 -29394 -54973 -82567
1535 -82567 -55646 -44124 -83274 -54999 -84357 -62551 20823 -11606 -52609 -99390 -63736 -78017
1523 -78017 -49207 -13871 34113 -24292 -118829 -127649 -49198 -99869 -67330 -43045 -76108 -72143
1511 -72143 -65360 -21487 -68702 -80725 -73432 -5039 -78426 -56518 -846 58858 -76049 -82973
1499 -82973 -2095 -111492 -101638 -116701 -117164 -47777 -22716 -6888 -20090 -12211 14192 390
1487 390 -78209 -41247 -30606 -40378 -51920 -95013 -85797 -72319 -99874 -37518 -102653 -46226 -45204
1474 -45204 -138586 -91760 -34490 -106620 -93307 -31563 -60407 -49689 -11931 -33845 -96028 -113908
1462 -113908 -123779 -57816 -45790 -89926 -102381 -106003 -14833 -4925 -51204 -31791 -8501 -26267
1450b6267o6560m6808J4736k1164J21660L2268p6872L0655J5238j1124m9280j4463
1438i7981o4329Q1943R217m5413k2695J9028M6866j4867R333L2394k6697m0413
1426a13614j4872J7019J5297N660O9465l8406n4888l1381M0940L6645K1547O233
1414d0355K8715m5086M55J5720j2678j7552k6161L5707L9479J7071r6333n22k854
1401a04394N6393N2105j6985q509n9348K4729L6642m3394j4865J0982R574o6863
1389a23933K8989N8896J4933r9307J2220N5698R8O409k1652j8165J6622L3424
1377c5768l7347m0077J7690K3313L3706l6665n7265O682L2761K5077k8503l0141
1365a26537J3330j942P7063M5931q1165M4866l7473p2123O3377K5989k1634K3952
$$ plain form
1450 -26267 -92827 -139635 -124899 -146063 -24403 7865 -69007 -38352 -23114 -34238 -83518 -97981
1438 -97981 -162310 -80367 -71150 -116563 -139258 -120230 -73364 -88231 -78898 -46504 -73201 -113614
1426 -113614 -128486 -111467 -96170 -90510 -21045 -59451 -114339 -145720 -104780 -68135 -46588 -40355
1414 -40355 -11640 -56726 -56271 -40551 -53229 -70781 -96942 -61235 -21756 -4685 -101018 -101540 -104394
1401 -104394 -48001 4104 -12881 -21390 -80738 -56009 -19367 -62761 -77626 -66644 -57070 -123933
1389 -123933 -94944 -36048 -21115 -120422 -108202 -52504 -52406 -45997 -67649 -85814 -69192 -35768
1377 -35768 -73115 -113192 -95502 -72189 -38483 -75148 -132413 -125731 -92970 -67893 -96396 -126537
1365 -126537 -113207 -115149 -38086 7845 -73320 -28454 -65927 -138050 -74673 -48684 -70318 -46366
1353d6366l828m3341P8477n5351l7414L3579L1325M206j910J980K1949K3977j8967
1340a1684l242l3422l2536k8903M997k9001m957M1524L9952J0434o7790K8297
1328h6331Q7189j24040J1728O7579P2997n8756j3210J3394N9865L0992r1235m553
1316c4381l8559j4119O969l536p506J5671K2239j3013j8716j5524J410O421j3295
1303a05939L3103N1915m7183M9981N5179J1410m3035j6030J7304o5521P7211J9930
1291C8325k0261n395K4332J3810r1391M2335j6956j8331K4017k1457M6525n7891
1279d2338o397m549K4932q6992Q04o6599N7444N2548p5571J5109O9346J7577J4529
1266c0157m7697k6998L6462n329k1601k5484O3848L2485P1277l8760l2428J5069
$$ plain form
1353 -46366 -50194 -93535 -15058 -70409 -107823 -74244 -42919 -38713 -40623 -38643 -16694 7283 -11684
1340 -11684 -14926 -48348 -80884 -109787 -104790 -133791 -138748 -97224 -57272 -46838 -114628 -86331
1328 -86331 858 -123182 -111454 -43875 29122 -29634 -42844 -29450 30415 61407 -29828 -34381
1316 -34381 -72940 -87059 -80090 -83626 -91132 -75461 -53222 -66235 -84951 -100475 -99065 -92644 -105939
1303 -105939 -72836 -20921 -68104 -18123 37056 48466 5431 -10599 6705 -58816 18395 38325
1291 38325 18064 12669 37001 50811 -40580 1755 -15201 -33532 -9515 -30972 15553 -42338
1279 -42338 -48735 -53284 -28352 -115344 -114540 -181139 -123695 -71147 -146718 -131609 -62263 -44686 -30157
1266 -30157 -77854 -104852 -68390 -73719 -95320 -120804 -56956 -24471 46806 8046 -24382 -9313
1254i313j2586k5152N8072k400r4193j4939M8847l4118m7297M9063O2302k6873
1242d8587n7138K4343O6510M058M6144n4316l8074K6175K8154o7301j1575k9984
1230a11591L5533N2376J4170K3350J9353m071o3292j0584j5380O4743M1971k626
1218D3952l2348p5393N737M0136p2912K1109L3006m2545l6147P324l0509O3666
1206g4924r346J9813J0673j7796k0132K4814R8393J1678n9970l9192j772Q1844
1194B4083M5888p5673n6045n0725M7160M0140n1166k8583Q0503k941J173k049
1182b8235J9383j0851K2795J145j6259l7518j114K0949m6293k5742Q0149j8641
1170d0232j6538l039n31J6042K3439k5334k6154J3748m5134n636K6053Q7646J3736
$$ plain form
1254 -9313 -21899 -47051 11021 8621 -85572 -100511 -51664 -85782 -133079 -84016 -21714 -48587
1242 -48587 -105725 -81382 -14872 -10814 35330 -18986 -57060 -30885 -2731 -70032 -81607 -111591
1230 -111591 -76058 -23682 -9512 13838 33191 29120 -34172 -44756 -60136 4607 46578 43952
1218 43952 11604 -63789 -58052 -17916 -90828 -69719 -36713 -79258 -115405 -108081 -138590 -74924
1206 -74924 -84270 -64457 -53784 -71580 -91712 -66898 31495 43173 -16797 -55989 -57761 24083
1194 24083 69971 -5702 -61747 -112472 -65312 -25172 -76338 -104921 -24418 -27359 -26186 -28235
1182 -28235 -8852 -19703 3092 4237 -12022 -49540 -50654 -29705 -75998 -101740 -21591 -40232
1170 -40232 -56770 -59809 -60340 -44298 -20859 -46193 -72347 -58599 -103733 -109369 -83316 4330 18066
1157A8066K0649m0868k5354l7226l2463L3493l739j4776K5222j3105K1680M1965
1145f456l4097m4633L6597m5050O2706J4542K419M2926j5636j8149l6193L4345
1133f679k7333p955O6039l6741j0029N2525l1434k3129K900L4884j5188q8263
1121i0403k8956N2855J3219O693K4187k5829M180M2038Q63j5643K8407l1214Q513
1108a1090j4535n3625M346K6309K0582l1458o9744j1079P7960K3095M1117n7367
1096e5489J3732k1975M7615K9031Q7925k1193j00057l8245J6180P4980r960o0249
1084c7705o4405Q0031K2044k3993n75l3482L9181K4708l9640J7868p1968m412
1072i2348L2012M3319L4086n4268o3635j9456O5225N3041j9247M8207n8218J5232
$$ plain form
1157 18066 38715 -2153 -27507 -64733 -97196 -63703 -67442 -82218 -56996 -70101 -48421 -6456
1145 -6456 -40553 -85186 -48589 -93639 -30933 -16391 -13972 28954 13318 -4831 -41024 -6679
1133 -6679 -34012 -41967 24072 -12669 -22698 29827 -1607 -24736 -21836 13048 -2140 -90403
1121 -90403 -119359 -66504 -53285 -46592 -22405 -48234 -44054 -2016 -1153 -16796 11611 -19603 -11090
1108 -11090 -25625 -79250 -74904 -48595 -28013 -59471 -129215 -140294 -62334 -39239 1878 -55489
1096 -55489 -41757 -63732 -16117 12914 100839 79646 -20411 -58656 -42476 32504 22544 -37705
1084 -37705 -102110 -22079 -35 -24028 -24603 -58085 -18904 5804 -33836 -15968 -87936 -92348
1072 -92348 -60336 -17017 17069 -37199 -100834 -120290 -55065 -2024 -21271 26936 -31282 -16050
1060a6050N7200r472K5720l0036J4740n818j971N643l7180l1255j4692L7546J01414
1047I5789l4588o6048o1287l0830M761J3513Q394M670L1912j15995L3880K5085
1035i0744j0176Q0314K187k3038J7156m954q409K9285L399o8976j4549M8790L4837
1022d878K1941k2301K2052k1612Q1K8827o1833J221o452K9536n201j835j8430
1009c8884j4685M0964L7277p9213M1458M2076m6267l6140k4146K6388p4109K4279
997a01002O6065k9368N127k9354L0909N2222K0791P896r075l710k87J3772k5011
984a025l2318m0421J3120K7690N6140n6860R070k8208K505M5997l9425K773L5529
971e433L8420P1240m6239j3159J7248p4291k5665R0526k8963l4433L5473J9308
$$ plain form
1060 -16050 41150 31678 57398 27362 42102 36284 34313 39956 2776 -28479 -43171 -5625 95789
1047 95789 61201 -4847 -66134 -96964 -92203 -78690 -70296 -65626 -33714 -149709 -115829 -90744
1035 -90744 -100920 -20606 -18419 -41457 -24301 -29255 -37664 -8379 -4980 -73956 -88505 -39715 -4878
1022 -4878 17063 -5238 16814 -4798 -4717 24110 -37723 -36502 -42954 -13418 -18619 -20454 -38884
1009 -38884 -53569 -12605 24672 -54541 -13083 28993 -17274 -53414 -77560 -51172 -125281 -101002
997 -101002 -34937 -64305 -59178 -88532 -57623 -5401 15390 23286 14211 10501 10214 23986 -1025
984 -1025 -33343 -73764 -60644 -32954 23186 -33674 -24604 -52812 -50307 -4310 -43735 -40962 -5433
971 -5433 32987 104227 57988 44829 62077 -12214 -37879 52647 23684 -10749 24724 44032
959D4032K8964j3884K842o9959n9141K7140N2114n5649L5226N5851l937O319l9521
946A0397m4517n5892J2903m4566N5303P8193o1361j9442J5509N1697k5871l1255
934e8902j2722N9208O6512m3273N3562q0684p1883k3079P3023K6886n1024N8559
922c817Q6294p6088K3870r386p4604m457j9304L5460K2540K1098L6370L9467n2454
909B4989r51J4577M556l3076n4878L0277L9425o4281O6898O093o9851L5230L2891
896C1899k619n5885j3287J23182R455J4328l5314j3379p0609l7182K4081J8441
884f889R1470J2592q4000J172l6590k6225O5240K7883m1491o8079k1025J1724
872g4218O4637L7608N8203r8642q92R019K0807J2305J5936m2946L624M1481n3049
$$ plain form
959 44032 72996 59112 61954 -8005 -67146 -40006 12108 -43541 -8315 47536 43599 49918 10397
946 10397 -34120 -90012 -77109 -121675 -66372 11821 -49540 -68982 -53473 -1776 -27647 -58902
934 -58902 -71624 -12416 54096 10823 64385 -16299 -88182 -111261 -38238 -11352 -62376 -3817
922 -3817 82477 6389 30259 20873 -53731 -58188 -77492 -42032 -19492 1606 37976 77443 24989
909 24989 24038 38615 43171 10095 -44783 -14506 24919 -39362 27536 33629 -36222 -992 31899
896 31899 29280 -26605 -39892 83290 92745 107073 71759 58380 -12229 -49411 -25330 -6889
884 -6889 84581 97173 13173 14345 -22245 -48470 16770 44653 3162 -64917 -85942 -74218
872 -74218 -9581 28027 86230 -12412 -13304 -4285 16522 28827 44763 1817 5441 46922 -6127
859f127m6092k2405K4353J3894M8082n2513m0263K6453M9175J673l1291L9699
847D638j8896L4174M8114p7472l2656P7650m9703n5919L1360O889j7601J9005
835c0417J4594j6251m1078K9924L6813Q12J0333J1032P0937m6942q1934l1226
823g3403q099L2969L0188k2609Q2505P136J986k9445J6566k5980j8648R614M7262
810E0042L896p8053m4356L3363l5186m707P5940M872O3745l9647K0800L5940q7045
797c96J3642k7515J3387K1256k9406J8617J5000j4422Q819M8013m5963l6317Q147
784g138L5726J8610m6026J1712K8264q1246K8863N0251J977P1246j10318k1283
772a9362P0053j4432J2837m7729m35K1963j4755K5543J6996N0686k1714k2702
$$ plain form
859 -6127 -52219 -74624 -50271 -36377 11705 -40808 -81071 -54618 -5443 -3770 -35061 4638
847 4638 -14258 19916 68030 -9442 -42098 35552 -14151 -70070 -38710 -31821 -49422 -30417
835 -30417 -15823 -32074 -73152 -43228 -6415 -5603 4730 15762 86699 39757 -42177 -73403
823 -73403 -81502 -48533 -18345 -40954 41551 48687 50673 21228 37794 11814 -6834 2780 50042
810 50042 53938 -24115 -68471 -35108 -70294 -75001 939 5811 69556 29909 50709 86649 -396
797 -396 13246 -14269 -882 20374 -9032 9585 24585 10163 18982 66995 21032 -15285 -7138
784 -7138 28588 47198 1172 12884 41148 -40098 -11235 39016 40993 112239 1921 -19362
772 -19362 50691 36259 49096 1367 932 22895 8140 33683 50679 101365 79651 56949
760E6949M0534p538j4312q730j6927m9025l5914O1681k4595k2458R552J9190N1475
747E9882P1l8054J6440L0467J7334L4656n5670O1133M28j8089P174j1439j10304
734e971m6113M383L2239K6149J3054K5038L1887R571R663l6851m7040m130J6741
721B8620k1036M2691l3340M4461N0429k696K0701k7803l4603n9545j8192N4394
709D4081j6163l2848M3360j1772l4386R7686n3816q3404L3460L8044N6347l3559
697D7030l6050k4890M7282l8694k4435L7086r5169J3210r626M8982N4424K6216
685D5366j7288j1440R2673L2635j6822r5722k3758o9485K0327J4598O6819Q036
673D5939K9089K6742l302M6528p9926m5416L0580l5253m4134j2882R387Q5664
$$ plain form
760 56949 97483 89945 75633 66903 49976 951 -34963 26718 2123 -20335 -10783 8407 59882
747 59882 59953 21899 38339 68806 86140 120796 65126 126259 126687 108598 115772 104333 -5971
734 -5971 -52084 -47701 -15462 10687 23741 48779 80666 90237 99900 63049 16009 11879 28620
721 28620 7584 50275 16935 61396 111825 109129 129830 102027 67424 7879 -10313 44081
709 44081 27918 -4930 38430 26658 -7728 89958 36142 -47262 -13802 24242 80589 47030
697 47030 10980 -13910 33372 -5322 -29757 7329 -87840 -74630 -84256 -35274 19150 45366
685 45366 28078 16638 109311 141946 125124 29402 5644 -63841 -43514 -28916 37903 45939
673 45939 75028 101770 98468 144996 65070 19654 50234 14981 -29153 -42035 -32648 53016
661E3016l1195j2342P0266j8869K1841n6502P8578K0475n2489j2927o8372m884
649a3404k4250L5761K7562r872k4552L6498K0099n6173L2838L4486n842k1292
637C1859P3426M2370k7865m2182m8893K6260o7478M7002P0758k6989o9504j3394
625d630J2140o6633J9659O9738j3885r844j1525n401R411M4380J8325l6558R9550
612A24727Q983l8421p8467o8519M0955M8838l8737J4805M7675L7087o4787N380
600C9519m3120q0158k8080R3472K9206O211K6953n77L5303m9315n400K6933J7274
587F8221k8465N84k7744L3080k9724J3657L4562M6244j1307o8061K9844o6827
575e936L0106j9378K4264M9366K4619n8577J2270L3441m328m9085R661J159L0620
$$ plain form
661 53016 21821 9479 79745 60876 82717 26215 104793 125268 72779 59852 -8520 -13404
649 -13404 -37654 -1893 25669 15797 -8755 27743 47842 -8331 24507 58993 53151 31859
637 31859 105285 147655 119790 77608 28715 54975 -12503 34499 105257 78268 8764 -4630
625 -4630 7510 -59123 -39464 30274 16389 6545 -4980 -10381 -970 43410 61735 25177 124727
612 124727 133710 95289 16822 -51697 -10742 38096 -641 14164 61839 98926 34139 39519
600 39519 -3601 -83759 -111839 -18367 10839 17050 44003 43426 78729 29414 24014 50947 68221
587 68221 39756 40340 12596 45676 15952 29609 64171 110415 99108 31047 60891 -5936
575 -5936 24170 4792 29056 78422 103041 44464 56734 90175 85847 36762 46423 47582 78202
562G8202N1239M055n6100l4283K3717k7283j5741N3834K7542l7565N8423k2884
550A03156r530m7347N6727o1385p2751P2824p756J2839J3915L4037j3351p0362
538A1016R996l0630k5377K9573N3671r1726M8306J3429J7456l0759L9521K2577
526F7053o817k2354J7514N0025R683n9988J142J4555K6651J8663o1608l297J7305
513F8527k8820K1119l813M158l4615m425O7263K1492K7588r1312m1295o634M5966
500D5199J16P553j3493k5705O14k0379R027O4623P0647p7318L5464m6076K0321
487G0593j1454l4624K8956o4912K2648K0163l1050L8685R514l9969L7861K8327
475G4738O298m8345J6776N1878j329R992j2578n3743P11O260o0439K4302L3646
$$ plain form
562 78202 129441 133496 77396 43113 66830 39547 23806 77640 105182 67617 126040 103156
550 103156 93626 46279 103006 41621 -31130 41694 33938 46777 60692 94729 81378 11016
538 11016 21012 -9618 -34995 -5422 48249 -43477 4829 18258 35714 4955 44476 67053
526 67053 60236 37882 55396 105421 115104 55116 56258 70813 97464 116127 54519 51222 68527
513 68527 39707 60826 57013 61171 26556 22131 89394 110886 138474 47162 5867 -767 45199
500 45199 45315 52868 39375 13670 14284 -6095 2932 67555 138202 60884 96348 50272 70593
487 70593 59139 24515 53471 -11441 11207 31370 320 39005 48519 8550 46411 74738
475 74738 81036 32691 49467 101345 100016 110008 97430 43687 44398 50658 -9781 14521 48167
462D8167k7696N2591l4719l2090o1965M2727P995K8373j0988R359k5535J2056
450H275M7735m9815j8974O312l5934J09N7186m750n7432K7597N2807l425k403
437B7288P59O035M6005j6942p1517k0639K6139M5188j2709N1618J01554q6269
425I6510r0989K0431J15626j0837j02171j1996P8084R552m4834l8058M8095m0461
413B8952K3840O9812q216k7678r886O0415j695N216q075l8215J085j1591l2097
400E1867k8183N0040n073o9188l9977Q571M4433J9377k5657J0494N6159J1168
388H4031k3259o641O9123j45m5666k2558m89L3811K3384r771Q022k6282J5726
375I9286l451j066k4025L5283q5918j5277N8674L2347j5459m0770o1905n930N172
$$ plain form
462 48167 20471 73062 38343 6253 -55712 -12985 -4990 23383 12395 21754 -3781 8275
450 8275 56010 6195 -12779 -6467 -42401 -42292 14894 10144 -47288 -19691 33116 29691 27288
437 27288 28047 34082 80087 63145 -8372 -29011 -2872 42316 29607 81225 182779 96510
425 96510 5521 25952 141578 130741 28570 16574 94658 104210 59376 21318 69413 28952
413 28952 52792 122604 114388 86710 76824 137239 135544 140760 132685 94470 95555 83964 51867
400 51867 23684 73724 68651 -537 -40514 -31943 12490 31867 6210 16704 72863 84031
388 84031 60772 54131 123254 123109 77443 54885 54396 88207 111591 101820 109842 83560 99286
375 99286 95835 94769 70744 106027 20109 4832 63506 95853 80394 39624 -22281 -28211 -23039
362b3039l1727N2036j0555K0415N5534r5425K2311N7215L168P3239m2377j7883
350F2912j8492q722L1589j1159Q9521r9210j5227J0511n0946l4991J20915k9311
338D7390l9712N8444l419j3124l3023M1431o2542K0290o0113k1137J11434j4547
326C1372J594n255j8081N0483M5438j2437J6236J0149l6430N658m468k9455K2587
313G7391N3772l8466L7795n9467j19L9183n8706r017r702N07N6501m1330J5589
300F3931j1367K9097K1005K399n3341p970J42801J888n1437m0988n230K2547l8886
287G4449o798M3135o0606Q846k9651J4003K3934O951J5723k1639K7099n4463L233
274D4216J3432m2088L1357M4944n670r0j1658j461o748K1709J4095m7838k039
$$ plain form
362 -23039 -54766 -2730 -13285 7130 62664 -32761 -10450 46765 49933 123172 80795 62912
350 62912 44420 35698 67287 56128 145649 46439 31212 41723 -9223 -44214 76701 47390
338 47390 7678 66122 62703 49579 16556 57987 -4555 15735 -44378 -65515 45919 31372
326 31372 32966 27711 9630 60113 105551 93114 109350 119499 83069 88727 84259 54804 77391
313 77391 131163 92697 130492 71025 70906 110089 51383 42366 32664 33171 89672 48342 63931
300 63931 52564 81661 102666 105065 51724 43754 186555 188443 137006 96018 90788 113335 74449
287 74449 67651 110786 50180 59026 29375 43378 67312 74263 89986 68347 95446 40983 44216
274 44216 57648 15560 46917 91861 86191 86101 74443 72982 66234 87943 102038 54200 52161
261E2161j7389j998M6124o0593R311J1788M959N5156k8427m8831k594J11792M2067
248A73526l1679n5219o8713J8139K30R623n7256K5496P0914J9308K364n9046q878
235C8809L9981L1992J3069q9932J1834M0486p6446k3542L6463J2692l9565l5297
223c9456K3778k3605M2141O687k0391N0315K5583p200l1255J1387J1449L5798
211H5231k1030K6842K6720k7891k3014O2277l9244j7984p830j3368R273n0778
199I204k8574O9345M892m771k5934j02885J0276N5151L3976P211L623O923k1962
186A6475o1831M9581R534L0222L8222o2100K9799O5481m2211k1883K2469n4357
174A9401m8757P28M80L3942Q1242L0224k5818j8289m4063n4011l4790j3149O9975
$$ plain form
261 52161 34772 32774 78898 18305 27616 39404 44363 99519 71092 22261 19667 131459 173526
248 173526 141847 86628 17915 36054 36284 45907 -11349 14147 85061 104369 106733 47687 38809
235 38809 78790 110782 123851 33919 45753 86239 9793 -13749 22714 35406 -4159 -39456
223 -39456 -15678 -39283 2858 9545 -10846 39469 65052 57852 26597 37984 49433 85231
211 85231 64201 91043 117763 89872 66858 129135 89891 71907 64077 50709 59982 9204
199 9204 -19370 49975 54867 50096 24162 -78723 -68447 -13296 20680 27891 31514 38437 16475
186 16475 -45356 4225 13759 43981 82203 20103 49902 115383 73172 51289 73758 19401
174 19401 -29356 -28628 -28148 5794 87036 117260 91442 73153 29090 -24921 -59711 -72860 -2885
161b885m5462q024n991M2509M5836J9893L398l2644j3950O288k4703K0156o210
148a789j055k6170l3819K5661L0976M6937k1639m2780J0848j1051o2810K0512
136f6179l4319K2917r658n848l8085J6111o182O727N7434N630P1902k8590N0623
123D2483k0479m7680o989n6470j5477O578N6253q098L9726P631m6012P518J0883
110c0133N738J896k1567l1098O61l586K3062K979m0356N387m841K5714k7487L2762
96f0869J8219n740n7587K1562L3278J0335p921N932n015p534q2162N605j2367
83a44264j7105L0549j5537l3067j8915M7149K0551L6058J6357o681o9408m012
71a58325K8418J9666m8847k8888N7740l0557j3993M2768R465j3189k0359N1324
$$ plain form
161 -2885 -48347 -56371 -62362 -19853 25983 45876 49274 16630 2680 8968 -15735 4421 -1789
148 -1789 -2844 -29014 -62833 -37172 -6196 40741 19102 -23678 -12830 -23881 -86691 -66179
136 -66179 -100498 -77581 -87239 -93087 -131172 -115061 -121243 -114516 -57082 -51452 20450 -8140 42483
123 42483 22004 -25676 -32665 -89135 -104612 -98034 -41781 -49879 -10153 -2522 -48534 -41016 -30133
110 -30133 -24395 -22499 -44066 -75164 -74503 -78089 -55027 -52048 -92404 -87017 -91858 -66144 -93631 -60869
96 -60869 -42650 -48390 -105977 -84415 -51137 -40802 -48723 -42791 -47806 -55340 -137502 -131897 -144264
83 -144264 -161369 -130820 -146357 -179424 -198339 -151190 -130639 -94581 -78224 -84905 -154313 -158325
71 -158325 -129907 -110241 -159088 -187976 -130236 -160793 -174786 -132018 -122553 -135742 -156101 -104777
59a04777o081k9893k5915j6073m8966J173R216k078j7823L9250m983r13K346M452
45b01065L4650l0621k9894K0573k322M117l2724J9751K6795n3705M249L6718j1024
32b14502n3863j5568J4848M3399J6693m6860K5616O4k940j3016l0714O637n7971
19c28177m3602j7677M1644N3509J1636O659l5476k1554L998J7490m982k5262J9513
6c22281K7694J9505K0004m2307k1741K0413
0b98713
$$ plain form
59 -104777 -110858 -140751 -166666 -182739 -231705 -230532 -221316 -223394 -241217 -201967 -206950 -207863 -205517 -201065
45 -201065 -166415 -197036 -226930 -206357 -208679 -204562 -237286 -217535 -190740 -244445 -240196 -203478 -214502
32 -214502 -268365 -283933 -269085 -225686 -208993 -255853 -230237 -230173 -233113 -246129 -276843 -270206 -328177
19 -328177 -371779 -389456 -347812 -294303 -282667 -276008 -311484 -333038 -329040 -311550 -316532 -341794 -322281
6 -322281 -294587 -275082 -255078 -297385 -319126 -298713
0 -298713
$$ Imaginary data points
##PAGE= N=2
##DATA TABLE= (X++(I..I)), XYDATA
16383b971935Q3514K6096M7501M8305J5652L9248M6930N7755L8634K1508M0696
16372b506096R0772N9674j062J0795P4316L9743K5939L8658M7714M6416Q2364
$$ plain form
16383 -2971935 -2888421 -2862325 -2814824 -2766519 -2750867 -2711619 -2664689 -2606934 -2568300 -2546792 -2506096
16372 -2506096 -2415324 -2355650 -2356712 -2345917 -2271601 -2231858 -2205919 -2167261 -2119547 -2073131 -1990767
$$ [...]
##END NTUPLES=NMR SPECTRUM
##END=
