##TITLE=1H_EC-3300(II-6)
 CDCl3
 8 sc, 
 24.9.2023
##JCAMPDX= 6.0         $$ Bruker NMR JCAMP-DX V2.0
##DATA TYPE= NMR SPECTRUM
##DATA CLASS= NTUPLES
##ORIGIN= UXNMR, Bruker Analytische Messtechnik GmbH
##OWNER= root
$$ XWIN-NMR		Version 3.5
$$ Mon Sep 25 14:05:45 2023 Russian Standard Time (UT+4h)  she@DPX200
##.OBSERVE FREQUENCY= 200.13135
##.OBSERVE NUCLEUS= ^1H
##.ACQUISITION MODE= SIMULTANEOUS
##.ACQUISITION SCHEME= undefined
##.AVERAGES= 8
##.DIGITISER RES= 18
##SPECTROMETER/DATA SYSTEM= spect
##.PULSE SEQUENCE= zg30
##.SOLVENT NAME= CDCl3
##.SHIFT REFERENCE= (INTERNAL, CDCl3, 0, 15.7282)
##AUDIT TRAIL= $$ (NUMBER, WHEN, WHO, WHERE, WHAT)
$$ ##TITLE= Audit trail, XWIN-NMR		Version 3.5
$$ ##JCAMPDX= 5.01
$$ ##ORIGIN= Bruker BioSpin GmbH
$$ ##OWNER= she
$$ F:/spectra/data/she/nmr/H-F/1/pdata/1/auditp.txt
$$ ##AUDIT TRAIL=  $$ (NUMBER, WHEN, WHO, WHERE, WHAT)
(   1,<2023-09-25 14:04:37.21 +0400>,<she>,<DPX200>,
      <created by zg, POWCHK disabled, PULCHK disabled
       configuration hash MD5:
       00 E9 B6 7A A2 85 ED C7 34 08 36 98 17 FE 4E 26
       data hash MD5: 16K
       0F 1C F8 F6 02 D2 CC 99 F5 BC 8E 3E 3B 31 EB 06>)
(   2,<2023-09-25 14:04:41.09 +0400>,<she>,<DPX200>,
      <Start of raw data processing
       efp BC_mod = 2 LB = 0.24 FT_mod = 6 PKNL = 1 PHC0 = -21711.87 PHC1 = 11.85271 SI = 16K 
       data hash MD5: 16K
       69 CF CA 1A DF 3E 20 B3 25 DE E5 89 6A AD 8E F6>)
(   3,<2023-09-25 14:04:59.95 +0400>,<she>,<DPX200>,
      <pk PHC0 = -1.525826 PHC1 = 2.6 
       data hash MD5: 16K
       2B BB B0 24 CB 36 1E 60 E7 19 AF 2C A4 46 13 79>)
(   4,<2023-09-25 14:05:03.25 +0400>,<she>,<DPX200>,
      <abs ABSG = 5 
       data hash MD5: 16K
       94 CC 8D 57 CB 11 51 56 50 5A 7A 10 18 C4 D0 CA>)
$$ ##END=
$$ 
$$ hash MD5
$$ 50 96 17 97 F0 9D D2 EA 77 DA 84 8D 3C 8E BC 6F
##$RELAX= 
##$RELAX= 
##$RELAX= 
##$RELAX= 
##$RELAX= 
##$RELAX= 
$$ Bruker specific parameters
$$ --------------------------
##$DU= <F:/spectra>
##$EXPNO= 1
##$NAME= <H-F>
##$PROCNO= 1
##$TYPE= <nmr>
##$USER= <she>
##$AMP= (0..31)
100 100 100 100 100 100 100 100 100 100 100 100 100 100 100 100 100 100 
100 100 100 100 100 100 100 100 100 100 100 100 100 100 
##$AQSEQ= 0
##$AQ_mod= 1
##$AUNM= <au_zg>
##$AUTOPOS= <>
##$BF1= 200.13
##$BF2= 200.13
##$BF3= 200.13
##$BF4= 200.13
##$BF5= 200.13
##$BF6= 200.13
##$BF7= 200.13
##$BF8= 200.13
##$BYTORDA= 1
##$CFDGTYP= 0
##$CFRGTYP= 5
##$CHEMSTR= <none>
##$CNST= (0..31)
1 1 145 1 1 1 1 1 1 1 1 1 1 1 1 1 1 1 1 1 1 1 1 1 1 1 1 1 1 1 1 1 
##$CPDPRG= <>
##$CPDPRG1= <>
##$CPDPRG2= <>
##$CPDPRG3= <>
##$CPDPRG4= <mlev>
##$CPDPRG5= <mlev>
##$CPDPRG6= <mlev>
##$CPDPRG7= <mlev>
##$CPDPRG8= <mlev>
##$CPDPRGB= <>
##$CPDPRGT= <>
##$D= (0..31)
0 1.2 0 0 0 0 0 0 0 0.06 0 0.03 0 0 0 0 0.0002 0 0 0 0 0 0 0 0 0 0 0 0 
0 0 0 
##$DATE= 1695636276
##$DBL= (0..7)
120 120 120 120 120 120 120 120 
##$DBP= (0..7)
150 150 150 150 150 150 150 150 
##$DBP07= 0
##$DBPNAM0= <>
##$DBPNAM1= <>
##$DBPNAM2= <>
##$DBPNAM3= <>
##$DBPNAM4= <>
$$ [...]
##$SUBNAM3= <"">
##$SUBNAM4= <"">
##$SUBNAM5= <"">
##$SUBNAM6= <"">
##$SUBNAM7= <"">
##$SUBNAM8= <"">
##$SUBNAM9= <"">
##$SW= 18.05172834244
##$SWIBOX= (0..15)
0 0 2 0 0 0 0 0 0 0 0 0 0 0 0 0 
##$SW_h= 3612.71676300578
##$TD= 16384
##$TD0= 1
##$TE= 0
##$TE2= 300
##$TE3= 300
##$TEG= 300
##$TL= (0..7)
0 120 120 120 120 120 120 120 
##$TP= (0..7)
150 150 150 150 150 150 150 150 
##$TP07= 0
##$TPNAME0= <>
##$TPNAME1= <>
##$TPNAME2= <>
##$TPNAME3= <>
##$TPNAME4= <>
##$TPNAME5= <>
##$TPNAME6= <>
##$TPNAME7= <>
##$TPOAL= (0..7)
0.5 0.5 0.5 0.5 0.5 0.5 0.5 0.5 
##$TPOFFS= (0..7)
0 0 0 0 0 0 0 0 
##$TUNHIN= 0
##$TUNHOUT= 0
##$TUNXOUT= 0
##$USERA1= <user>
##$USERA2= <user>
##$USERA3= <user>
##$USERA4= <user>
##$USERA5= <user>
##$V9= 5
##$VALIST= <valist>
##$VCLIST= <CCCCCCCCCCCCCCC>
##$VD= 0
##$VDLIST= <DDDDDDDDDDDDDDD>
##$VPLIST= <PPPPPPPPPPPPPPP>
##$VTLIST= <TTTTTTTTTTTTTTT>
##$WBST= 1024
##$WBSW= 4
##$XGAIN= (0..3)
0 0 0 0 
##$XL= 0
##$YL= 0
##$YMAX_a= 376276
##$YMIN_a= -508855
##$ZGOPTNS= <>
##$ZL1= 120
##$ZL2= 120
##$ZL3= 120
##$ZL4= 120
##$ABSF1= 15.74579
##$ABSF2= -2.30606
##$ABSG= 5
##$ABSL= 3
##$ALPHA= 0
##$AQORDER= 0
##$ASSFAC= 0
##$ASSFACI= 0
##$ASSFACX= 0
##$ASSWID= 0
##$AUNMP= <proc_1d>
##$AZFE= 0.1
##$AZFW= 0.1
##$BCFW= 0
##$BC_mod= 2
##$BYTORDP= 0
##$COROFFS= 0
##$CY= -3
##$DATMOD= 1
##$DC= 0
##$DFILT= <>
##$DTYPP= 0
##$F1P= 0
##$F2P= 0
##$FCOR= 1
##$FTSIZE= 16384
##$FT_mod= 6
##$GAMMA= 0
##$GB= 0
##$INTBC= 1
##$INTSCL= 3.70164e-10
##$ISEN= 128
##$LB= 0.24
##$LEV0= 0
##$LPBIN= 0
##$MAXI= 10000
##$MC2= 0
##$MEAN= 0
##$ME_mod= 0
##$MI= 1.114404
##$NCOEF= 0
##$NC_proc= -6
##$NLEV= 6
##$NOISF1= 3.799351
##$NOISF2= 2.8
##$NSP= 0
##$NTH_PI= 0
##$NZP= 0
##$OFFSET= 15.72816
##$PC= 1
##$PHC0= -21713.39
##$PHC1= 14.45271
##$PH_mod= 1
##$PKNL= yes
##$PPARMOD= 0
##$PSCAL= 0
##$PSIGN= 0
##$REVERSE= no
##$SF= 200.130008681293
##$SI= 16384
##$SIGF1= 3
##$SIGF2= 2
##$SINO= 5.538805
##$SIOLD= 16384
##$SREGLST= <1H.CDCl3>
##$SSB= 0
##$STSI= 16384
##$STSR= 0
##$SW_p= 3612.71676300578
##$SYMM= 0
##$S_DEV= 0
##$TDeff= 16384
##$TDoff= 0
##$TI= <>
##$TILT= no
##$TM1= 0
##$TM2= 0
##$TOPLEV= 0
##$USERP1= <user>
##$USERP2= <user>
##$USERP3= <user>
##$USERP4= <user>
##$USERP5= <user>
##$WDW= 1
##$XDIM= 16384
##$YMAX_p= 316681172
##$YMIN_p= -356600
$$ End of Bruker specific parameters
$$ ---------------------------------
##NTUPLES= NMR SPECTRUM
##VAR_NAME=  FREQUENCY,     SPECTRUM/REAL,   SPECTRUM/IMAG
##SYMBOL=    X,             R,               I
##VAR_TYPE=  INDEPENDENT,   DEPENDENT,       DEPENDENT
##VAR_FORM=  AFFN,          ASDF,            ASDF
##VAR_DIM=   16384,         16384,           16384
##UNITS=     HZ,            ARBITRARY UNITS, ARBITRARY UNITS
##FACTOR=    0.220516191357247, 1,           1
##FIRST=     3147.67677822434, 0,            0
##LAST=      -465.039984781437, 0,           0
##MIN=       -465.039984781437, -356600,     0
##MAX=       3147.67677822434, 316681172,    0
$$ Real data points
##PAGE= N=1
##DATA TABLE= (X++(R..R)), XYDATA
$$ [...]
11883C54688m1096l215p8495m2017R8347O8547q6645M7849O4707l6084o6503m8918
11871B31165O2644n3778r3226M8067J31897j2507j36949O1554N2798P2538l7325
11860C26878j35482P1454l9483o2863R3006L7071K8342m2122k7428k391L2124
11849B79106k4706l1769q197L7885P897j0405j8587p374Q8553Q70m7948r2428
11837A72897J05833r6088r5431J42133Q8684o1246l8021K2874n9757N9925r5661
11826A46142p687K7825q293J27382N1510r1659M63J29589r9553m167m6103j339
11814B24110j0298k2195N1099o443J4956k0716L1128N5351n2464o6971M9035J03324
11802C49916k3473l9137p1554J4614l0826K2682k9802Q0397O192J4470j5688k5567
$$ plain form
11883 354688 313592 310377 231882 189865 288212 356759 270114 317963 382670 346586 280083 231165
11871 231165 293809 240031 146805 194872 326769 314262 177313 238867 291665 364203 326878
11860 326878 191396 262850 223367 160504 253510 290581 318923 276801 249373 246982 279106
11849 279106 254400 222631 214434 252319 260216 249811 231224 223850 312403 313273 265325 172897
11837 172897 278730 182642 87211 229344 318028 256782 218761 241635 181878 241803 146142
11826 146142 138455 166280 157987 285369 336879 245220 245683 375272 275719 271552 225449 224110
11814 224110 213812 191617 242716 236273 251229 230513 261641 316992 264528 197557 246592 349916
11802 349916 326443 287306 215752 230366 199540 222222 192420 272817 279009 293479 277791 252224
11790B52224J8325P4193k2457N999P189L516j2812n0710O2131K3327J1991l3543
11778C39373J12346m9251k4920L3529n3238m1849o3094O1078k6622o1454M9799
11767B75697L9081N2172q8626M0021P1909J06069j08744j29297J45725L2774j67015
11756B69766O9304K3917j39224Q0169K2018j5512n0102m2842K2649p2822Q2659
11745B49980m1458Q9119L6976j06747m4616o520O362P9136O6915j19376k0538
11734A89233j1188m3529p5190J71548K7914m9264N3872M7914l2577j7062j54596
11723A07075J8333L7775p299j1254p269M3356l0810r164O4477J07783k6087j5338
11711B71578j4476O444j2032Q573K655L0204k2506m2972R0717K2438L6804j4967
$$ plain form
11790 252224 270549 344742 322285 328284 335473 338989 326177 275467 337598 360925 372916 339373
11778 339373 451719 402468 377548 411077 357839 315990 252896 313974 287352 225898 275697
11767 275697 314778 366950 278324 318345 390254 496323 387579 258282 404007 436781 269766
11756 269766 339070 362987 223763 303932 325950 310438 260336 217494 240143 167321 249980
11745 249980 208522 297641 334617 227870 183254 176734 183096 262232 329147 209771 189233
11734 189233 178045 134516 59326 230874 258788 209524 263396 311310 278733 261671 107075
11723 107075 125408 163183 155884 144630 137361 180717 149907 140743 205220 313003 286916 271578
11711 271578 257102 263546 251514 260087 262742 292946 270440 227468 318185 340623 377427 362460
11699C62460j51512p8840J7211R2346P1274j6283P09K356J01552K8210p9102N5398
11687D05779m3367N5621j6340J4028r931J47529k6100p4092k7447O6087o3010
11676D28757J9711P4311j5350q669N3691J6697k5649P8787P5257j3629O2172K9483
11664G75569L0624R3224l7433J9799k022k0687o6258Q5370J07985K5809K5614
11653A037594M9291o833P2121r734N8868J02495P6883O5949L7906o9853J46607
11642A561294P6880P5014J53300J5907J26363J7332J1822P6426J16766K09980
11632B441084J6235Q5796J45052Q7617J73176J46131P0193m1168M6182K9578R0279
11621C290155R375K668k3391n1584q8242j68702l7844p0216r8182j48666j06177
$$ plain form
11699 362460 210948 132108 149319 241665 312939 296656 297365 299721 401273 429483 350381 405779
11687 405779 362412 418033 401693 415721 405790 553319 527219 453127 425680 491767 428757
11676 428757 448468 522779 507429 498760 552451 569148 543499 622286 697543 683914 746086 775569
11664 775569 806193 899417 861984 881783 879761 859074 792816 878186 986171 1011980 1037594
11653 1037594 1086885 1080052 1152173 1142439 1201307 1303802 1380685 1446634 1484540 1414687 1561294
11642 1561294 1638174 1713188 1866488 1882395 2008758 2026090 2037912 2114338 2231104 2441084
11632 2441084 2457319 2543115 2688167 2775784 2948960 3095091 3165284 3124116 3170298 3199876 3290155
11621 3290155 3299530 3302198 3278807 3227223 3138981 2970279 2932435 2862219 2764037 2615371 2509194
11610B509194j7079j04152j27065j34463j20529j40320k6527L7732j02147r9819
11600A674825o3950n1318p1261p621m96M1562j2533j24316j17294j9190l6160
11589A212248j04022N7892n2142n2940j60797k8200J32296q1708l384q5485j23530
11578G10228j5424O552J2592o0708l6864P1627j09279j51628N6266j8951m1508
11567D22903k0602j1011m1111N5189K5180j6244Q617p3483n9921m7624j3719J9619
11555B47793J73515j06114K3597p0245Q5613k5254j14179p608L4553M1811l5617
11544B47865o549m686l7056J2839m0796J00482J06026q4706L8138l1945M768j11221
11532A93159j71189j9423K7091J2338N03J02147r522J685m9924N3496L7798n5468
$$ plain form
11610 2509194 2492115 2387963 2260898 2126435 2005906 1865586 1839059 1876791 1774644 1674825
11600 1674825 1610875 1559557 1488296 1480675 1480179 1521741 1509208 1384892 1267598 1248408 1212248
11589 1212248 1108226 1166118 1113976 1061036 900239 872039 1004335 922627 919243 833758 710228
11578 710228 694804 701356 713948 653240 616376 688003 578724 427096 483362 464411 422903
11567 422903 402301 391290 350179 405368 430548 414304 422921 349438 289517 241893 228174 247793
11555 247793 421308 315194 338791 268546 354159 328905 214726 207118 241671 283482 247865
11544 247865 241316 236630 199574 212413 171617 272099 378125 293419 331557 299612 304380 193159
11532 193159 21970 2547 29638 41976 42479 144626 135104 136789 86865 140361 178159 122691
11520A22691Q6q1181j1175r8045M8203N7333j2990P5020L167m1391o8521N0177
11508D3374m3962K2927k759n8816O249l3423Q0260k2121M6167l9146N5330O1186
11496A15266k9959p8655l690R320l0395J0380N7150l2326m0066o2111K7721L1996
11484b5369J8233j2093M7443j8972R36q4890L0581O8615l5710n9292M3271J5928
11472a1319K2260N8228K2214K7496R414n8705J9342L3585j2746j6627p2740k4543
11460d141M0504o1358R375M9945N1616j61731M0188R3731j725r347k9147N8416
11448G6326n7454M6429L5566J8979j51902M7701k3183J1231N9964N6412l9128
11437H0941j33360J01232p855k8472m0698J1323O1784n241q5117o3588Q0390L4654
$$ plain form
11520 122691 122777 41596 30421 -67624 -19421 37912 24922 99942 103109 61718 -6803 43374
11508 43374 -588 22339 19580 -39236 -32987 -66410 13850 -8271 37896 -1250 54080 115266
11496 115266 85307 6652 2962 12282 -18113 -7733 49417 17091 -22975 -85086 -57365 -25369
11484 -25369 -7136 -19229 28214 9242 10178 -74712 -44131 24484 -11226 -70518 -27247 -11319
11472 -11319 10941 69169 91383 118879 128293 69588 88930 122515 109769 93142 20402 -4141
11460 -4141 36363 -24995 -15620 34325 85941 -75790 -35602 58129 56404 47057 17910 76326
11448 76326 18872 65301 100867 119846 -32056 15645 -7538 3693 63657 120069 80941
11437 80941 -52419 48813 40958 12486 -28212 -16889 44895 39654 -45463 -109051 -28661 5993
11425E993L2618K9150P5469k3450l3961k4539j6228j29136J43973j5227q4485
11414c9823k6433O1008J2232k4029j8754k4248L4098N318P5889q1232K8682J1867
11402A4575n0623o810L0499N402n8218j2684l39J16600L3961k3961k7735M131
11390B4798j2361R406l9739N1299L4344m3924M3393j04183J13373n1429n6466
11379c1489N799J4376J2374j4756K0057M2276K04j14687K113l7269m3907J38020
11367f889n2884K0002m2250j68579P3561L0013P693N1596P0089l316P9509k4202
11355C4343m7327j7247R022L5990R526M6710k5599j04647N3260K7082k3022r8688
11343a00597r845J28298k008r6790o5944R2289m9923q0155J9255R6035p0753O1185
$$ plain form
11425 5993 38611 67761 143230 119780 85819 61280 45052 -84084 59889 44662 -39823
11414 -39823 -66256 -5248 6984 -17045 -35799 -60047 -25949 -20631 55258 -25974 2708 14575
11402 14575 -36048 -42858 -12359 -6957 -65175 -77859 -78198 38402 72363 48402 20667 24798
11390 24798 12437 21843 -17896 33403 67747 23823 67216 -36967 76406 24977 -31489
11379 -31489 -25690 -11314 1060 -13696 6361 48637 48841 -65846 -63733 -101002 -144909 -6889
11367 -6889 -59773 -39771 -82021 -250600 -177039 -147026 -139333 -87737 -17648 -20964 58545 34343
11355 34343 -12984 -30231 -21209 14781 24307 71017 45418 -59229 -5969 21113 -1909 -100597
11343 -100597 -110442 17856 15848 -80942 -146886 -54597 -104520 -184675 -165420 -69385 -140138 -78953
11331g8953J04676l2335k6587N1479j4735j19787P4012N8239N864l5093j0520
11320b3740K9901k0852j22046L0732L154l5460N714J26587m2610K9756K5842j53922
11308a46944L7754j0356k5179r6210k616P1620J39397M4864O3060n0328j53541
11297a28479n0346L331J05305J4789q88P5555j3067j17362J2044M2258m1031N7655
11285d0236P7735N2044q0780O5744N8086j16165L7196K7000o7354K5996J1095
11274E0361j13962O7169J3748k8666L5414k7066J553M3748j6120N733r7822J00115
11262C4205J9627n5993M9551m4922Q5800j10462O2771N7436Q0117k0077j58312
11251b59l6869J5292Q7245L5367J6307J02144l634J922K8986o1758k5833k2170
$$ plain form
11331 -78953 25723 -6612 -33199 18280 3545 -116242 -42230 16009 21873 -13220 -23740
11320 -23740 6161 -14691 -136737 -106005 -102851 -138311 -132597 -6010 -48620 -18864 6978 -146944
11308 -146944 -109190 -119546 -144725 -240935 -243551 -171931 -32534 12330 75390 25062 -128479
11297 -128479 -178825 -175494 -70189 -55400 -56288 19267 6200 -111162 -99118 -56860 -97891 -40236
11285 -40236 37499 89543 8763 74507 132593 16428 53624 80624 13270 39266 50361
11274 50361 -63601 3568 17316 -11350 24064 -3002 -1449 42299 26179 31912 -65910 34205
11262 34205 53832 -2161 47390 2468 88268 -22194 40577 98013 178130 158053 -259
11251 -259 -37128 -21836 65409 100776 117083 219227 215593 217515 246501 184743 158910 136740
11239A36740P2180J138M1076M8628k2473m4303m8853M3389n4935M850P2520j16343
11227A33614l0802l558P5646q8411l5302m689P3959J4538m0732J2694K1215j893
11215A26279q8415J6651n0732K5963l75M276j7811r6149N3573O2536j26614O5924
11203b4894j6348p6986k1266N1038k4138J10786M0243r5379L0915j4308N799N6179
11191B1641m1749q19Q2714j7788p427J36184l9941p6294M0272m8921n3771K0974
11179A5075P9539R435r6525o6834j7381m7827M3012O7559M7665k5684n6806q5279
11167a34051N6309k316j14578J36014J41084n5289j14241P4845J2559j58672K2255
11156a36081R9506j056p1059O9947n190k3413M7758n4591L4894o0704k1724J13425
$$ plain form
11239 136740 208920 210058 251134 299762 277289 232986 184133 227522 172587 177437 249957 133614
11227 133614 102812 99254 174900 86489 51187 46498 120457 134995 94263 106957 128172 126279
11215 126279 37864 54515 3783 29746 29371 33647 15836 -80313 -26740 35796 -90818 -24894
11203 -24894 -41242 -118228 -139494 -88456 -112594 -1808 38435 -56944 -26029 -40337 -34538 21641
11191 21641 -20108 -20927 61787 43999 36572 172756 132815 56521 96793 47872 -5899 15075
11179 15075 94614 104049 7524 -59310 -76691 -124518 -81506 -13947 33718 8034 -48772 -134051
11167 -134051 -77742 -80058 -194636 -58622 82462 27173 -87068 -12223 336 -158336 -136081
11156 -136081 -36575 -37631 -108690 -38743 -43933 -67346 -19588 -74179 -39285 -99989 -121713 -8288
11144h288K0390l4389j76794k2655R4570R2075J2578m8096p1341k786J12932J0344
11132b1460j03395R709j098P7620j3797K3285j6674q0043J6461k3840J8631q9706
11120b04307J81577Q5398q8129m3443K0515N4724j36678j59486J602M6394J20405
11109a21428Q6187O9558k7720j59000N0269l3542M6723K3924m1859Q6131j3931
11098c4688N8804P5578j34031K0741l7702K3142q2135l7448p1400O526l9354m2773
11086b94740J78211q360J45082K6110k2879k2845o9457k7704%J17329l0150o2795
11074g2198M9638P687o0693n1207K8138L1228j1709j2156P6469k5917N956K9924
11062d840j35185p7061N1866J759J43440k8453m5253r6395L7100o626m389M602
$$ plain form
11144 -8288 12102 -22287 -199081 -221736 -127166 -35091 -22513 -70609 -141950 -144736 -31804 -21460
11132 -21460 -124855 -115146 -116244 -38624 -52421 -29136 -45810 -125853 -109392 -133232 -114601 -204307
11120 -204307 -22730 62668 -25461 -68904 -48389 6335 -130343 -289829 -288227 -241833 -121428
11109 -121428 -35241 34317 6597 -152403 -102134 -135676 -88953 -65029 -106888 -20757 -34688
11098 -34688 24116 99694 -34337 -13596 -51298 -28156 -110291 -147739 -219139 -212613 -251967 -294740
11086 -294740 -116529 -124889 20193 46303 23424 579 -68878 -96582 -96582 20747 -9403 -72198
11074 -72198 -22560 -14873 -75566 -126773 -98635 -67407 -79116 -91272 -14803 -40720 -34764 -4840
11062 -4840 -140025 -217086 -165220 -163461 -20021 -48474 -93727 -190122 -153022 -159648 -164037 -159435
11050a59435J06911N8804j91276O0255P5543j2067n6867k3882l045J42929Q1286
11039G9156j84186m892M8722p232j14185M965J31530r0704r602R1786L2811P313
11027a4518J4148j3610k8807m3505o5598k2258L0986k1032O8839R296R289n8408
11015a35178l2396R643O2610R699j4541M0844M135J8488j3769r5893P499M3097
11003i5762m5205N8332k8230k5650j2554k8608R0121J40183m6334j00475l102
10992i7284k703R5993m6238j59789K2162M022O1056J14172M7205L7168o7284l3740
10980b5260O3256j45125k8083J49105p3160j15000J7826K1375P6132O2990Q6082
10969I0138J06918r3387o5131p2673n4402K2125J23340m4833p7469J1464q2094
$$ plain form
11050 -159435 -52524 6280 -184996 -124741 -49198 -61265 -118132 -142014 -145059 -2130 79156
11039 79156 -105030 -109922 -61200 -68432 -182617 -177652 -46122 -136826 -146428 -54642 -21831 -14518
11027 -14518 -370 -13980 -42787 -86292 -151890 -174148 -143162 -164194 -95355 -86059 -76770 -135178
11015 -135178 -167574 -157931 -95321 -85622 -100163 -59319 -55184 -36696 -50465 -146358 -138859 -95762
11003 -95762 -140967 -82635 -110865 -136515 -149069 -177677 -87556 52627 6293 -94182 -97284
10992 -97284 -99987 -3994 -50232 -210021 -187859 -183837 -122781 -8609 38596 75764 8480 -25260
10980 -25260 37996 -107129 -135212 13893 -59267 -174267 -156441 -135066 -58934 4056 90138
10969 90138 197056 103669 38538 -34135 -88537 -66412 56928 12095 -65374 -53910 -136004
10958a36004o7980J05754K5191l8939L399L4867j7108r066J1934o9300Q1925L2214
10946d3113k4078Q1623o2448j5677Q8357m2925l7628J56274r1224n2244J14895
10935G1812K1440J4531j22287p4663O5809N8547j5066q9847o4794J5233Q2015
10924c7270P6921K2401K5963o4493l9431p480l1480o9787J45812J4570l1615k0176
10912a6065L2222J8112k1213k7310l1039K3214J8161r4922k6303P2594N1911q0568
10900h1206j3924M003k8753q798O4323N7841m8379j04215P2279l5580p2392J07963
10888h6838J0647L9273K3609r9964M4058m737o0628L3983P8213l3881p2790R246
10876a19809k5546J7167P2561k1600n590L2233m958K4728j2349J5371o9291N6671
$$ plain form
10958 -136004 -203984 -98230 -73039 -111978 -108579 -73712 -90820 -99886 -87952 -157252 -75327 -43113
10946 -43113 -67191 14432 -48016 -63693 24664 -18261 -55889 100385 9161 -43083 71812
10935 71812 93252 107783 -14504 -89167 -23358 35189 20123 -69724 -134518 -119285 -37270
10924 -37270 39651 62052 88015 23522 -15909 -23389 -54869 -124656 21156 35726 4111 -16065
10912 -16065 16157 34269 13056 -14254 -45293 -22079 -3918 -98840 -125143 -52549 -638 -81206
10900 -81206 -95130 -91127 -119880 -128678 -64355 -6514 -54893 -159108 -86829 -122409 -194801 -86838
10888 -86838 -76191 -36918 -13309 -113273 -69215 -73952 -134580 -100597 -22384 -56265 -129055 -119809
10876 -119809 -145355 -128188 -55627 -77227 -82817 -50584 -55542 -30814 -43163 -27792 -97083 -40412
10864d0412L0057o9526k5364j1134P4056O6547J811o3362n8227l6171O5861M5570
10852b0294j0356J12016j7032j34501q67P5189p648J36511j26294o8497J3511
10841d8262O4954k0230o9616q3641R7569l3375O2602N3106k9897p854p7890l4321
10829a26855M1125n3755K477L3917p418N2706J6194M2113m4006p366j03523M6965
10817a07426j5253q5k9135n5259Q3319J18373M4913J9231j23686q1686M1082k4680
10805a30292J10187l3464Q877l7058l0962N877N8311P1641m7376M7722j25884
10794a02421p5431J52319j8802K5758m1132j0127o1119o5271O958K1608Q1316
10783h6344K7967J16429l2922j19589l9430m5862R8618J8788n5311J7065Q4828
$$ plain form
10864 -40412 -10355 -79881 -105245 -116379 -42323 24224 26035 -37327 -95554 -131725 -65864 -20294
10852 -20294 -30650 81366 64334 -70167 -71034 4155 -3493 133018 6724 -61773 -48262
10841 -48262 16692 -3538 -73154 -156795 -59226 -92601 -29999 23107 -6790 -14644 -92534 -126855
10829 -126855 -85730 -139485 -137008 -103091 -110509 -57803 -41609 504 -43502 -50868 -154391 -107426
10817 -107426 -122679 -122764 -151899 -207158 -123839 -5466 39447 58678 -65008 -146694 -105612 -130292
10805 -130292 -20105 -53569 -44692 -81750 -112712 -106835 -48524 23117 -24259 23463 -102421
10794 -102421 -177852 -25533 -44335 -18577 -59709 -69836 -130955 -196226 -189268 -167660 -86344
10783 -86344 -58377 58052 25130 -94459 -133889 -179751 -81133 -62345 -117656 -100591 -15763
10772a5763J1012j06968o8978m3583O6377j4451L7153J64861J14974j83344o1760
10761a00470N1394j4936L4197l3644l6860K837N4784o567L6417p9362q5973N1796
10749a26387m6019k2960J38153J23817o5782o1060j02463N4532J9349J8887J516
10738f8417R4515j9272L573n7079l5429L7429Q9453J3973j08300r3569Q6502L7934
10726a8687K4504o6866L5348p4845k7028L6816K0130J355J2399Q7774J072J9926
10714E1898R413K5147n6621q1303k5205P690p960n2052J917K01691J5887q2567
10702G935M0097j45429P298R4682J279K9991M1875o1643K0776o446j34253J28721
10690B4883k6673j3234l6283L4463p6842n3702J01911K8636j220k0793Q1831p1537
$$ plain form
10772 -15763 -4751 -111719 -180697 -224280 -157903 -172354 -135201 29660 144634 -38710 -100470
10761 -100470 -49076 -64012 -29815 -63459 -100319 -97482 -42698 -49265 -12848 -92210 -178183 -126387
10749 -126387 -172406 -195366 -57213 66604 822 -60238 -162701 -108169 -88820 -69933 -68417
10738 -68417 26098 6826 10399 -46680 -82109 -44680 44773 58746 -49554 -143123 -56621 -18687
10726 -18687 5817 -61049 -25701 -100546 -127574 -90758 -70628 -69273 -56874 30900 31972 51898
10714 51898 61311 86458 29837 -51466 -76671 -68981 -76941 -128993 -127076 74615 90502 7935
10702 7935 48032 -97397 -90099 4583 5862 35853 77728 16085 36861 30415 -103838 24883
10690 24883 -1790 -15024 -51307 -16844 -93686 -147388 -45477 -16841 -18061 -38854 42977 -28560
10678b8560k7679P760R7392M4096q7181k556L8011j6387M8026O4224J4265m8036
10666A03375p8764j03133r0179P5930K4052Q5364o0293q5553j389J06774q1775
10655a05591J46641l2284K3484k6951P0202L410p3134o4194k4827L2926K7825
10644b2493J12046o6981r7108N8872o285o3813K3157O1966k6446M8120M6838l3715
10632C4158Q070m1763j8539N8441p8340j5488P2145n2969j5193O6202R2493L730
10620A12947j10811n1617R143L7391P7563p8934k2472n919m117n3079K0827N7684
10608a1394J0779O2104j39806Q411Q9317l7785k4747J2293O7432l6256L2691J4964
10596D8003K6496J9998n2768m471m2139J3818K8012N5593O4641j23724R8714p3531
$$ plain form
10678 -28560 -56239 -48479 48913 93009 5828 3272 41283 24896 72922 137146 151411 103375
10666 103375 24611 -78522 -168701 -92771 -68719 16645 -43648 -129201 -130590 -23816 -105591
10655 -105591 41050 8766 32250 5299 75501 78911 5777 -58417 -83244 -50318 -22493
10644 -22493 89553 22572 -74536 -15664 -21949 -85762 -62605 -639 -27085 21035 67873 34158
10632 34158 42228 465 -18074 40367 -37973 -53461 18684 -34285 -49478 16724 109217 112947
10620 112947 2136 -49481 -40338 -2947 74616 -4318 -26790 -32709 -36826 -89905 -69078 -11394
10608 -11394 -615 61489 -78317 -69906 19411 -18374 -43121 -30828 36604 348 33039 48003
10596 48003 74499 94497 41729 37258 -4881 8937 36949 92542 157183 33459 132173 58642
10584E8642j4474O1608j04035N6695K2161n7725Q6794Q6650n3889n5861j6584
10573F9982j2814J28978L9164q0072j63750K6560P5055j4021P8772N9819m9289
10562A58384m006j26403J4114O0883K6206J33237K612m460p3249J991o632k8563
10550A54114L4231l4541k7152M5368K992J4049k3988q4996M3632K5611N488O8911
10538B23719P727j13213M6319N5246m6300j19656o222J06300j8511n1448P6198
10527A60159r723j0628m9207j0867j82Q0668j9389L1458J08997R732P3444p9495
10515B84967N777l7959j39793j37290K6342l4830Q2034k4366J04672P7014j6499
10504A90069j08134J458J50330M4571K8397M4138q4853j8265J42143L8252m5943
$$ plain form
10584 58642 44168 105776 1741 58436 80597 22872 109666 196316 142427 86566 69982
10573 69982 57168 186146 225310 145238 -18512 8048 83103 69082 147854 207673 158384
10562 158384 154378 27975 42089 102972 129178 262415 265027 260567 187318 189309 182677 154114
10550 154114 188345 153804 126652 172020 175012 189061 165073 80077 123709 149320 154808 223719
10538 223719 231446 118233 164552 219798 173498 53842 47620 153920 135409 83961 160159
10527 160159 150436 139808 90601 79734 79552 160220 140831 172289 281286 291018 364462 284967
10515 284967 290744 252785 112992 -24298 2044 -32786 49248 24882 129554 206568 190069
10504 190069 81935 83393 233723 278294 306691 350829 265976 247711 389854 428106 382163
10493C82163r6513N8432m2840j4034k685Q154O0104M2552k5841Q0430k9632o8516
10481C51774j4830R1839j1219r9529K323R00N8634n5673m9978R2887P1268p029
10469D31367n6896J0235N6161j3340k4291l5302j1057J4547M7502K931m2535m4747
10457C34575k3323n6598O4028M8956j13109J01064J0357L5293j1297L9664L7098
10446D66708K8263l4519P850l3736K516J15891O185l6873l955Q2062j8198N7145
10434F39339j19559N3372R6427j47395j17128N998R4611M306l6478O4642K0784
10423E58919J30251r1058l8019O0597Q255L0346k604m1735m719M1769J01237k0357
10411G32882k8790o972P0468p3545j1002M3410j18252J25646R2919p862K2076
$$ plain form
10493 382163 285650 344082 301242 287208 284523 292677 352781 395333 369492 449922 420290 351774
10481 351774 336944 428783 417564 318035 320358 321258 379892 324219 274241 367128 438396 431367
10469 431367 374471 384706 440867 427527 403236 367934 356877 371424 418926 421857 379322 334575
10457 334575 311252 254654 318682 367638 254529 355593 365950 401243 389946 429610 466708
10446 466708 494971 460452 468302 434566 437082 552973 559158 522285 518330 600392 582194 639339
10434 639339 519780 573152 669579 522184 405056 411054 505665 509971 473493 538135 558919
10423 558919 689170 598112 560093 620690 628945 659291 656687 614952 610233 652002 753239 732882
10411 732882 704092 697120 767588 694043 683041 726451 608199 733845 826764 818902 840978
10400H40978q819M0513n8834N4901Q3596p5266r6624N5853K9548l9170L835Q6812
10388I17323R2461J9646L6854M7189K8987q7894j363L1649J34573N2653q4134
10377A187944N0658M109Q2528K9347K4437N0265O3844r3389M8752l2963J5228
10366A430760Q3641L3823N7081M8814J04763m3046L6405m0066J81319P9970k9928
10355A943536P0572J31415N8459O0766j3654O0230O8453L8319N6192O8262R4303
10344B636853L8203L4055N2274k5787R6402K4585J09933J17526p5317R0016J56157
10333C254900J09536J0686J27349R7885j6128Q2866J43912J20820o960J60369
10323D085235J47364J20157N8354J21155J88421J80243J34297J03173J25586J55669
$$ plain form
10400 840978 832159 872672 813838 868739 952335 877069 780445 836298 865846 826676 830511 917323
10388 917323 1009784 1029430 1066284 1113473 1142460 1054566 1053203 1084852 1219425 1272078 1187944
10377 1187944 1238602 1242711 1325239 1354586 1379023 1429288 1493132 1399743 1448495 1415532 1430760
10366 1430760 1514401 1548224 1605305 1654119 1758882 1715836 1752241 1712175 1893494 1973464 1943536
10355 1943536 2014108 2145523 2203982 2264748 2251094 2311324 2379777 2418096 2474288 2542550 2636853
10344 2636853 2675056 2709111 2761385 2735598 2832000 2856585 2966518 3084044 3008727 3098743 3254900
10333 3254900 3364436 3375122 3502471 3600356 3584228 3667094 3811006 3931826 3924866 4085235
10323 4085235 4232599 4352756 4411110 4532265 4720686 4900929 5035226 5138399 5263985 5419654
10313E419654M2974K19828L29589J42896K18797K80792K26099K42253K91621K61708
10303G676211K18374K33535L64443M11815M85092L09533L56296L69376M67881
10294A0892556N82876N38481O09429N57503O63124O61443P95157Q15820R60857
10285A7077246Q45716R00888J080579J073905J089844J074295J055918J048660
10277B5247051J076361R37496Q26516M45418K91999J77996j65221m08529m49494
10268B7979593p67553q07350j005514j221946j092559j154887j145584j121538
10260A9662662j147246j032325j037779r70388r24583p71664p09734p38744p47280
10251A1582919o15721m62344n22750m66920n57568m83786l52837n10565l35055
$$ plain form
10313 5419654 5462628 5682456 6012045 6154941 6373738 6654530 6880629 7122882 7414503 7676211
10303 7676211 7894585 8128120 8492563 8904378 9389470 9699003 10055299 10424675 10892556
10294 10892556 11475432 12013913 12623342 13180845 13843969 14505412 15300569 16116389 17077246
10285 17077246 17922962 18823850 19904429 20978334 22068178 23142473 24198391 25247051
10277 25247051 26323412 27260908 28087424 28532842 28824841 29002837 28837616 28429087 27979593
10268 27979593 27212040 26404690 25399176 24177230 23084671 21929784 20784200 19662662
10260 19662662 18515416 17483091 16445312 15474924 14550341 13778677 13068943 12330199 11582919
10251 11582919 10967198 10504854 9982104 9515184 8957616 8473830 8120993 7610428 7275373
10242G275373l40732l65135j50790k44904k88179k72562j69159k26697k89846
10233D927369j81210k54343j12555n4444j36649j87857j75309L463k36857j22760
10223C468848j89616k126o9796j17804k4452j38282p9857j24143l2161j41540
10213B549071n7680k39355n9326N6742m7691R104j10057n1455l7469p4991r8863
10202A838030N6037j80398k5169O146j67923p929l4399q1737N3099q713q6196
10191A360848o2294o9866l634l3015L0182o1371o889o2027k0843K7239k989m4779
10179A050562l1569O3141M875j14075J00557r0334j7787J3218n6489j3000j9862
10168H89237M0203l5933o5577K0415k2422n4036O8112J5690o4950m377j7850n4868
$$ plain form
10242 7275373 6934641 6569506 6418716 6173812 5885633 5613071 5443912 5217215 4927369
10233 4927369 4746159 4491816 4379261 4324817 4188168 4000311 3825002 3828465 3591608 3468848
10223 3468848 3279232 3277106 3207310 3089506 3065054 2926772 2846915 2722772 2690611 2549071
10213 2549071 2491391 2252036 2192710 2249452 2201761 2210865 2100808 2049353 2011884 1936893 1838030
10202 1838030 1894067 1713669 1688500 1694646 1526723 1518794 1484395 1402658 1455757 1447044 1360848
10191 1360848 1298554 1228688 1225054 1192039 1222221 1160850 1153961 1091934 1071091 1098330 1095341 1050562
10179 1050562 1018993 1082134 1087009 972934 1073491 983157 965370 978588 922099 909099 889237
10168 889237 929440 893507 827930 848345 825923 771887 839999 855689 790739 786362 768512 713644
10156G13644j3021P2483J7233M6786o7825n6097Q58N9575q7178n6712P7663m011
10144G03398m6658m7364m1140j8790m9921L7037Q6468o7768p3618n7766J5221
10133D39099k7062k1942R878N2077k9362l2114j0246O9245m7190j42996P8317
10122C37704J24449L1603r8817j44613Q5396J0739j7807R409k619l597o1645l7373
10110B32829l2436R5960M7383j2857P0340M4638m9685r4092J8724O6560q5623
10099C01741o6420L0058J2344j0119j2955j4462n0827R0433l0775o3705l5735
10088A49578Q971p1224K8117L8790o9642q548O0755l9869o2384O142R0470O408
10076A37564r7065M6122Q9308M6918k5573M869k6871q8719N7363l4176N6865N719
$$ plain form
10156 713644 700623 773106 790339 837125 769300 713203 714061 773636 686458 629746 707409 703398
10144 703398 656740 609376 568236 549446 499525 536562 623030 555262 481644 423878 439099
10133 439099 412037 390095 399973 452050 422688 390574 380328 449573 402383 259387 337704
10122 337704 462153 493756 394939 250326 335722 346461 328654 338063 335444 331847 270202 232829
10110 232829 200393 296353 343736 330879 401219 445857 396172 302080 320804 387364 301741
10099 301741 235321 265379 277723 267604 254649 240187 189360 279793 249018 185313 149578
10088 149578 158549 87325 115442 154232 84590 76042 136797 96928 34544 40686 131156 137564
10076 137564 40499 86621 175929 222847 197274 202143 175272 86553 143916 109740 166605 172324
10064A72324n9184m6996j6304M4966n0776j6384K4242j9348O3636K7608K5758
10053A49542O9323o4395n8205k8305J756q304N0888J153k7031m9454j9596m8193
10041c0821N9614n5955N2114P7063q7090L5516q8666l4625L608J08599j1033Q1594
10029A09918J7731k614J9201p7492o7875J0839J06768p4923m7021N0738l3416
10018A1854L6126o8900n3894Q4209P7903N2342K5788j4887o8108K6104j10821
10007b284m8200Q361O6803p2377j13534L3178r330P1576M4571q1258m2590L1934
9995a13150K4176p9554J6770o760J2596R8687N0368q850q0038M3097M1503p8601
9983g9756J19108k2793n9687K2512j8418N6426j03403j1367L128K6096L5679p1584
$$ plain form
10064 172324 113140 66144 49840 94806 44030 27646 51888 32540 96176 123784 149542
10053 149542 218865 154470 96265 67960 69716 61412 112300 113453 86422 36968 17372 -30821
10041 -30821 28793 -27162 24952 102015 14925 50441 -38225 -72850 -69242 39357 28324 109918
10029 109918 127649 125035 144236 66744 -1131 9708 116476 41553 -5468 45270 11854
10018 11854 47980 -20920 -74814 9395 87298 139640 165428 150541 82433 108537 -2284
10007 -2284 -50484 -42123 24680 -47697 -161231 -128053 -137383 -65807 -21236 -102494 -145084 -113150
9995 -113150 -88974 -168528 -151758 -158518 -145922 -47235 3133 -5717 -85755 -42658 -1155 -79756
9983 -79756 39352 16559 -43128 -20616 -39034 17392 -86011 -97378 -94250 -68154 -32475 -104059
9971a04059Q2962K5941j24111n9110J12522K5984k2745M6642P5798l5877n294
9960A8653L0162p2831r4510L8419J0586M9380l9361P2772l2194r9J9724n0438
9948d9737k5554k0456P1976L8555o0814J4471j0941J5586m8794K7245M9447J37923
9936A38907P3643j09503j01377j8501J9767l8956k3426l7301O5076J9989j3105
9925b4787j5736Q4419M3939q9505n7170L1628r48J26568k5062j06937j891L2632
9913b850k7038p4137Q3503R6659j18397j4973J6466m5585J6206Q3052l4076J0000
9901a1170l8104M1191j7727P1561n1941p4136K9271j04212N5484J29486P1948
9890A01651m6124p7729M4262M5058j20071n7993Q4967j5942O4936L7318l9181
$$ plain form
9971 -104059 -21097 4844 -119267 -178377 -65855 -39871 -62616 -15974 59824 23947 18653
9960 18653 48815 -24016 -118526 -80107 -69521 -20141 -59502 13270 -18924 -19023 701 -49737
9948 -49737 -75291 -95747 -23771 14784 -46030 -31559 -42500 -26914 -75708 -48463 984 138907
9936 138907 212550 103047 1670 -16831 2936 -36020 -59446 -96747 -31671 -11682 -24787
9925 -24787 -40523 43896 87835 -1670 -58840 -27212 -28160 98408 73346 -33591 -35482 -2850
9913 -2850 -29888 -104025 -20522 76137 -42260 -57233 -40767 -86352 -70146 12906 -21170 -11170
9901 -11170 -49274 -8083 -25810 45751 -6190 -80326 -51055 -155267 -99783 29703 101651
9890 101651 55527 -22202 22060 67118 -52953 -110946 -25979 -41921 23015 60333 21152
9879B1152l2431j06381K4726m0733O6431Q8458k5245K5755J7732J39258J6252
9868A94974j19362o292r2281l1966J16364j3524k8280o7228l8618j0605J1486
9857h5332L9861o8592l0533Q6536L3470L1215K0972o9298j2001r2651J6195m2558
9845a72716J01922j663l5556N7920l2955j861k3052J03646m3556j8233O266J8776
9833d1062O2412k4687j03789N7725K7040l7695k0902K9929m8473O6508L1897o1623
9821f2720o690l2700M817R9044o3001j8248j8051L2003L5921J24334J5251j34465
9809b4505l4996M3402J14822m1543M2329N587m73m6630M133P8618l1753j38231
9797b9240l8844l982m753R0571J18477q511o5022k9835L2729l578n249M0303M3611
$$ plain form
9879 21152 -11279 -117660 -92934 -133667 -67236 21222 -4023 21732 39464 178722 194974
9868 194974 75612 69320 -22961 -54927 61437 47913 19633 -47595 -86213 -96818 -85332
9857 -85332 -45471 -114063 -144596 -58060 -24590 6625 27597 -41701 -53702 -146353 -130158 -172716
9845 -172716 -70794 -72457 -108013 -50093 -83048 -84909 -107961 -4315 -47871 -66104 -59838 -41062
9833 -41062 21350 -3337 -107126 -49401 -22361 -60056 -80958 -51029 -99502 -32994 -1097 -62720
9821 -62720 -69410 -102110 -97293 1751 -61250 -79498 -97549 -65546 -29625 94709 109960 -24505
9809 -24505 -59501 -16099 98723 57180 99509 105096 104623 57993 62126 140744 108991 -29240
9797 -29240 -68084 -72066 -76819 13752 132229 123718 58696 28861 61590 58012 52763 93066 136677
9784A36677J5827l400l0560M0764k03758m7817J42057N7194j6668m1432l1673
9773A7211J7245R6457N8396n1115r6714P1538J34102n1179n8888O0251J2789k6793
9761A83300J56961P2073L4527O2311j2893J6239j97289l724O2592l0243m4045
9750B99809k21308Q8604J00023l9523k7457n8977L1283J6475O1385K6305j7730
9739B58889L0620m746L4295K5384r3645N2081P662L5122Q0814l7191J22501J5250
9727E27036k8847N3715j16588j21578L9750M3786n6909q2153m3156P0884J2832
9716B98772k3277m5127l22O7988K296n9517j07209J47131o8324l3872l9753n865
9704A32921M9251m5828K4356J8683k0941P0672o0863j34653P0776J15253o0568
$$ plain form
9784 136677 152504 149104 118544 159308 -44450 -92267 49790 106984 90316 48884 17211
9773 17211 34456 130913 189309 138194 41480 113018 247120 195941 137053 197304 210093 183300
9761 183300 340261 412334 446861 509172 496279 512518 315229 311505 374097 343854 299809
9750 299809 78501 167105 267128 227605 200148 141171 172454 188929 250314 276619 258889
9739 258889 289509 284763 319058 344442 250797 302878 310540 345662 426476 389285 511786 527036
9727 527036 498189 551904 435316 313738 353488 397274 340365 258212 215056 285940 298772
9716 298772 275495 230368 230046 298034 300330 240813 133604 280735 212411 178539 138786 132921
9704 132921 182172 136344 160700 179383 158442 229114 168251 33598 104374 219627 159059
9693A59059j8942m7788j5226J4860j29621J04573J73262j4261j21500n2682M5587
9682I7321J10875r1201M2400m6742j022r8090k8273K924k3068P5936J00066J2665
9670A53791M1901k4848M4617K6117j65899l9705m5352J7027R4498l5728O5533
9659A31952P6893j7098r5075q8408J21404O2275q5725J7660j6678j82028R8434
9648B3606K6368K190N5776l8204N0518K0915J1807r7850N6946J63578p7970o5309
9636A32371K8868J6579l4083R5288J952q7150K6961n323L7553J53165J1300P7047
9624D54528p3491N7127P2282p7448j49427p3249l752Q428R8476j8417n7530m7204
9612A90323p9995q1440P6042J9269j2333m6660J02696N5065n9888N2293o2852
$$ plain form
9693 159059 140117 92329 77103 91963 -37658 66915 240177 225916 104416 51734 97321
9682 97321 208196 116995 159395 112653 111631 13541 -14732 -11808 -34876 41060 141126 153791
9670 153791 195692 170844 215461 241578 75679 35974 -9378 7649 102147 66419 131952
9659 131952 208845 191747 96672 8264 129668 191943 106218 123878 107200 -74828 23606
9648 23606 49974 52164 107940 69736 120254 141169 152976 55126 112072 275650 197680 132371
9636 132371 161239 177818 143735 239023 240975 153825 180786 175463 213016 366181 377481 454528
9624 454528 381037 438164 510446 432998 283571 210322 206570 214998 313474 295057 237527 190323
9612 190323 110328 28888 104930 124199 111866 65206 167902 222967 163079 215372 152520
9601A52520p8990M2033n7521m5985J19426O3656k4508j8000o1647J08351q373
9590A90962K2721N962l3471q1889p6948K2900l6562L1234P087o8385K3677N7330
9578F4618O3182n5054M8525J1316N835J1030q0084M345R5467j4855n4165j1061
9566H9099l3933P196L2904R0299J9425J8789p435k7533l0038J8584K3889M4928
9554B46174N2732m9928n9178N5879J6209j5108j7135O6138R6997m8619K1350J29432
9542D94943j3227L5443n8375n496O4674L624r616q9781K9559O8446L4263o8406
9530D86051n8893Q1638q1536j25660k762J1566o4062M7778j46695L7665J05318
9519B90408m1842Q274m5275M1420J9582m146K7143l0998m3061L1674N8646n1161
$$ plain form
9601 152520 73530 115563 58042 12057 131483 195139 170631 152631 90984 199335 190962
9590 190962 213683 219645 186174 104285 27337 50237 13675 44909 51996 -16389 7288 64618
9578 64618 127800 72746 121271 132587 138422 149452 69368 73713 169180 154325 100160 89099
9566 89099 55166 62362 95266 185565 204990 223779 216344 188811 158773 177357 201246 246174
9554 246174 298906 248978 189800 245679 261888 246780 229645 295783 392780 344161 365511 494943
9542 494943 481716 517159 458784 453288 517962 521586 511970 422189 451748 520194 554457 486051
9530 486051 427158 508796 427260 301600 298838 310404 246342 294120 147425 185090 290408
9519 290408 248566 256840 211565 252985 272567 268421 295564 264566 221505 253179 311825 260664
9507B60664L9009o0327j52302L3665M3035M7198k4681m606j08032q088J13602
9496A79137L5563l3024N668O4320P760p5293Q874j2025K2909O614n41k9473r747
9483A70742K4622J2588L1805r779M1298J01408R829j46743J813P5136J2953j20568
9471B05104P8227O5256k2064j55779L2879N8583M110J25797l4069N4836j2411
9460D00469j05K0029o1645j33843J1092r576J41709k5011k4326J3246m4268n8763
9448B29008o4491L3156J00227R2665j12094Q4073r4766J132K5787O6424p1792
9437B89329m7871l934o7808N5620N8925J6855L4513m345K2230n903K9412j976
9425C75047r2202J5542k748M9101m1256l7082J1183N1884k6394O816k0662l9058
$$ plain form
9507 260664 299673 239346 87044 120709 163744 210942 186261 181655 73623 65535 179137
9496 179137 214700 181676 187344 251664 259424 184131 193005 180980 203889 210503 209962 180489 170742
9483 170742 195364 207952 239757 229978 271276 372684 382513 235770 237583 312719 325672 205104
9471 205104 283331 348587 326523 170744 203623 262206 266316 392113 358044 412880 400469
9460 400469 400364 420393 358748 224905 235997 226421 368130 343119 318793 332039 287771 229008
9448 229008 164517 197673 297900 390565 278471 362544 267778 268910 294697 361121 289329
9437 289329 241458 237524 169716 225336 284261 301116 335629 331284 353514 347611 377023 375047
9425 375047 282845 298387 295639 344740 303484 266402 277585 329469 303075 309891 289229 250171
9413B50171j5411L1509n0780O3915Q3801L1642L3479J7970k7247r6788O0964M4435
9401D27660L6288o7212j9544k3975M6652r549l8686K8819j1814k3425k0547m3268
9389B81399o1210J36042o507j26861P2548N6107n6127J64340k7194m4881J38392
9378E26048J5329q768P510M3062J7139q3735J46267J06240o5060R4528J00642
9367H99202J68652L8601N4344J00332m0524P9026j01223K1772k7043j10088j30071
9356I52980r5571L386l7386j31249j35606o2415O9255n4693N5171O0685m9303
9345E75254J01342k8894K2002j6176j2776j49401j89455J38865n9830M9714N6474
9334D87119Q3855p1531o9401j43496J34344P9531j46476M7338N1941L7504j28691
$$ plain form
9413 250171 234760 266269 215489 279404 363205 394847 428326 446296 419049 322261 383225 427660
9401 427660 463948 396736 377192 353217 399869 390320 351634 380453 368639 345214 324667 281399
9389 281399 220189 356231 349724 222863 295411 351518 295391 459731 432537 387656 526048
9378 526048 541377 532609 540119 583181 600320 516585 662852 769092 704032 798560 899202
9367 899202 1067854 1106455 1160799 1261131 1220607 1299633 1198410 1220182 1193139 1083051 952980
9356 952980 857409 860795 823409 692160 556554 494139 563394 508701 563872 624557 575254
9345 575254 676596 647702 669704 653528 640752 491351 301896 440761 380931 430645 487119
9334 487119 570974 499443 430042 286546 420890 500421 353945 401283 453224 490728 362037
9323C62037M860l6921N3668r3923l7418O4448J6085n2627M4636o8589J50362l6826
9311C69792J8562O2113J8192m2743j2967q4877p6163M7094K7578N495O1103M3329
9299D36508l3211o7908q826J07455L2501l6157r1274m1095k65Q2577L3501m2472
9287C71334m9151P9690N7996j6039J644J07582j41434r2570M8157J8961m6425
9276C39745q6915J93665K701M8219p5177R5054J5953j77088P8261J5218Q001J8356
9264D75993P5534j8680K1854J459l9383k7667j47877M3230K3613k0443O6871r4659
9252C59845p0001R190M0412o3715o97J07798M3039n2001L3805q958m979P1353
9240D65091n371J9122p3972L285J40151K9790n555l7775l7257m4330P1592l2027
$$ plain form
9323 362037 366897 329976 383644 289721 252303 316751 332836 280209 324845 256256 406618 369792
9311 369792 388354 450467 468659 425916 412949 328072 251909 299003 326581 332076 393179 436508
9299 436508 403297 335389 326563 434018 466519 430362 339088 297993 297728 380305 413806 371334
9287 371334 322183 401873 459869 443830 445474 553056 411622 319052 367209 386170 339745
9276 339745 252830 446495 449196 497415 422238 517292 533245 356157 434418 449636 457637 475993
9264 475993 551527 532847 554701 556160 516777 489110 341233 384463 408076 387633 454504 359845
9252 359845 289844 299034 339446 275731 275034 382832 425871 373870 407675 398717 393738 465091
9240 465091 459720 478842 404870 408155 548306 578096 572541 534766 497509 453179 524771 492744
9228D92744o4481Q294P8272J9785j2987m9737J5720N5404q1237K3391o855L6981
9216E15294L3463j7715K2965P1427j12357n5094J10274p281N0252O403J4891M6640
9204F79162J9793m4099m4512m9002n5658R1422R0361k2732r801R9092q0088J893
9192F75831M6271j8454P0643M2125k4119p5121L6147K4005O8386o4205P9574J63006
9180A024089O7071J52982O1145J3481J26225K57153J72544M84978J59395l17020
9170B202043k87850k37180k84648j16780l5760j58297j384J18927r8210n419N8745
9159A154187q209J3960r6200M4427M285m6515p6704P6996L0465Q6253J16257l8300
9147A260902O8277m3227k5641J17127O7038j9890j0610J76566M2143K7489J5902
$$ plain form
9228 492744 428263 436557 514829 534614 521627 471890 487610 543014 461777 485168 478313 515294
9216 515294 548757 531042 554007 625434 513077 457983 568257 560976 611228 617631 632522 679162
9204 679162 698955 654856 610344 561342 505684 597106 687467 664735 654934 754026 673938 675831
9192 675831 722102 703648 774291 816416 792297 717176 753323 777328 845714 781509 861083 1024089
9180 1024089 1091160 1244142 1305287 1318768 1444993 1702146 1874690 2359668 2519063 2202043
9170 2202043 1914193 1677013 1392365 1275585 1239825 1081528 1080144 1199071 1100861 1095442 1154187
9159 1154187 1145978 1159938 1063738 1108165 1112450 1065935 989231 1066227 1096692 1182945 1299202 1260902
9147 1260902 1329179 1285952 1260311 1377438 1444476 1424586 1413976 1590542 1632685 1660174 1676076
9136A676076N3942Q2777R1610K00651J46928J61748N14706L48837K72693K01494
9126C751462j57460k36636l27607j68610l4631j78661K2277r036j36653K7445
9116B551890j72593k46219j62364k3915n8127M6416J6749n9614m5018P5684O1869
9105A984758k8344L6374j7911O4807J16201J82724J96333K31715O1779k2658M9956
9094B855734J54283O8761K41209L74119L95299N05379J92049j12850m76287n88396
9084C609300m78040k46084j94592j25132l7126Q7080j20287p750K0169k2866n479
9073B479193o2318o1319q6854l624R740l1846J112L9834M7793K0380L4182J00646
9061B486919J17907R0626r115O4009N5669N4132L8786j0036j02028L2308n1403
$$ plain form
9136 1676076 1730018 1812795 1904405 2105056 2251984 2413732 2928438 3277275 3549968 3751462
9126 3751462 3594002 3357366 3029759 2861149 2826518 2647857 2670134 2661098 2524445 2551890
9116 2551890 2379297 2133078 1970714 1946799 1888672 1935088 1951837 1892223 1847205 1922889 1984758
9105 1984758 1956414 1992788 1974877 2039684 2155885 2338609 2534942 2766657 2828436 2805778 2855734
9094 2855734 3010017 3078778 3319987 3694106 4089405 4594784 4786833 4673983 4197696 3609300
9084 3609300 3131260 2885176 2690584 2565452 2528326 2615406 2495119 2487369 2507538 2484672 2479193
9073 2479193 2416875 2355556 2268702 2265078 2274818 2242972 2244084 2283918 2331711 2352091 2386273 2486919
9061 2486919 2604826 2695452 2686337 2750346 2806015 2860147 2898933 2888897 2786869 2819177 2767774
9050B767774j45726q6307j9859q682K8946o4898N6659k4113N0653N8761j2734
9039B600474P8511O9474n6363K3941L9382k6584m2163k4672J92400j0720j5880
9028B827800M0305L0806Q8323M6612R7451k830J11827J04974O3303R0847L2970
9017C532388J31732J00231J01047m1555K02725L00147J82584K03868J55066L15603
9007E183836M14961K27071L14223J53910J61567J54513r5361j0586J3789m5304
8997F472619L744O8080l2817j77088j34667l36206m25307m20111k73146k54899
8987D490202k41588o7720j38176k07037q8101l1176j30344j12743n7240l4367
8977C381710j22111j4819Q316m2540k0247n3467M6200J5543p3709K5109j748K9219
$$ plain form
9050 2767774 2622048 2535741 2515882 2507200 2536146 2471248 2527907 2503794 2554447 2613208 2600474
9039 2600474 2678985 2748459 2692096 2716037 2755419 2728835 2686672 2662000 2854400 2843680 2827800
9028 2827800 2868105 2898911 2987234 3033846 3131297 3128467 3240294 3345268 3408571 3499418 3532388
9017 3532388 3664120 3764351 3865398 3823843 4026568 4326715 4509299 4713167 4868233 5183836
9007 5183836 5598797 5825868 6140091 6294001 6455568 6610081 6514720 6504134 6517923 6472619
8997 6472619 6476363 6544443 6511626 6334538 6199871 5863665 5438358 5018247 4745101 4490202
8987 4490202 4248614 4180894 4042718 3835681 3747580 3716404 3586060 3473317 3416077 3381710
8977 3381710 3259599 3244780 3253096 3210556 3190309 3136842 3183042 3198585 3124876 3149985 3148237 3177456
8965C177456L3212j8481p9203l2978P6387J54905m9648L7075P7779m1876J04752
8954C439380j859J73328N4760n1153L6536Q1119N3743k6226O997J2631R673o6824
8942C722105j57751L0440k8085P5936p3596k7979M0592L5221O4296l7844n1202
8931C592133j22563J1443k0042l3859M7687k6704m142J7089M7096p1770J0610
8920C446978P1682l7039n0417J7644N1328N053N9610J40109J9676J6711m432l06
8908C736597J14701P3375N6191K3427R8189N7324J4962Q8201K06886L3490r9952
8897D403391M2421J39214J61117J72784N3717j693P6795J22018j7135J6338J29570
8886E298537K01952M38505M80351M68164L01427m2801j75827m55558m60807j93324
$$ plain form
8965 3177456 3210668 3192187 3112984 3080006 3156393 3311298 3261650 3298725 3376504 3334628 3439380
8954 3439380 3437521 3610849 3665609 3614456 3650992 3732111 3785854 3759628 3766625 3779256 3788929 3722105
8942 3722105 3564354 3594794 3566709 3642645 3569049 3541070 3581662 3616883 3681179 3643335 3592133
8931 3592133 3469570 3481013 3460971 3427112 3474799 3448095 3443953 3461042 3508138 3436368 3446978
8920 3446978 3518660 3481621 3431204 3448848 3500176 3505229 3564839 3704948 3724624 3741335 3736903 3736597
8908 3736597 3851298 3924673 3980864 4004291 4102480 4159804 4174766 4262967 4469853 4503343 4403391
8897 4403391 4445812 4585026 4746143 4918927 4972644 4970951 5047746 5169764 5152629 5168967 5298537
8886 5298537 5500489 5938994 6419345 6887509 7188936 7146135 6970308 6514750 6053943 5860619
8876E860619q7860j25269k3620o0501j28808j86071m6113j29329J0149L7771p30
8865E120238m2730R910j9579j0751q5796j5429K485M4327J00816J63623J66584
8854E433698J77142J29363K21032K60852R7062J0461J95122K40228L65014K67408
8844G397382L41485L41081K88107n7206m24562l30660k22020j40146o3225j51744
8834F978492K2378Q6025J08713J31258M8873K06370L5014M1561N4956m2062J12604
8823G784182J32414J27165O4659J47072N5517J61858K41596R9293J53974J18873
8813I086603J81050K64043K77906J21265K29094L22291J95631K13543K14472K37992
8803A1343890L04870K82062L42674M60539M81403O20855N03761M96186Q80508
$$ plain form
8876 5860619 5772759 5647490 5623870 5563369 5434561 5248490 5202377 5073048 5083197 5120968 5120238
8865 5120238 5077508 5087418 5067839 5057088 4971292 4955863 4958348 5002675 5103491 5267114 5433698
8854 5433698 5610840 5740203 5961235 6222087 6319149 6329610 6524732 6764960 7129974 7397382
8844 7397382 7738867 8079948 8368055 8310849 7886287 7555627 7333607 7193461 7130236 6978492
8834 6978492 7000870 7086895 7195608 7326866 7375739 7582109 7617123 7658684 7713640 7671578 7784182
8823 7784182 7916596 8043761 8108420 8255492 8311009 8472867 8714463 8813756 8967730 9086603
8813 9086603 9267653 9531696 9809602 9930867 10159961 10482252 10677883 10891426 11105898 11343890
8803 11343890 11648760 11930822 12273496 12734035 13215438 13836293 14340054 14836240 15716748
8794A5716748Q78323R53321Q70467O61511N90533N20879J70083K19553K19709
8785B0801127L39971K81631J4764m6192j8064j47448k34563j92570k6904P655
8775B0779407J94509K27580N23166M99787O86685P05483R22801R95750J479618
8766B7014786J732295K169052K627150L409500L963087M568022M673212M063008
8758E4220112L255284K729541K599374K270010J143685K31577p00996j191831
8750F4556756j713921j773561k081912l137624m268556m581082m252401l467314
8742C9280385k698752k001859j352184q80466o45598k18316p3083J49398L08742
8733C1868267L85584L76134N93031K35079K98300o7116j70098q1424K08474L65733
$$ plain form
8794 15716748 16595071 17548392 18418859 19080370 19670903 20191782 20361865 20581418 20801127
8785 20801127 21141098 21422729 21437493 21391301 21373237 21225789 20991226 20798656 20771752 20779407
8775 20779407 20973916 21201496 21724662 22224449 22911134 23616617 24539418 25535168 27014786
8766 27014786 28747081 30916133 33543283 36952783 40915870 45483892 50157104 54220112
8758 54220112 57475396 60204937 62804311 65074321 66218006 66449583 65748587 64556756
8750 64556756 62842835 61069274 58987362 55849738 51581182 47000100 42747699 39280385
8742 39280385 36581633 34579774 33227590 32347124 31701526 31483210 31410127 31559525 31868267
8733 31868267 32253851 32629985 33223016 33458095 33756395 33689279 33519181 33437757 33646231 34011964
8723C4011964N91617N61964R49094J090712J305581J311318J423856J722628J816102
8714D4784836K029621K613718L016473L448139M114052N414615P227878R358949
8706H2008281J1970250J6075932K1859759K9964937M1628045N7595420N5578548
8699C16681172m910928n3901752o1710606m4869414k6946724j9413811j4065715
8692I0862222j0568477p482975o170893m913036m906578m430272m360327l602222
8684D4427442l167110k520014k188375j687817j610916j079154j029516r10690
8676C0233850j255808j040216j269254r85141j237454j166813j016952q69286
8668B1392926r92853p49436o02950m08059n25934l72138m57119l42638m16812
$$ plain form
8723 34011964 34603581 35165545 36114639 37205351 38510932 39822250 41246106 42968734 44784836
8714 44784836 46814457 49428175 52444648 55892787 60006839 65421454 72649332 82008281
8706 82008281 93978531 110054463 131914222 161879159 203507204 261102624 316681172
8699 316681172 311770244 257868492 196157886 151288472 124341748 104927937 90862222
8692 90862222 80293745 72810770 66639877 61726841 56820263 52389991 48029664 44427442
8684 44427442 41260332 38740318 36551943 34864126 33253210 32174056 31144540 30233850
8676 30233850 28978042 27937826 26668572 25683431 24445977 23279164 22262212 21392926
8668 21392926 20400073 19650637 19047687 18639628 18113694 17741556 17284437 16941799 16524987
8659A6524987k11101l42958l06343l06369j27181j33884j10914j33882k67414
8650A4584941l14346k34113l46145l30872l21219n9283p3505j54668k01699k45932
8640A2303159k41399j98587k47772j92983l40142k63306j01895j04199j58172
8631A0454704q1958j73392j75344L6639j21184M5652Q1832n3201R9958J91628
8621A0305334N5966O521P1643O7527J44474J83869J33780J75092J82888O961j2904
8610A1321151k64166k73260k32517j03119j46308K1096o3605j47004j20921m1642
8600I949705m7336r7127K4858J6393M6651m855p0656M4087K4438n5414n2320q9157
8588I689267j21993j03078j01433l404m9380R4970O0698M5345m4059K86559M04612
$$ plain form
8659 16524987 16313886 15970928 15664585 15358216 15231035 15097151 14986237 14852355 14584941
8650 14584941 14270595 14036482 13690337 13359465 13038246 12978963 12905458 12750790 12549091 12303159
8640 12303159 12061760 11863173 11615401 11422418 11082276 10818970 10717075 10612876 10454704
8631 10454704 10372746 10199354 10024010 10060649 9939465 9985117 10066949 10013748 10113706 10305334
8621 10305334 10361300 10367821 10439464 10506991 10651465 10835334 10969114 11144206 11327094 11334055 11321151
8610 11321151 11056985 10783725 10551208 10448089 10301781 10322877 10259272 10112268 9991347 9949705
8600 9949705 9902369 9805242 9830100 9846493 9893144 9888289 9817633 9861720 9886158 9830744 9778424 9689267
8588 9689267 9567274 9464196 9362763 9359359 9309979 9404949 9465647 9510992 9466933 9753492 10158104
8577A0158104R4190J43646K01669K89652K76583J83198K95782M08907M95754P02081
8567A3249566P88560O00892K29939r7335l28223l75252l64568l16316k42220J5380
8557A3160423j05650j65936j32626j05110l42147l44873k36319j86794q3219k5586
8547A1432163k4283J59908J12074J85454L68882J83530J68416J99501P7707L8603
8537A2901955j42198k29502j95094P1020J65209M4099N6619L81215M10227K77806
8527A3741356L22052J98245K71131K05688m669k2044k0943R1406J36465R7538
8517A5016225K51369M3571P3331K44119n6458K32054L19607L99419N35953O29336
8507A7688526Q65324J052411J064222J206404J233745R69998M61702K63139l0601
$$ plain form
8577 10158104 10252294 10395940 10597609 10887261 11163844 11347042 11642824 12051731 12547485 13249566
8567 13249566 14038126 14639018 14868957 14771622 14443399 14068147 13703579 13387263 13145043 13160423
8557 13160423 13054773 12888837 12756211 12651101 12308954 11964081 11727762 11540968 11457749 11432163
8547 11432163 11407880 11567788 11679862 11865316 12234198 12417728 12586144 12785645 12863352 12901955
8537 12901955 12759757 12530255 12335161 12406181 12571390 12615489 12672108 13053323 13463550 13741356
8527 13741356 14063408 14261653 14532784 14738472 14733803 14711759 14690816 14782222 14918687 15016225
8517 15016225 15267594 15311165 15384496 15628615 15572157 15804211 16123818 16523237 17059190 17688526
8507 17688526 18553850 19606261 20670483 21876887 23110632 24080630 24542332 24805471 24774870
8498B4774870k24153k83784j40421P6508K84318O16141Q49913O69636O12491Q74393
8488B8109912R08159K03495o80286q52180o89659l72120q3964q343J50661P4770
8478B6760445l56202o01735m84358l71490j20981k3957J18074L10555L38352L66053
8468B5934756P30676Q69140J053693J286822J356327J658722K147718K542488
8460C7580342L249366L750609M918935O503851Q154106J0566831J2663696J2317626
8452I9705362Q952049O549733O853201M979143l306275j1050916j2534036r496664
8444I0651597n326211k213366j044804l437157p230890r007821q465220o693051
8436D7233077n257492m263398l622836l080847k464950k292566j785841j449053
$$ plain form
8498 24774870 24550717 24266933 24126512 24203020 24487338 25103479 25953392 26623028 27235519 28109912
8488 28109912 29018071 29221566 28541280 27689100 26999441 26627321 26543357 26535014 26685675 26760445
8478 26760445 26404243 25802508 25318150 24946660 24825679 24801722 24919796 25230351 25568703 25934756
8468 25934756 26665432 27534572 28588265 29875087 31231414 32890136 35037854 37580342
8460 37580342 40829708 44580317 49499252 56003103 64157209 74724040 87387736 99705362
8452 99705362 108657411 115207144 122060345 127039488 123733213 112682297 100148261 90651597
8444 90651597 85325386 83112020 82067216 78630059 71399169 62391348 53926128 47233077
8436 47233077 41975585 37712187 34089351 31008504 28543554 26250988 24465147 23016094
8428B3016094j267842j052678r25514p96819q11561n84984o33600n78777n89036
8419A5775283n10666m43155k14362k96301j86186p567J75544J46160J93806K90884
8409A4923440N0871j76708j49258r6534k06672m3118J0708p9207n45641p42885
8399A2944996o20987m96646m18060m88360o57123n59914n40705n29340l31262
8390H302599m77301l07960k09949k29957j78503k09251k47466j08723j72115q4322
8380F077052j33567o3722j89422k10882j89431q6270r3717j3642j53627o6814
8370D875958o5017k9851n1901p5173j00815j763q4235l1726k00724n5350n835
8359D173568k29014q158n0278K9978p8821p2563q901R4296l0682q8389k5307n7038
$$ plain form
8428 23016094 21748252 20695574 19770060 18973241 18161680 17576696 16943096 16364319 15775283
8419 15775283 15264617 14821462 14607100 14310799 14124613 14117046 14292590 14438750 14632556 14923440
8409 14923440 14974311 14797603 14648345 14551811 14345139 14302021 14312729 14233522 13687881 12944996
8399 12944996 12324009 11827363 11409303 10920943 10263820 9703906 9163201 8633861 8302599
8390 8302599 7825298 7517338 7307389 7077432 6898929 6689678 6442212 6333489 6161374 6077052
8380 6077052 5943485 5879763 5690341 5479459 5290028 5203758 5110041 5096399 4942772 4875958
8370 4875958 4810941 4781090 4729189 4654016 4553201 4551438 4467203 4435477 4234753 4179403 4173568
8359 4173568 3944554 3936396 3886118 3916096 3837275 3764712 3755811 3850107 3819425 3731036 3705729 3648691
8347C648691n0537j23798j11533l6285j98534p7348n8452j7574j12510k1220j309
8336B839591Q5760j15086r8366n501n0827m4494R0992r3499l9834Q6323j8646
8325B636413j09554n816O9975J1157j0820M9093J43644M8198M2911J1476o4552
8314B822125O584M2560l0925L054j03989j06501j3576n1392j0091J7356O8479
8303B643684M4059J07175N206J5314N384K3945k7038j07313m8544m7357O6493
8292B681008l4539r7997j75029J64238N1291j8994l6423n6005N3366L7863q7268
8281B481511j41760j9193R6555j065j17033P4769L8385m758k6592N5688j0066
8270B426441m184l0079J8189o2160p4849m2179j50842j40295q7322M4535q2680
$$ plain form
8347 3648691 3598154 3474356 3362823 3326538 3128004 3050656 2992204 2974630 2862120 2840900 2839591
8336 2839591 2925351 2810265 2711899 2706398 2655571 2611077 2702069 2608570 2568736 2655059 2636413
8325 2636413 2526859 2521043 2591018 2602175 2591355 2640448 2784092 2832290 2875201 2886677 2822125
8314 2822125 2828709 2871269 2840344 2843398 2739409 2632908 2619332 2567940 2557849 2575205 2643684
8303 2643684 2687743 2794918 2800124 2815438 2820822 2844767 2817729 2710416 2661872 2614515 2681008
8292 2681008 2646469 2548472 2373443 2537681 2588972 2569978 2533555 2477550 2530916 2568779 2481511
8281 2481511 2339751 2320558 2417113 2416048 2299015 2373784 2412169 2407411 2380819 2436507 2426441
8270 2426441 2422257 2392178 2410367 2348207 2273358 2231179 2080337 1940042 1852720 1897255 1814575
8259A814575q3491Q108K606O5087n8346P957R683J00972n4468J4342O5886n7840
8247A835071n2760M4725Q623P4495K237m0188J3661L3980O7258J84496O5062R6167
8235B332827K0435m147J36476J1523N6685l6369j00326l9497J91064J41250O4006
8224B773927L03388L19978J16006j76350l79420k13395j63071r1699j59273j08394
8214B221697j07844j33047o5564k2815k1203q0801j7957r5382j14709j49135M0397
8203A453637m4070p7396N8381m3294l8396P2233j39512j24791m3506j0296l2583
8192A030407J96654K46729j55263k2746l2898o3409j12640P1898j7853k2892j73176
8181I44811M7834P5183N4226q8326r9856K9274J2218p7688Q5316L1163o1698m0391
$$ plain form
8259 1814575 1731084 1739192 1741798 1806885 1748539 1756496 1766179 1867151 1812683 1827025 1892911 1835071
8247 1835071 1782311 1827036 1835659 1910154 1912391 1872203 1885864 1919844 1987102 2171598 2236660 2332827
8235 2332827 2353262 2349115 2485591 2497114 2553799 2517430 2417104 2377607 2568671 2709921 2773927
8224 2773927 3077315 3397293 3513299 3336949 2957529 2744134 2581063 2489364 2330091 2221697
8214 2221697 2113853 1980806 1915242 1892427 1871224 1790423 1772466 1677084 1562375 1413240 1453637
8203 1453637 1409567 1332171 1390552 1347258 1308862 1381095 1241583 1116792 1073286 1062990 1030407
8192 1030407 1227061 1473790 1318527 1295781 1262883 1199474 1086834 1158732 1140879 1117987 944811
8181 944811 992645 1067828 1122054 1033728 933872 963146 975364 897676 982992 1014155 952457 912066
8169I12066P4655Q8209n8348j13385n6320j08955l0367Q1165M7952q3953j01058
8158F51661K125l1721j9016n1990J8702R430j6738p5937O7424J04970M2797R3432
8146G95139O2403j46525o2605j12520J2439j8297L1635k7846O1597J11382K9932
8135G36734l629n9148l1711j0449J3372j1232k5908N3897Q541J759N9118l9013
8123F92331J15491r053L5742m0098j8786J5430l3233j3243Q5064J16304J6934
8112I62883J8937r7105k1672m1451L5293j0024K0327J06898M3544P2964K8548
8101A119142K6756P5908P6161r498J4747j07420m9229l0626l3753l2918n0309
8090I98961O6581o1013j38359N9208L6663o846K9152m0126m5204p6883K9145J1327
$$ plain form
8169 912066 986721 1074930 1016582 903197 846877 737922 707555 788720 836672 752719 651661
8158 651661 653786 622065 603049 551059 569761 579191 562453 486516 553940 658910 701707 795139
8146 795139 857542 711017 648412 535892 548331 530034 561669 533823 595420 706802 736734
8135 736734 733105 673957 642246 631797 645169 633937 608029 661926 670467 672226 731344 692331
8123 692331 807822 798769 834511 794413 775627 791057 757824 744581 829645 945949 962883
8112 962883 981820 884715 863043 821592 856885 846861 867188 974086 1017630 1090594 1119142
8101 1119142 1145898 1221806 1297967 1288469 1303216 1195796 1146567 1115941 1082188 1049270 998961
8090 998961 1065542 1004529 866170 925378 962041 955195 984347 944221 899017 822134 851279 862606
8078H62606l6528P0109R0338p5084j2119N7613o5739N0439O8971N9621q8324m7121
8066I34782o0534K5335o1857L5558Q1352P5768J28952k4255p5434q1011j4969
8055I63687j3384J0952q7552p8119o1895m4013l2536J08914O2283r8150n5335
8044F74852J7768p2356K0551P704r1116j667O2942m3537q141j58732J2123J94292
8032F14683J0352q4927j43470l9636Q9371K619n9787m0480J9465J44167m2554
8021D69803j09841N9179l8729k5110L6242Q6737m5981r159r0954p2113j2198l5346
8009B12530J3280R9570P7992R4145r4823k8710j5769o1601q583O6970L7995p574
7997C85422m6717J7940N8306M4505L5087J3905n2808k0706L4099P8534Q0868Q4595
$$ plain form
8078 862606 826078 896187 986525 911441 899322 956935 891196 941635 1010606 1070227 981903 934782
8066 934782 874248 899583 837726 873284 954636 1030404 1159356 1135101 1059667 978656 963687
8055 963687 950303 961255 873703 795584 733689 689676 657140 766054 828337 730187 674852
8044 674852 692620 620264 640815 648519 557403 555736 618678 575141 567000 408268 420391 614683
8032 614683 625035 540108 396638 357002 446373 448992 389205 348725 368190 512357 469803
8021 469803 359962 419141 380412 355302 391544 478281 432300 423141 332187 260074 247876 212530
8009 212530 225810 325380 403372 497517 402694 373984 358215 296614 288031 355001 392996 385422
7997 385422 338705 356645 414951 459456 494543 508448 455640 434934 469033 547567 628435 713030
7985G13030J5350m5142N4546N4086j8214K9399R75n2332n9784p0877l4538q7127
7973D99372K421N3072j03540N19J75084k6437q1402M3798k1216p6428J5317k0160
7961D60400M2206j77440O0248K4018M725j2683P5229J8189k7969K5757K3659J05826
7949F22165J65021l7209L2666L0476J2695j22360n5197J00036J10749l3502q340
7938H17200j20997j18807j3269k0409n5439j8743p916m4852J8821n7074J8330
7927C96845O2090Q677L5348k8743j12576l1058l3208N7565n6342L5484N9038O450
7915C99570l6857r5204j4504Q765R5687L218r9318J9996P486J7621l3933K0773
7903B93300j7778j06756j1464Q0868m1421N0389m2288K5603J07474q1950j01227
$$ plain form
7985 713030 728380 683238 737784 791870 773656 803055 804030 751698 691914 621037 586499 499372
7973 499372 501793 554865 451325 451844 626928 600491 519089 562887 541671 465243 480560 460400
7961 460400 502606 325166 385414 409432 414157 401474 476703 494892 466923 492680 516339 622165
7949 622165 787186 749977 782643 813119 825814 703454 648257 748293 859042 825540 817200
7938 817200 696203 577396 564127 543718 488279 469536 461620 416768 435589 378515 396845
7927 396845 458935 467612 502960 474217 361641 330583 297375 354940 298598 334082 393120 399570
7915 399570 362713 267509 253005 261770 357457 360675 261357 281353 288839 306460 272527 293300
7903 293300 275522 168766 157302 238170 196749 247138 204850 230453 337927 255977 154750
7892A54750n4232K6359o153N6484R581O6726m5502q9162q7078j5371J2978M8659
7880G8039J3692o019L8716m0561n715l6768Q5896k0479j7622K0295J01511J3416
7868B24401p9764j5432N6107L9774r1792J0253o1050Q5169k5267p7258K1564L8253
7856A24958l5927l3703L5246L0541J25999l8038l7695Q8424p1675n9705o4997
7845F3428P2967N6969r8244L2548J8716R1056o0341o3388l2050j6323J9255R170
7833I3763j31832K0850R6554m1454o4638m9054j6224J3396J39646J10137j54100
7822A7044l299o4914K0547L2062M648L5649J5463R760m2440o3224n2016K5435
7810f5285n918m5226m1908Q4392j92339N2379K27151N2859j3040P288j20767O9189
$$ plain form
7892 154750 100518 126877 120724 177208 186789 253515 208013 118851 31773 16402 29380 78039
7880 78039 91731 85712 124428 83867 78152 41384 127280 106801 89179 109474 210985 224401
7868 224401 144637 129205 185312 225086 133294 143547 82497 167666 142399 65141 86705 124958
7856 124958 89031 55328 90574 121115 247114 209076 171381 259805 188130 128425 63428
7845 63428 136395 193364 95120 127668 146384 237440 177099 113711 81661 65338 84593 93763
7833 93763 -38069 -17219 79335 37881 -26757 -75811 -92035 -78639 61007 171144 17044
7822 17044 13745 -51169 -30622 1440 6088 41737 57200 66960 24520 -38704 -90720 -65285
7810 -65285 -71203 -116429 -158337 -73945 -266284 -213905 13246 66105 53065 60353 -60414 8775
7798H775P0402q7298j4951K0019R7006L7328K3513o8523P601M137m0986l9937
7786A7086L2576j10631R156J56489L8608m874q4477p5057L1947M1901J66497j35510
7774H3711n4872O2975o3740J8079K7886n7817l1878J277L0398Q7485L7M7708r795
7761A41454q4612J7821N3549L225M424j09911P1543K3875r1386N4329J8891K2915
7749A26117P331j32077r6384P8420K01196J943j04369q6977j0567O1604P3339
7738A19576k9002j59459K3632J22191r750q2656N1220J5559P0009L3873q7502
7727F7691q2995Q269M6987k7330R5048J4411m8620j7866O8404j4032k8714j3624
7715F7629M4963n8954n5959L0118N3209j539j13219k5285O261l1070K4383L9221
$$ plain form
7798 8775 79177 -8121 -23072 -3053 93953 131281 154794 86271 93872 98009 57023 17086
7786 17086 49662 -60969 -51813 104676 143284 138410 53933 -21124 10823 52724 219221 83711
7774 83711 28839 91814 28074 46153 74039 16222 -15656 -14379 16019 103504 103541 151249 141454
7761 141454 56842 74663 128212 131437 135861 25950 97493 121368 29982 84311 103202 126117
7749 126117 133448 1371 -95013 -16593 184603 186546 82177 -4800 -15367 46237 119576
7738 119576 90574 -68885 -45253 76938 67188 -15468 35752 51311 121320 155193 67691
7727 67691 -15304 -7035 39952 12622 107670 122081 73461 55595 123999 109967 81253 67629
7715 67629 112592 53638 -2321 27797 81006 79467 -33752 -59037 -52776 -83846 -59463 -20242
7703b0242O7242O5191M1194o3731M5506k3244l4161j3190K3071O9482j12580N8680
7691A03218M6023j8848j45312k6966K9104L4783m165O9960M3594k7256p8372Q2098
7679A07861n2103q0266k828p6500K6988P2447P768m6061P8234k7504Q9514n8926
7667C8624p589k4213l6739m7639L1624P1816N8354j3831K4511l3465k7089N2671
7655H7035m0533N8232J2316j8934k2849j05774O6874O3579o3285P3518Q3901j21763
7643G2317m2005j7926M5253k3501j2766M479m3593Q8741O1075o8081O2442n6015
7631G0420j08540R0565k1443P4521k8892p8909J7554N7087l0475j4041M3664m5959
7619B5552M2988K0550j16928k1869P5029Q1146O0508n0981k2617O5166m7644O852
$$ plain form
7703 -20242 47000 112191 153385 89654 135160 111916 77755 64565 87636 157118 44538 103218
7691 103218 149241 130393 -14919 -41885 -12781 22002 17837 87797 131391 104135 25763 107861
7679 107861 55758 -24508 -27336 -103836 -76848 -4401 3367 -42694 35540 8036 97550 38624
7667 38624 31035 6822 -29917 -77556 -45932 25884 84238 70407 94918 61453 34364 87035
7655 87035 46502 104734 117050 98116 75267 -30507 36367 99946 36661 110179 194080 72317
7643 72317 30312 12386 57639 34138 21372 25851 -17742 70999 132074 63993 126435 70420
7631 70420 -38120 52445 31002 105523 76631 -2278 15276 72363 41888 27847 71511 25552
7619 25552 68540 89090 -27838 -49707 25322 106468 166976 115995 93378 158544 110900 117752
7607A17752j65613J7379N3062O193O7600l7539J4792q8211j1880P5460j1727P067
7595D4335j1356Q6945j12361m9324p517M6369P746R218P9270K7022p5853J4976
7583E9470O1023m240P232J4405m7462l1750P1282O7265n1892j61971j2606Q335
7571b0909K9711L9641J19463o7257R6506K0637q4428m0292P4100J7381p1922m5997
7559F6634N788Q0474k031p1818Q4440m7650o0539N1362O6352q365N0250J20299
7547C35196j64900q2843j08150N1590L7589N865M3468l1289k4102O0154o917M8076
7535A63737k0564J19023n7527o4811j553O7615P3515k1015n7629M526l0668k7950
7523A46699K4019P1702K4689k0538O3115j03975m5570O2141j555O3637J00870
$$ plain form
7607 117752 -47861 -30482 22580 28773 96373 58834 73626 -14585 -26465 48995 37268 44335
7595 44335 32979 119924 7563 -41761 -49278 -2909 4837 14055 93325 120347 44494 59470
7583 59470 120493 116253 123485 137890 90428 58678 129960 197225 145333 -16638 -29244 -20909
7571 -20909 8802 48443 167906 100649 197155 217792 133364 93072 167172 184553 112631 66634
7559 66634 72422 152896 150865 79047 163487 115837 55298 106660 173012 164647 214897 335196
7547 335196 170296 87453 -20697 30893 68482 74347 117815 86526 62424 122578 115661 163737
7535 163737 143173 262196 204669 139858 138305 205920 279435 258420 200791 205317 174649 146699
7523 146699 170718 242420 267109 246571 309686 205711 160141 222282 220727 284364 385234
7512C85234o6909o2537n8052K4185r663m8511N7816m5740j3270M0166K4076K5200
7500B51995J47859L0912j16220R367K9197q820j26526O5493M1802L496l5079k8916
7488B64560J40568M6056n4901O7735m848o7609n4806m6958L9512K7176p7793L7438
7476C16130m9903L0999J06997j21081J8818P4713M1459k5718r0306Q7261p5514
7465C13855Q6394j4897r150J03874r811j21467o2050m5844L4978P5195N790m5368
7453C11499p4581J24293L6325j01253j6080J15517N4160q956M8984j14045M2009
7442D17872J16290N2710J5447p9343j09547J2643M1851L2429K9873j9544k0554
7431D90127J1210r2092M5844L3007p8199J54922Q8799M1040k5002M46L625M7896
$$ plain form
7512 385234 318325 255788 197736 221921 212258 163747 221563 175823 162553 202719 226795 251995
7500 251995 399854 430766 314546 323913 353110 344290 217764 283257 325059 328555 293476 264560
7488 264560 405128 451184 396283 464018 459170 391561 336755 289797 329309 356485 278692 316130
7476 316130 266227 297226 404223 283142 301960 376673 418132 392414 302108 389369 313855
7465 313855 400249 385352 376202 480076 470265 348798 286748 240904 275882 351077 356867 311499
7453 311499 236918 361211 397536 296283 280203 395720 449880 440924 489908 375863 417872
7442 417872 534162 586872 602319 522976 413429 426072 467923 500352 530225 510681 490127
7431 490127 501337 409245 455089 488096 409897 564819 653618 694658 669656 670102 673727 721623
7419G21623o8777r6908P2712L5978N7253l8982P8292N0458k9249K4625m9853P2993
7407H30165l6455J19567J3936P9446M0225o3108L3031o0236J5017K1472O7182
7396A060242M4505q1714L4965O7347J1375J10108Q9389M8440p744J35868R7127
7385A609908n4443J70121N6902N8276J0639J0551q34P2860R2687o5628O0681P6525
7373B098245m286j32843Q0301R6865k4925m6280M3028o7155o5938l2050K4745
7362A969707J1913o0455O3075j02062j14624j20884o9340q2819j54351j19930
7352A220230J0676O1970m3381m0052p0543k9774j8749O0074O1016r78p2184n4825
7340A083480N9665n0781L5749k8366N3696L6647J2254l2738n4081m8957J47224
$$ plain form
7419 721623 652846 555938 628650 664628 721881 682899 761191 811649 782400 807025 757172 830165
7407 830165 793710 913277 927213 1006659 1046884 983776 1016807 956571 971588 993060 1060242
7396 1060242 1104747 1023033 1057998 1125345 1136720 1246828 1336217 1384657 1376913 1512781 1609908
7385 1609908 1555465 1725586 1782488 1840764 1851403 1861954 1861120 1933980 2026667 1961039 2021720 2098245
7373 2098245 2093959 1961116 2041417 2138282 2113357 2067077 2110105 2042950 1977012 1944962 1969707
7362 1969707 1981620 1921165 1984240 1882178 1767554 1646670 1577330 1494511 1340160 1220230
7352 1220230 1230906 1292876 1249495 1209443 1138900 1109126 1090377 1150451 1211467 1210489 1138305 1083480
7340 1083480 1143145 1092364 1128113 1099747 1153443 1190090 1202344 1169606 1115525 1066568 1213792
7329A213792O0408k750n0796M3257k592k1881O5053O252j4691r173K5911N0562
7317A363352M115O5710m476k5561K1245m5762O2341P7782P8087N0820Q6464l6117
7305A698000k4192J52397k870n8194J06105R8961j02178n3916J89740J4153K662
7294B020668J01030P953q6601l022l738j06848l4373J2871L7250r9439j44287
7283A701464J44635L0697M9318m5744j06970q7768j42881l0386j77343j05166
7273A229856m648N907N4555o9095k3026o6534P839k0706M5002n0528l8251j423
7261A068948M0813j6515m5846K968P7477j4737o8540R6707M2279n2144n4208O8801
7249A146003L7467q5472n3631P4998L4342J3384k7868M1497k5067q2222R7511
$$ plain form
7329 1213792 1274200 1271450 1220654 1263911 1261319 1239438 1304491 1310743 1296052 1286879 1312790 1363352
7317 1363352 1367467 1433177 1428701 1403140 1424385 1378623 1440964 1518746 1596833 1647653 1734117 1698000
7305 1698000 1673808 1826205 1823335 1765141 1871246 1970207 1868029 1814113 2003853 2018006 2020668
7294 2020668 2121698 2129651 2043050 2040028 2036290 1929442 1895069 1907940 1945190 1845751 1701464
7283 1701464 1846099 1876796 1926114 1880370 1773400 1685632 1542751 1512365 1335022 1229856
7273 1229856 1225208 1231115 1285670 1216575 1193549 1127015 1134854 1114148 1159150 1108622 1070371 1068948
7261 1068948 1109761 1093246 1047400 1050368 1127845 1113108 1044568 1141275 1183554 1131410 1077202 1146003
7249 1146003 1183470 1097998 1044367 1119365 1153707 1167091 1139223 1180720 1155653 1073431 1170942
7238A170942M4092j8999N7198J4198L9410M8480n1377n0884L601M9164P7269L0354
7226A413448N2382K9859O5034J0190J814o6002r6817L0877M7886J96679o574l8360
7214A640416K9967L0210K2109K3760J06240P4082Q1042J65908Q1808P6377K3174
7203B355093J97186K46632K47527K27190J72453J22770J8675J21670n9538p6958
7193C572700k3863J47248L4295p3059j13198r8897r3542j97140r1806k09782q9633
7182B763323o0458j93249j48839N090p025k4894L2367M8328j35497p8005J6034
7171B217175J01375l238k28828m6439M7283M1447K3891J0836r8214n8290r243
7160A997755l5660J19515l7127o8313M2901N9448N4782M6137J70597R8209R2959
$$ plain form
7238 1170942 1215034 1196035 1253233 1267431 1306841 1355321 1303944 1253060 1256661 1305825 1383094 1413448
7226 1413448 1465830 1495689 1560723 1570913 1572727 1506725 1409908 1440785 1488671 1685350 1678776 1640416
7214 1640416 1670383 1700593 1722702 1746462 1852702 1926784 2007826 2173734 2255542 2331919 2355093
7203 2355093 2552279 2798911 3046438 3273628 3446081 3568851 3587526 3709196 3649658 3572700
7193 3572700 3548837 3696085 3730380 3657321 3544123 3445226 3351684 3154544 3062738 2852956 2763323
7182 2763323 2702865 2509616 2360777 2365867 2358842 2333948 2366315 2414643 2279146 2201141 2217175
7171 2217175 2318550 2315312 2086484 2040045 2087328 2128775 2152666 2163502 2065288 2006998 1997755
7160 1997755 1962095 2081610 2044483 1976170 2019071 2078519 2133301 2179438 2350035 2448244 2541203
7149B541203L849J29853K21781K76308J7484M8483l025k4457k9698O4260K7790
7138C273831n2607q3523l8554m9582j51313k28511j80315k05799j46910M8900
7128B185617L332r6906n6524m6294j4885q711j33950j18924N3307l5262j19066
7117A611734N5565p1352j25921J0056P737m9005p8267M3478L9664j2431r83l3513
7105A396762r859n0667K8009J1978n704P1171k8728j55613O2747J33K926l7841
7093A285314p4493P5734P9016j7050l971p3508K1641n4410R995J32522K6517k6087
7081A381220N024m2176p2754j57005Q3910P8034J2800L2950j8697l4241j28948
7070A140117K2267N9104m9229o5981J16696q7901J2375K1709K7035o073j9809
$$ plain form
7149 2541203 2545052 2674905 2896686 3172994 3190478 3238961 3235936 3211479 3181781 3246041 3273831
7138 3273831 3221224 3137701 3099147 3049565 2898252 2669741 2489426 2283627 2136717 2185617
7128 2185617 2188949 2092043 2035519 1989225 1974340 1965629 1831679 1712755 1766062 1730800 1611734
7117 1611734 1667299 1595947 1470026 1480082 1487819 1438814 1360547 1404025 1443689 1431258 1430275 1396762
7105 1396762 1386903 1336236 1364245 1376223 1370519 1441690 1412962 1257349 1320096 1320229 1323155 1285314
7093 1285314 1210821 1286555 1365571 1348521 1344550 1271042 1292683 1238273 1248268 1380790 1407307 1381220
7081 1381220 1386244 1344068 1271314 1114309 1198219 1276253 1289053 1322003 1303306 1269065 1140117
7070 1140117 1162384 1221488 1172259 1106278 1222974 1135073 1147448 1169157 1196192 1190119 1170310
7059A170310j775j1344J40425j25294L4785l4486L6230n4119r1785K0749r0239
7048I93457k0172j9582J11184N8968L8225J6819j4396k3174M0217Q021m6917n0131
7036A092519k822K2083P0524O7497K0624k5624m3285O64R7326Q7381P0153m979
7024A452061R041Q6344K9640K8408q1392q0827N9500N7469l7859j85384Q5718
7013A422719K0596p3295N7709L9282k7973o3649O1793Q1314m6598O2720R4952
7002A629570Q2952M89n8277J9484Q7209K8722Q3630P2793r3371J92894L1790J58
6990B078043L3639q0641m8242J19888q6225R069R378j11160n9012p273O0955k9822
6978A888597r7232K6888K6320K9503N8037l6930j4705o039l0629j01004o2665
$$ plain form
7059 1170310 1168535 1157191 1297616 1172322 1207107 1172621 1208851 1154732 1062947 1083696 993457
7048 993457 973285 953703 1064887 1123855 1162080 1178899 1164503 1141329 1181546 1189567 1142650 1092519
7036 1092519 1089697 1111780 1182304 1249801 1270425 1244801 1201516 1202180 1299506 1386887 1457040 1452061
7024 1452061 1461102 1547446 1577086 1605494 1524102 1443275 1502775 1560244 1522385 1337001 1422719
7013 1422719 1443315 1370020 1427729 1467011 1439038 1375389 1437182 1518496 1471898 1534618 1629570
7002 1629570 1712522 1713011 1654734 1674218 1761427 1790149 1873779 1946572 1853201 2046095 2077885 2078043
6990 2078043 2111682 2031041 1982799 2102687 2016462 2025531 2034909 1923749 1864737 1857464 1918419 1888597
6978 1888597 1791365 1818253 1844573 1874076 1932113 1895183 1880478 1874439 1843810 1742806 1680141
6967A680141N1915l8994n1904J2841j333N2115L7723P0286k5003j05202j5048
6956A667537r0087J7071O6915j1772P4302r7695L9894P5388Q8256m2571O6023
6945A853261R9335l7378J4095k3837l2543j7815q894Q6371L8252j6381p5315o6271
6933A812880J1986J9899r8381j07962M985o541L1936j12125M5759P7375j33463
6922A546348m4924J01449j9253J9254j9282J04572J5521n5117K4059n8322J9925
6911A634230O452k2174k0837K7559J00182j8941K8088M8508N9624P0437q8570
6900A824558j13265M5082j2p658o266k4620q8787Q2063J48228M124n7430k9807
6888A776210m5130Q0784j4916j73769P6860L6935R6021Q08m3309O9618M2310M3802
$$ plain form
6967 1680141 1732056 1693062 1641158 1653999 1652666 1704781 1742504 1812790 1787787 1682585 1667537
6956 1667537 1577450 1594521 1661436 1649664 1723966 1626271 1666165 1741553 1829809 1787238 1853261
6945 1853261 1952596 1915218 1929313 1905476 1872933 1855118 1846224 1932595 1970847 1954466 1879151 1812880
6933 1812880 1824866 1844765 1746384 1638422 1643407 1636866 1668802 1556677 1602436 1679811 1546348
6922 1546348 1501424 1602873 1583620 1602874 1583592 1688164 1703685 1648568 1672627 1614305 1634230
6911 1634230 1640682 1618508 1597671 1625230 1725412 1706471 1734559 1783067 1842691 1913128 1824558
6900 1824558 1711293 1756375 1756363 1748705 1742439 1717819 1629032 1711095 1859323 1863447 1806017 1776210
6888 1776210 1731080 1811864 1796948 1623179 1700039 1736974 1832995 1833803 1790494 1860112 1902422 1946224
6876A946224Q9964O7855O4196M006P0153J1246M4593Q6141k369J34791K15320
6865B732120J28389p5313q3161j8653p1236j21728p3393M0552k2207n1770k9343
6854B354257P9342r7288J47506J49796K6195O1558J2775k2780N3881j2307j14865
6843B638070o9152p4613l1514l1063k5132m7747L884J22440o6417k6462O1145
6832B453439Q0230j1639n468Q8588M4303l0209o7274O7037L986p15L6448L3544
6820B692270n9905r2207M5230j1887m9786N5619o5974j25914q8569n8967l1412
6809B208498j8994m4749r0916j07036q0512o1674N4703N6704J4366L2880k0519
6798A942751m3308k7811j21868M5708l372k158k309P7906R1638k8385K7814m2219
$$ plain form
6876 1946224 2036188 2104043 2168239 2172245 2242398 2253644 2298237 2384378 2382009 2516800 2732120
6865 2732120 2860509 2785196 2702035 2683382 2612146 2490418 2417025 2457577 2435370 2383600 2354257
6854 2354257 2433599 2336311 2483817 2633613 2659808 2721366 2734141 2711361 2765242 2752935 2638070
6843 2638070 2568918 2494305 2462791 2431728 2406596 2358849 2362733 2485173 2418756 2392294 2453439
6832 2453439 2533669 2522030 2516562 2605150 2649453 2619244 2551970 2619007 2622993 2622278 2658726 2692270
6820 2692270 2632365 2540158 2585388 2573501 2523715 2579334 2513360 2387446 2298877 2239910 2208498
6809 2208498 2189504 2144755 2053839 1946803 1866291 1804617 1859320 1916024 1930390 1963270 1942751
6798 1942751 1899443 1871632 1749764 1795472 1792100 1789942 1787633 1865539 1957177 1928792 1956606 1914387
6786A914387J8837K2272K534J5428M1586O1339L0243K1075J3666o7451k5532J9942
6774B068326l8515j65590n5654J24485q8364l0552J07789J7454r7187o3284j09921
6763A668987q3760N0322P522l100N2099l3583N8541K6620J6958n9779n1712K3482
6751A672597K1862L1007k727j1380n2491k1642j21086j9423M9462k4934L2704
6740A553949J55743R8592r7583j31973p5352K6379M8757L4754O342l5760J4166
6729A598014p912P2270K6600o0752m5395J36519N1128m3622r800L7710m0624J3179
6717A727315P624p9606M1592O8707m3975L1288N6835K6557M460q0259l5323K6073
6705A751288P5668j26645k7297J70188Q9015q017n5196q6825N2069J19795n6096
$$ plain form
6786 1914387 1933224 1955496 1958030 1973458 2015044 2076383 2106626 2127701 2141367 2073916 2048384 2068326
6774 2068326 2029811 1864221 1808567 1933052 1844688 1814136 1921925 1939379 1842192 1778908 1668987
6763 1668987 1585227 1635549 1643071 1639971 1692070 1658487 1717028 1743648 1760606 1700827 1649115 1672597
6751 1672597 1694459 1725466 1722739 1711359 1658868 1637226 1516140 1496717 1546179 1521245 1553949
6740 1553949 1709692 1808284 1710701 1578728 1503376 1529755 1578512 1613266 1619608 1583848 1598014
6729 1598014 1590102 1662372 1688972 1628220 1582825 1719344 1770472 1726850 1717050 1754760 1714136 1727315
6717 1727315 1734939 1655333 1696925 1765632 1721657 1752945 1809780 1836337 1840797 1760538 1725215 1751288
6705 1751288 1826956 1700311 1673014 1843202 1932217 1924200 1869004 1782179 1834248 1954043 1897947
6694A897947r2376J0378j05024J40134R3467m9571M1658q4063p6848N0195L9047
6683A864944P9302n8479N2021j3904J1166M0217J51618m1125q6715N3720p6710
6672A976055l1288k4049M7579P4423J21050j26870m1474M9325n5680j5919P7059
6661B050211K5202M8194L953o347O1866O9737Q3119m6912o559k3503J00354n5087
6649B304228l578K8134j01783O8863K0230p7324j20598J03908N0768J6701M3608
6638B333157q9743J6014j5160P5413l8541j2093K4876k5221L6851R6773Q7562
6627B489888n2653M3911l3876L835m7339M964r2488L6174J24542O5166o3256j9344
6615B459524k5982L4767J0594Q5200k1727J1447l9941r4782N657m6902K6747J21139
$$ plain form
6694 1897947 1805571 1815949 1710925 1851059 1944526 1894955 1936613 1852550 1775702 1825897 1864944
6683 1864944 1944246 1885767 1937788 1923884 1935050 1975267 2126885 2085760 1999045 2052765 1976055
6672 1976055 1944767 1920718 1968297 2042720 2163770 2036900 1995426 2044751 1989071 1973152 2050211
6661 2050211 2075413 2123607 2127560 2121213 2183079 2252816 2335935 2289023 2282464 2258961 2359315 2304228
6649 2304228 2300650 2328784 2227001 2295864 2316094 2238770 2118172 2222080 2272848 2289549 2333157
6638 2333157 2243414 2259428 2244268 2319681 2281140 2269047 2293923 2268702 2305553 2402326 2489888
6627 2489888 2437235 2481146 2447270 2451105 2403766 2408730 2316242 2352416 2476958 2542124 2478868 2459524
6615 2459524 2433542 2468309 2478903 2564103 2542376 2553823 2513882 2419100 2424757 2377855 2404602 2525741
6603B525741j10367N0903P0283k8040K4591L7066q717O9947J8783O8248j1545
6592B706893k8699J851N8767M0692n1341K8978R4439O4587j50280Q17N4415P2658
6580B893777L0824n8783m8766N6243N2734q5330l2614N8606m1748r2525m17J29027
6568B861028M6808j7662L7152O0188M0356p586J0860j305o2403N0449L3546l531
6556C047900K6846Q420j0626j0568l1509N7522r5990K0604N5114K1147m4979N5586
6544C099467l8848n3150J0647K8459R1067N4767N2514j8939j9159J86547P9250
6533C472622K9484j0786n8755p3129r283p0743L1591R2080n993O3301k6583o0171
6521C373635L0097O8429L8354J5497R618k0129n192j1018J1143L2126J50146p0392
$$ plain form
6603 2525741 2415374 2466277 2536560 2508520 2533111 2570177 2561460 2631407 2650190 2718438 2706893
6592 2706893 2678194 2680045 2738812 2779504 2728163 2757141 2851580 2916167 2765887 2766704 2821119 2893777
6580 2893777 2924601 2865818 2817052 2873295 2926029 2840699 2808085 2866691 2824943 2732418 2732001 2861028
6568 2861028 2907836 2890174 2927326 2987514 3027870 3020284 3031144 3029839 2967436 3017885 3051431 3047900
6556 3047900 3074746 3083166 3072540 3061972 3030463 3087985 2991995 3012599 3067713 3088860 3043881 3099467
6544 3099467 3060619 3007469 3018116 3046575 3137642 3192409 3244923 3225984 3206825 3393372 3472622
6533 3472622 3502106 3491320 3432565 3359436 3350153 3279410 3311001 3403081 3397088 3460389 3433806 3373635
6521 3373635 3403732 3472161 3510515 3526012 3535630 3515501 3510309 3499291 3510434 3542560 3692706 3622314
6509C622314j945J0474k8826k257m0736L101M5465K8992m0253K1907K850m6004
6497C575082j5297J67525N2902L0983J4547J18915j8803n7849l678k108O781j8690
6485C850310j9140k2915J18748l6068P0405M230j5657L4694j3097N2347K8071
6474D051928l5189Q7062L1112k0915L9308M9857Q1019j737L7159L270j1024r2469
6462D219381O5860O3435k5779O9486l9676J2359o9629L2253P1074R0546M4027
6451D533337j7529K8404N9561l5483M7790N5212p4413Q8179j7724m2232J73345
6440D798447N0006k0657J8255L5300J66514j5474K9737k2772Q5261l2316J0528
6429E102829p6940m628m0110Q0007J61356N9240J01379r0360o2676Q0762k7195
$$ plain form
6509 3622314 3620369 3630843 3602017 3599760 3559024 3562125 3607590 3636582 3596329 3618236 3621086 3575082
6497 3575082 3559785 3727310 3780212 3811195 3825742 3944657 3925854 3868005 3864327 3862219 3869000 3850310
6485 3850310 3831170 3808255 3927003 3890935 3961340 3965570 3949913 3984607 3971510 4023857 4051928
6474 4051928 4016739 4103801 4134913 4113998 4153306 4203163 4284182 4282445 4319604 4322874 4311850 4219381
6462 4219381 4285241 4348676 4322897 4392383 4352707 4365066 4295437 4327690 4398764 4489310 4533337
6451 4533337 4515808 4544212 4603773 4568290 4616080 4671292 4596879 4685058 4667334 4625102 4798447
6440 4798447 4848453 4827796 4846051 4881351 5047865 5032391 5062128 5039356 5124617 5092301 5102829
6429 5102829 5025889 5021261 4981151 5061158 5222514 5281754 5383133 5292773 5230097 5310859 5283664
6418E283664K5667j13071R720R2298l1926M8221J07638R383N933q9589M5944O0926
6406E454808L3342J4840o0353m128J06321J09233N1415M2133p0035J5405K5757
6395E718738m1661o45o000L669R3383M9744j04794Q0239J05164J5922P2710o4549
6383E921920L0060k3879L960P8250R9989q8421R293J57129O3780L4657n6825R4758
6371F324671P5318l540J1864R1731J6688M2247J37597N7739j5740J4789K2875
6360F776239J48019K0737L9638J55463R9545N2158O4089M4789J09951N6243Q6369
6349G653240J12476l0630J36301M8527J44199J05033R4446J79441Q2335K03986
6339H729354K52528Q9592J94414J58487Q4607J00258L02446K36278L30007L92622
$$ plain form
6418 5283664 5309331 5196260 5205980 5298278 5266352 5314573 5422211 5431594 5437527 5347938 5393882 5454808
6406 5454808 5488150 5502990 5442637 5438509 5544830 5654063 5705478 5747611 5677576 5692981 5718738
6395 5718738 5677077 5676432 5670432 5674101 5767484 5817228 5712434 5792673 5897837 5913759 5986469 5921920
6383 5921920 5951980 5928101 5932061 6010311 6110300 6021879 6031172 6188301 6252081 6286738 6229913 6324671
6371 6324671 6399989 6396449 6408313 6500044 6516732 6558979 6696576 6754315 6738575 6753364 6776239
6360 6776239 6924258 6944995 6984633 7140096 7239641 7291799 7355888 7400677 7510628 7566871 7653240
6349 7653240 7765716 7735086 7871387 7919914 8064113 8169146 8263592 8443033 8525368 8729354
6339 8729354 8981882 9071474 9265888 9424375 9508982 9609240 9911686 10147964 10477971 10870593
6329A0870593L81306L61647O54614O97979Q01728Q28681Q22506J089811J087989
6320A7596854J109488J121598Q88737N47504J47821k94859p34931q07636j103503
6311A8471073j126803j073907j017728r71361p61485o35879o71171n29249m05502
6302A1277988l23378k96823k92143m49130k70984k03320j88199p0096k53611k57254
6292H673050p2404j50393q2731M4700j64712q3128q9756j07287p7232o9153j44435
6281G676519j60102j0509n8330j14714j13984j39887L540K6034j48537q8521j351
6270F870158N0200j31403j08136J18l5776r8994m6099j11793o9165q1650K7309
6259F264769n2786l6246r247j0322j10750j6395J65857o1390j18948j68l0640
$$ plain form
6329 10870593 11251899 11613546 12268160 12966139 13767867 14596548 15419054 16508865 17596854
6320 17596854 18706342 19827940 20716677 21264181 21412002 21117143 20382212 19574576 18471073
6311 18471073 17344270 16270363 15252635 14281274 13519789 12883910 12212739 11683490 11277988
6302 11277988 10954610 10657787 10365644 9916514 9645530 9442210 9254011 9183915 8930304 8673050
6292 8673050 8600646 8450253 8367522 8412222 8247510 8164382 8074626 7967339 7890107 7820954 7676519
6281 7676519 7516417 7505908 7447578 7332864 7218880 7078993 7082533 7108567 6960030 6871509 6870158
6270 6870158 6920358 6788955 6680819 6680937 6645161 6546167 6500068 6388275 6319110 6237460 6264769
6259 6264769 6211983 6175737 6166490 6156168 6045418 6029023 6194880 6133490 6014542 6014374 5983734
6248E983734p7422j16225l6822K6706n3429M1451K2677o7978M5240o0137j04580
6237E603215J6780j6587L104M660q2241l8869J47171o5437m4698J36929j8670
6226E645357q8061K5049J01956l2532Q2325O6774k0735m833q2113j12310L3003
6215E613880m9646R950P1244m6642m931K0395L1786j02593n0490L7252j0583p8255
6203E441367L3861M2810j11252o8269k0137N5509L6208o0348p5733j8886j41947
6192E113183M9267J6319m3931K621k5082J24749k9638q8125N7294q7459j07n9775
6180E029316j20196k4608R1068L1374R570k9728l2464J05036p1530q5462J1546
6169D913922K2809k4679r5292j8481M9473K5651k1972n5342O8308l4041o3538
$$ plain form
6248 5983734 5906312 5790087 5753265 5779971 5726542 5767993 5790670 5722692 5767932 5707795 5603215
6237 5603215 5619995 5603408 5606512 5611172 5528931 5490062 5637233 5571796 5527098 5664027 5645357
6226 5645357 5557296 5582345 5684301 5651769 5734094 5800868 5780133 5775300 5693187 5580877 5613880
6215 5613880 5564234 5574184 5645428 5598786 5593855 5614250 5646036 5543443 5492953 5530205 5519622 5441367
6203 5441367 5475228 5518038 5406786 5338517 5318380 5373889 5410097 5349749 5274016 5255130 5113183
6192 5113183 5162450 5178769 5134838 5137459 5112377 5237126 5207488 5119363 5176657 5089198 5089091 5029316
6180 5029316 4909120 4884512 4975580 5006954 5016524 4986796 4954332 5059368 4987838 4902376 4913922
6169 4913922 4936731 4912052 4816760 4798279 4847752 4873403 4851431 4796089 4864397 4830356 4766818
6158D766818J15084K0842l8466n9571j585J27357M5668N4703l4195R073o0982
6147D944746k1459M6200N6181m3809o0520R0801m8144q2143M8878j00487j00572
6136D729672l6548o0189j43219l0543K4430J4516j12104j12235m6024k0991N2365
6125D259130j3759K2376j17032p6011j21k933L2375O2904j6561q0681k2568q297
6113D038822m0362k5037M0315K2858o1515j14803n1006O1429l0133Q737l5178
6102C814127N6857o7064P6420P4972j70016R4129m7370j01632j5072j1921q393
6091C695037L101o842K8143J28649k7946j23802o5214N7213l7038q6730k1133
6080C543438j49k2950j22787M5515P0527L5612L0125p0604L1043m0326k1355P1488
$$ plain form
6158 4766818 4881902 4902744 4864278 4804707 4803122 4930479 4976147 5030850 4996655 5005728 4944746
6147 4944746 4923287 4969487 5025668 4981859 4921339 5012140 4963996 4881853 4930731 4830244 4729672
6136 4729672 4693124 4632935 4489716 4459173 4483603 4498119 4386015 4273780 4227756 4206765 4259130
6125 4259130 4245371 4267747 4150715 4074704 4074583 4071650 4104025 4166929 4150368 4069687 4047119 4038822
6113 4038822 3998460 3973423 4013738 4036596 3975081 3860278 3809272 3870701 3840568 3849305 3814127
6102 3814127 3870984 3803920 3880340 3955312 3785296 3879425 3832055 3730423 3715351 3703430 3695037
6091 3695037 3698138 3691296 3719439 3848088 3820142 3696340 3631126 3688339 3651301 3564571 3543438
6080 3543438 3543289 3520339 3397552 3443067 3513594 3549206 3579331 3508727 3539770 3499444 3478089 3549577
6068C549577m8085O9059p7179o4160n3161R8971p9088j7336M3279r0256j8636
6057C312985l6881p1162J18303l855n9978N3056N1704j27797n7663p587m719J08064
6045C274470p2086J3724L2678q1159l3422K240L577J12217m945j25401j1723J57685
6033C267855p2298j24659O295k7170N9884J8999J2270l6043p1172K6699j0280
6022C050380l2391K8752J15031o7335P974m3610j04516M9148K4815J0447N6020
6011C094715n383n830j4731M4156j4424j1583P6009j937O9154j63316J845L7871
5999C106546O640l0638K3961J8190L0085J022L863N0347l1771m5970J1855N6015
5987C200145j73332N0283O5846L0039N062O1847K2077m842L1912Q238l8141n9767
$$ plain form
6068 3549577 3501492 3570551 3493372 3429212 3376051 3475022 3395934 3378598 3421877 3331621 3312985
6057 3312985 3276104 3204942 3323245 3319390 3259412 3312468 3364172 3236375 3178712 3171125 3166406 3274470
6045 3274470 3202384 3216108 3248786 3167627 3134205 3136445 3140022 3252239 3247294 3121893 3110170 3267855
6033 3267855 3195557 3070898 3077193 3050023 3109907 3128906 3141176 3105133 3033961 3060660 3050380
6022 3050380 3017989 3046741 3161772 3094437 3102411 3058801 2954285 3003433 3028248 3038695 3094715
6011 3094715 3089332 3083502 3068771 3112927 3098503 3086920 3162929 3160992 3230146 3066830 3068675 3106546
5999 3106546 3113186 3082548 3106509 3124699 3154784 3155806 3159669 3210016 3178245 3132275 3144130 3200145
5987 3200145 3026813 3077096 3142942 3172981 3178043 3239890 3261967 3257125 3289037 3297275 3259134 3199367
5975C199367M9665J60297m745j32688r773O7727P2796O5893o9994N5884P5673
5964C530102q1453r995P670m8171J19540O994p5977R0995J43977j02907J2749
5953C593524J23472r510l9870N0389J02177J60350j31868R738j7561m8123J09879
5942C902597K9630J08090k6766n8767K6346j58262N689J22521L308K482l5303
5931C921565P9392j4381J7590L051j7859N9247j01623p0858J09244q6641n5957
5920C842770m0854Q0885j04338n9302J2065o4642K22j7042j45778j8758q196l0325
5908C446707N5134l5916J02541l4737q3585O1746j1837p3061P6423l209q8354
5897C411852J42494P3114l0487L1516O9790N0689l2765l1541j26317K5692K9627
$$ plain form
5975 3199367 3249032 3409329 3404584 3271896 3262123 3329850 3402646 3468539 3398545 3454429 3530102
5964 3530102 3448649 3438654 3446324 3398153 3517693 3524687 3448710 3539705 3683682 3580775 3593524
5953 3593524 3716996 3707486 3667616 3718005 3820182 3980532 3848664 3858402 3840841 3792718 3902597
5942 3902597 3932227 4040317 4013551 3954784 3981130 3822868 3828557 3951078 3954386 3956868 3921565
5931 3921565 4000957 3986576 4004166 4007217 3989358 4048605 3946982 3876124 3985368 3898727 3842770
5920 3842770 3801916 3882801 3778463 3719161 3731226 3666584 3666806 3649764 3503986 3485228 3477032 3446707
5908 3446707 3501841 3465925 3568466 3533729 3450144 3511890 3500053 3426992 3503415 3500206 3411852
5897 3411852 3554346 3627460 3596973 3628489 3698279 3748968 3716203 3684662 3558345 3584037 3613664
5886C613664k4810Q8205J4882N9100j2333M469J1258p775o160n0981P2424P9108
5874C841051k2451l2327j4181j2810K173P1397K9108N786J34196L8917m9697J31997
5862D123159J32349J8725P4270J24832P3630K01615R5661R979J16958J36804N5189
5851E163171J78845K00509M3589Q5340J48696O7944J48383P0889J15881j2547
5841F210700P6888J7404m2148Q9779N3768n8712o7211M1384k3435p916P0632l2093
5829F329040Q1741K0262o085K09729N2585J34511N7955J23248N2617J85865K88659
5818G530127J39007Q5242J06301J3143q2163r070l0668Q1467j50236j36068n2583
5807G494499n7526o2689J2434K50029L30918J44936j01540l90599n04079l77965
$$ plain form
5886 3613664 3588854 3677059 3691941 3751041 3738708 3743177 3754435 3746660 3740500 3689519 3761943 3841051
5874 3841051 3818600 3786273 3772092 3759282 3761455 3832852 3861960 3867746 4001942 4040859 3991162 4123159
5862 4123159 4255508 4274233 4348503 4473335 4546965 4748580 4844241 4854220 4971178 5107982 5163171
5851 5163171 5342016 5542525 5586114 5671454 5820150 5888094 6036477 6107366 6223247 6210700
5841 6210700 6287588 6304992 6262844 6352623 6406391 6347679 6280468 6321852 6298417 6290501 6361133 6329040
5829 6329040 6410781 6431043 6424958 6634687 6687272 6821783 6879738 7002986 7055603 7241468 7530127
5818 7530127 7669134 7754376 7860677 7873820 7791657 7782587 7751919 7833386 7683150 7547082 7494499
5807 7494499 7436973 7374284 7386718 7636747 7967665 8112601 8011061 7620462 7116383 6738418
5797F738418l80649l28134k51234k14502j53250k11417j10964R8824l2688l1044
5787E123360M3260R0417O4254M8564J4848J3310j30389q4018j18295M7890L6670
5776E149871L837k9218J7595J64330J60158j06523n6784J98826l9930L161J62194
5765E627517J6864Q7946J17468Q9426O9342O4681J57170J6532J38740J49958R4449
5754F630093J15772J10060O6888Q3227J54482J72526N7471K05019K19175K13518
5744H028231Q7119R5295K50373J08581L43914K01951K47827L53241M71091M96355
5734A0683978K91190N43843N50774N74382N74664O07638P17255Q08899P77492
5725A6130115P98277P20049N90567N83340L28865P4398k39257n47955p84146r04362
$$ plain form
5797 6738418 6357769 6029635 5778401 5563899 5410649 5199232 5088268 5187092 5154404 5123360
5787 5123360 5166620 5257037 5321291 5369855 5384703 5398013 5267624 5183606 5065311 5113201 5149871
5776 5149871 5153708 5124490 5142085 5306415 5466573 5360050 5303266 5502092 5462162 5465323 5627517
5765 5627517 5644381 5732327 5849795 5939221 6008563 6073244 6230414 6246946 6385686 6535644 6630093
5754 6630093 6745865 6855925 6922813 7006040 7160522 7333048 7390519 7595538 7814713 8028231
5744 8028231 8115350 8210645 8461018 8569599 8913513 9115464 9363291 9716532 10187623 10683978
5734 10683978 10975168 11519011 12069785 12644167 13218831 13826469 14543724 15352623 16130115
5725 16130115 16928392 17648441 18239008 18822348 19151213 19225611 18986354 18438399 17654253 16749891
5715A6749891q97785q46520q85914q35433p74165l71214m16032n41133m82306
5706A0699389k66015k99872l17099j77534k11352k53733k58124j02506q4652o3912
5696H664590j36938j17357j55968o3807m0837N132p0903j09971o1604k0215K6327
5685G918449j89291p779l2950j2285r6352M380o84L0656J8082j33111j587k2659
5673G474869J1750m0810P8840j9639j7867o6328q9483K755R7061k4850j09137
5662G297161J6081o1637l0677J0252O1662K3488Q035L9226j27657L521j01411
5651G138044q3596n4197O5432l2300j26399M0371j7240N5781q3864j6982k9556
5640F855494k2174k9792r801n0024q2388J9962N7177O4276L5209o237q7105j19509
$$ plain form
5715 16749891 15852106 15005586 14119672 13284239 12510074 12138860 11722828 11181695 10699389
5706 10699389 10433374 10133502 9816403 9638869 9427517 9173784 8915660 8813154 8728502 8664590
5696 8664590 8527652 8410295 8254327 8190520 8149683 8154815 8083912 7973941 7912337 7892122 7918449
5685 7918449 7729158 7721379 7688429 7676144 7579792 7584172 7583488 7614144 7632226 7499115 7497528 7474869
5673 7474869 7486619 7445809 7524649 7505010 7487143 7420815 7331332 7334087 7431148 7406298 7297161
5662 7297161 7313242 7251605 7220928 7231180 7292842 7316330 7324365 7363591 7235934 7239455 7138044
5651 7138044 7054448 7000251 7065683 7033383 6906984 6947355 6930115 6985896 6902032 6885050 6855494
5640 6855494 6833320 6803528 6793727 6743703 6661315 6681277 6738454 6802730 6837939 6831702 6744597 6625088
5628F625088o6794m8851J3973J36753L2664N3752j04606o3397p879r2722p6688
5617F401293M6264N8157J00612r2244m5300o3158j29925p6809k0809q4552l974
5606F089555j01515n9612J29342l2017J0268j0339L0516K3272q1223J9683K5474
5595F043404q8208p0356P8276N5629j08649n020n9624J10864L7537o5678N3766
5584E981941k4059p8385j01840N6557n2121l1976M2875j5651k8746j24930p5933
5573E547732P6050O7817p8316J3075q726l2752M1651k2428J24538Q3620N9097
5562E871358J08782L3232Q1397J97078R1704J26422K93377K07294L85229M94567
5552G890440M72827P07308M59874l61183p06235o57726m65922k77469j62434r8283
$$ plain form
5628 6625088 6558294 6509443 6523416 6660169 6692833 6746585 6641979 6578582 6570703 6477981 6401293
5617 6401293 6447557 6505714 6606326 6514082 6468782 6405624 6275699 6198890 6178081 6093529 6089555
5606 6089555 5988040 5928428 6057770 6025753 6036021 6025682 6056198 6079470 5998247 6017930 6043404
5595 6043404 5955196 5884840 5963116 6018745 5910096 5905076 5845452 5956316 5993853 5928175 5981941
5584 5981941 5957882 5879497 5777657 5834214 5782093 5750117 5792992 5777341 5748595 5623665 5547732
5573 5547732 5623782 5691599 5613283 5626358 5617632 5584880 5626531 5604103 5728641 5812261 5871358
5562 5871358 5980140 6013372 6094769 6291847 6383551 6509973 6803350 7010644 7395873 7890440
5552 7890440 8363267 9070575 9530449 9169266 8463031 7805305 7339383 7061914 6899480 6801197
$$ [...]
##END NTUPLES=NMR SPECTRUM
##END=
