##TITLE=1H_EC-3300(II-5)
 CDCl3
 8 sc, 
 24.9.2023
##JCAMPDX= 6.0         $$ Bruker NMR JCAMP-DX V2.0
##DATA TYPE= NMR SPECTRUM
##DATA CLASS= NTUPLES
##ORIGIN= UXNMR, Bruker Analytische Messtechnik GmbH
##OWNER= root
$$ XWIN-NMR		Version 3.5
$$ Mon Sep 25 14:12:48 2023 Russian Standard Time (UT+4h)  she@DPX200
##.OBSERVE FREQUENCY= 200.13135
##.OBSERVE NUCLEUS= ^1H
##.ACQUISITION MODE= SIMULTANEOUS
##.ACQUISITION SCHEME= undefined
##.AVERAGES= 8
##.DIGITISER RES= 18
##SPECTROMETER/DATA SYSTEM= spect
##.PULSE SEQUENCE= zg30
##.SOLVENT NAME= CDCl3
##.SHIFT REFERENCE= (INTERNAL, CDCl3, 0, 15.7381)
##AUDIT TRAIL= $$ (NUMBER, WHEN, WHO, WHERE, WHAT)
$$ ##TITLE= Audit trail, XWIN-NMR		Version 3.5
$$ ##JCAMPDX= 5.01
$$ ##ORIGIN= Bruker BioSpin GmbH
$$ ##OWNER= she
$$ F:/spectra/data/she/nmr/H-F/1/pdata/1/auditp.txt
$$ ##AUDIT TRAIL=  $$ (NUMBER, WHEN, WHO, WHERE, WHAT)
(   1,<2023-09-25 14:11:41.79 +0400>,<she>,<DPX200>,
      <created by zg, POWCHK disabled, PULCHK disabled
       configuration hash MD5:
       00 E9 B6 7A A2 85 ED C7 34 08 36 98 17 FE 4E 26
       data hash MD5: 16K
       A1 5D B4 ED 61 B9 88 FB E4 C0 1F AD 63 98 16 93>)
(   2,<2023-09-25 14:11:44.84 +0400>,<she>,<DPX200>,
      <Start of raw data processing
       efp BC_mod = 2 LB = 0.24 FT_mod = 6 PKNL = 1 PHC0 = -21713.39 PHC1 = 14.45271 SI = 16K 
       data hash MD5: 16K
       05 2E 92 AA 7E 6E 65 45 D4 53 C1 CD A8 B8 04 B1>)
(   3,<2023-09-25 14:12:01.46 +0400>,<she>,<DPX200>,
      <pk PHC0 = 1.221958 PHC1 = -1.6 
       data hash MD5: 16K
       36 BE 49 0A 03 19 A5 11 2C 67 85 F0 B9 A9 EF 42>)
(   4,<2023-09-25 14:12:05.12 +0400>,<she>,<DPX200>,
      <abs ABSG = 5 
       data hash MD5: 16K
       96 95 31 A2 48 08 00 6A 1D 38 E0 C5 43 08 7A 31>)
$$ ##END=
$$ 
$$ hash MD5
$$ 3E F1 BE 31 35 53 CB 8C F2 1C E6 3B 8A 20 17 62
##$RELAX= 
##$RELAX= 
##$RELAX= 
##$RELAX= 
##$RELAX= 
##$RELAX= 
$$ Bruker specific parameters
$$ --------------------------
##$DU= <F:/spectra>
##$EXPNO= 1
##$NAME= <H-F>
##$PROCNO= 1
##$TYPE= <nmr>
##$USER= <she>
##$AMP= (0..31)
100 100 100 100 100 100 100 100 100 100 100 100 100 100 100 100 100 100 
100 100 100 100 100 100 100 100 100 100 100 100 100 100 
##$AQSEQ= 0
##$AQ_mod= 1
##$AUNM= <au_zg>
##$AUTOPOS= <>
##$BF1= 200.13
##$BF2= 200.13
##$BF3= 200.13
##$BF4= 200.13
##$BF5= 200.13
##$BF6= 200.13
##$BF7= 200.13
##$BF8= 200.13
##$BYTORDA= 1
##$CFDGTYP= 0
##$CFRGTYP= 5
##$CHEMSTR= <none>
##$CNST= (0..31)
1 1 145 1 1 1 1 1 1 1 1 1 1 1 1 1 1 1 1 1 1 1 1 1 1 1 1 1 1 1 1 1 
##$CPDPRG= <>
##$CPDPRG1= <>
##$CPDPRG2= <>
##$CPDPRG3= <>
##$CPDPRG4= <mlev>
##$CPDPRG5= <mlev>
##$CPDPRG6= <mlev>
##$CPDPRG7= <mlev>
##$CPDPRG8= <mlev>
##$CPDPRGB= <>
##$CPDPRGT= <>
##$D= (0..31)
0 1.2 0 0 0 0 0 0 0 0.06 0 0.03 0 0 0 0 0.0002 0 0 0 0 0 0 0 0 0 0 0 0 
0 0 0 
##$DATE= 1695636701
##$DBL= (0..7)
120 120 120 120 120 120 120 120 
##$DBP= (0..7)
150 150 150 150 150 150 150 150 
##$DBP07= 0
##$DBPNAM0= <>
##$DBPNAM1= <>
##$DBPNAM2= <>
##$DBPNAM3= <>
##$DBPNAM4= <>
$$ [...]
##$SUBNAM3= <"">
##$SUBNAM4= <"">
##$SUBNAM5= <"">
##$SUBNAM6= <"">
##$SUBNAM7= <"">
##$SUBNAM8= <"">
##$SUBNAM9= <"">
##$SW= 18.05172834244
##$SWIBOX= (0..15)
0 0 2 0 0 0 0 0 0 0 0 0 0 0 0 0 
##$SW_h= 3612.71676300578
##$TD= 16384
##$TD0= 1
##$TE= 0
##$TE2= 300
##$TE3= 300
##$TEG= 300
##$TL= (0..7)
0 120 120 120 120 120 120 120 
##$TP= (0..7)
150 150 150 150 150 150 150 150 
##$TP07= 0
##$TPNAME0= <>
##$TPNAME1= <>
##$TPNAME2= <>
##$TPNAME3= <>
##$TPNAME4= <>
##$TPNAME5= <>
##$TPNAME6= <>
##$TPNAME7= <>
##$TPOAL= (0..7)
0.5 0.5 0.5 0.5 0.5 0.5 0.5 0.5 
##$TPOFFS= (0..7)
0 0 0 0 0 0 0 0 
##$TUNHIN= 0
##$TUNHOUT= 0
##$TUNXOUT= 0
##$USERA1= <user>
##$USERA2= <user>
##$USERA3= <user>
##$USERA4= <user>
##$USERA5= <user>
##$V9= 5
##$VALIST= <valist>
##$VCLIST= <CCCCCCCCCCCCCCC>
##$VD= 0
##$VDLIST= <DDDDDDDDDDDDDDD>
##$VPLIST= <PPPPPPPPPPPPPPP>
##$VTLIST= <TTTTTTTTTTTTTTT>
##$WBST= 1024
##$WBSW= 4
##$XGAIN= (0..3)
0 0 0 0 
##$XL= 0
##$YL= 0
##$YMAX_a= 153310
##$YMIN_a= -196699
##$ZGOPTNS= <>
##$ZL1= 120
##$ZL2= 120
##$ZL3= 120
##$ZL4= 120
##$ABSF1= 15.72816
##$ABSF2= -2.323689
##$ABSG= 5
##$ABSL= 3
##$ALPHA= 0
##$AQORDER= 0
##$ASSFAC= 0
##$ASSFACI= 0
##$ASSFACX= 0
##$ASSWID= 0
##$AUNMP= <proc_1d>
##$AZFE= 0.1
##$AZFW= 0.1
##$BCFW= 0
##$BC_mod= 2
##$BYTORDP= 0
##$COROFFS= 0
##$CY= -3
##$DATMOD= 1
##$DC= 0
##$DFILT= <>
##$DTYPP= 0
##$F1P= 0
##$F2P= 0
##$FCOR= 1
##$FTSIZE= 16384
##$FT_mod= 6
##$GAMMA= 0
##$GB= 0
##$INTBC= 1
##$INTSCL= 3.70164e-10
##$ISEN= 128
##$LB= 0.24
##$LEV0= 0
##$LPBIN= 0
##$MAXI= 10000
##$MC2= 0
##$MEAN= 0
##$ME_mod= 0
##$MI= 1.114404
##$NCOEF= 0
##$NC_proc= -9
##$NLEV= 6
##$NOISF1= 3.799351
##$NOISF2= 2.8
##$NSP= 0
##$NTH_PI= 0
##$NZP= 0
##$OFFSET= 15.73808
##$PC= 1
##$PHC0= -21712.17
##$PHC1= 12.85271
##$PH_mod= 1
##$PKNL= yes
##$PPARMOD= 0
##$PSCAL= 0
##$PSIGN= 0
##$REVERSE= no
##$SF= 200.130006697046
##$SI= 16384
##$SIGF1= 3
##$SIGF2= 2
##$SINO= 5.538805
##$SIOLD= 16384
##$SREGLST= <1H.CDCl3>
##$SSB= 0
##$STSI= 16384
##$STSR= 0
##$SW_p= 3612.71676300578
##$SYMM= 0
##$S_DEV= 0
##$TDeff= 16384
##$TDoff= 0
##$TI= <>
##$TILT= no
##$TM1= 0
##$TM2= 0
##$TOPLEV= 0
##$USERP1= <user>
##$USERP2= <user>
##$USERP3= <user>
##$USERP4= <user>
##$USERP5= <user>
##$WDW= 1
##$XDIM= 16384
##$YMAX_p= 447787865
##$YMIN_p= -2084255
$$ End of Bruker specific parameters
$$ ---------------------------------
##NTUPLES= NMR SPECTRUM
##VAR_NAME=  FREQUENCY,     SPECTRUM/REAL,   SPECTRUM/IMAG
##SYMBOL=    X,             R,               I
##VAR_TYPE=  INDEPENDENT,   DEPENDENT,       DEPENDENT
##VAR_FORM=  AFFN,          ASDF,            ASDF
##VAR_DIM=   16384,         16384,           16384
##UNITS=     HZ,            ARBITRARY UNITS, ARBITRARY UNITS
##FACTOR=    0.220516191357247, 1,           1
##FIRST=     3149.66206074571, 0,            0
##LAST=      -463.054702260073, 0,           0
##MIN=       -463.054702260073, -2084255,    0
##MAX=       3149.66206074571, 447787865,    0
$$ Real data points
##PAGE= N=1
##DATA TABLE= (X++(R..R)), XYDATA
$$ [...]
5848B3243780J46287n37015J75102J83419L33760J224078L9171j60380O31145
$$ 23243780 23390067 22853052 23028154 23211573 23545333 24769411 24808582 24648202 25279347
5839B5279347N08774j92954L68616K46427l06676n14428l68828R09654O93298
$$ 25279347 25788121 25595167 25963783 26210210 25903534 25389106 25020278 25929932 26623230
5830B6623230J74073M71950N27894q03854m90081M01167l77539R0341R5173N05385
$$ 26623230 26797303 27269253 27797147 26993293 26503212 26904379 26526840 26617181 26712354 27217739
5820B7217739o75185M71000R24022J69951J86866j271767k21331m21827P26320
$$ 27217739 26542554 27013554 27937576 28107527 28294393 27022626 26801295 26379468 27105788
5811B7105788J279878m32280j69840j39937K54630N59425Q79367k49638p04684
$$ 27105788 28385666 27953386 27783546 27643609 27898239 28457664 29337031 29087393 28382709
5802B8382709J19128K47657M20380J28125j179114p75459o83811j087773j25088
$$ 28382709 28501837 28749494 29169874 29297999 28118885 27343426 26659615 25571842 25446754
5793B5446754P92475j7310M37436p4550j131676p7086R4862J03410N25784j0543
$$ 25446754 26239229 26221919 26659355 26584805 25453129 25376043 25470905 25574315 26100099 26089556
5783B6089556J45707J30620k88435j21457j29206j62195J002293o68333n50535
$$ 26089556 26235263 26365883 26077448 25955991 25826785 25664590 26666883 25998550 25448015
5774B5448015R70649o13004L68308J31235K72814j98223k40491Q68583J194439
$$ 25448015 26418664 25805660 26173968 26305203 26578017 26379794 26139303 27007886 28202325
5765B8202325j126340j90431R28561J83432J86720J113485Q8576L93752L63226
$$ 28202325 27075985 26885554 27814115 27997547 28184267 29297752 29386328 29780080 30143306
5756C0143306M64621Q61606J071399M62080N40823J028938L8936p62536r12858
$$ 30143306 30607927 31469533 32540932 33003012 33543835 34572773 34611709 33849173 32936315
5747C2936315K28511J048235M30616o55396L3089n58074j41168O4360n2018j16104
$$ 32936315 33164826 34213061 34643677 33988281 34021370 33463296 33322128 33386488 33334470 33218366
5737C3218366N83300p3071J02548m0389j28201k33426R3918q49661j08587m69467
$$ 33218366 33801666 33728595 33831143 33790754 33662553 33429127 33523045 32673384 32564797 32095330
5727C2095330n61305l72995p93862Q3963j159653o5535J235955j70584m88133
$$ 32095330 31534025 31161030 30367168 30451131 29291478 29225943 30461898 30291314 29803181
5718B9803181J60574R2288q50157k67032J305232J056844m03793L49763R40227
$$ 29803181 29963755 30056043 29205886 28938854 30244086 31300930 30897137 31246900 32187127
5709C2187127n35382J72066m02504j56594j01296l71824o01546r7008M88291j074443
$$ 32187127 31651745 31823811 31421307 31264713 31163417 30791593 30190047 30093039 30581330 29506887
5699B9506887r62399j042659M70496Q64142k97232j228210o87211M52941p24461
$$ 29506887 28544488 27501829 27972325 28836467 28539235 27311025 26623814 27076755 26352294
5690B6352294l88925M87601J223857r66021k06732M84500N07476K70240K04830
$$ 26352294 25963369 26450970 27674827 26708806 26502074 26986574 27494050 27764290 27969120
5681B7969120O50321M39123n26668r3610j73319r68299k36519o0549j063953N23899
$$ 27969120 28619441 29058564 28531896 28438286 28264967 27296668 27060149 26999600 25935647 26459546
5671B6459546J298106m65819j93469o87873K22834j30186j44603J34236q75748
$$ 26459546 27757652 27291833 27098364 26410491 26633325 26503139 26358536 26492772 25617024
5662B5617024m86807k17526r02955o11747P83548J9332j27412q5060j53610l60601
$$ 25617024 25130217 24912691 24009736 23397989 24181537 24200869 24073457 23988397 23834787 23474186
5652B3474186N8649L11922M82394n39822j139622J349999J55085l12963j16967
$$ 23474186 23532835 23844757 24327151 23787329 22647707 23997706 24152791 23839828 23722861
5643B3722861L4485K64249l60552o57740l94294J47107j52711K09192M63376m28908
$$ 23722861 23757346 24021595 23661043 23003303 22609009 22756116 22603405 22812597 23275973 22847065
5633B2847065P6933K83061n65783m1117Q00556J50498k78479J08085M51557k16349
$$ 22847065 22923998 23207059 22641276 22600159 23400715 23551213 23272734 23380819 23832376 23616027
5623B3616027K052K88191O96012l069J66981o51846k15729k66017n7485j42515
$$ 23616027 23618079 23906270 24602282 24599213 24766194 24114348 23898619 23632602 23575117 23432602
5613B3432602o14825q13705m65225N34745Q00481P7980m91659N21114K10728M82540
$$ 23432602 22817777 22004072 21538847 22073592 22874073 22952053 22460394 22981508 23192236 23674776
5603B3674776J76450k99040n14044P49868P1802P88559N77485j03390M18059O23755
$$ 23674776 23851226 23552186 23038142 23788010 23859812 24648371 25225856 25122466 25540525 26164280
5593B6164280J034453J240598N33537M63804P47155j4078O57541J52375j131536
$$ 26164280 27198733 28439331 28972868 29436672 30183827 30169749 30827290 30979665 29848129
5584B9848129j637907o14055j85114J69539K38553k61650M52387P71521K61475
$$ 29848129 28210222 27596167 27411053 27580592 27819145 27557495 28009882 28781403 29042878
5575B9042878Q81544J163943J70983Q3011p40737j052356j081099j150819l36257
$$ 29042878 29924422 31088365 31259348 31342359 30601622 29549266 28468167 27317348 26981091
5566B6981091O5006N84597m33046k24173M11345P55348Q66839j9799J108799K40404
$$ 26981091 27046097 27630694 27197648 26973475 27384820 28140168 29007007 28987208 30096007 30336411
5556C0336411N7007p26075k85271j057778l34607L46245N23772k83434K27319
$$ 30336411 30393418 29667343 29382072 28324294 27989687 28335932 28859704 28576270 28803589
5547B8803589N37738m44257L64479L30800J70047J657472J148788M6951J864866
$$ 28803589 29341327 28897070 29261549 29592349 29762396 31419868 32568656 32615607 34480473
5538C4480473J995642J486486Q23499J631328K135371K375780L74407l33178j179595
$$ 34480473 36476115 37962601 38786100 40417428 42552799 44928579 45302986 44969808 43790213
5529D3790213k332547j541399J16530K89117J90016P0652N61095J510556J874059
$$ 43790213 41457666 39916267 40032797 40321914 40511930 40582582 41143677 42654233 44528292
5520D4528292J171126M77886J552753J643804L07851n58430j684566j550192o54396
$$ 44528292 45699418 46177304 47730057 49373861 49681712 49123282 47438716 45888524 45234128
5511D5234128j331436n78286j174550j204755q95268j301803j478726j320036
$$ 45234128 43902692 43324406 42149856 40945101 40049833 38748030 37269304 35949268
5503C5949268m35545p75004m1641p80961k00711j522760q13395M39824l50088
$$ 35949268 35513723 34738719 34697078 33916117 33715406 32192646 31379251 31819075 31468987
5494C1468987k38639R5498K14213K42400K62881L75835q71570m57633O64550n046
$$ 31468987 31230348 31325846 31540059 31782459 32045340 32421175 31549605 31091972 31756522 31751476
5484C1751476M9726K3514K84594M19509N96134J30923J515008L59211o30642J080373
$$ 31751476 31801202 31824716 32109310 32528819 33124953 33255876 34770884 35130095 34499453 35579826
5474C5579826M51763m98891l38021Q92107J556057Q01831J177523K21685P76118
$$ 35579826 36031589 35532698 35194677 36086784 37642841 38444672 39622195 39843880 40619998
5465D0619998l08814Q56019M99823R77276R44606Q91156M83210J37028j91646
$$ 40619998 40311184 41167203 41667026 42644302 43588908 44480064 44963274 45100302 44908656
5456D4908656j100886Q32568o19814j91549j146268n45574k34703j288761j139397
$$ 44908656 43807770 44640338 44020524 43828975 42682707 42137133 41902430 40613669 39474272
5447C9474272l31203n05764j43517p7771p6144n42442n20585M57386P57207m58126
$$ 39474272 39143069 38637305 38493788 38416017 38339873 37797431 37276846 37734232 38491439 38033313
5437C8033313p75689R62203N10372l34274R97949J048245M42816J021151J457476
$$ 38033313 37257624 38219827 38730199 38395925 39393874 40442119 40884935 41906086 43363562
5428D3363562J769832J726576K729304K060936J301293M24534k03309k282200
$$ 43363562 45133394 46859970 49589274 51650210 52951503 53376037 53172728 50890528
5420E0890528l232198j798337j974010r73448j432193j230092j25504J67959n439
$$ 50890528 47658330 45859993 43885983 42912535 41480342 40250250 40124746 40292705 40287266
5411D0287266K34650N39297n9399R08177J062525P63960J054280J333446J500542
$$ 40287266 40521916 41061213 41001814 41909991 42972516 43736476 44790756 46124202 47624744
5402D7624744P18526l81529k054420k008026j448910j854692o43191j43665j92654
$$ 47624744 48343270 47961741 45907321 43899295 42450385 40595693 39952502 39808837 39616183
5393C9616183L66150O55363Q72759J478943J964374K656515K279152J967987L8170
$$ 39616183 39982333 40637696 41510455 42989398 44953772 47610287 49889439 51857426 51895596
5384E1895596j758304l620517l653862l447819j965731o53070q10428j166410
$$ 51895596 50137292 46516775 42862913 39415094 37449363 36796293 35985865 34819455
5376C4819455p83599m88685M1591K76440K45476J022974m89654J796168P96142
$$ 34819455 34035856 33547171 33588762 33865202 34110678 35133652 34643998 36440166 37236308
5367C7236308K28229M91845j095504q40716l37200o21525j186483r81498q08437
$$ 37236308 37464537 37956382 36860878 36020162 35682962 35061437 33874954 32893456 32085019
5358C2085019m41122O92139P43698m96356P67285K040277N79060K091404J731713
$$ 32085019 31643897 32336036 33079734 32583378 33350663 35390940 35970000 38061404 39793117
5349C9793117J838585L404711K530037J385331j118056j802274l203609l944432
$$ 39793117 41631702 45036413 47566450 48951781 47833725 46031451 42827842 38883410
5341C8883410k359855j905777r63004o96758j369464l90592N29630K93145L72283
$$ 38883410 36523555 34617778 33654774 32958016 31588552 31197960 31727590 32020735 32393018
5332C2393018m23403j3998N49326J33338k34391K62151R43537Q93176O71793O11303
$$ 32393018 31969615 31955617 32504943 32638281 32403890 32666041 33609578 34502754 35174547 35785850
5322C5785850K797702K113201Q44125M65166j707081k360797j577589k661599
$$ 35785850 38583552 40696753 41540878 42006044 40298963 37938166 36360577 33698978
5314C3698978j678683j240457l39984o22085m01081l5423J46897L01351J171491
$$ 33698978 32020295 30779838 30439854 29817769 29416688 29381265 29528162 29829513 31001004
5305C1001004M46185Q34611N60271J82015K68346q50500Q72472k27102r02862
$$ 31001004 31447189 32281800 32842071 33024086 33292432 32441932 33314404 33087302 32184440
5296C2184440J21333j139581j32382n74571R97653J097761J963605J889400J615475
$$ 32184440 32305773 31166192 31033810 30459239 31456892 32554653 34518258 36407658 38023133
5287C8023133N27400j427250j482349j761463K7141o16568K27365j935280j270505
$$ 38023133 38550533 37123283 35640934 33879471 33906612 33290044 33517409 31582129 30311624
5278C0311624j888191p30751n25092r38429m60556N04762q50021j16135o95841
$$ 30311624 28423433 27692682 27167590 26229161 25768605 26273367 25423346 25307211 24611370
5269B4611370j341965k96695K57667o11496l04325k7179N18533k6897k33900L56965
$$ 24611370 23269405 22972710 23230377 22618881 22314556 22287377 22805910 22779013 22545113 22902078
5259B2902078o086R76386J446861O10985j111440j45079l32969p62739N39375
$$ 22902078 22895992 23872378 25319239 25930224 24818784 24673705 24340736 23577997 24117372
5250B4117372Q81439K95947K33182n29934j690422l79865p53394r16861j01015
$$ 24117372 24998811 25294758 25527940 24998006 23307584 22927719 22174325 21257464 21156449
5241B1156449m47497L74973o03796R21179Q60290O9899K59354j04756n44998p6644
$$ 21156449 20708952 21083925 20480129 21401308 22261598 22331497 22590851 22486095 21941097 21864453
5231B1864453o79298j207078k17422n57101j8616o70167j06142N37947j282007
$$ 21864453 21185155 19978077 19760655 19203554 19184938 18514771 18408629 18946576 17664569
5222A7664569K79504N98642k72659J345868r29219k35692O94574n87371O0392
$$ 17664569 17944073 18542715 18270056 19615924 18686705 18451013 19145587 18558216 18618608
5213A8618608j82602j51452L66016k89264l05617N14333K53098O49846K02626
$$ 18618608 18436006 18284554 18650570 18361306 18055689 18570022 18823120 19472966 19675592
5204A9675592N81893l99083j31040q1635n60769k53296j17444k39590L22142K13131
$$ 19675592 20257485 19858402 19727362 19645727 19084958 18831662 18714218 18474628 18796770 19009901
5194A9009901K91970r16379Q83775O02430m24889L63516l64360m12025M45667
$$ 19009901 19301871 18385492 19269267 19871697 19446808 19810324 19445964 19033939 19479606
5185A9479606j04919k41215l7731J52570m96121j34837J16429r6773L35472J59699
$$ 19479606 19374687 19133472 19095741 19248311 18752190 18617353 18733782 18637009 18972481 19132180
5175A9132180l80944M61404l22835l44643P70974m97848l00321r96182L56172
$$ 19132180 18751236 19212640 18889805 18545162 19316136 18818288 18517967 17521785 17877957
5166A7877957l6264m54577P48858Q2247Q9419m98998j79782P36203P63161q94183
$$ 17877957 17841693 17387116 18135974 18218221 18307640 17808642 17628860 18365063 19128224 18234041
5156A8234041j011597O77652q1386j27714Q3462l45955j96093K32091l50369j89796
$$ 18234041 17222444 17900096 17818710 17690996 17774458 17428503 17232410 17464501 17114132 16924336
5146A6924336N96307n74841j69035k584P49150j97580j36814P23426J57597K54661
$$ 16924336 17520643 16945802 16776767 16774183 17523333 17325753 17188939 17912365 18069962 18324623
5136A8324623j084016m8593j96476L07849N18425j42551k37080R92839r93060
$$ 18324623 17240607 17192014 16995538 17303387 17821812 17679261 17442181 18435020 17441960
5127A7441960m74150K1091M79050O0926k68669K17425J032772r27005p98777l7683
$$ 17441960 16967810 16988901 17467951 17528877 17260208 17477633 18510405 17583400 16784623 16746940
5117A6746940N96863N95881m92944m63562j42097L23624p09126K64838P24014
$$ 16746940 17343803 17939684 17446740 16983178 16841081 17164705 16455579 16720417 17444431
5108A7444431n29146l55100j75020p85847M7214J087710N25402L73516K24684
$$ 17444431 16915285 16560185 16385165 15599318 15646532 16734242 17259644 17633160 17857844
5099A7857844m73017Q32339P4947Q90259j59006l75416J4069q64614j016018J67955
$$ 17857844 17384827 18217166 18292113 19182372 19023366 18647950 18662019 17797405 16781387 16949342
5089A6949342N41493l78644k73294L96164M33839L60082N0901Q02444L47906K9529
$$ 16949342 17490835 17112191 16838897 17235061 17668900 18028982 18079883 18882327 19230233 19259762
5079A9259762j166709p35328Q74961M23571j00083o93427j000771K30283L05865
$$ 19259762 18093053 17357725 18232686 18656257 18556174 17862747 16861976 17092259 17398124
5070A7398124q12627J18668N91883J10109L47218l44038o68166Q27729L48273
$$ 17398124 16585497 16704165 17296048 17406157 17753375 17409337 16741171 17568900 17917173
5061A7917173n75382J0916L42324k59643M11677p7655j34048O83170m11939j81773
$$ 17917173 17341791 17352707 17695031 17435388 17847065 17769410 17635362 18318532 17906593 17724820
5051A7724820p19218O2988O57134l7687K8514L24586m59605O34156M63706k49714
$$ 17724820 17005602 17068590 17725724 17688037 17716551 18041137 17581532 18215688 18679394 18429680
5041A8429680M66459k9315O71280l09635K45315Q81427j75230M82853P09877j57046
$$ 18429680 18896139 18866824 19538104 19228469 19473784 20355211 20179981 20662834 21372711 21215665
5031B1215665J17603P03139L74589l00878j424253m63739K38153r00455k41113
$$ 21215665 21333268 22036407 22410996 22110118 20685865 20222126 20460279 19559824 19318711
5022A9318711n18987N08820R52164O73652j01958K12562j52682p26596r3045K52157
$$ 19318711 18799724 19308544 20260708 20934360 20832402 21044964 20892282 20165686 20072641 20324798
5012B0324798m5860m0075J18587J141216l14234J17135o8919j119597N32990L47415
$$ 20324798 20278938 20238863 20357450 21498666 21184432 21301567 21232648 20113051 20646041 20993456
5002B0993456p77942L83643O72623o71010M91403P48780M17994J76528R5005M90304
$$ 20993456 20215514 20599157 21271780 20600770 21092173 21840953 22258947 22435475 22530480 23020784
4992B3020784n19627k99913l77569o80797R02143P98956O44584J91530k76886
$$ 23020784 22501157 22201244 21823675 21142878 22045021 22843977 23488561 23680091 23403205
4983B3403205k81621L97375j5625K86211L90063K81319k30273P54507M36745K81064
$$ 23403205 23121584 23518959 23503334 23789545 24179608 24460927 24230654 24985161 25421906 25702970
4973B5702970L80116o73867K05485L09804J50387m59654R0658r269j06973Q49125
$$ 25702970 26083086 25409219 25614704 25924508 26074895 25615241 25705899 25696630 25589657 26438782
4963B6438782o49500n4493R7654L94489Q85124N05564J44797r09370J3833P73755
$$ 26438782 25789282 25734789 25832443 26226932 27112056 27617620 27762417 26853047 26866880 27640635
4953B7640635O81474n41026L15098N35830N32920L09584J51043n63078q66328
$$ 27640635 28322109 27781083 28096181 28632011 29164931 29474515 29625558 29062480 28196152
4944B8196152O12156O09177j22724j314421j61593M8588N07869j44775m54101
$$ 28196152 28808308 29417485 29294761 27980340 27818747 27867335 28375204 28230429 27776328
4935B7776328K74825l61668J178536M88524m24883M98105o9944m83352K21647
$$ 27776328 28051153 27689485 28868021 29356545 28931662 29429767 29359823 28876471 29098118
4926B9098118N40760O58049R4679j43524o6046P53566J155522J40763Q96866j06820
$$ 29098118 29638878 30296927 30391606 30248082 30182036 30935602 32091124 32231887 33128753 33021933
4916C3021933J1584J266262N78113N54488J98401M0108j70155Q61035K57091m22543
$$ 33021933 33033517 34299779 34877892 35432380 35630781 35670889 35500734 36361769 36618860 36196317
4906C6196317K60290p57434l8820q3789m59671k79788N17368l91966j29694J97791
$$ 36196317 36456607 35699173 35660353 35576564 35116893 34837105 35354473 34962507 34832813 35030604
4896C5030604J22315o35079j571R60488P6112m72947M78381M3789L04389K31301
$$ 35030604 35152919 34517840 34516269 35476757 35552869 35079922 35558303 35602092 35906481 36137782
4886C6137782q81509p2563m44885Q92824J46544k28983o24587O10963N95621l59431
$$ 36137782 35256273 35183710 34738825 35631649 35778193 35549210 34924623 35535586 36131207 35771776
4876C5771776L06428o30650p4438k16194L59147P77149L60503j67461J9966k47888
$$ 35771776 36078204 35447554 35373116 35156922 35516069 36293218 36653721 36486260 36506226 36258338
4866C6258338N14547m72384L44531N34940o71582q1793L19455j2769m97434J039512
$$ 36258338 36772885 36300501 36645032 37179972 36508390 36426597 36746052 36733283 36235849 37275361
4856C7275361O33905m97421n9774O73024n07421L47705P71150L95326k35097N77563
$$ 37275361 37909266 37411845 37352071 38025095 37517674 37865379 38636529 39031855 38796758 39374321
4846C9374321N73322J223318J048039j12802L60152k25851N29484K23106k21058
$$ 39374321 39947643 41170961 42219000 42106198 42466350 42240499 42769983 42993089 42772031
4837D2772031Q22871N56884Q83065J21539j04073Q05937P75644k47429J106918
$$ 42772031 43594902 44151786 45034851 45156390 45052317 45858254 46633898 46386469 47493387
4828D7493387Q05270L12276M26372L69927J203570P74916L54534P28221P58045
$$ 47493387 48298657 48610933 49037305 49407232 50610802 51385718 51740252 52468473 53226518
4819E3226518Q15127J196238J749195J206310J011270P56047O72340J359070J416678
$$ 53226518 54041645 55237883 56987078 58193388 59204658 59960705 60633045 61992115 63408793
4810F3408793Q33752J359631J972333R96873J328322K215651J907363K186817
$$ 63408793 64242545 65602176 67574509 68571382 69899704 72115355 74022718 76209535
4802G6209535L180645L968323M404164N302775N742480O373403P109937R109153
$$ 76209535 79390180 83358503 87762667 93065442 98807922 105181325 112291262 121400415
4794A21400415J0937210J2463199J7212625K3499518L3915598M6966330N8479898
$$ 121400415 132337625 144800824 162013449 185512967 219428565 266394895 324874793
4787C24874793N3891885K1521111j1306227m4814625o3603813n5242362l9744894
$$ 324874793 378766678 400287789 388981562 344166937 280563124 225320762 185575868
4780A85575868k6461473j9311183j3636724j0646375p826361o477355m612562
$$ 185575868 159114395 139803212 126166488 115520113 107693752 101216397 96603835
4773I6603835m496373l868536k706318k881529j740781r77558j621853n57841
$$ 96603835 92107462 88238926 85532608 82651079 80910298 79932740 78310887 77753046
4765G7753046q13549o73015j422408L13979M29365o58039k3200M54006M06703
$$ 77753046 76939497 76266482 74844074 75158053 75587418 74929379 74906179 75360185 75766888
4756G5766888J181462M60541O31775P25424j31778J637592J425728P44737Q62655
$$ 75766888 76948350 77408891 78040666 78766090 78634312 80271904 81697632 82442369 83305024
4747H3305024N52450J26J23008J050016O75085J222630M58851J647137J921908
$$ 83305024 83857474 83857600 83980608 85030624 85705709 86928339 87387190 89034327 90956235
4738I0956235J574097J672253K489140K696285K675925L511425L905495M374938
$$ 90956235 92530332 94202585 96691725 99388010 102063935 105575360 109480855 113855793
4730A13855793M620175O379528P826125R283777J1799333J4880421J9763424K8362599
$$ 113855793 118475968 124855496 132681621 141965398 153764731 168645152 188408576 216771175
4722B16771175M0836151N2014955M9154756K0208907k091780j3637876m1076962
$$ 216771175 257607326 309622281 358777037 378985944 376894164 363256288 322179326
4715C22179326n7572358m9481550l4641854k4359150j8329701j2794372j0057076
$$ 322179326 264606968 215125418 180483564 156124414 137794713 125000341 114943265
4708A14943265q214262p240183n757215m080800l256726k966790k837558j449888
$$ 114943265 106729003 99488820 93731605 89650805 86394079 83427289 80589731 79139843
4700G9139843j761041j874795k162624o17955j269577j253279p06091j339492
$$ 79139843 77378802 75504007 73341383 72723428 71453851 70200572 69494481 68154989
4692F8154989j174862o64712k70518j072269r38619L30787q18804j397826R1800
$$ 68154989 66980127 66315415 66044897 64972628 64034009 64364796 63545992 62148166 62239966
4683F2239966J274965o94595r17520L31774n80504r50423n51256p38678J11599
$$ 62239966 63514931 62820336 61902816 62234590 61654086 60703663 60152407 59413729 59525328
4674E9525328p70119o4275o03047k22672j161834m87508P2471J104792m92757
$$ 59525328 58755209 58690934 58087887 57865215 56703381 56215873 56288344 57393136 56900379
4665E6900379O17949J47757q7680r67617l65131k4713r7213n15150r52416O6713
$$ 56900379 57518328 57666085 57578405 56610788 56245657 56220944 56123731 55608581 54656165 54722878
4655E4722878p29568o91703m42269M65470q6918j392848r61054J042278n41392
$$ 54722878 53993310 53301607 52859338 53324808 53237890 51845042 50883988 51926266 51384874
4646E1384874m15867K66611P00022k59096j93667k92892J98719M98173O43951
$$ 51384874 50969007 51235618 51935640 51676544 51482877 51189985 51388704 51886877 52530828
4637E2530828j065934q98858m37266J175429j07516P9708m99375m54026q88428
$$ 52530828 51464894 50566036 50128770 51304199 51196683 51276391 50777016 50322990 49434562
4628D9434562l49465l81415l82860l00759k51160j54713N87361k46630k64283
$$ 49434562 49085097 48703682 48320822 48020063 47768903 47614190 48201551 47954921 47690638
4619D7690638m17489n96639R4892N99123l68620j50951n7786L23042J1782j3095
$$ 47690638 47273149 46676510 46771402 47370525 47001905 46850954 46793168 47116210 47127992 47114897
4609D7114897o74657j563750j75379p86722L83099o40884j28127o125J18093j03447
$$ 47114897 46440240 44876490 44701111 43914389 44297488 43656604 43528477 43522352 43640445 43536998
4599D3536998m99734o58912Q847J70577m5006M09686m96656j395735q5091j98067
$$ 43536998 43037264 42378352 42387199 42557776 42512770 42922456 42425800 41030065 40944974 40746907
4589D0746907k25816n37351p25611m21531M08206l15693p40992P5089N31743n42188
$$ 40746907 40521091 39983740 39258129 38836598 39244804 38929111 38188119 38263208 38794951 38252763
4579C8252763j75320L01463k92024m11838p45585m21621K64490m42619o36867
$$ 38252763 38077443 38378906 38086882 37675044 36929459 36507838 36772328 36329709 35692842
4570C5692842j66769n61631l30721M12851Q3674p0919J90537j201618j017314
$$ 35692842 35526073 34964442 34633721 35046572 35130246 35059327 35249864 34048246 33030932
4561C3030932J528694O83816j78119k65162N20775o54178m99684K813o01935l28918
$$ 33030932 34559626 35243442 35065323 34800161 35320936 34666758 34167074 34169887 33567952 33239034
4551C3239034M81172K78913p74308K09759k95220J091588L89486o44552n49452
$$ 33239034 33720206 33999119 33224811 33434570 33139350 34230938 34620424 33975872 33426420
4542C3426420L52372k63588J25641O01330j081636m0700K56702J31625M24406
$$ 33426420 33778792 33515204 33640845 34242175 33160539 33119839 33376541 33508166 33932572
4533C3932572J46908j53808Q6574J96227p5303N47846N11812k80417O20949j10930
$$ 33932572 34079480 33925672 34012246 34208473 34133170 34681016 35192828 34912411 35533360 35422430
4523C5422430L40489L76312k87748m8456j50502J322264O92068q67745j96671
$$ 35422430 35762919 36139231 35851483 35803027 35652525 36974789 37666857 36799112 36602441
4514C6602441O9593K65851O47386L04624M77283N75168Q93267O64263P54797M82421
$$ 36602441 36672034 36937885 37585271 37889895 38367178 38942346 39835613 40499876 41254673 41737094
4504D1737094O80908K062457J978827Q10831K531152K070782K749495L224336
$$ 41737094 42418002 44480459 46459286 47270117 49801269 51872051 54621546 57845882
4496E7845882L706592L255041O94823l26146j621326l548571l336981k784426
$$ 57845882 61552474 64807515 65502338 65176192 63554866 60006295 56669314 53884888
4488E3884888k328101k063874j562621j66495K66559M50450N77002M43597J835896
$$ 53884888 51556787 49492913 47930292 47763797 48030356 48480806 49057808 49501405 51337301
4479E1337301J41949j260572k050394j080479j656020j089720j51465l65812n10290
$$ 51337301 51479250 50218678 48168284 47087805 45431785 44342065 44190600 43824788 43314498
4470D3314498q03069M35087L65917j8965M05138P47647M38659J126036J420862
$$ 43314498 42511429 42946516 43312433 43293468 43698606 44446253 44884912 46010948 47431810
4461D7431810J585048J27967J405329j439016j353558q69334j243875o69815r7952
$$ 47431810 49016858 49144825 50550154 49111138 47757580 46888246 45644371 44974556 44876604
4452D4876604j15167k19517M2737n50410L7074P43851J286442J102813l4457k17879
$$ 44876604 44761437 44541920 44584657 44034247 44071321 44815172 46101614 47204427 47169970 46952091
4442D6952091J376170J19042k5044Q52747j71490K26232n60197Q74277M57267
$$ 46952091 48328261 48447303 48422259 49275006 49103516 49329748 48769551 49643828 50101095
4433E0101095m49966J47367n6382r8937J60210M98902M08756N60400P11415N28477
$$ 50101095 49651129 49798496 49742114 49643177 49803387 50302289 50711045 51271445 51982860 52511337
4423E2511337Q29043Q99472N04146M21864J676331J592988K159564K655987L298420
$$ 52511337 53340380 54239852 54743998 55165862 56842193 58435181 60594745 63250732 66549152
4414F6549152K664299L429372M098208K278028O55190j781174j724225l106357
$$ 66549152 69213451 72642823 76741031 79019059 79674249 77893075 76168850 73062493
4406G3062493k566721j369191j185428j215533q13264l48465J69818M98157J6697
$$ 73062493 70495772 69126581 67941153 66725620 65912356 65563891 65733709 66231866 66248563
4397F6248563l0428n2826o98488m11167j409882j513280j361906k389584k344683
$$ 66248563 66218135 66165309 65466821 65055654 63645772 62132492 60770586 58381002 56036319
4388E6036319j262029j396645j766069k241029j670071j653958j972628r82099
$$ 56036319 54774290 53377645 51611576 49370547 47700476 46046518 44073890 43091791
4380D3091791j027468j211787l43002j96720n48301N45119p58806j454291K56797
$$ 43091791 42064323 40852536 40509534 40312814 39764513 40309632 39550826 38096535 38353332
4371C8353332q18150j060997O03476p80602n06961m02322o20672J641k58779K01348
$$ 38353332 37535182 36474185 37077661 36297059 35790098 35387776 34767104 34768745 34509966 34711314
4361C4711314m6809j314851j7697m8457K13207m73843o37091m9391l55264L44634
$$ 34711314 34664505 33349654 33331957 33283500 33496707 33022864 32385773 32336382 31981118 32325752
4351C2325752j66879P4919q22179L10740j66247m91291Q57752j95017n01310J8423
$$ 32325752 32158873 32233792 31411613 31722353 31556106 31064815 31922567 31727550 31226240 31244663
4341C1244663J79737j21452M54991l86413K53137M50810p23714m67542j04082
$$ 31244663 31424400 31302948 31757939 31371526 31624663 32075473 31351759 30884217 30780135
4332C0780135k47714m17762M82006M72469k57211r39064J131711n79052o31278
$$ 30780135 30532421 30114659 30596665 31069134 30811923 29872859 31004570 30425518 29794240
4323B9794240k49287M58196N67671J84550q19257o13317R3918m18059j97325J18431
$$ 29794240 29544953 30003149 30570820 30755370 29936113 29322796 29416714 28998655 28801330 28919761
4313B8919761k06044N23791k25150L87454M97369o96725q20130r9534Q00692l43093
$$ 28919761 28713717 29237508 29012358 29399812 29897181 29200456 28380326 28280792 29081484 28738391
4303B8738391j75047Q20367J408k08219J122074J38191J51736l67636k95215J05916
$$ 28738391 28563344 29383711 29385119 29176900 30298974 30437165 30588901 30221265 29926050 30031966
4293C0031966k3245K4578m89188L24789N23017O64066J22264j117333Q13261j609
$$ 30031966 30008721 30033299 29544111 29868900 30391917 31055983 31178247 30060914 30874175 30872566
4283C0872566P30882m79629n69579j77296l00229L18353N22297J022838L945o44329
$$ 30872566 31603448 31123819 30554240 30376944 30076715 30395068 30917365 31940203 31944148 31299819
4273C1299819L81357N83677q537l34990P43347N85632O09312J227336J16772K16505
$$ 31299819 31681176 32264853 32256316 31921326 32664673 33250305 33859617 35086953 35203725 35420230
4263C5420230R86160J195334K050885J230370J36968J426666Q98877O66279L7755
$$ 35420230 36406390 37601724 39652609 40882979 41019947 42446613 43345490 44011769 44049524
4254D4049524j282768k265223j553607l97835p40982j375418K58251p82204k35950
$$ 44049524 42766756 40501533 38947926 38550091 37809109 36433691 36691942 35909738 35673788
4245C5673788M58674k73804O3122p53888k55409l26355p2230L02438J18323k53064
$$ 35673788 36132462 35858658 35921780 35167892 34912483 34586128 34513898 34816336 34934659 34681595
4235C4681595k17119l45896L19970l50317k91933n52703M91315j20728k77582
$$ 34681595 34464476 34118580 34438550 34088233 33796300 33243597 33734912 33614184 33336602
4226C3336602M20605j205382l82994N63742K75146N25160l68613L308o50066P02235
$$ 33336602 33757207 32551825 32168831 32732573 33007719 33532879 33164266 33167574 32517508 33219743
4216C3219743P78162O42665M03560J18859j02633N74036k21726l38816M07725
$$ 33219743 33997905 34640570 35044130 35162989 35060356 35634392 35412666 35073850 35481575
4207C5481575J082427R4415K97795J37155p70211N29485K25770k93609j77424
$$ 35481575 36564002 36658417 36956212 37093367 36323156 36852641 37078411 36784802 36607378
4198C6607378P21701M9794N80365J8310J469367O64030O12303P30266K3457n21216
$$ 36607378 37329079 37378873 37959238 37977548 39446915 40110945 40723248 41453514 41476971 40955755
4188D0955755n62314l67229p5711j179295j91939N5974j009770K73149O7668M6715
$$ 40955755 40393441 40026212 39950501 38771206 38579267 38635241 37625471 37898620 37966288 38013003
4178C8013003J8758j72856J79689l13979m398K91897P24279J38921R18378N98140
$$ 38013003 38031761 37858905 38038594 37724615 37720217 38012114 38736393 38875314 39793692 40391832
4168D0391832J640240J271934R39189K41022L50011J408041P21410R79768N28639
$$ 40391832 42032072 43304006 44243195 44484217 44834228 46242269 46963679 47943447 48472086
4159D8472086Q18559O98236m79949M95403q79204j289920j703495r67764k78266
$$ 48472086 49290645 49988881 49508932 50004335 49125131 47835211 46131716 45163952 44885686
4150D4885686n81471l01769o72586m9930j87633k54028o3670J66357R95255l0054
$$ 44885686 44304215 44002446 43329860 43279930 43092297 42838269 42774599 42940956 43936211 43906157
4140D3906157j6811O18642N22599J103218O28360Q56009O42935J787265O10052
$$ 43906157 43889346 44507988 45030587 46133805 46762165 47618174 48261109 50048374 50658426
4131E0658426J182338J025758J031074J660488J154042J892130J261760M59315
$$ 50658426 51840764 52866522 53897596 55558084 56712126 58604256 59866016 60325331
4123F0325331l9298j474127l6197Q10845q28150p9506k58379k91253q7122M21272
$$ 60325331 60286033 58811906 58775709 59586554 58758404 58678898 58420519 58129266 58042144 58463416
4113E8463416N47950K79954K30174J359090O55971L69999J289004P43009P77458
$$ 58463416 59011366 59291320 59521494 60880584 61536555 61906554 63195558 63938567 64716025
4104F4716025R61005J468301J990939O00719K484785K091505P71151J962109J203897
$$ 64716025 65677030 67145331 69136270 69736989 72221774 74313279 75084430 77046539 78250436
4095G8250436K269779K052154J826953J645001K546570L059905K294590J046460
$$ 78250436 80520215 82572369 84399322 86044323 88590893 91650798 93945388 94991848
4087I4991848K354302L506435M091489N740057P260990P190898O574758M421876
$$ 94991848 97346150 100852585 104944074 110684131 117945121 125136019 131710777 136132653
4079A36132653M64217l656881n319639n039489m105177m430252l290216k443217
$$ 136132653 136596870 132939989 127620350 122580861 118475684 114045432 110755216 108311999
4071A08311999j486539k31644o82911n16360P1569L20456M09023R72537O99720
$$ 108311999 106825460 106593816 105910905 105394545 105466114 105786570 106195593 107168130 107867850
4062A07867850J15798R12471O4937J854637Q32016M64163J385832P13775J342113
$$ 107867850 107983648 108896119 108961056 110815693 111647709 112111872 113497704 114211479 115553592
4053A15553592J378760J637185J298795J010208J557157J703511J821102J691599
$$ 115553592 116932352 118569537 119868332 120878540 122435697 124139208 125960310 127651909
4045A27651909J452271J475747J329426K534751K229764J657095K120488K658904
$$ 127651909 129104180 130579927 131909353 134444104 136673868 138330963 140451451 143110355
4037A43110355K994319J753960K592768J606937J453821K404487J574431K680575
$$ 143110355 146104674 147858634 150451402 152058339 153512160 155916647 157491078 160171653
4029A60171653K615894J492730K505240J332459J125939J520177J410475J474911
$$ 160171653 162787547 164280277 166785517 168117976 169243915 170764092 172174567 173649478
4021A73649478J293251K232475J636185J804107J665008P01559P52080K017464
$$ 173649478 174942729 177175204 178811389 180615496 182280504 182982063 183734143 185751607
4013A85751607J699729L74177K98835R70692J063204J421408J838803J407582
$$ 185751607 187451336 187825513 188124348 189095040 190158244 191579652 193418455 194826037
4005A94826037J192239K180217J963678K049262J707593K143842O28987K145372
$$ 194826037 196018276 198198493 200162171 202211433 203919026 206062868 206691855 208837227
3997B08837227J444127J164604J223153Q39189J964898K089682Q40616K074106
$$ 208837227 210281354 211445958 212669111 213508300 215473198 217562880 218403496 220477602
3989B20477602J483636Q31679J518469P03926l85195j045340j259839n86362q6414
$$ 220477602 221961238 222792917 224311386 225015312 224630117 223584777 222324938 221738576 221652162
3980B21652162j112433j28939n06928j426528m42844j392751l553405m840123
$$ 221652162 220539729 220410790 219903862 218477334 218034490 216641739 213088334 208248211
3972B08248211m265132n056564n920681m993656n004934m777932m452958m122951
$$ 208248211 203983079 198926515 193005834 188012178 183007244 178229312 173776354 169653403
3964A69653403m163824l851518l456983k461655k966412l204624l545392l341493
$$ 169653403 165489579 161638061 158181078 155719423 152753011 149548387 146002995 142661502
3956A42661502l431462k069087k924073l099036k362714l099754k610068k202709
$$ 142661502 139230040 137160953 134236880 131137844 128775130 125675376 123065308 120862599
3948A20862599j965689l468156k126980k538140k429704l006936k269648k826095
$$ 120862599 118896910 115428754 113301774 110763634 108333930 105326994 103057346 100231251
3940A00231251j613396j130575k452075k127601j171970p38124q46665j807119
$$ 100231251 98617855 97487280 95035205 92907604 91735634 90997510 90150845 88343726
3932H8343726j361137j07723m63905k62227j011903j028603k25722R91318r28107
$$ 88343726 86982589 86874866 86410961 86148734 85136831 84108228 83882506 84873824 83945717
3923H3945717j4810q17795l13421n31712o59983N8876m10847m11431m18008m33257
$$ 83945717 83930907 83113112 82799691 82267979 81607996 81666872 81256025 80844594 80426586 79993329
3913G9993329J18391M79568l04063n19398J53231m37082o4183q7029J39063j050102
$$ 79993329 80111720 80591288 80287225 79767827 79921058 79483976 79419793 79332764 79471827 78421725
3903G8421725j351111r8476j95612j530594k43469j98022r43375j366660j158429
$$ 78421725 77070614 76972138 76776526 75245932 75002463 74804441 73861066 72494406 71335977
3894G1335977j82480m28036j047590j241037o39992p43942m69636k68911q43792
$$ 71335977 71153497 70725461 69677871 68436834 67796842 67052900 66583264 66314353 65470561
3885F5470561l92112K76687j482031n78193j19284k29565m33327q94699j37585
$$ 65470561 65078449 65355136 63873105 63294912 63175628 62946063 62512736 61618037 61480452
3876F1480452l36o91821l54390j24436o74834M40760R27285j5874L88415N36077
$$ 61480452 61480116 60788295 60433905 60309469 59634635 60075395 61002680 60986806 61375221 61911298
3866F1911298k67746J24813R57631P56818M48836J37860Q6505L20764J454600
$$ 61911298 61643552 61768365 62725996 63482814 63931650 64069510 64156015 64476779 65931379
3857F5931379N27073P64347J752056Q01228J424651K106287K653581J437173O35577
$$ 65931379 66458452 67222799 68974855 69776083 71200734 73307021 75960602 77397775 78033352
3848G8033352J142411K84546J41293P00473p60622l69729m03367n52350k85581
$$ 78033352 79175763 79460309 79601602 80302075 79541453 79171724 78768357 78216007 77930426
3839G7930426k414R07242Q44301M14914J067361M44883k94170o68327j009534
$$ 77930426 77928012 78835254 79679555 80094469 81161830 81606713 81312543 80644216 79634682
3830G9634682p25078k152949j402799j092393r55555r05965o06353q40705M4042
$$ 79634682 78909604 76756655 75353856 74261463 73305908 72399943 71793590 70952885 70996927
3821G0996927n66857K16288N3159m36201k82562J51535n04743m0244l32693J36809
$$ 70996927 70430070 70646358 70699517 70263316 69980754 70132289 69627546 69587302 69254609 69391418
3811F9391418p36637P8752Q18186q97628m56081l89517L45114p45224J05271k65195
$$ 69391418 68654781 68733533 69551719 68654091 68198010 67808493 68153607 67408383 67513654 67248459
3801F7248459j93431q12148j27006k68975N96525p11858k32635N29537P90245
$$ 67248459 67055028 66242880 66115874 65846899 66443424 65731566 65498931 66028468 66818713
3792F6818713j07416o33530P4983r28172N6786n5920R67198K91604M65325L7993
$$ 66818713 66711297 66077767 66152750 65224578 65281364 65225444 66192642 66484246 66949571 66987564
3782F6987564L37624j32811K92332J307800P54240Q64412M02504J678364R49057
$$ 66987564 67325188 67192377 67484709 68792509 69546749 70411161 70813665 72492029 73441086
3773G3441086Q92387J159303N78860J074691J130055J094933k06721J40832J023235
$$ 73441086 74333473 75492776 76071636 77146327 78276382 79371315 79164594 79305426 80328661
3764H0328661L64744J004070L26957O24854L36569N78533J330260J280378K30844
$$ 80328661 80693405 81697475 82024432 82649286 82985855 83564388 84894648 86175026 86405870
3755H6405870k66132O11769M37389M09556j31032J15456l31934M21576m18245
$$ 86405870 86139738 86751507 87188896 87598452 87467420 87582876 87250942 87672518 87254273
3746H7254273q8232R24589N1767M32260j6751J4741m18374j3389J73079P68621
$$ 87254273 87166041 88090630 88142397 88574657 88557906 88572647 88154273 88140884 88313963 89082584
3736H9082584m72277p16739O73927M29872J022176K9942j0610J459544P0153j12744
$$ 89082584 88610307 87893568 88567495 88997367 90019543 90049485 90038875 91498419 91568572 91455828
3726I1455828Q9875R14806R61177R9526Q68781M07678J319423P83543J291355
$$ 91455828 91545703 92460509 93421686 93521212 94389993 94797671 96117094 96900637 98191992
3717I8191992J551934j45585Q06598J343484M36157J230263J630991J002624N22724
$$ 98191992 99743926 99598341 100404939 101748423 102184580 103414843 105045834 106048458 106571182
3708A06571182J468773Q93292J083257R66184J815573J068131O97314J677273
$$ 106571182 108039955 108933247 110016504 110982688 112798261 113866392 114563706 116240979
3700A16240979Q87378J477532O89130Q65610J439274Q74114K026589J282107J296228
$$ 116240979 117128357 118605889 119295019 120160629 121599903 122474017 124500606 125782713 127078941
3691A27078941M87987Q19725J519493J492398J762532J858117J712238J206630
$$ 127078941 127566928 128386653 129906146 131398544 133161076 135019193 136731431 137938061
3683A37938061J617294K007198J935269J701575J459041K694160J576235K250129
$$ 137938061 139555355 141562553 143497822 145199397 146658438 149352598 150928833 153178962
3675A53178962L410197K655118L033494K889231K574626K921332K929181L340819
$$ 153178962 156589159 159244277 162277771 165167002 167741628 170662960 173592141 176932960
3667A76932960M256064K499286L891613K941814K727671L808101L487549M290180
$$ 176932960 181189024 183688310 187579923 190521737 193249408 197057509 200545058 204835238
3659B04835238L945698L867037M184450L542747M239910M545271M119728M476557
$$ 204835238 208780936 212647973 216832423 220375170 224615080 229160351 233280079 237756636
3651B37756636M461879M282145N076960M046288N845946N107656N145073N319363
$$ 237756636 242218515 246500660 251577620 255623908 261469854 266577510 271722583 277041946
3643B77041946O306171O782305O597719Q487489Q187127Q204387P617127O677468
$$ 277041946 283348117 290130422 296728141 305215630 313402757 321607144 329224271 335901739
3635C35901739N512411N336338M754805M607744N736192M976919O295039O170060
$$ 335901739 341414150 346750488 351505293 356113037 361849229 366826148 373121187 379291247
3627C79291247O483378O939223N695829N385799L665261K653266L61384p65768
$$ 379291247 385774625 392713848 398409677 403795476 407460737 410114003 410475387 409709619
3619D09709619j538051l145961l132200l045920k954474j891443k000335j711122
$$ 409709619 408171568 405025607 401893407 398847487 395893013 394001570 392001235 390290113
3611C90290113n95227j592445k184163j985266l547413m286731m358898m522856
$$ 390290113 389694886 388102441 385918278 383933012 380385599 376098868 371739970 367217114
3603C67217114m027203l118307k701949k427845k265020j953683k245413j937821
$$ 367217114 363189911 360071604 357369655 354941810 352676790 350723107 348477694 346539873
3595C46539873n10963j182007j131447j652887j027663l48951p68893o31271j142550
$$ 346539873 346028910 344846903 343715456 342062569 341034906 340685955 339917062 339285791 338143241
3586C38143241p81747j360409j245390r4757j352155k785097j997177j165194
$$ 338143241 337361494 336001085 334755695 334660938 333308783 330523686 328526509 327361315
3578C27361315j393217k440840l044590j759539k221482l235861l301562k335659
$$ 327361315 325968098 323527258 320482668 318723129 316501647 313265786 309964224 307628565
3570C07628565l226643l177385l394666l780295l421820l275783l212484m777747
$$ 307628565 304401922 301224537 297829871 294049576 290627756 287351973 284139489 279361742
3562B79361742l334029m762897m190302l927338n144522l351810m516175l798698
$$ 279361742 276027713 271264816 267074514 263147176 258002654 254650844 250134669 246335971
3554B46335971m456129m790965l671406l877230l616000m209607l943696m092151
$$ 246335971 241879842 237088877 233417471 229540241 225924241 221714634 217770938 213678787
3546B13678787m221673l989345l842256l738313m340607m285468l176410l547298
$$ 213678787 209457114 205467769 201625513 197887200 193546593 189261125 186084715 182537417
3538A82537417l084648l924056l514643l397274m298821l591307k623449l087889
$$ 182537417 179452769 175528713 172014070 168616796 164317975 160726668 158103219 155015330
3530A55015330l152998k829564k191034k879049l078130k652838k888669k195955
$$ 155015330 151862332 149032768 146841734 143962685 140884555 138231717 135343048 133147093
3522A33147093k685813k037872j704138k175893j823692k429526k350999j818610
$$ 133147093 130461280 128423408 126719270 124543377 122719685 120290159 117939160 116120550
3514A16120550n80354k169741k389850j432649j035639k200710k007786j390073
$$ 116120550 115540196 113370455 110980605 109547956 108512317 106311607 104303821 102913748
3506A02913748k205727j753676j503434j734219j271205j421429j716588j369758
$$ 102913748 100708021 98954345 97450911 95716692 94445487 93024058 91307470 89937712
3498H9937712j616921k199664j633307p02599j523528j503512k074743j735620
$$ 89937712 88320791 86121127 84487820 83785221 82261693 80758181 78683438 76947818
3490G6947818j301690l98753j460668p36999n84816j522546j466819j269923r34537
$$ 76947818 75646128 75247375 73786707 73049708 72464892 70942346 69475527 68205604 67271067
3481F7271067n48768j583524j760949n77838j115216o41513k206139j359027o05051
$$ 67271067 66722299 65138775 63377826 62799988 61684772 61043259 58837120 57478093 56873042
3472E6873042j521509p17517m91323n22564p82633r29155j363291j119791j009293
$$ 56873042 55351533 54634016 54142693 53620129 52837496 51908341 50545050 49425259 48415966
3463D8415966k52727m86232j402649l50162m77455q90176j752016j017660n76164
$$ 48415966 48163239 47677007 46274358 45924196 45446741 44556565 42804549 41786889 41210725
3454D1210725l26098k16884J64672m38742l82558m29560k07645l40694n22266
$$ 41210725 40884627 40667743 40832415 40393673 40011115 39581555 39373910 39033216 38510950
3445C8510950o60861j192627j84920m95793k46382M70253l66423j274919O07748
$$ 38510950 37850089 36657462 36472542 35976749 35730367 36200620 35834197 34559278 35167026
3436C5167026j72559j850250k03785Q50775o42230l18108L32536o18492j388075
$$ 35167026 34994467 33144217 32940432 33791207 33148977 32830869 33163405 32544913 31156838
3427C1156838J42103j89149J42634k68676o28601n75349K92535L43500n56920
$$ 31156838 31298941 31109792 31252426 30983750 30355149 29779800 30072335 30415835 29858915
3418B9858915p19346n49352j40892N3004J89030o99230p33048p22767K50675M20756
$$ 29858915 29139569 28590217 28449325 28502329 28691359 27992129 27259081 26536314 26786989 27207745
3408B7207745R06009l9366o89375m03195o27406o6676l24415n731J12007m55221
$$ 27207745 28113754 28074388 27385013 26981818 26354412 26287736 25963321 25957590 26069597 25614376
3398B5614376J4008J99109J38601K00330j076914O50432j29346N03805p21830
$$ 25614376 25628384 25827493 25966094 26166424 25089510 25739942 25610596 26114401 25392571
3389B5392571r72626K12680J109637m87199m20305k78758K23757J060787k31227
$$ 25392571 24419945 24632625 25742262 25255063 24834758 24556000 24779757 25840544 25609317
3380B5609317p28813k15406m51028k29973R72965K58369L9291l33235N42013k50773
$$ 25609317 24880504 24665098 24214070 23984097 24957062 25215431 25254722 24921487 25463500 25212727
3370B5212727O57270q0714q0266M09190q16585K21704L93483O21931N53757L76822
$$ 25212727 25869997 25789283 25709017 26118207 25301622 25523326 25916809 26538740 27092497 27469319
3360B7469319l59580k44709L12437R2628P5444L36356L66920K94937J74368K62546
$$ 27469319 27109739 26865030 27177467 27270095 27345539 27681895 28048815 28343752 28518120 28780666
3350B8780666P19174l00750l60309J091177J185147p3762l21263L08043L82099
$$ 28780666 29499840 29199090 28838781 29929958 31115105 31041343 30720080 31028123 31410222
3341C1410222k40675J291929q6588M25301R65689O18480N6495P95529K00507R87980
$$ 31410222 31169547 32461476 32374888 32800189 33765878 34384358 34440853 35236382 35436889 36424869
3331C6424869O38497Q99607P83049P06720L63714n765L72664L85905Q11583J194581
$$ 36424869 37063366 37962973 38746022 39452742 39816456 39810691 40183355 40569260 41380843 42575424
3321D2575424K3479L43712N02792O59089k10670K0065R51329R86551Q04705O72180
$$ 42575424 42598903 42942615 43445407 44104496 43893826 43913891 44865220 45851771 46656476 47328656
3311D7328656J110272J234034R54148K50373R80692M6861Q12588J311558J026560
$$ 47328656 48438928 49672962 50627110 50877483 51858175 51905036 52717624 54029182 55055742
3302E5055742R93871J572757J15593J242720P64122Q73816K366973L75135R03548
$$ 55055742 56049613 57622370 57737963 58980683 59744805 60618621 62985594 63360729 64264277
3293F4264277J358958J852500J414999J488516J732792J611529J025455J566371
$$ 64264277 65623235 67475735 68890734 70379250 72112042 73723571 74749026 76315397
3285G6315397R40162J478256J871891J124728J483946K235331K108787K463105
$$ 76315397 77255559 78733815 80605706 81730434 83214380 85449711 87558498 90021603
3277I0021603K115249K422186J883444K141492K589204L175555L441753K860807
$$ 90021603 92136852 94559038 96442482 98583974 101173178 104348733 107790486 110651293
3269A10651293L015363K527294L422719L361284L310775L065150M157071M431026
$$ 110651293 113666656 116193950 119616669 122977953 126288728 129353878 133510949 137941975
3261A37941975L784081L648387N014640M931492M562567N304273P462229P521704
$$ 137941975 141726056 145374443 150389083 155320575 159883142 165187415 172649644 180171348
3253A80171348P589931P951042J0501437J0799425J1849439J3400350J6942616
$$ 180171348 187761279 195712321 206213758 217013183 228862622 242262972 259205588
3246B59205588J8923665K3211059K6704832L2060165L6749310L2717138J8023391
$$ 259205588 278129253 301340312 328045144 360105309 396854619 429571757 447595148
3239D47595148J92717q596573q769533q089485r391388j0548922j0674994j0410902
$$ 447595148 447787865 439191292 430421759 422332274 412940886 402391964 391716970 381306068
3231C81306068j0963711j1116325j2330188j3972493j4180694j6135622j7923237
$$ 381306068 370342357 359226032 346895844 332923351 318742657 302607035 284683798
3224B84683798j8712264j9749665j9501813j8309844j6513384j5662040j4235539
$$ 284683798 265971534 246221869 226720056 208410212 191896828 176234788 161999249
3217A61999249j2681186j0679971r896605q800547p534933p024811o162654m684949
$$ 161999249 149318063 138638092 128741487 119940940 112406007 105381196 99218542 94533593
3209I4533593m547320m789836m170093l514146l631173k448859k347729k775492
$$ 94533593 89986273 85196437 81026344 77512198 73881025 71432166 69084437 66308945
3201F6308945l146283k820070j954983j641590j393432j626162j603008j19697
$$ 66308945 63162662 60342592 58387609 56746019 55352587 53726425 52123417 52003720
3193E2003720k165482j683809j392778j692597j585727o71485q91846j681934
$$ 52003720 49838238 48154429 46761651 45069054 43483327 42811842 41919996 40238062
3185D0238062j203668p57415r49288j701353k34775m84477j554476r69929q25148
$$ 40238062 39034394 38276979 37327691 35626338 35391563 34907086 33352610 32382681 31557533
3176C1557533j182994n44062p21297j368914j179514o565M01005j268731o16401
$$ 31557533 30374539 29830477 29109180 27740266 26560752 26554187 26955192 25686461 25070060
3167B5070060p57351L15315K85355j291245q14470p19512l08989l17821r02610
$$ 25070060 24312709 24628024 24913379 23622134 22807664 22088152 21779163 21461342 20558732
3158B0558732m06245M60439n44928p79214n16911O90339n90911r10n24159j096827
$$ 20558732 20152487 20612926 20067998 19288784 18771873 19462212 18871301 18870391 18346232 17249405
3148A7249405m996l2575l73927P96150l1558j140372n38632j74769l44673p59114
$$ 17249405 17244409 17211834 16837907 17634057 17602499 16462127 15923495 15748726 15404053 14644939
3138A4644939k61241J80803O31273K12571l64043q79541j217280N8252n0036l36723
$$ 14644939 14383698 14564501 15195774 15408345 15044302 14164761 12947481 13005733 12955697 12618974
3128A2618974J79879j38551P43483M48410k42674l10942r23805l02403m30570
$$ 12618974 12798853 12660302 13403785 13852195 13609521 13298579 12374774 12072371 11641801
3119A1641801L16160M67859n93649m2886l73773r31642j65218J073266N07409
$$ 11641801 11957961 12425820 11832171 11789285 11415512 10483870 10318652 11391918 11899327
3110A1899327j10087n15626q06558K55570N96738p93935p54140j0300j54915J47039
$$ 11899327 11789240 11273614 10467056 10722626 11319364 10525429 9771289 9760989 9606074 9753113
3100I753113L98974k53102M49574n02191K4657k21031M29047k03604n43337l73415
$$ 9753113 10152087 9898985 10348559 9846368 9871025 9649994 10079041 9875437 9332100 8958685
3090H958685l37804O74985k58240k28229M52597o13281q63771O83455M01430j2827
$$ 8958685 8620881 9295866 9037626 8809397 9261994 8648713 7784942 8468397 8869827 8857000
3080H857000j222998l35245M1430k13997N0109N31072K96096L39891m67249j036183
$$ 8857000 7634002 7298757 7340187 7126190 7176299 7707371 8003467 8343358 7876109 6839926
3070F839926j72555J268878Q52670p93402M42362l93313j88596k54548l90537
$$ 6839926 6667371 7936249 8788919 7995517 8437879 8044566 7855970 7601422 7210885
3061G210885k67309j81461K84271Q2590k50842L92313k3109K59949o92383j68200
$$ 7210885 6943576 6762115 7046386 7128976 6878134 7270447 7247338 7507287 6814904 6646704
3051F646704J37581K29025O4515m03151n97489P5081j37676q9996L22189K0366
$$ 6646704 6784285 7013310 7077825 6674674 6077185 6152266 6014590 5924594 6246783 6267149
3041F267149K06324N74006l24620j030436M0587j8646L86043j79298L85352J2048
$$ 6267149 6473473 7047479 6722859 5692423 5733010 5714364 6100407 5921109 6306461 6318509
3031F318509j38627P25313J18031J80997n52286n97616q86117Q67056J060944
$$ 6318509 6179882 6905195 7023226 7204223 6651937 6054321 5168204 6035260 7096204
3022G096204p67701r38861M4804R68065r5532N06265J38849n34144k98902R10164
$$ 7096204 6328503 5389642 5434446 6402511 6306979 6813244 6952093 6417949 6119047 7029211
3012G029211k09084k32681p05937N69684M92266L57051j97996n98962J52803O16696
$$ 7029211 6820127 6587446 5881509 6451193 6943459 7300510 7102514 6503552 6656355 7273051
3002G273051q92611M78255L49333N26280j64039k14178k73824N07426k30030l92536
$$ 7273051 6380440 6858695 7208028 7734308 7570269 7356091 7082267 7589693 7359663 6967127
2992F967127L93383J15443o03445j29098O77737N43840Q2806J86571m03296m64300
$$ 6967127 7360510 7475953 6872508 6743410 7421147 7964987 8047793 8234364 7831068 7366768
2982G366768P45565K78718Q9385k10652n17753J16755Q36716p76291k64996L18155
$$ 7366768 8112333 8391051 8480436 8269784 7752031 7868786 8705502 7929211 7664215 7982370
2972G982370J53550O16879N36147p98703l49245M19424J42663N60115J424691
$$ 7982370 8135920 8752799 9288946 8490243 8140998 8560422 8703085 9263200 10687891
2963A0687891j94498o16052l97694L11170L09879o82723J099737M40033l5049
$$ 10687891 10493393 9877341 9479647 9790817 10100696 9417973 10517710 10957743 10922694
2954A0922694J009359p98855O8778L6932J92978K69815O92589n63636N39002m58020
$$ 10922694 11932053 11133198 11201976 11238908 11431886 11701701 12394290 11830654 12369656 11911636
2944A1911636Q14430J120520j9108M57896J021900O21520J222735K9412q169J129502
$$ 11911636 12726066 13846586 13827478 14285374 15307274 15928794 17151529 17180941 17172772 18302274
2934A8302274Q19989J289017J150108J208847J186976Q37397j83891M60663J637143
$$ 18302274 19122263 20411280 21561388 22770235 23957211 24794608 24610717 25071380 26708523
2925B6708523O91124n09198k34860M55047j27892j282474j48496P13804j52174
$$ 26708523 27399647 26890449 26655589 27110636 26982744 25700270 25551774 26265578 26113404
2916B6113404K08687J111084r29522L17259L39906N89773P20243m2945M60447
$$ 26113404 26322091 27433175 26503653 26820912 27160818 27750591 28470834 28427889 28888336
2907B8888336J188467J94680Q31716J459240J709426K772122K477970K982042
$$ 28888336 30076803 30271483 31103199 32562439 34271865 37043987 39521957 42503999
2899D2503999M163211K818832P59247k175697l912189m381476k707181k757347
$$ 42503999 46667210 49486042 50245289 48069592 44157403 39775927 37068746 34311399
2891C4311399l370583j578473j862793j397442p54661m48745L00957p27666p83058
$$ 34311399 30940816 29362343 27499550 26102108 25347447 24898702 25199659 24471993 23688935
2882B3688935q469n45687k50649j89757J72065k07027L66664N97264O21257K28150
$$ 23688935 23680466 23134779 22884130 22694373 22866438 22659411 23026075 23623339 24244596 24472746
2872B4472746M45225J23776N25538J128738l96932j286170r4297k28703n15224
$$ 24472746 24917971 25041747 25567285 26696023 26299091 25012921 24918624 24689921 24174697
2863B4174697j058611j744805j485424l48446p89395j284569q52178q25463q19597
$$ 24174697 23116086 21371281 19885857 19537411 18748016 17463447 16611269 15785806 14966209
2854A4966209p66008p92081j4003r5399l4408j210944K21724K08915m73763l97342
$$ 14966209 14200201 13408120 13394117 13298718 13264310 12053366 12275090 12484005 12010242 11612900
2844A1612900m28383p60302k2183k8871m07762n07780p23360K18775L44317k14500
$$ 11612900 11184517 10424215 10402032 10373161 9965399 9457619 8734259 8953034 9297351 9082851
2834I082851q89886m87298m66326k54532n75784M75017l97418o26057p93495L62127
$$ 9082851 8192965 7705667 7239341 6984809 6409025 6884042 6486624 5860567 5067072 5429199
2824E429199J77185M82714j43553N4899p17920N18075L6248r15571p24276J92113
$$ 5429199 5606384 6089098 5945545 6000444 5282524 5800599 5836847 4921276 4197000 4389113
2814D389113m45878M05888j03884R61325m85682l90562N2154l97820N32614n92583
$$ 4389113 3943235 4349123 4245239 5206564 4720882 4330320 4382474 3984654 4517268 3924685
2804C924685Q456m32981n24716Q89092j45705o26311L19982N88780k62888k09320
$$ 3924685 3933141 3500160 2975444 3864536 3718831 3092520 3412502 4001282 3738394 3529074
2794C529074k11581n6025M31374o72115Q8610N7580L2252m52361Q438O59191M40736
$$ 3529074 3317493 3261468 3692842 3020727 3109337 3166917 3199169 2746808 2755246 3414437 3855173
2783C855173N39745l35257j280158q3957J43348M61916o43022J35514r6617O17065
$$ 3855173 4394918 4059661 2779503 2695546 2838894 3300810 2657788 2793302 2696685 3313750
2773C313750q61810r32632L83348N41993M36314j6174j39209j91482n40576J67590
$$ 3313750 2451940 1519308 1902656 2444649 2880963 2864789 2725580 2534098 1993522 2161112
2763B161112K21283l30984r66512O21434K99355J2565K56471m47076k59136R18970
$$ 2161112 2382395 2051411 1084899 1706333 2005688 2018253 2274724 1827648 1568512 2487482
2753B487482L11909l34435o98602J70436J75573r15680M36253J57114K8004o70700
$$ 2487482 2799391 2464956 1766354 1936790 2112363 1196683 1632936 1790050 1818054 1147354
2743A147354j3273q1412m21412R8592M85230P25280m31034n57135J29734Q19678
$$ 1147354 1134081 1052669 631257 729849 1215079 1940359 1509325 952190 1081924 1901602
2733A901602K14061o4762k38168n03862N0169j95361k58635L7217m42234m1073
$$ 1901602 2115663 2050901 1812733 1308871 1359040 1163679 905044 942261 500027 458954
2723D58954Q37451K01008M85355j38172q40521K33098K49334K75176J034624L72583
$$ 458954 1296405 1497413 1982768 1844596 1004075 1237173 1486507 1761683 2796307 3168890
2713C168890q17797j161862m97109l61836n14344J76086K02688O88302k3156M70790
$$ 3168890 2351093 1189231 692122 330286 -184058 -7972 194716 883018 859862 1330652
2703A330652l44366k0457N69037l66083P73669m64182m05851m85048k77361m20071
$$ 1330652 986286 965829 1534866 1168783 1942452 1478270 1072419 587371 310010 -110061
2693a10061Q63921Q66736J69460o67072J15845O74545r79656l46957P7218j04630
$$ -110061 753860 1620596 1790056 1122984 1238829 1913374 933718 586761 663979 559349
2683E59349o2449N91730o3228q28224l61150L96601O75272Q7135o76014M26899
$$ 559349 496900 1088630 1025402 197178 -163972 232629 907901 995036 319022 745921
2673G45921O83699j96652j19749m97452m64687K68295M53058L93428m30210j31886
$$ 745921 1429620 1232968 1113219 615767 151080 419375 872433 1265861 835651 703765
2663G03765K15001k73395K39284k4824o66866o71796N62089M32078j88248P90512
$$ 703765 918766 645371 884655 859831 192965 -478831 83258 515336 327088 1117600
2653A117600r3070k27821m85721k02881M54578j099439O67315L50363K36062n02105
$$ 1117600 1024530 796709 310988 108107 562685 -536754 130561 480924 716986 214881
2643B14881J168105m7362J32658R9108j04287n36121q2769K0687j59789N57706
$$ 214881 1382986 1335624 1468282 1567390 1463103 926982 844213 864900 705111 1262817
2633A262817k30088l82815K49784M01067o69087q7055L62000J066090j324861
$$ 1262817 1032729 649914 899698 1300765 631678 544623 906623 1972713 647852
2624F47852p83006N78664P3716k1566K57088M08698p33613k18341M77963j68701
$$ 647852 -135154 443510 517226 495660 752748 1161446 427833 209492 687455 518754
2614E18754L71209M56460r07932k41853N99971j58334O4387m03913M59403n62937
$$ 518754 889963 1346423 438491 196638 796609 638275 702662 298749 758152 195215
2604A95215k41310J44342O86174P50939q0378p99347K03647m40165Q7746J51511
$$ 195215 -46095 98247 784421 1535360 1454982 655635 859282 419117 506863 658374
2594F58374m24944M20984L35087L48574n02691o61345l01324P6681o0777O64749
$$ 658374 233430 654414 989501 1338075 835384 174039 -127285 -50604 -111381 553368
2584E53368O89023j32060m6458l1489j024722J23644N3826J26648k98878M11773
$$ 553368 1242391 1110331 1063873 1032384 7662 131306 185132 311780 12902 424675
2574D24675L36942j431399K98724K65741J96124O00333j66255j34565n4571n65635
$$ 424675 761617 -669782 -371058 -105317 90807 691140 524885 390320 335749 -229886
2564b29886j07587R7715n9502k84005J161212J51659k19070n51862K75176O63034
$$ -229886 -337473 -239758 -299260 -583265 577947 729606 510536 -41326 233850 896884
2554H96884n93054L9062N9692l22119n08701n8645P29173k65820N88238m40612
$$ 896884 303830 342892 402584 80465 -428236 -486881 242292 -23528 564710 124098
2544A24098k0343M08919M89940L0133j052973j12648l129L93507p58495j18601
$$ 124098 103755 512674 1002614 1032747 -20226 -132874 -136003 257504 -500991 -619592
2534f19592K01357M28699P20082J5584o93615k54075R20463J23843l33750q62111
$$ -619592 -418235 10464 730546 746130 52515 -201560 718903 842746 508996 -353115
2524c53115K53360M69037l89792q87014J005398R47983o04239L49619q45304l77864
$$ -353115 -99755 369282 -20510 -907524 97874 1045857 441618 791237 -54067 -431931
2514d31931q3596j86123N56525R08293m07481j92566n37041l33361L52878P76268
$$ -431931 -515527 -701650 -145125 763168 355687 163121 -373920 -707281 -354403 421865
2504D21865M4478L01239o83961J27873M2627o86530j52499L01325Q67002l08577
$$ 421865 466343 767582 83621 211494 254121 -432409 -584908 -283583 583419 274842
2494B74842n93962N12365p4406l59086J86687L28152O5102n48391L42057J35631
$$ 274842 -319120 193245 118839 -240247 -53560 274592 339694 -208697 133360 268991
2484B68991k15153K76567J49609L14101o61719l19008O42059O6831j18869K90687
$$ 268991 53838 330405 480014 794115 132396 -186612 455447 522278 403409 694096
2474F94096J59165j367155L35366L04609o89209J336895K00533q74139p86812
$$ 694096 853261 -513894 -178528 126081 -563128 773767 974300 100161 -686651
2465f86651j46087J82253K47495P61203n409l16298m31920p17158K58063O16901
$$ -686651 -832738 -650485 -402990 358213 352804 36506 -395414 -1112572 -854509 -237608
2455b37608J147958q40522O61743q19999l07657N64520k15655n79451l58698N87924
$$ -237608 910350 69828 731571 -88428 -396085 168435 -47220 -626671 -985369 -397445
2445c97445Q22651P0140M30432L23473j037818N59133k0084l45091l66816J079033
$$ -397445 425206 495346 925778 1249251 211433 770566 750482 405391 38575 1117608
2435A117608o40147k19107L0369j59099l57761N46850P37516l48759j60278K46886
$$ 1117608 477461 258354 288723 129624 -228137 318713 1056229 707470 547192 794078
2425G94078q68019N54668m3206n4904Q19548m78555J598l04599J662O23776l51398
$$ 794078 -73941 480727 437521 382617 1202165 723610 725208 420609 422271 1046047 694649
2414F94649q26496L0291r3870M02925L41811L76862K07603k72110r02020l01362
$$ 694649 -131847 -101556 -195426 207499 549310 926172 1133775 861665 -40355 -341717
2404c41717J51335n75453J292239O02706k18983p91463K7773k36469K11672L64301
$$ -341717 -190382 -765835 526404 1129110 910127 118664 146437 -90032 121640 485941
2394D85941o5139l92792O55203P130j016017P65772R43982n64937K92628L47970
$$ 485941 420802 28010 683213 690343 -325674 440098 1384080 819143 1111771 1459741
2384A459741j292546K21190M49001l79188l76323N93230O5970K56496N8334l71922
$$ 1459741 167195 388385 837386 458198 81875 675105 741075 997571 1055905 683983
2374F83983j35613l05697o1987K88908P14067O61630l66458Q17082m19210m14766
$$ 683983 548370 242673 180686 469594 1183661 1845291 1478833 2295915 1876705 1461939
2364A461939k57493L79251J61038q06819R8878m15549o40157M2362O81892J916
$$ 1461939 1204446 1583697 1744735 937916 1036794 621245 -18912 23450 705342 707258
2354G07258j90159l19675O86733O9764l94224k83254P20624p7535k33548n25802
$$ 707258 517099 197424 884157 953921 559697 276443 997067 919532 685984 160182
2344A60182R18778L03913o85055N9352j69997j95402r87284J08327J348835L86700
$$ 160182 1078960 1382873 697818 757170 587173 391771 -595513 -487186 861649 1248349
2334A248349l25924m71560l41170J64245L28164n4059l54803P55814o17524L35857
$$ 1248349 922425 450865 109695 273940 602104 548045 193242 949056 331532 667389
2324F67389k39462O75339M61125p23696k78633o3011K6508k74738N49964j01852
$$ 667389 427927 1103266 1564391 840695 562062 499051 525559 250821 800785 698933
2314F98933m57327k67475l14156R09203q0783N65820K45203J58069J87799j12997
$$ 698933 241606 -25869 -340025 569178 488395 1054215 1299418 1457487 1645286 1532289
2304A532289O32769q83644q25166L12476O72412k97437L47223l62911l82279n57312
$$ 1532289 2165058 1281414 456248 768724 1441136 1143699 1490922 1128011 745732 188420
2294A88420n52113R34605J5733L94616J82840o88978k92002R73129N8058K36658
$$ 188420 -363693 570912 586645 981261 1164101 475123 183121 1156250 1214308 1450966
2284A450966p01573l48219O97172M61432k53747p2607l64040j87313O69488K52547
$$ 1450966 749393 401174 1098346 1559778 1306031 1233424 869384 682071 1351559 1604106
2274A604106p50757J43843Q34208j013830K09031M9371k64279N40301K32607o21879
$$ 1604106 853349 997192 1831400 817570 1026601 1075972 811693 1351994 1584601 962722
2264I62722n0158m49564k28444J637424R55552j223977j99680P78633K2053o55054
$$ 962722 912564 463000 234556 1871980 2827532 1603555 1403875 2182508 2204561 1549507
2254A549507o74225m46414M4950L77419k2059O4654L96458m12967n2463o24278
$$ 1549507 875282 428868 473818 851237 829178 893832 1290290 877323 824860 200582
2244B00582O91739J23117P0272p64409L80036P35591o28537K30857M82760M4965
$$ 200582 892321 1015438 1085710 321301 701337 1436928 808391 1039248 1522008 1566973
2234A566973m90166r1689m896L09547M17997l4725J97909l43586L07163L93639
$$ 1566973 1076807 985118 980222 1289769 1707766 1673041 1870950 1527364 1834527 2228166
2224B228166l55607O50144l57435n84257L10338Q93324r29101M23154r3324K31786
$$ 2228166 1872559 2522703 2165268 1581011 1891349 2784673 1855572 2278726 2185402 2417188
2214B417188L03065n61772n39936M75686O00770P59598n8276o94122K66733N01919
$$ 2417188 2720253 2158481 1618545 2094231 2695001 3454599 3396323 2702201 2968934 3470853
2204C470853j68537o66985Q12552n12436K78874M5714k86021K44452K17197l07621
$$ 3470853 3302316 2635331 3447883 2935447 3214321 3260035 2974014 3218466 3435663 3128042
2194C128042O31204N54954K38627j53368K50299l22059R2891R82942j96521J41296
$$ 3128042 3759246 4314200 4552827 4399459 4649758 4327699 4420590 5403532 5207011 5348307
2184E348307l56533L67701J97434n04570J6144K70510j90081N61669q9601J60598
$$ 5348307 4991774 5359475 5556909 5052339 5068483 5338993 5148912 5710581 5620980 5781578
2174E781578L17782m48921m87281Q10689Q06089R91211k63323k68204N3609K37447
$$ 5781578 6099360 5650439 5163158 5973847 6779936 7771147 7507824 7239620 7293229 7530676
2164G530676R04464J44338R83568k2787r96000J245980j73902l19506N75996p1117
$$ 7530676 8435140 8579478 9563046 9540259 8544259 9790239 9616337 9296831 9872827 9801710
2154I801710O08123K44571j04912k18461P56210P76085M09479N57597j9019K43639
$$ 9801710 10409833 10654404 10549492 10331031 11087241 11863326 12272805 12830402 12811383 13055022
2144A3055022N27186L53921J31032Q15597L63402J428470J31280L64205J097045
$$ 13055022 13582208 13936129 14067161 14882758 15246160 16674630 16805910 17170115 18267160
2135A8267160K74551J089673J616953Q54035O01051J038114J172977J083071J113453
$$ 18267160 18541711 19631384 21248337 22102372 22703423 23741537 24914514 25997585 27111038
2126B7111038L13102J309148J974329L85293J860543K055590J569302K602450
$$ 27111038 27424140 28733288 30707617 31092910 32953453 35009043 36578345 39180795
2118C9180795L143859L336592N693361M830276K847346L312983K511324L928381
$$ 39180795 42324654 45661246 51354607 56184883 59032229 62345212 64856536 68784917
2110F8784917N950296P681262R631623J3187124J6349784K1514727L1592151M3447113
$$ 68784917 74735213 82416475 92048098 105235222 121585006 143099733 174691884 218138997
2102B18138997O3475703Q4670177P0009315l4720005r3880901p9031364n3078519
$$ 218138997 281614700 366284877 436294192 401574187 307693286 228661922 175583403
2095A75583403l3718762k5955417j8317363j5696567j1590518p977701m359781
$$ 175583403 141864641 115909224 97591861 81895294 70304776 62327075 57967294
2088E7967294n826230l324824o74166o61623m049959l954453l780687k736650
$$ 57967294 52141064 48816240 48142074 47480451 43430492 39476039 35695352 32958702
2080C2958702k735699j962230j598405j857989j523083j262484j568296j352559
$$ 32958702 30223003 28260773 26662368 24804379 23281296 22018812 20450516 19097957
2072A9097957q25704J23556j96935l217j945844r92840o34802n28943j256017
$$ 19097957 18272253 18395809 18198874 18195657 16249813 15256973 14622171 14093228 12837211
2063A2837211m03633n45622N9927M88936K5187j197638j268998O12886k34452
$$ 12837211 12433578 11887956 11947883 12436819 12462006 11264368 9995370 10608256 10373804
2054A0373804o57313l38429N9887l0082p85932m87070j13533n7219j144270l32210
$$ 10373804 9716491 9378062 9437949 9407867 8621935 8134865 8021332 7964113 6819843 6487633
2044F487633K40081K46462m58003j36520K63402n56877l40170r7122l21685o80646
$$ 6487633 6727714 6974176 6516173 6379653 6643055 6086178 5746008 5648886 5327201 4646555
2034D646555m7662j47507L53735l66249p38755M6058k40054M90014j10436Q04634
$$ 4646555 4598893 4451386 4805121 4438872 3700117 3746175 3506121 3996135 3885699 4690333
2024D690333j040807j08993P47646p69209j91677j54761q38455m22326P54245
$$ 4690333 3649526 3540533 4288179 3518970 3327293 3172532 2334077 1911751 2665996
2015B665996R04311n0388j113139k98128P40343O63010n0083k87342q44196K54327
$$ 2665996 3570307 3519919 2406780 2108652 2848995 3512005 3461922 3174580 2330384 2584711
2005B584711J85448k04991q81337J12084R14721l7090m96134l45076J86532N44394
$$ 2584711 2770159 2565168 1683831 1795915 2710636 2673546 2177412 1832336 2018868 2563262
1995B563262o24379k52673N15462L7736k20752l5848P02412j04381l61463k67342
$$ 2563262 1938883 1686210 2201672 2239408 2018656 1982808 2685220 2580839 2219376 1952034
1985A952034J51662O40102q07690j205378N75470j3797k0114n37377k48547J064154
$$ 1952034 2103696 2743798 1936108 730730 1306200 1292403 1272289 734912 486365 1550519
1975A550519N22263m89076p22935K22972Q8111n30209L42381P51842j81775p2849
$$ 1550519 2072782 1583706 860771 1083743 1171854 641645 984026 1735868 1554093 1481244
1965A481244l21464N9226r84441L65419P58625N70842j016044j49130P6772j89718
$$ 1481244 1159780 1219006 234565 599984 1358609 1929451 913407 764277 841049 651331
1955F51331O05376j018374q7632N52035J63230M06418K59929l27988K65454m97356
$$ 651331 1256707 238333 150701 702736 865966 1272384 1532313 1204325 1469779 972423
1945I72423n58495l11586k72145R23250J033247l32619j66806l45605p49061J92259
$$ 972423 413928 102342 -169803 753447 1786694 1454075 1287269 941664 192603 384862
1935C84862k11812K94034R4321K35275K24939m36342j23844o81411j9067j48647
$$ 384862 173050 467084 561405 796680 1021619 585277 461433 -219978 -239045 -387692
1925c87692m56925P09440J077590M9615p21850M17880j52582j9524q21352q4390
$$ -387692 -844617 -135177 942413 992028 270178 688058 535476 515952 -305400 -389790
1915c89790N93823q7362k87344K95815n6557P37733o83876J89023N81426l25092
$$ -389790 204033 116671 -170673 125142 68585 806318 122442 311465 892891 567799
1905E67799q2785j23806N08121J78179L83749j38115l9289k69780o09724J09014
$$ 567799 485014 361208 869329 1047508 1431257 1293142 1253853 984073 374349 483363
1895D83363j73096k05631m03618k99040J90090J9707J037104k36218J27141Q3421
$$ 483363 310267 104636 -298982 -598022 -407932 -388225 648879 412661 539802 623223
1885F23223j71034M01635k80243n10547m42466L17626j53489K93126N50288N05679
$$ 623223 452189 853824 573581 63034 -379432 -61806 -215295 77831 628119 1133798
1875A133798l01256j66483j28603p13611K51238K22472j59874P0039P31258l83508
$$ 1133798 832542 666059 537456 -176155 75083 297555 137681 207720 938978 555470
1865E55470j21759m35653J112128p82329l56466L83723j031369N22338O33915
$$ 555470 433711 -1942 1110186 327857 -28609 355114 -676255 -153917 479998
1856D79998j89733l05232P77714R94848j010968n67345q7328J46042O3925r1501
$$ 479998 290265 -14967 762747 1757595 746627 179282 91954 237996 301921 210420
1846B10420J99545l04128k37581R6568J88974L81317N5043l76253L72806M25973
$$ 210420 409965 105837 -131744 -35176 153798 535115 590158 213905 586711 1012684
1836A012684R42213M45253L31387k92166k57478M18500p12368j99637L03747j563849
$$ 1012684 1954897 2400150 2731537 2439371 2181893 2600393 1888025 1688388 1992135 428286
1826D28286n17479J183147j078l34133m2550l59952n22381O02387P09597q75888
$$ 428286 -89193 1093954 1092876 758743 716193 356241 -166140 436247 1145844 269956
1816B69956k20644R15326k60841j89669K15469j049068k24533M95666o3843m22288
$$ 269956 49312 964638 703797 514128 729597 -319471 -544004 -48338 -112181 -534469
1806e34469L68363O53758p80467N48570M10737m65557k62386N27558o3693o91662
$$ -534469 -166106 487652 -292815 255755 666492 200935 -61451 466107 402414 -289248
1796b89248L64338p6698j45057J24348p67214M36635J33120O46294k2300j99334
$$ -289248 75090 -1608 -146665 -22317 -789531 -352896 -219776 426518 404218 204884
1786B04884j61898n28264J56522P29679N128p38192k25736R48771o49511K0218
$$ 204884 42986 -485278 -328756 400923 406051 -332141 -557877 390894 -258617 -238399
1776b38399J78960o52413M28888M8368Q34008O44637q00658n04010R76430k76001
$$ -238399 -59439 -711852 -282964 -234596 599412 1244049 443391 -60619 915811 639810
1766F39810r77334K22940j30682K84175M80218K48820l6320q73115M64202m87911
$$ 639810 -337524 -114584 -245266 38909 519127 767947 731627 -141488 322714 -165197
1756a65197J76512O8431k91661L6628J036599n88419l42335M68687N22522m94999
$$ -165197 11315 79746 -211915 -175287 861312 272893 -69442 399245 921767 426768
1746D26768k49768J31389m57443m60622K1325O70580l93242O19856k05443m9966
$$ 426768 177000 308389 -149054 -609676 -588351 82229 -311013 308843 103400 53434
1736E3434j69003l4269J08013k24141n90696J36049L30690n91193K39777M7052
$$ 53434 -115569 -149838 -41825 -265966 -856662 -720613 -389923 -981116 -741339 -694287
1726f94287P27346k99688L97231k6391J56775K98642p9738Q1447n70495k7999
$$ -694287 33059 -266629 130602 104211 260986 559628 479890 561337 -9158 -37157
1716c7157L85204L16939m09512j284770P98812P44805k75156n46835n67425l6153
$$ -37157 348047 664986 255474 -1029296 -230484 514321 239165 -307670 -875095 -911248
1706i11248O10687K45459Q3995k09544J37441K11545n6179l09098J15995J54373
$$ -911248 -300561 -55102 28893 -180651 -43210 168335 112156 -196942 -80947 73426
1696G3426M10227o94656m98687O06522K06398m04830r4830N763o2780L76298q1408
$$ 73426 483653 -211003 -709690 -103168 103230 -301600 -396430 -390667 -453447 -77149 -158557
1685a58557j42509k47274K98734l3624l80377j30061L80378k72537O25446o05086
$$ -158557 -301066 -548340 -249606 -283230 -663607 -793668 -413290 -685827 -60381 -665467
1675f65467J62291L6050M98574R73812o32202k7415k39126L62025l28849q26558
$$ -665467 -503176 -467126 31448 1005260 373058 345643 106517 468542 139693 -686865
1665f86865k23870L39914M150M94006k96461j207925k09716N89380J060209j46734
$$ -686865 -910735 -570821 -566671 -72665 -369126 -1577051 -1786767 -1197387 -137178 -283912
1655b83912P0775l18718Q16598o50780K75928O88294k12762K82545k82688l44381
$$ -283912 -213137 -531855 284743 -366037 -90109 598185 385423 667968 385280 40899
1645D0899j88198l41532R72740o2533p31842L70877p803P4649m99324N65292O02720
$$ 40899 -147299 -488831 483909 421376 -310466 60411 52608 127257 -372067 193225 795945
1634G95945q76243r8042P80755k49058q03810j09654M34755k46342J32868o5195
$$ 795945 -80298 -178340 602415 353357 -450453 -560107 -125352 -371694 -238826 -304021
1624c04021n28677K06843j79789P53641Q63805m83323n63865l47282N25674O107
$$ -304021 -832698 -625855 -805644 -52003 811802 328479 -235386 -582668 -56994 -50887
1614e0887p25441O44310m09750J07199J87130k91324O4345j80277P7439K29855
$$ -50887 -776328 -132018 -541768 -434569 -247439 -538763 -474418 -654695 -577256 -347401
1604c47401K24220M13991L91722j40623n01927p66960L32331N86116n64494M41976
$$ -347401 -123181 290810 682532 541909 39982 -726978 -394647 191469 -373025 68951
1594F8951L7397K36911J51318k21335l28654N35048m40614j07579O61595j007895
$$ 68951 106348 343259 494577 273242 -55412 479636 39022 -68557 593038 -414857
1584d14857N5899n13660K51360P87094N28211K21618n40974P4839k6718j116430
$$ -414857 -358958 -872618 -621258 165836 694047 915665 374691 449530 422812 -693618
1574f93618Q20026j27241r1683j59310m19491k38119N20256J00642m87000M04795
$$ -693618 126408 -833 -92516 -251826 -671317 -909436 -389180 -288538 -775538 -370743
1564c70743j16399l59456m73069J39244J77559M78711P80481K06274n93356j68243
$$ -370743 -487142 -846598 -1319667 -1180423 -1002864 -524153 256328 462602 -130754 -298997
1554b98997L41081J32372p16783K88255m91212N37924Q73991q1602m18656J18416
$$ -298997 42084 174456 -542327 -254072 -745284 -207360 666631 585029 166373 284789
1544B84789N14326p44290n34030J46914K53253r04438N60095J58005l18674N05993
$$ 284789 799115 54825 -479205 -332291 -79038 -983476 -423381 -265376 -584050 -78057
1534g8057P43932L45403n83423l87999K0809l03109o75424L68874Q36552p40887
$$ -78057 665875 1011278 427855 39856 60665 -242444 -917868 -548994 287558 -453329
1524d53329L83519K39297K88103l21197L13315L7870l30369k16938o36596l41572
$$ -453329 -69810 169487 457590 136393 449708 487578 157209 -59729 -696325 -1037897
1514a037897L27693P18514k90484m8381k33407P97711n10933J06388N34525n07729
$$ -1037897 -710204 8310 -282174 -330555 -563962 233749 -277184 -170796 363729 -144000
1504a44000k85813l3613j5357J92375J22750K67178J63277o49094N1580l64607
$$ -144000 -429813 -463426 -478783 -286408 -163658 103520 266797 -382297 -330717 -695324
1494f95324N86026L14124L46074l54887q9290M84747p47901q06878K18361L47249
$$ -695324 -109298 204826 550900 196013 106723 591470 -156431 -963309 -744948 -397699
1484c97699j60112N13165M74176l34426J16016J32937j71716J76141R0554l6920
$$ -397699 -557811 -44646 429530 95104 211120 344057 172341 348482 439036 402116
1474D02116m03307Q2693n62393L66899M03947L38970Q31619j21159n51528O9765
$$ 402116 -1191 81502 -480891 -113992 289955 628925 1460544 1339385 787857 857622
1464H57622o74223m53561N12365N383Q91814k78793r6023p54208m61247q69335
$$ 857622 183399 -270162 242203 247586 1139400 860607 764584 10376 -450871 -1320206
1454a320206L19900O43455j87426N27946M60581k10105j88030L36958l94088L47534
$$ -1320206 -1000306 -356851 -544277 -16331 444250 234145 46115 383073 -11015 336519
1444C36519j72392n34831o20322R48108l01242O43018l75868J83293m84098N84778
$$ 336519 164127 -370704 -991026 -42918 -344160 298858 -77010 106283 -377815 206963
1434B06963m2716j393450R28155M05831q941m95198j24853p00293k56705J03797
$$ 206963 164247 -1229203 -301048 104783 95842 -399356 -524209 -1224502 -1481207 -1377410
1424a377410L0854J661969m88272k93842J49510j67614L75307J71152k44080m96575
$$ -1377410 -1346556 315413 -172859 -466701 -317191 -484805 -109498 61654 -182426 -679001
1414f79001O22114o82217L89170J288782J48087r57331l51637L7157N05994m02859
$$ -679001 -56887 -739104 -349934 938848 1086935 129604 -222033 -184876 321118 -81741
1404h1741P427R9831M66379j79288K19963J27649o93620P79096n00686j056710
$$ -81741 -74314 25517 491896 312608 532571 660220 -33400 745696 245010 -811700
1394h11700J82184J157627k34263r7955j77568m23238n87532J01403L48379M1947
$$ -811700 -629516 528111 293848 195893 18325 -404913 -992445 -891042 -542663 -500716
1384e00716m1856J03486K90492q6629P5393m37083J91773N01883l39867K58710
$$ -500716 -542572 -439086 -148594 -235223 -159830 -596913 -405140 96743 -243124 15586
1374A5586O29246r11006o72200l70685k16863Q78733P14823j077794k2502K85483
$$ 15586 644832 -266174 -938374 -1309059 -1525922 -647189 67634 -1010160 -1032662 -747179
1364g47179L21139j27341M67231K25205J03563m35538K31925j70128K14757j35587
$$ -747179 -426040 -553381 -86150 139055 242618 -192920 39005 -131123 83634 -51953
1354e1953l27235J001660m51975j52940j50616N647K90228j71157l69471J61875
$$ -51953 -379188 622472 170497 17557 -133059 -127412 162816 -8341 -377812 -215937
1344b15937j39577L81077J89979m03799P30179P08668r99087k95252J71320l49950
$$ -215937 -355514 25563 215542 -188257 541922 1250590 251503 -43749 127571 -222379
1334b22379J47242k8288j69576j88668k31286O73918n4114k11734K34020o19460
$$ -222379 -75137 -103425 -273001 -461669 -692955 -19037 -73151 -284885 -50865 -670325
1324f70325L99791O98286k41034k11494k59134l18764j83517k08569M70592J125703
$$ -670325 -270534 427752 186718 -24776 -283910 -602674 -786191 -994760 -524168 601535
1314F01535o22739o13009R5858O82699j17086N4633q3829p854k87799K43631K46035
$$ 601535 -21204 -634213 -538355 144344 27258 81891 -1938 -9792 -297591 -53960 192075
1303A92075K36380o99734j02648K95222L49534m8869q2655Q0254p14043J79452
$$ 192075 428455 -271279 -373927 -78705 270829 221960 139305 219559 -494484 -315032
1293c15032l3581M15501M26809J6931P2773o08522J3152L26193j000078O8047
$$ -315032 -348613 66888 493697 510628 583401 -25121 -11969 314224 -685854 -617807
1283f17807m18405K62880J052266M04607j94833q93550k1000r624q95734L2419
$$ -617807 -1036212 -773332 278934 683541 488708 -404842 -425842 -435466 -1331200 -1298781
1273a298781L86216P80213K48663L40676L43332n75394j75552j3707N31927J95777
$$ -1298781 -912565 -132352 116311 456987 800319 224925 49373 35666 567593 763370
1263G63370K18215r31513M7023L39983l31570M44750k78107r42039M02174k2314
$$ 763370 981585 50072 97095 437078 105508 550258 272151 -669888 -267714 -290028
1253b90028k32206n40294N30005J197288J51963k32203m04829M05551j5442K11392
$$ -290028 -522234 -1062528 -532523 664765 816728 584525 179696 585247 569805 781197
1243G81197p74603l92533O54431k7625q29604Q33452m17601R5506o90403N29332
$$ 781197 6594 -385939 268492 240867 -588737 244715 -172886 -77380 -767783 -238451
1233b38451J62782l40381k96199N41422K67079m18624o802J54219L70337k43607
$$ -238451 -75669 -416050 -712249 -170827 96252 -322372 -329174 -174955 195382 -48225
1223d8225l25744L08496L46364p9755k4406k92069m53520j83504P77718M98282
$$ -48225 -373969 -65473 280891 201136 176730 -115339 -568859 -752363 25355 523637
1213E23637m83086J01728K57059j040850k88933N95408J67614K289l2573k92970
$$ 523637 40551 142279 399338 -641512 -930445 -335037 -167423 -165134 -197707 -490677
1203d90677r59534R27348k64603k22750N85625l34660O99356l83748J03361J94410
$$ -490677 -1450211 -522863 -787466 -1010216 -424591 -759251 -59895 -443643 -340282 -145872
1193a45872j081248p23094R57213P29629M19295j50918k2576K98516j54788k87751
$$ -145872 -1227120 -1950214 -993001 -263372 155923 5005 -17571 280945 126157 -161594
1183a61594J96941n30160l52407N80689J67191r10888L24531O70812n38520n3211
$$ -161594 35347 -494813 -847220 -266531 -99340 -1010228 -685697 -14885 -553405 -606616
1173f06616M30561M94712k64220k42831J155627l25022j28203l20362q07648j24863
$$ -606616 -176055 318657 54437 -188394 967233 642211 514008 193646 -614002 -738865
1163g38865K94739r8902n9933K93024M66584n20154L42617M07165k81857l48070
$$ -738865 -444126 -543028 -602961 -309937 156647 -363507 -20890 386275 104418 -243652
1153b43652p7643n7638M76299n0123m80252Q06649k53973p4641l6585k06124q6863
$$ -243652 -321295 -378933 97366 47243 -433009 373640 119667 45026 8441 -197683 -284546
1142b84546J96370k4951m73283o48993K30345O97022K00134K55078J14932N29658
$$ -284546 -88176 -113127 -586410 -1235403 -1005058 -308036 -107902 147176 262108 791766
1132G91766n30835K03749o24207j22643j1960M04630k10704Q1685M78916m17674
$$ 791766 260931 464680 -159527 -282170 -294130 110500 -100204 -18519 460397 42723
1122D2723j775J6974P492J3408K08548P4961p25994j22797J30593L24907O38683
$$ 42723 40948 57922 65414 78822 287370 362331 -363663 -486460 -355867 -30960 607723
1111F07723N14690p82405m88162O86528p18596p23530O94380k25109k63276L95832
$$ 607723 1122413 340008 -148154 538374 -180222 -903752 -209372 -434481 -697757 -301925
1101c01925K12110K36937j20061K62402k76065o78010L10506Q33794p16157l22424
$$ -301925 -89815 147122 27061 289463 13398 -664612 -354106 479688 -236469 -558893
1091e58893r0401L90223n94750j10377P67027K58104j93933N14153j73097J73017
$$ -558893 -649294 -259071 -853821 -964198 -197171 60933 -133000 381153 208056 381073
1081C81073q6399J5368k31032k30608k965M98929m9343k69097l12521k24984K75039
$$ 381073 294674 310042 79010 -151598 -154563 344366 295023 25926 -286595 -511579 -236540
1070b36540k06118k52435j4419K74834l260K33375R19766o68267j4485o0404J66097
$$ -236540 -442658 -695093 -709512 -434678 -437938 -204563 715203 46936 32451 -27953 138144
1059A38144L7091n82027J26887L54055K24493o13748q2555O39737j00102l28149
$$ 138144 175235 -406792 -279905 74150 298643 -315105 -397660 242077 141975 -186174
1049a86174K32365M27827l53646M73704l78841j50228l35639l30045j46275J155160
$$ -186174 46191 474018 120372 594076 215235 65007 -270632 -600677 -746952 408208
1039D08208l93043m45531k23362n09732K79953Q60508K46105l98067N15339l04613
$$ 408208 15165 -430366 -653728 -1163460 -883507 -22999 223106 -174961 340378 35765
1029C5765j02982j48491L64857n89026J5972K71398j84748q2613r6141L88254
$$ 35765 -67217 -215708 149149 -439877 -423905 -152507 -337255 -419868 -516009 -127755
1019a27755J92335k43219J66972j70321J40953o08582P46612O691p45532K15901
$$ -127755 64580 -178639 -11667 -181988 -41035 -649617 96995 103686 -641846 -425945
1009d25945j82473J4555P37609k51065j22971k29974R72004J24488m78170p87463
$$ -425945 -608418 -593863 143746 -107319 -230290 -460264 511740 636228 158058 -629405
999f29405q31449Q21971J096275o37008j56474o4309L47942J01403L77222K23414
$$ -629405 -1460854 -638883 457392 -179616 -336090 -400399 -52457 48946 426168 649582
989F49582o33296p14710Q66072Q29201l79021q99284o07634K55404L72793L61893
$$ 649582 16286 -698424 167648 996849 617828 -281456 -889090 -633686 -260893 101000
979A01000j144787K3556J325089k20700Q20887N67904p14137q87374k02718L99804
$$ 101000 -1043787 -1020231 304858 84158 905045 1472949 758812 -128562 -331280 68524
969F8524m95047p70205n46500O88464N16479J49142L43812n96953K88456k07703
$$ 68524 -426523 -1196728 -1743228 -1054764 -538285 -389143 -45331 -642284 -353828 -561531
959e61531p81424M00558L20341j70190o7343J03119L79416n23114l24481M05962
$$ -561531 -1342955 -942397 -622056 -792246 -859589 -756470 -377054 -900168 -1224649 -818687
949h18687K8399M00944m5585k21115N1908L67001n90836k7506K77993J35994p7370
$$ -818687 -790288 -389344 -434929 -656044 -604136 -237135 -827971 -855477 -577484 -441490 -518860
938e18860Q18833N2758j8504m87074Q53747l54074p71041j14092K1178N3779P2944
$$ -518860 299973 352731 334227 -152847 700900 346826 -424215 -538307 -517129 -463350 -390406
927c90406j90755P08411N3396l33991m63374j94887J221152R1804n21319k5966
$$ -390406 -581161 127250 180646 -153345 -616719 -811606 409546 501350 -19969 -45935
917d5935n75548K94524n4855L61030M56986j66774Q22260n68913l20671J62626
$$ -45935 -621483 -326959 -381814 -20784 436202 269428 1091688 522775 202104 364730
907C64730j53029J96916N36618j22279k53438L5111l22061o92113o1188j35654
$$ 364730 211701 408617 945235 822956 569518 604629 282568 -409545 -470733 -606387
897f06387N84174k27089j08108k52946P2967r2400L51922j11183j1256k58723
$$ -606387 -22213 -249302 -357410 -610356 -537389 -629789 -277867 -389050 -400306 -659029
887f59029n06598O9771P74119l84177L94974M19898q84506J202767J65964l94281
$$ -659029 -1165627 -1095856 -321737 -705914 -310940 108958 -775548 427219 593183 198902
877A98902n8885j34380j20007K85403R8713o04129k29255J88350n8534L59892
$$ 198902 140017 5637 -114370 171033 269746 -334383 -563638 -375288 -433822 -73930
867g3930k09168L52163m62270k70570P27704j63639L04471J93357q5881p71288
$$ -73930 -283098 69065 -393205 -663775 63929 -99710 204761 398118 312237 -459051
857d59051o02046J094978q4080o13201J417991L40807j068950o12162O56396j00932
$$ -459051 -1061097 33881 -50199 -663400 754591 1095398 26448 -585714 70682 -30250
847c0250n89727M86969O02586j44808M89285K19667o94245q7531k02068L30344
$$ -30250 -619977 -133008 469578 324770 814055 1033722 339477 251946 49878 380222
837C80222l31580j000l01163k38224p0807P7230M26965M78941j68759K80453M06726
$$ 380222 48642 47642 -253521 -491745 -562552 -485322 -58357 420584 251825 532278 939004
826I39004J01815m92813N18121j1028j342112L83862K05173N15694p09340L2757
$$ 939004 1040819 548006 1066127 1055099 -287013 96849 302022 817716 108376 141133
816A41133K35191n39902k84097O12756J44675M03815l86278J91608r1486m11639
$$ 141133 376324 -163578 -447675 165081 309756 713571 327293 518901 427415 15776
806A5776O30803p13591J31870L0143r62601O78370K41244l18357M05864j74091
$$ 15776 646579 -67012 64858 95001 -867600 -189230 52014 -266343 139521 -34570
796c4570l50439Q3736J03219j62283J41929k90334l17979Q94607M56818o16948
$$ -34570 -385009 -301273 -198054 -360337 -218408 -508742 -826721 67886 524704 -92244
786i2244o30656N71355K75182k81048n2586n89770J585497J2982j067730j17625
$$ -92244 -722900 -151545 123637 -157411 -209997 -799767 785730 798712 -269018 -386643
776c86643P00688n17757n0741O46367l28023j5068J121817l05348r85626q1266
$$ -386643 314045 -203712 -254453 391914 63891 48823 1170640 865292 -120334 -201600
766b01600L70777l58404j07627J06450L94735L00363o11004j97006o92520M84755
$$ -201600 169177 -189227 -296854 -190404 204331 504694 -106310 -303316 -995836 -511081
756e11081M85411n01458J05411K68215m23575O25705M91694o42337J22382Q8601
$$ -511081 -25670 -527128 -421717 -153502 -577077 48628 540322 -102015 20367 108968
746A08968P14920o3377j019392k70224j87841N52205K29165j52305L58254K01162
$$ 108968 823888 760511 -258881 -529105 -716946 -164741 64424 -87881 270373 471535
736D71535l4549j28108p45661L02267q39584p8247R49067M15619K62909p5322
$$ 471535 436986 308878 -436783 -134516 -974100 -1052347 -103280 312339 575248 499926
726D99926k04201n29209K36730J31442K22243m76393m10029j9117n79380J97954
$$ 499926 295725 -233484 3246 134688 356931 -119462 -529491 -548608 -1127988 -930034
716i30034L43917M30002m15131J26833J76473l4645l20810l9756M60947J11946
$$ -930034 -586117 -156115 -571246 -444413 -267940 -302585 -623395 -663151 -202204 -90258
706i0258P6880N9827k22713n274J027204j55993o43325K86683k32666p9779l608
$$ -90258 -13378 46449 -176264 -181538 845666 689673 46348 333031 100365 20586 16978
695A6978k87345j29315O86628K98456n78008M26587o02029m72418R3230N50687
$$ 16978 -270367 -399682 286946 585402 7394 433981 -168048 -640466 -547236 3451
685C451o38879J78107K79381q5353l25075O3769P5553J42527N33407q49002J62775
$$ 3451 -635428 -457321 -177940 -263293 -588368 -524599 -449046 -306519 226888 -622114 -459339
674d59339O57514n04090l20551K29152l11100L17073K52964O41230m26573J79852
$$ -459339 198175 -305915 -626466 -397314 -708414 -391341 -138377 502853 76280 256132
664B56132N22846l48667o67597n47589J38716L39270j60817K23613l05120L05766
$$ 256132 778978 430311 -237286 -784875 -646159 -306889 -467706 -244093 -549213 -243447
654b43447M35752p64215j72738L25079m05335N79510K94849j3211o49044M91260
$$ -243447 192305 -571910 -744648 -419569 -824904 -245394 49455 36244 -612800 -121540
644a21540L1891R9652m17257l8454M20101j2752m56806K81936M13671l90835N58659
$$ -121540 -89649 10003 -407254 -445708 -25607 -38359 -495165 -213229 200442 -190393 368266
633C68266K05549K49860l98472K10199m94976m2857M03027k35201n05742m19380
$$ 368266 573815 823675 425203 635402 140426 97569 500596 265395 -240347 -659727
623f59727m9807n23017N92791R33738j25010J063924q05749P0690l43533m52343
$$ -659727 -709534 -1232551 -639760 293978 168968 1232892 427143 497833 154300 -298043
613b98043J15183M90042R898l3062j025561m89467Q02480L64824n82531O89329
$$ -298043 -182860 307182 317080 284018 -741543 -1231010 -428530 -63706 -646237 43092
603D3092r0878n30775Q23896K83797J68640k50698j170236M39210M25366R96138
$$ 43092 -47786 -578561 245335 529132 697772 447074 -723162 -283952 141414 1137552
593A137552l26658m47631J24038o62346J039M87365J85494p96203N48008j10021
$$ 1137552 810894 363263 487301 -175045 -174006 313359 498853 -297350 250658 140637
583A40637J51305K99837o04262J21171K17322l35353j28583j07637M35426K21306
$$ 140637 291942 591779 -12483 108688 326010 -9343 -137926 -245563 189863 411169
573D11169l23846p4645N07225J61157n57944J20471Q31257Q1900o13858J60106
$$ 411169 87323 12678 519903 681060 123116 243587 1074844 1156744 542886 702992
563G02992n46260o35650L68138j39745M10200k41092q42735L20721O52220j41930
$$ 702992 156732 -478918 -110780 -250525 159675 -81417 -924152 -603431 48789 -93141
553i3141M95698m26057j98930K4294K60803l47839o80350L18159P91687k3185
$$ -93141 402557 -23500 -222430 -198136 62667 -285172 -965522 -647363 144324 121139
543A21139l28131K41669L14564l15385l28292J91618O19301J98142n51532o71063
$$ 121139 -206992 34677 349241 33856 -294436 -102818 516483 714625 163093 -507970
533e07970K3086N92284l96643r29470J578326l69366j62318M67546K72376R8793
$$ -507970 -484884 107400 -289243 -1218713 359613 -9753 -172071 295475 567851 666644
523F66644K94490k57198l67712m69076O39042L37852p23528N38153k07074o6745
$$ 666644 961134 703936 336224 -132852 506190 844042 120514 658667 451593 384848
513C84848p47817k1571J07482l68483Q01305k3191k85959L20912m27535K8653
$$ 384848 -362969 -384540 -277058 -645541 155764 132573 -153386 167526 -260009 -231356
503b31356j74099K66670N40775K87134m71753k96049N07596n50008p77259M68058
$$ -231356 -405455 -138785 401990 689124 217371 -78678 428918 -121090 -898349 -430291
493d30291l54068K16276N888k15358m8571P63345J41318n00463K31965p6992n90935
$$ -430291 -784359 -568083 -562195 -777553 -826124 -62779 78539 -421924 -189959 -266951 -857886
482h57886R3035P8859N71415M99038p13656l33511O00805K19254l42574L59171
$$ -857886 -764851 -685992 -114577 384461 -329195 -662706 -61901 157353 -185221 173950
472A73950L01644k68012P09054M15147o17835o54849L48301o60676o02234K82608
$$ 173950 475594 207582 916636 1331783 713948 59099 407400 -253276 -855510 -572902
462e72902m8672Q01517m59326o97703J21585Q87899O68621K00758q40245l51547
$$ -572902 -621574 179943 -279383 -977086 -855501 32398 701019 901777 61532 -290015
452b90015K34106r0157o13113O50307J06328j01900J09605K4655R91764Q8036
$$ -290015 -55909 -146066 -759179 -108872 -2544 -104444 5161 29816 1021580 1109616
442A109616k75044l12499K29385m79720p4998M95276j48488n33336j83668N33600
$$ 1109616 834572 522073 751458 271738 196740 692016 543528 10192 -173476 360124
432C60124j69326p64829M88580j950J62396N64699J62138q53637K03448K04831
$$ 360124 190798 -574031 -85451 -87401 74995 639694 801832 -51805 151643 356474
422C56474L80285k74830j04012K64930K42647n74130n10049R74873M07919q42390
$$ 356474 736759 461929 357917 622847 865494 291364 -218685 756188 1164107 321717
412C21717K56864N11154r10707m64475p05494R003N06066P28708k66680k28276
$$ 321717 578581 1089735 179028 -285447 -990941 -981938 -475872 252836 -13844 -242120
402b42120P50832K98771n45116n43035n56901N33308N16150l91407n94938k68573
$$ -242120 508712 807483 262367 -280668 -837569 -304261 211889 -179518 -774456 -1043029
392a043029N49768j31792J22543j92806m33521N25594m04403O79275J90139l11293
$$ -1043029 -493261 -625053 -502510 -695316 -1128837 -603243 -1007646 -328371 -138232 -449525
$$ [...]
##END NTUPLES=NMR SPECTRUM
##END=
