##TITLE=1H_EC-3299(IV-33)x2
 DMSO
 8 sc, 
 6.9.2023
##JCAMPDX= 6.0         $$ Bruker NMR JCAMP-DX V2.0
##DATA TYPE= NMR SPECTRUM
##DATA CLASS= NTUPLES
##ORIGIN= UXNMR, Bruker Analytische Messtechnik GmbH
##OWNER= root
$$ XWIN-NMR		Version 3.5
$$ Wed Sep  6 15:29:45 2023 Russian Standard Time (UT+4h)  she@DPX200
##.OBSERVE FREQUENCY= 200.13135
##.OBSERVE NUCLEUS= ^1H
##.ACQUISITION MODE= SIMULTANEOUS
##.ACQUISITION SCHEME= undefined
##.AVERAGES= 8
##.DIGITISER RES= 18
##SPECTROMETER/DATA SYSTEM= spect
##.PULSE SEQUENCE= zg30
##.SOLVENT NAME= DMSO
##.SHIFT REFERENCE= (INTERNAL, DMSO, 0, 15.7557)
##AUDIT TRAIL= $$ (NUMBER, WHEN, WHO, WHERE, WHAT)
$$ ##TITLE= Audit trail, XWIN-NMR		Version 3.5
$$ ##JCAMPDX= 5.01
$$ ##ORIGIN= Bruker BioSpin GmbH
$$ ##OWNER= she
$$ F:/spectra/data/she/nmr/H-F/1/pdata/1/auditp.txt
$$ ##AUDIT TRAIL=  $$ (NUMBER, WHEN, WHO, WHERE, WHAT)
(   1,<2023-09-06 15:26:58.34 +0400>,<she>,<DPX200>,
      <created by zg, POWCHK disabled, PULCHK disabled
       configuration hash MD5:
       00 E9 B6 7A A2 85 ED C7 34 08 36 98 17 FE 4E 26
       data hash MD5: 16K
       C8 A9 38 E2 AC 35 F5 AA 16 87 78 3F 3B 90 6D 77>)
(   2,<2023-09-06 15:27:02.82 +0400>,<she>,<DPX200>,
      <Start of raw data processing
       efp BC_mod = 2 LB = 0.24 FT_mod = 6 PKNL = 1 PHC0 = -21045.35 PHC1 = 15.85271 SI = 16K 
       data hash MD5: 16K
       C6 37 BC 4B 8F 97 6B A4 82 AD AD 62 C3 79 67 32>)
(   3,<2023-09-06 15:27:20.64 +0400>,<she>,<DPX200>,
      <pk PHC0 = -3.795175 PHC1 = 2.4 
       data hash MD5: 16K
       E2 D2 CC 34 C9 BB D2 CE B9 1B B6 44 F9 18 EF 0C>)
(   4,<2023-09-06 15:27:23.79 +0400>,<she>,<DPX200>,
      <abs ABSG = 5 
       data hash MD5: 16K
       9F 70 94 14 27 87 CB 6A AC 97 1A 19 27 77 B1 69>)
(   5,<2023-09-06 15:27:56.59 +0400>,<she>,<DPX200>,
      <abs ABSG = 5 
       data hash MD5: 16K
       9F 8D 3D B9 49 4C 11 3B 23 1F 3E 66 BA 48 18 94>)
$$ ##END=
$$ 
$$ hash MD5
$$ CB 7E B5 24 2B 1D F8 F2 1C 38 EA CA 5A 9D 2A 4E
##$RELAX= 
##$RELAX= 
##$RELAX= 
##$RELAX= 
##$RELAX= 
##$RELAX= 
$$ Bruker specific parameters
$$ --------------------------
##$DU= <F:/spectra>
##$EXPNO= 1
##$NAME= <H-F>
##$PROCNO= 1
##$TYPE= <nmr>
##$USER= <she>
##$AMP= (0..31)
100 100 100 100 100 100 100 100 100 100 100 100 100 100 100 100 100 100 
100 100 100 100 100 100 100 100 100 100 100 100 100 100 
##$AQSEQ= 0
##$AQ_mod= 1
##$AUNM= <au_zg>
##$AUTOPOS= <>
##$BF1= 200.13
##$BF2= 200.13
##$BF3= 200.13
##$BF4= 200.13
##$BF5= 200.13
##$BF6= 200.13
##$BF7= 200.13
##$BF8= 200.13
##$BYTORDA= 1
##$CFDGTYP= 0
##$CFRGTYP= 5
##$CHEMSTR= <none>
##$CNST= (0..31)
1 1 145 1 1 1 1 1 1 1 1 1 1 1 1 1 1 1 1 1 1 1 1 1 1 1 1 1 1 1 1 1 
##$CPDPRG= <>
##$CPDPRG1= <>
##$CPDPRG2= <>
##$CPDPRG3= <>
##$CPDPRG4= <mlev>
##$CPDPRG5= <mlev>
##$CPDPRG6= <mlev>
##$CPDPRG7= <mlev>
##$CPDPRG8= <mlev>
##$CPDPRGB= <>
##$CPDPRGT= <>
##$D= (0..31)
0 1.2 0 0 0 0 0 0 0 0.06 0 0.03 0 0 0 0 0.0002 0 0 0 0 0 0 0 0 0 0 0 0 
0 0 0 
##$DATE= 1693999617
##$DBL= (0..7)
$$ [...]
##$SUBNAM3= <"">
##$SUBNAM4= <"">
##$SUBNAM5= <"">
##$SUBNAM6= <"">
##$SUBNAM7= <"">
##$SUBNAM8= <"">
##$SUBNAM9= <"">
##$SW= 18.05172834244
##$SWIBOX= (0..15)
0 0 2 0 0 0 0 0 0 0 0 0 0 0 0 0 
##$SW_h= 3612.71676300578
##$TD= 16384
##$TD0= 1
##$TE= 0
##$TE2= 300
##$TE3= 300
##$TEG= 300
##$TL= (0..7)
0 120 120 120 120 120 120 120 
##$TP= (0..7)
150 150 150 150 150 150 150 150 
##$TP07= 0
##$TPNAME0= <>
##$TPNAME1= <>
##$TPNAME2= <>
##$TPNAME3= <>
##$TPNAME4= <>
##$TPNAME5= <>
##$TPNAME6= <>
##$TPNAME7= <>
##$TPOAL= (0..7)
0.5 0.5 0.5 0.5 0.5 0.5 0.5 0.5 
##$TPOFFS= (0..7)
0 0 0 0 0 0 0 0 
##$TUNHIN= 0
##$TUNHOUT= 0
##$TUNXOUT= 0
##$USERA1= <user>
##$USERA2= <user>
##$USERA3= <user>
##$USERA4= <user>
##$USERA5= <user>
##$V9= 5
##$VALIST= <valist>
##$VCLIST= <CCCCCCCCCCCCCCC>
##$VD= 0
##$VDLIST= <DDDDDDDDDDDDDDD>
##$VPLIST= <PPPPPPPPPPPPPPP>
##$VTLIST= <TTTTTTTTTTTTTTT>
##$WBST= 1024
##$WBSW= 4
##$XGAIN= (0..3)
0 0 0 0 
##$XL= 0
##$YL= 0
##$YMAX_a= 206484
##$YMIN_a= -244031
##$ZGOPTNS= <>
##$ZL1= 120
##$ZL2= 120
##$ZL3= 120
##$ZL4= 120
##$ABSF1= 15.7557
##$ABSF2= -2.296149
##$ABSG= 5
##$ABSL= 3
##$ALPHA= 0
##$AQORDER= 0
##$ASSFAC= 0
##$ASSFACI= 0
##$ASSFACX= 0
##$ASSWID= 0
##$AUNMP= <proc_1d>
##$AZFE= 0.1
##$AZFW= 0.1
##$BCFW= 0
##$BC_mod= 2
##$BYTORDP= 0
##$COROFFS= 0
##$CY= -3
##$DATMOD= 1
##$DC= 0
##$DFILT= <>
##$DTYPP= 0
##$F1P= 0
##$F2P= 0
##$FCOR= 1
##$FTSIZE= 16384
##$FT_mod= 6
##$GAMMA= 0
##$GB= 0
##$INTBC= 1
##$INTSCL= 3.70164e-10
##$ISEN= 128
##$LB= 0.24
##$LEV0= 0
##$LPBIN= 0
##$MAXI= 10000
##$MC2= 0
##$MEAN= 0
##$ME_mod= 0
##$MI= 1.114404
##$NCOEF= 0
##$NC_proc= -6
##$NLEV= 6
##$NOISF1= 3.799351
##$NOISF2= 2.8
##$NSP= 0
##$NTH_PI= 0
##$NZP= 0
##$OFFSET= 15.7557
##$PC= 1
##$PHC0= -21049.14
##$PHC1= 18.25271
##$PH_mod= 1
##$PKNL= yes
##$PPARMOD= 0
##$PSCAL= 0
##$PSIGN= 0
##$REVERSE= no
##$SF= 200.130003168816
##$SI= 16384
##$SIGF1= 3
##$SIGF2= 2
##$SINO= 5.538805
##$SIOLD= 16384
##$SREGLST= <1H.CDCl3>
##$SSB= 0
##$STSI= 16384
##$STSR= 0
##$SW_p= 3612.71676300578
##$SYMM= 0
##$S_DEV= 0
##$TDeff= 16384
##$TDoff= 0
##$TI= <>
##$TILT= no
##$TM1= 0
##$TM2= 0
##$TOPLEV= 0
##$USERP1= <user>
##$USERP2= <user>
##$USERP3= <user>
##$USERP4= <user>
##$USERP5= <user>
##$WDW= 1
##$XDIM= 16384
##$YMAX_p= 379106020
##$YMIN_p= -398196
$$ End of Bruker specific parameters
$$ ---------------------------------
##NTUPLES= NMR SPECTRUM
##VAR_NAME=  FREQUENCY,     SPECTRUM/REAL,   SPECTRUM/IMAG
##SYMBOL=    X,             R,               I
##VAR_TYPE=  INDEPENDENT,   DEPENDENT,       DEPENDENT
##VAR_FORM=  AFFN,          ASDF,            ASDF
##VAR_DIM=   16384,         16384,           16384
##UNITS=     HZ,            ARBITRARY UNITS, ARBITRARY UNITS
##FACTOR=    0.220516191357247, 1,           1
##FIRST=     3153.18831321923, 0,            0
##LAST=      -459.528449786553, 0,           0
##MIN=       -459.528449786553, -398196,     0
##MAX=       3153.18831321923, 379106020,    0
$$ Real data points
##PAGE= N=1
##DATA TABLE= (X++(R..R)), XYDATA
$$ [...]
8477G86783k7305r0739r7873M1704K648O7264k7204J9209L5442M9344m3328l9964
8465F75981J35711K296q299j0095m07m2760k6793R4327J0233K3755n0467l3188
8453G70294n1628L2152n7344n0976l9070q7703j7025p8145K6798j08334j02060
8442B36959L8303o021q2808J07143J9488j07804q2105L2967N5916O7402k8983
8431B50457j48255p2760J18307Q3406O3509j39205K1314M4230J445K7651j2442
8420B37657M7286k4811J1537M4164J08694R747j5501J00056j11296J00665Q457
8409E16655n1909k2209M6994O7809m4642j49770P412r4731J08622m4931O1821
8398D01121o243m9824L3179n1354j80681j07857k5682j0780j7050l5746l3388
$$ y = [786783, 759478, 668739, 570866, 612570, 615218, 682482, 655278, 674487, 709929, 759273, 715945, 675981, 811692, 813988, 805689, 795594, 795187, 752427, 725634, 819961, 830194, 853949, 803482, 770294, 718666, 750818, 693474, 642498, 603428, 515725, 498700, 420555, 447353, 339019, 236959, 275262, 269241, 186433, 293576, 313064, 205260, 123155, 156122, 212038, 279440, 250457, 102202, 29442, 147749, 231155, 294664, 155459, 176773, 221003, 222448, 250099, 237657, 284943, 260132, 271669, 315833, 424527, 434274, 418773, 518829, 407533, 508198, 516655, 464746, 442537, 489531, 557340, 512698, 362928, 370340, 275609, 384231, 339300, 401121, 394878, 345054, 378233, 326879, 146198, 38341, 12659, 1879, -15171, -50917, -84305]
8387h4305K9433R4441k705R880j9135K9826j05634M7190J3190j06640l6495k0704
8375a51658K1276J12973l3366j7135J5528L7585l6284o2434Q085m6650l0903K8589
8363a54394O8502l3703n4528L2378Q674j04448K6194P2456n2889R8302R40R751
8351h2765r6786N8462n9129L5466j0444n7244k1983J9263M9078o6645k0837R5356
8339a58208j22180L9329Q1738O5654p7795r4169L5749K5522N5126j03069p8697
8328c31000P4847J9864M0315l1287j27131P3749L3813m5893N5334n673j484K4582
8316b19964l0078L8569p6922O4860O9136j01718k2972p839M0489P483J3160N4051
8304a71745J832K8200L883J8299l4952k6385O4969K7859k5164l3757M6193p7329
$$ y = [-84305, -54872, 39569, 36864, 46744, 27609, 57435, -48199, -1009, 12181, -94459, -130954, -151658, -130382, -17409, -50775, -67910, -52382, -14797, -51081, -113515, -105430, -152080, -182983, -154394, -85892, -119595, -174123, -141745, -133071, -237519, -211325, -138869, -191758, -93456, -92516, -82765, -179551, -121089, -180218, -144752, -155196, -212440, -234423, -215160, -166082, -232727, -253564, -158208, -280388, -241059, -159321, -93667, -171462, -265631, -229882, -204360, -149234, -252303, -331000, -256153, -236289, -195974, -227261, -354392, -280643, -246830, -292723, -237389, -243062, -244546, -219964, -250042, -211473, -288395, -223535, -154399, -256117, -279089, -286928, -246439, -238956, -225796, -171745, -169913, -141713, -137830, -119531, -154483, -180868, -115899, -88040, -113204, -146961, -100768, -178097]
8292a78097j2904M263l1165K1505O6373j7087q2725j532Q0654q5466m2435J22482
8280a56134r1592M3238k8810J3223q852K7188O7232l8929j8755k5530k9121L843
8268b42999j2123K8384O4427K5212J5892K5312j33389j59436N5704P9041K09J31238
8256a22528M6164m9093j2204m1516o643k2666q536K9900j0825l909j0656j6536
8244b29048r1591n9060O2974O830Q1773J29265P8427j54883j14349J8995M3572
8233b27095N270o5699P0055L401P0j4807J9852j34530n4713N1175P9052q130o982
8220b83081R016m5650J1855J267r457O0451k8141m1435K9525Q0289j83j053J4163
8207b02434m4144L8383n2628R6875M2405j00602l9669K8244L6068l4257L1173
$$ y = [-178097, -191001, -186738, -217903, -196398, -130025, -147112, -229837, -231369, -150715, -236181, -278616, -156134, -247726, -204488, -233298, -220075, -228927, -201739, -134507, -173436, -192191, -217721, -246842, -242999, -255122, -226738, -162311, -137099, -121207, -95895, -229284, -388720, -333016, -253975, -253766, -122528, -76364, -125457, -137661, -179177, -185820, -208486, -217022, -187122, -197947, -201856, -212512, -229048, -320639, -379699, -316725, -309895, -228122, -98857, -20430, -175313, -289662, -270667, -227095, -221825, -287524, -217469, -214068, -213998, -228805, -208953, -343483, -398196, -347021, -267969, -276099, -283081, -274065, -319715, -307860, -306593, -316050, -255599, -283740, -325175, -295650, -215361, -215544, -216597, -202434, -246578, -208195, -260823, -163948, -121543, -222145, -261814, -233570, -197502, -231759, -200586]
8196b00586n8613N3148K8188K3211J81108j72498j42663J18763J20634l3573j02804
8185a85685l5682r0734k8781J03752j3912K3492K5070n963o7084J9317O3544o779
8173a99445j6369J9974M1609j0462M7277m2380k2008n6012l1387n8509M6788Q9932
8161a90992O2775J3160m0286k9205p8362J6679n4453O8479O8853m4252q8640j073
8149b97317K9780N1516R157l9962R5719k4415j2889N5524p9848k219k6242N1015
8137a90181l1509k0946q0767n0903L8890Q7262J06541q5102K6633l3185o1595
8126b94862j3045M5966L1068N0068K1113l8363k6267K1978r4700K6575J18240
8115a52229j8455o9369k7307K8618K5620M26Q239L4935m1912j7479J887l1740
$$ y = [-200586, -259199, -206051, -177863, -154652, 26456, -146042, -288705, -169942, -49308, -82881, -185685, -221367, -312101, -340882, -237130, -251042, -227550, -202480, -208443, -275527, -256210, -192666, -199445, -215814, -195840, -154231, -164693, -117416, -159796, -181804, -237816, -269203, -327712, -280924, -190992, -128217, -115057, -155343, -184548, -262910, -246231, -300684, -232205, -163352, -207604, -296244, -297317, -267537, -216021, -206864, -246826, -151107, -175522, -188411, -132887, -212735, -214954, -241196, -190181, -221690, -242636, -323403, -374306, -335416, -248154, -141613, -226715, -200082, -233267, -294862, -307907, -261941, -230873, -180805, -159692, -198055, -224322, -202344, -297044, -270469, -152229, -170684, -240053, -267360, -238742, -213122, -212696, -204457, -169522, -211434, -228913, -227026, -258766]
8103b58766M2820J28637o0506n1768J368K131Q5274N1453o9660j4836P4411o9561
8091a39003m1717l1263m7707P2086J7707l7340j21428K1542O68n4816P1399k073
8079b91945O1545P04r8861j5395P1492K9667N6661n443m9440P6228l691N9183
8067a09295k0194k5330J2459K6243j1263p5060j01384J26424m3020l8858N8999
8056b00279O8772k6140l4970l4801J2611M206j9292Q3909O6357J6335l0334L8753
8044e4873j99469J2793J07547K8594N5986P3851q3320j45271q387R8438k1296
8033a35407l6852L4260M0907l5587P805l914n7819j2113J1405J099L7582J746
8021a46888j43524J8160Q1446q990j8078k9712J6902R252O2572n1817L2916P4165
$$ y = [-258766, -215946, -87309, -147815, -199583, -198215, -196084, -110810, -59357, -129017, -143853, -69442, -139003, -180720, -211983, -259690, -187604, -169897, -207237, -328665, -307123, -306455, -361271, -289872, -291945, -230400, -229696, -328557, -343952, -272460, -242793, -186132, -191575, -241015, -164787, -168478, -109295, -129489, -154819, -142360, -116117, -127380, -202440, -303824, -177400, -220420, -259278, -200279, -131507, -157647, -192617, -227418, -214807, -210601, -229893, -145984, -79627, -63292, -93626, -54873, -254342, -241549, -134002, -105408, -49422, 24429, -58891, -204162, -212549, -114111, -135407, -172259, -137999, -97092, -132679, -124874, -128788, -186607, -198720, -187315, -186216, -148634, -146888, -290412, -272252, -190806, -199796, -217874, -247586, -230684, -221432, -158860, -210677, -177761, -103596]
8009a03596l3759m690L6122o2689k827m6716o470P7411M8608m5493p5109k0131
7997b39339J34337M2173j2464j8586k683j2097N0663r351m425L2024l3195k8906
7985a01849k4928p245R46K0020K3827m740O8077m9011r8423p883n347J33172Q6668
7972C3284k4706q8862l8606k042P9016k0689R9560j18189n1J5074q012k1102j3604
7959a08929j5198M1916m5220L278K4058O1929O9830j5107l4800j12907J8945K3866
7947h8339J09094k80L5718p1017l4417K6233j413j3845j5609l666J34047o4171
7935A2335n9767N4376O743j3687K8673M7020q5000J7039k2103p3402N0621J02051
7923F4899L1928m9182q705n8898q674J01111q9825J22649Q4966l5997n856k5107
$$ y = [-103596, -137355, -142045, -105923, -168612, -171439, -218155, -224625, -147214, -98606, -144099, -219208, -239339, -105002, -62829, -75293, -93879, -96562, -108659, -57996, -67347, -71772, -39748, -72943, -101849, -126777, -134022, -133076, -113056, -89229, -93969, -25892, -74903, -173326, -181209, -186556, -53384, 33284, 8578, -80284, -118890, -120932, -41916, -62605, 36955, -81234, -81285, -66211, -74223, -95325, -108929, -124127, -82211, -127431, -124153, -100095, -38166, 31664, 16557, -18243, -131150, -112205, -88339, 20755, 20475, 56193, -14824, -49241, -23008, -24421, -38266, -53875, -57541, 76506, 12335, -47432, 6944, 13687, 0, 28673, 75693, -9307, 7732, -14371, -87773, -37152, 64899, 96827, 47645, 38940, -19958, -28632, 72479, -17346, 105303, 190269, 154272, 148416, 123309]
7911A23309j3521r6287N2167R4429p3617m6716L2325J6736J3521J6363Q231O6959
7899A93899p8232K8893O620p5752m7682L8001L9657O0922N4988k8175l2841n8876
7887A01422p1810M5506J126K353M3161M2966N687M8787l6978j48922L9105J58410
7875B30813K7954k1464K0660r4295M1369r1503M0986l3715O4884O4513r5300o395
7863A48507J1124O1001J6700j5468j7297n3382L6564j3189k1434R2607j4378M1290
7851B72645K5513q6791r6088M047O1451J56244p3708J8153M64N2066q5165p7277
7839A71554O3369K2253j9261P6783O499o8327j9626n1455K0691K0793n3293N5202
7827B25182J6717K0946J15009j3370n4941o0516m8565r958R6636k5404j4059o4139
$$ y = [123309, 109788, 13501, 65668, 160097, 86480, 39764, 72089, 88825, 102346, 118709, 126940, 193899, 115667, 144560, 151180, 75428, 27746, 65747, 105404, 166326, 221314, 193139, 160298, 101422, 29612, 75118, 76244, 78597, 121758, 164724, 170411, 219198, 182220, 33298, 72403, 230813, 258767, 237303, 257963, 163668, 205037, 113534, 154520, 120805, 185689, 250202, 154902, 148507, 159631, 220632, 237332, 221864, 204567, 151185, 187749, 174560, 153126, 245733, 231355, 272645, 298158, 211367, 115279, 119326, 180777, 337021, 263313, 281466, 281930, 333996, 248831, 171554, 234923, 257176, 237915, 314698, 321197, 252870, 233244, 181789, 202480, 223273, 169980, 225182, 241899, 262845, 377854, 364484, 309543, 249027, 200462, 190504, 287140, 261736, 247677, 183538]
7815A83538n9273n0601P2372K8677j0832l5939O5575r8959L88608J2329j14573
7804C80922m3072J8805m8747J4408n7780J14044M4604j59803l8809l7274L8877
7793B26175m4252j3010m5815K2748M5363K4694m0540q69R227k6245k318Q5543
7781B40701M5517N5902j25070j7786l2630p7135N0879R1542j22895N4266P8527
7770B41818J7190r8895j5243m5744l7248L3578N3103N3113j3593o0809Q1691j8537
7758A90424N0334N8474r5991j34978M338J2782n2829J03459p1944J7374M241M2176
7746A27860J01701j7638K1563n8028K671O621l4277m700r944l9685J3394o2540
7734D6998K0358Q6861l1670p8085K7356K8787m4235P9016J26830m4515l7128q3440
$$ y = [183538, 124265, 73664, 146036, 174713, 163881, 127942, 193517, 94558, 483166, 495495, 380922, 337850, 356655, 307908, 322316, 264536, 378580, 423184, 263381, 224572, 187298, 226175, 181923, 168913, 123098, 145846, 191209, 215903, 175363, 174494, 183721, 157476, 155158, 240701, 286218, 342120, 217050, 199264, 166634, 89499, 140378, 231920, 109025, 163291, 241818, 259008, 160113, 144870, 99126, 61878, 95456, 148559, 201672, 188079, 127270, 208961, 190424, 240758, 299232, 203241, 68263, 72601, 85383, 32554, 136013, 64069, 81443, 85684, 127860, 229561, 211923, 233486, 175458, 178129, 184750, 150473, 145773, 135829, 96144, 109538, 46998, 67356, 154217, 122547, 44462, 71818, 100605, 56370, 135386, 262216, 217701, 180573, 97133]
7722I7133q7041P0268k8118O9484J4360K5317L2197q8638r372P0360N448q2249
7710H9149J1601N123l8121O9419N2874o8257j8910q939K6388L6070k1943p7319
7698E7135K7435K2279J5141n5943q4607L1479Q9078l085K2237J14493k5606k1059
7686A88977l1577K7378L659K5794j6137M8304K3653J0226L3040J6796N8090M2555
7674D30758k1025K129P9218N1490o4473J9024k0313M7413K9374k378O5821M552
7662F21590K036j879J8216O5280p8185o3044O7521K5155k6458j54859m6265P0173
7650D99281l2098j8262l0148q0032r756k7489l9462m2466K6315N1233L4117j41982
7638A89251k6183k5542m3848N1901J2413J3786L394L1744n3767r516p7366N2351
$$ y = [97133, 10092, 80360, 52242, 121726, 136086, 161403, 193600, 104962, 95590, 165950, 171398, 89149, 100750, 105873, 67752, 137171, 190045, 121788, 102878, 93939, 120327, 156397, 134454, 57135, 84570, 106849, 121990, 66047, -18560, 12919, 101997, 98912, 121149, 235642, 210036, 188977, 157400, 184778, 188437, 214231, 198094, 246398, 270051, 280277, 313317, 330113, 388203, 430758, 409733, 411862, 491080, 542570, 478097, 497121, 476808, 524221, 553595, 551217, 617038, 621590, 623626, 621747, 639963, 705243, 627058, 564014, 631535, 656690, 630232, 475373, 429108, 499281, 467183, 448921, 418773, 338741, 328985, 301496, 262034, 219568, 245883, 297116, 331233, 189251, 163068, 137526, 93678, 145579, 157992, 171778, 175172, 206916, 153149, 143633, 66267, 118618]
7626A18618J9549k3408J9367L9649n279l984K5004n2705O2233Q230j11487o9591
7614B6196M2469P3052N5351k2398j3840o6401k0071O2198Q9849p032k07116N614
7602A7871Q9041l957J4316p005k409j5254L3021K9707k4803Q4469k3399k2315
7590A69283o8538q0856P158K5416j0627n409L7776Q0776Q4867m543k2786j7833
7578A94684k6708m8737K9246k6126O7048l9588k3944P051K5523J37224n400k4084
7566B66189p0807o7722J21020P7893l6801o0047M303J460j0855J6804L3702Q9475
7554C64614m7423r2634J6644l7504J0840P5554j6057l2395J24744L0811l9448
7543C57746O3584K2661Q5458o4272j4158P7655o185L5427J07254J9773M797l089
$$ y = [118618, 138167, 114759, 134126, 173775, 168496, 164512, 189516, 136811, 199044, 207274, 95787, 26196, 68665, 141717, 197068, 174670, 160830, 94429, 74358, 136556, 226405, 219373, 12257, 17871, 106912, 102955, 117271, 110266, 107857, 92603, 125624, 155331, 130528, 214997, 191598, 169283, 100745, 19889, 27047, 52463, 41836, 36427, 74203, 154979, 239846, 235303, 212517, 194684, 167976, 119239, 148485, 122359, 189407, 149819, 125875, 132926, 158449, 295673, 290273, 266189, 195382, 127660, 248680, 326573, 289772, 229725, 234028, 235488, 224633, 241437, 275139, 364614, 317191, 224557, 241201, 203697, 214537, 290091, 274034, 241639, 366383, 397194, 357746, 421330, 443991, 529449, 465177, 451019, 528674, 522489, 557916, 665170, 684943, 689740, 686651]
7531F86651M277O965O9627j1140R381O693k6626K3617J1857R749L4728Q842n6851
7518G77770M7879k200M4090L9216O4173k5147O6373o9051q3241J17427n5606K2140
7506I43823M6732m3658p276l9124k3777K6033j1261n0383k1272p1397k5351J1715
7494G34804J15199N4970n2326n2493J17959J7399m9948J9672j29462j02710N1226
7483G24290J8124l1931l4880n9015m8508l1134J05919Q3462r573n9475P6761m3730
7471F90310j4628J1152j37755l5193L0342M4571k2102M8095K4555K0948r8818
7460E61477q396K297J7725J19758N1935J6127q8162P209J11603j0357J2948j539
7448G92625M763n0203L2073J25813J507L7856j7699r0912k6054O1578K0040J17167
$$ y = [686651, 690928, 697893, 767520, 756380, 765761, 772454, 745828, 769445, 781302, 791051, 825779, 834621, 777770, 825649, 823449, 867539, 906755, 970928, 945781, 1012154, 943103, 859862, 977289, 921683, 943823, 990555, 946897, 939621, 900497, 876720, 902753, 891492, 841109, 819837, 748440, 723089, 734804, 850003, 904973, 852647, 800154, 918113, 935512, 885564, 905236, 775774, 673064, 724290, 742414, 710483, 675603, 616588, 568080, 536946, 642865, 726327, 716754, 657279, 734040, 690310, 675682, 686834, 549079, 513886, 544228, 588799, 566697, 614792, 639347, 660295, 561477, 553081, 555378, 573103, 692861, 744796, 760923, 672761, 679970, 791573, 781216, 794164, 792625, 797388, 747185, 779258, 905071, 906578, 944434, 926735, 835823, 809769, 871347, 891387, 1008554]
7436A008554O2776j0299o9596k1501n4388P072k1661J07351o188L8145L2812p0132
7424A002945j0656j3728l0890k4484l3853L2701Q095j2227l3270j86898p9857
7413F17878J11876J2957N8529P7549p7511M6128j8510N0380Q6801j0978m4727
7402I10372p4937o2393q9212n759L3023m3566j0148J1495p2053L2906L4908K5914
7390F90550P5339O3296o1056r0319o3305j4352J35313j3256l1256j2661R3366
7379G71659j16l6233k3769J3307Q0409Q783K1808Q1452P7216N6362J41968Q6898
7367A279744j5500k9641K04665J11490l2604L1802Q8826n017l8554p1137o7853
7356A456221q749n0470o0142p8472m6215j64117j10648q763n5591m0659J8024
$$ y = [1008554, 1071330, 1061031, 991435, 969934, 915546, 922618, 900957, 1008308, 1002120, 1040265, 1073077, 1002945, 992289, 978561, 947671, 923187, 889334, 922035, 930130, 917903, 884633, 697735, 617878, 729754, 742711, 801240, 878789, 801278, 847406, 828896, 879276, 966077, 955099, 910372, 835435, 773042, 683830, 678071, 711094, 667528, 657380, 668875, 596822, 629728, 664636, 690550, 765889, 829185, 768129, 677810, 614505, 600153, 735466, 722210, 690954, 678293, 771659, 771543, 735310, 711541, 724848, 805257, 814040, 835848, 917300, 994516, 1050878, 1192846, 1279744, 1264244, 1234603, 1439268, 1550758, 1518154, 1549956, 1638782, 1633765, 1595211, 1524074, 1456221, 1447472, 1397002, 1336860, 1258388, 1212173, 1048056, 937408, 928645, 873054, 832395, 850419]
7345H50419m5382K4837j26229j06824J10109R6390j35642l0207M0940K3233l0086
7334F71558M7110N9490j9181o0539j9403M6287J0592o6680p1332L3311K112P3712
7322G07037L9626k9747O3884O8733j25145q77K49526K6219Q8091q2363P2109K10143
7310A287236J26865l0527n0894J25975o2454j3399j7375n3299q5850j15684r0569
7299A020025k8356j08075j0159m8383j13869O864n7487r6287l4573k6205K9893
7288E33388m4906j18286m7357O9693m9341J4865J324j5854L874j4731n728o3824
7276B63117k3738K8317n675l54j0673J14034n8006m9676P885o8542O517J05384
7264C08590o371p770q5220k8198L6184n0059o716J0504J3612n2780J17856J3949
$$ y = [850419, 805037, 829874, 703645, 596821, 706930, 803320, 667678, 637471, 678411, 701644, 671558, 718668, 778158, 758977, 698438, 679035, 725322, 735914, 669234, 597902, 631213, 633325, 707037, 746663, 716916, 780800, 849533, 724388, 723511, 973037, 999256, 1087347, 1004984, 1077093, 1287236, 1414101, 1383574, 1332680, 1458655, 1396201, 1382802, 1365427, 1312128, 1226278, 1110594, 1020025, 991669, 883594, 873435, 825052, 711183, 718047, 660560, 564273, 529700, 503495, 533388, 488482, 370196, 322839, 392532, 343191, 358056, 359380, 343526, 347400, 332669, 326941, 263117, 239379, 267696, 262021, 261667, 250994, 365028, 307022, 257346, 265231, 196689, 203206, 308590, 302219, 294449, 209229, 181031, 217215, 167156, 160440, 170944, 184556, 131776, 249632, 263581]
7252B63581K8272l6335r5248q0462K7249J3329P53M8201l988j32189J7300Q969
7240E9432K2557k2691Q746J2449P6919Q5292j0764m7557l2842l9890j69701K3161
7228c4889J1990J42126j6494L8389Q54K2041j9310m5000j3438p7290J2010N0151
7216G1140R1976J0876n5766q2270o4791J26106r137o1060q2826Q213O1010n9584
7204d6113k0284R0997R400j207M4908k8601o5122m8228J044K339L6544O6904p743
7191C4838L0508J4204o4602N4259O7800o3622n9759L430o8402J55246J59j2475
7179I1584q6932J14752r3887K0761K2666j05035M949J2501N429m0803M3582J92572
7167A82139J1825o3180n4543q6131K153o852p5251J18384L6447k7438J06584o3124
$$ y = [263581, 291853, 255518, 160270, 79808, 107057, 120386, 121139, 169340, 165352, 33163, 50463, 59432, 81989, 59298, 68044, 80493, 157412, 242704, 231940, 184383, 151541, 111651, -58050, -34889, -22899, 119227, 102733, 141122, 141976, 164017, 144707, 99707, 86269, 8979, 20989, 71140, 163116, 173992, 118226, 35956, -28835, 97271, 88134, 27074, -55752, -47539, 13471, -46113, -66397, 24600, 34000, 32793, 77701, 49100, -16022, -64250, -63206, -60867, -24323, 42581, 34838, 65346, 79550, 14948, 69207, 137007, 73385, 13626, 17056, -51346, 103900, 104059, 91584, 4652, 119404, 25517, 46278, 68944, -36091, -31142, -18641, -13212, -54015, -10433, 182139, 193964, 130784, 76241, -9890, -7737, -14589, -89840, 28544, 64991, 37553, 144137, 81013]
7155H1013j4563K4032j1561q1071j3110k5830O0882K0346j4423q5696Q2248K7203
7143D9470L4657q1396J9483n285j52669k4613N8781M1641P0461o2876r5115q6576
7131b34037Q2456P6729P4014M4759L1704J6540j31341m3168J06625Q5695k9189
7120H0787q9386j3506J0182r7240J42450M0284j37473O4771J9427n9069L7067
7109a706r878m2139M2103P7767l0075n4048J3444K750m315k6659J05817k4129
7097D8932M0465l9361q1757o3497k585N7017l2752N2138m7888j7834r77M6724
7085d1375J1523R1636j23719m2502L8426N7378k8299j5907O1482N5193j03611
7074c9775j4425K499R2991l2828o0237O9876K6301K9465O5752j04439k1260m958
$$ y = [81013, 66450, 90482, 78921, -2150, -15260, -41090, 19792, 40138, 25715, -59981, 22267, 49470, 84127, 2731, 22214, 16929, -135740, -160353, -101572, -59931, 10530, -52346, -147461, -234037, -151581, -74852, -838, 43921, 75625, 92165, -39176, -82344, 24281, 109976, 80787, -8599, -22105, -11923, -109163, 33287, 73571, -63902, 869, 20296, -38773, -1706, -11584, -53723, -11620, 66147, 36072, -17976, -4532, -1782, -6097, -32756, 73061, 48932, 89397, 50036, -31721, -95218, -97803, -40786, -73538, -21400, -69288, -87122, -88099, -41375, -29852, 61784, -61935, -104437, -66011, -8633, -36932, -52839, 8643, 63836, -39775, -54200, -51701, 41290, 8462, -51775, 18101, 44402, 73867, 139619, 35180, 13920, 8962]
7062H962o43K453m8424L1764N8346J5099j45747l7935J20879l5396K2933N4993
7050D7284K2570j00173N520O2165j5787N4434n6192J1800L7132q116m4263P590
7038B3964l2541n0771N3967N2652j53911J1677p653Q3597M4630N7369p1172n7251
7026d5443O1535L8267p7604p2330R0080R127j14425K7967J08629J4835m5064N197
7014G71o9762N0510J2252l5420k4327M9353M6692M8401K3572m0149k2748J5357
7002E4502l5568L9011m0149j5565k4027J3550K6803p7872K6468n579K3085M9406
6990C4065k918l413j0754m6276L9545O8134P6865j14217o8466P0058N3033m5092
6978E0564l1794q4735P27q957r163P8923J2720k7234k0065J732J38440N6825m8023
$$ y = [8962, 8319, 10772, -37652, -5888, 52458, 67557, -78190, -116125, 4754, -30642, -7709, 47284, 69854, -30319, -24799, 37366, 21579, 76013, 19821, 31621, 68753, 60637, 16374, 23964, -8577, -59348, -5381, 47271, -106640, -94963, -102616, -19019, 25611, 82980, 11808, -45443, 16092, 54359, -23245, -95575, -5495, 3632, -110793, -82826, 25803, 40638, -4426, 771, -68991, -18481, -6229, -41649, -65976, -16623, 30069, 78470, 102042, 61893, 39145, 54502, 18934, 57945, 17796, 2231, -21796, -8246, 18557, -59315, -32847, -38426, -15341, 34065, 31147, 27734, 16980, -29296, 10249, 78383, 155248, 41031, -27435, 42623, 95656, 50564, 18770, -65965, -65238, -74195, -83358, -4435, 8285, -18949, -39014, -37282, 101158, 157983, 109960]
6965A09960m6470j3765K0502m766p6346L6603n614j14905Q6455M0467n5369j7909
6953d1157m006J04225Q2470m5786p7272J1999Q9242o9808j5894J01376o6802J8747
6941H7334l3264m9833M8169M183o3841L6125J23681q7746o2548k6357L9378k3656
6929h375L1564Q1998J4160j0844o9126j8513j7701L6199r846r4259N1308L5285
6917B1850M96N4532O756l0888n572K0769R2040J3733r8333o3641P0152J3028n4704
6904D0218n4445o5037J71368p7388R069N0227p326O2772j7006p3137q892n6696
6892b6273m3917P1274j9463k8688J1436j0514j7053M0423n6119P236P6090J11661
6880A16093m4585j35733q7343k849j0474R013P1943L3255L5096J0113k4140q3136
$$ y = [109960, 63490, 49725, 70227, 65461, -10885, 25718, 20104, -94801, -8346, 32121, -23248, -41157, -45163, 59062, 141532, 95746, 18474, 30473, 119715, 49907, 34013, 135389, 68587, 87334, 54070, 4237, 52406, 56589, -7252, 28873, 152554, 64808, 2260, -24097, 15281, -8375, 23189, 105187, 119347, 108503, 39377, 20864, 3163, 39362, 29516, -64743, -13435, 21850, 22346, 76878, 83634, 52746, 47174, 67943, 159983, 173716, 75383, 11742, 81894, 94922, 40218, -14227, -79264, 92104, 14716, 23785, 74012, 66686, 129458, 112452, 39315, 30423, -26273, -70190, 1084, -18379, -47067, -35631, -46145, -63198, -22775, -78894, -71658, 4432, 116093, 71508, -64225, -151568, -154417, -164891, -155878, -83935, -50680, -15584, -5471, -29611, -112747]
6868a12747L8301N7379l5694j4707K4880K8342M12K0567M9187q933Q0729J597
6856A29313l2686N656l5906n1011n654J03780L5714o8969j32890o1756J05550
6845h859q6693K0284j32862J8416P9400M1354L9513K5793J8014o5027L7165j6586
6833c0088n0492O2485m6172r0683L0151J8284K1722K7660L6421k6920l5607n2711
6821a35950P2945k1540J8474J11239M8492o2953l6881j36608M9100j143J8451
6810g6374m3906k0953j1532O9156M2368k3520n5559P8187J15436n6353j49675
6799a32725j9648Q7105N7310N5533k0910J8816r9944m1293O5288M2542N0216j8931
6787D3359m4143k8997R2882k3533o6297r5763N4506j7813K8014P5955K1192m393
$$ y = [-112747, -74446, -17067, -52761, -67468, -42588, -14246, -13834, 6733, 55920, 46987, 127716, 129313, 96627, 102283, 66377, 15366, 9712, 113492, 149206, 80237, -52653, -114409, -8859, -95552, -75268, -208130, -189714, -110314, -68960, -29447, -3654, 14360, -50667, -13502, -30088, -80580, -18095, -64267, -154950, -124799, -106515, -84793, -57133, -20712, -47632, -83239, -135950, -63005, -84545, -66071, 45168, 93660, 30707, -6174, -142782, -93682, -94825, -76374, -120280, -141233, -152765, -83609, -41241, -64761, -120320, -42133, 73303, 16950, -132725, -152373, -65268, -7958, 47575, 26665, 45481, -54463, -95756, -30468, 12074, 62290, 43359, -784, -29781, 63101, 39568, -26729, -122492, -67986, -85799, -57785, 18170, 39362, 34969]
6775C4969q017m5115J4558J7107k748J5477j7769M1226j12045r968L3434M5540
6763F649M0911l5892o9326l0967m1878Q2630m7689Q5927N3534J4443j8664o3048
6751b3370l8165L5140n4730l5261J21843R9384j07395r0756Q2121M8456j8280
6740A8987n9904k1573p4534R4996J27091j7503K254n9217m4883m8992J0162l7829
6728a10945o569P1163k0796o5479J04312l6486N8787K8620j2373p6042N1058K590
6716a2160J5810j4382o6085m8027j04536R3031j621O4932k079L9816P840k1665
6704d9126J28785l2741j90397k796P9881J06595r280M8155n091j53585J2371J18765
6692E1536j09992Q886K6687o5859p713K6658O8443l0688o6134J3038J12497M5533
$$ y = [34969, 26952, -18163, -3605, 13502, 10754, 26231, 8462, 49688, -62357, -72325, -38891, 6649, 47560, 11668, -57658, -88625, -130503, -47873, -95562, -9635, 43899, 58342, 39678, -23370, -61535, -26395, -81125, -116386, 5457, 104841, -2554, -93310, -11189, 37267, 18987, -40917, -62490, -137024, -42028, 85063, 67560, 69814, 10597, -34286, -83278, -73116, -110945, -117514, -46351, -67147, -132626, -28314, -64800, -6013, 22607, 10234, -65808, -14750, -12160, 3650, -10732, -76817, -124844, -229380, -136349, -137970, -73038, -75117, -35301, -27461, -49126, 79659, 46918, -143479, -146275, -66394, 40201, 30921, 79076, 73985, -79600, -67229, 51536, -58456, -49570, -22883, -88742, -96455, -69797, -1354, -32042, -98176, -85138, 27359, 72892]
6680G2892j32969L9748j4157n732K8643j01912J1342J4190q135J08703J0674p3834
6668e0547N7516m4892k6023O7608R4042m9440r8273Q434K6614M92M7008O6752
6656I9291o9965L331l6174J9163N3423n7783j1170L6228J7354K8340N4557l2138
6644A04457o2417q958N6263j15124Q0342O6557j6865r6450n133Q1259L0126o3245
6632E0812p9171K8966n5763m1405L9531J29820k1593m2046j6994q4621R9460O7991
6620G4987l3849L8766K2148n0550r7192O6668N9904l4577P1867r9250q0554J08239
6608D6607L2175o7870j4019P496K1299q07q4355N7209N1572J2969o7414R125j077
6595B910O4880Q419r2316J2570J3027J4140n8006k5193J31996j9084k5340M1633
$$ y = [72892, -60077, -20329, -34486, -40218, -11575, -113487, -102145, -87955, -96090, 12613, 23287, -50547, 6969, -37923, -63946, 3662, 97704, 48264, -50009, -41575, -14961, -14469, 32539, 99291, 29326, 32657, -3517, 15646, 69069, 11286, 116, 36344, 53698, 82038, 136595, 104457, 42040, 33082, 89345, -25779, 54563, 121120, 104255, 7805, 2672, 83931, 114057, 50812, -28359, 607, -55156, -96561, -57030, 72790, 51197, 9151, -7843, -92464, 6996, 74987, 41138, 79904, 102052, 51502, -45690, 20978, 80882, 46305, 118172, 18922, -61632, 46607, 78782, 10912, -3107, 4389, 25688, 24881, -59474, -2265, 49307, 62276, -5138, 3987, 2910, 67790, 76209, -16107, -3537, 9490, 23630, -34376, -59569, 72427, 53343, 28003, 69636]
6583F9636q8689k4977L5041K595m7136J32212P7986o2658J8707j14985K0322J0080
6571B8134O2775l3755M5209M6290p7697o5729P0105r8241K6689J04496o7970L977
6559D4283L8048j0446J3357j10187l907P2282O2196Q9375m6842m2402K0652o5675
6547F0734j2221J65306l1020L288J3424q1822o0270L1982L2897L4231n7811j9499
6535G9219K1530N333Q412L1303K2323m3674p5812L7789R7143l578n731l2404m7184
6522I4669m1159M864L0594J7293K5334m3892N4633M6631Q3813o1817j5880k8049
6510A67034K10375L063j8469j44929j58026K6958O1759O033k3159M2647J6102
6499A89388k0498m0873O3387Q7797j6534j02738q2201J20115N5564n8845j11259
$$ y = [69636, -19053, -44030, -8989, -6394, -53530, 78682, 156668, 94010, 112717, -2268, 18054, 28134, 90909, 57154, 102363, 148653, 70956, 5227, 75332, -22909, 3780, 108276, 40306, 44283, 82331, 71885, 85242, -24945, -28852, 43430, 105626, 195001, 148159, 105757, 126409, 60734, 48513, 213819, 182799, 186087, 199511, 117689, 57419, 89401, 122298, 156529, 98718, 79219, 100749, 106082, 114494, 145797, 168120, 124446, 48634, 86423, 183566, 179988, 174257, 141853, 94669, 53510, 58374, 88968, 106261, 131595, 87703, 142336, 188967, 272780, 210963, 195083, 167034, 377409, 380472, 362003, 217074, 59048, 86006, 147765, 153798, 130639, 173286, 189388, 168890, 128017, 191404, 279201, 262667, 159929, 77728, 197843, 253407, 194562, 83303]
6488H3303J14108N6198Q346r3930k600O7021r9180J6519K3263Q3600k926m526
6476B49196J2065K9556Q945l7236J2917N879j05420J40115Q6305p3929j94065
6465A34328J13960P4704J03780l7828k3575o5363m804O1611J2763R5333J7164
6454D82073j9991r485K3017J5539L0553J382j19595l6542K3053K0221L2525M6658
6442D89408l2612m458N1240J1357n6091m6818O1295j7432L1401O2860j63779j110
6430C85261J6107j8883O2847j25110M7876J8257k0700P4930L7178n9634N9851
6419D77980k9625j9074K9696O110j1001R8227K7449p5498K9693j982M8989L506
6407E84470k3076L716l8702L507K7294N4736P326o429M122N1353l4806j4734L015
$$ y = [83303, 197411, 253609, 261955, 168025, 165425, 232446, 133266, 149785, 173048, 256648, 253722, 249196, 261261, 290817, 299762, 262526, 275443, 281322, 175902, 316017, 402322, 328393, 134328, 248288, 322992, 426772, 388944, 365369, 300006, 295202, 356813, 369576, 464909, 482073, 462082, 452597, 475614, 491153, 521706, 523088, 403493, 366951, 390004, 410225, 442750, 489408, 456796, 452338, 503578, 514935, 458844, 412026, 473321, 455889, 487290, 550150, 386371, 385261, 401368, 382485, 445332, 320222, 368098, 386355, 365655, 440585, 477763, 418129, 477980, 448355, 429281, 458977, 465087, 454086, 552313, 579762, 504264, 533957, 531975, 580964, 584470, 561394, 565110, 526408, 529915, 557209, 611945, 619271, 612842, 616964, 668317, 633511, 618777, 621792]
6394F21792N2895l010M6325l2159o1137N2359O8632k3214l2949k2886n4955J19701
6382G31394N144l0317m4958J7182O790M4476l3225P70P1602m4573P278J31917
6370H63480L7983p8131k1332J36869p836n354O5929R794k2529m0024r4115M0531
6358H85265j8384l5723K7488R3499Q4196J7989l9154n409O4793L2218M9175n5782
6346A100171L5630K5883q2717Q0289P8869n4400p2538N4388J42557J8790o790
6335A320132O9138j08849q788J7122k0567O4853N6428p4528m8173P9709P6487
6324A422964P0966L2401O6070Q0618M6458o9272J6347n1816J43753O5080J02309
6313A925878J13467N0266P9752m176j4124L5517Q6758j18138o6372J51245l4071
$$ y = [621792, 674687, 671677, 718002, 685843, 624706, 677065, 745697, 722483, 689534, 666648, 611693, 731394, 736538, 706221, 661263, 678445, 685235, 729711, 696486, 697256, 768858, 724285, 731563, 863480, 901463, 823332, 802000, 938869, 931033, 925679, 991608, 1001402, 978873, 938849, 844734, 885265, 866881, 831158, 858646, 952145, 1036341, 1054330, 1015176, 1009767, 1074560, 1106778, 1155953, 1100171, 1135801, 1161684, 1078967, 1159256, 1238125, 1183725, 1111187, 1165575, 1308132, 1326922, 1320132, 1389270, 1280421, 1271633, 1288755, 1268188, 1333041, 1389469, 1314941, 1266768, 1346477, 1422964, 1493930, 1526331, 1592401, 1673019, 1719477, 1650205, 1666552, 1614736, 1758489, 1823569, 1925878, 2039345, 2089611, 2169363, 2165187, 2151063, 2186580, 2273338, 2155200, 2088828, 2240073, 2206002]
6302B206002m0343M2409N4968M6912N0917J24326J6543j9911j19132J11482p397
6291B466776n5697J61009Q7074O7405m0278M4849o1004k6644j102L2994L3918
6280B709300p1119o5127Q8984O6680K085l7375j19620m3338M4425j7077j55230
6269B402588k5904N8942l7685l5396m8414n152M1343m8411m1546n8883R8098N6878
6257B356458l5488l4846k1666o6095l9887K9841N1565k8123q6187L8333q5892
6246B078013k7569J477o4170J9405N0579J9735M7228q1538k5780Q670l2480k3397
6234A970173J30337R9944n9469m7300J2603n3370J9209Q3366N4642N2996K3758
6223B286889o6418k1916J58494N0670r2768O2933o7793J5250J07338r3593J5100
$$ y = [2206002, 2165659, 2208068, 2263036, 2309948, 2360865, 2485191, 2501734, 2481823, 2362691, 2474173, 2466776, 2411079, 2572088, 2659162, 2726567, 2686289, 2731138, 2670134, 2643490, 2642388, 2675382, 2709300, 2638181, 2573054, 2662038, 2728718, 2730803, 2693428, 2573808, 2530470, 2574895, 2557818, 2402588, 2376684, 2435626, 2397941, 2362545, 2314131, 2308979, 2350322, 2301911, 2260365, 2201482, 2299580, 2356458, 2320970, 2286124, 2264458, 2198363, 2158476, 2188317, 2239882, 2211759, 2125572, 2163905, 2078013, 2050444, 2051921, 1987751, 2007156, 2057735, 2077470, 2124698, 2043160, 2017380, 2026050, 1993570, 1970173, 2100510, 2200454, 2140985, 2093685, 2106288, 2052918, 2072127, 2155493, 2210135, 2263131, 2286889, 2220471, 2198555, 2357049, 2407719, 2314951, 2377884, 2310091, 2325341, 2432679, 2339086, 2354186]
6212B354186J3539n6738l031Q9118P6454m3874K3661m0201m7885Q9312J3092j1115
6200B456518j56J0232L0502o8122k7639J7031J509l9173J0374M8166o1617L6530
6188B414155l7696R5941l4774p1194q1147n2387J5491k40o26j65810j2750M1628
6176B110591o5650O4486j4740J545n3110k5367l2014n707L9063Q7095o3092q840
6164B034260m8937k6684P8893j11590j10625J01773L7346l3908j15815P9761j4336
6153A870138q4833L3219J36082m488o0026J0197N5869r2947p5676P4374N7226
6142A919135j8194K3360J246o6454l710m0717L8060J8085N6212k2727L9016j09671
6130A833641N4111j6466j9621Q974j9464N7522l9358l9330L1528J23411j0425
$$ y = [2354186, 2367725, 2310987, 2307956, 2397074, 2473528, 2429654, 2453315, 2413114, 2365229, 2454541, 2467633, 2456518, 2456362, 2466594, 2497096, 2428974, 2401335, 2418366, 2419875, 2380702, 2391076, 2439242, 2377625, 2414155, 2376459, 2472400, 2437626, 2366432, 2285285, 2232898, 2248389, 2248149, 2247523, 2081713, 2068963, 2110591, 2044941, 2109427, 2094687, 2096232, 2043122, 2017755, 1985741, 1980034, 2019097, 2106192, 2043100, 2034260, 1985323, 1958639, 2037532, 1925942, 1815317, 1917090, 1954436, 1920528, 1804713, 1884474, 1870138, 1785305, 1818524, 1954606, 1950118, 1890092, 1900289, 1956158, 1863211, 1787535, 1861909, 1919135, 1900941, 1924301, 1925547, 1859093, 1855383, 1814666, 1852726, 1870811, 1927023, 1904296, 1943312, 1833641, 1887752, 1871286, 1851665, 1860639, 1841175, 1898697, 1859339, 1820009, 1851537, 1974948, 1964523]
6119A964523j9750J8982L7520r5114J7886J54191n4133j1036n8932Q2188M6340
6108B082665R7751J914J7169M5216j5809K3106k4740K4420k9190K2085O6279k9674
6096B281192O5522Q9108o7736o7777O3947o1591P25L0470j30645L7658R5693Q3033
6084B419599M8929L403P1060j4740J2001Q826P9241l4743k7539o7313K4678J42070
6072B665472m0958k6267R1169p650M712N5939K9491p061L3999R784o5270R8218
6060B841578L2562o8066N4466Q8115m9729Q564Q7107j014l7224J5261L7539p8858
6048B930301Q3384P2413r1650j01139n9505k8704N6951K2359j7560L2739P48m0361
6036B859976j23308j5497L8926M4252N1870O009K1150o4767O543r682J00259l17
$$ y = [1964523, 1944773, 1963755, 2001275, 1906161, 1924047, 2078238, 2024105, 2013069, 1954137, 2036325, 2082665, 2180416, 2182330, 2199499, 2244715, 2228906, 2252012, 2227272, 2251692, 2222502, 2244587, 2310866, 2281192, 2346714, 2435822, 2368086, 2300309, 2364256, 2302665, 2303390, 2333860, 2203215, 2240873, 2336566, 2419599, 2468528, 2471931, 2542991, 2528251, 2540252, 2549078, 2628319, 2593576, 2566037, 2498724, 2523402, 2665472, 2624514, 2598247, 2689416, 2681766, 2686478, 2742417, 2771908, 2764847, 2798846, 2808630, 2743360, 2841578, 2874140, 2806074, 2860540, 2948655, 2898926, 2907490, 2994597, 2993583, 2956359, 2971620, 3009159, 2930301, 3013685, 3086098, 2994448, 2893309, 2833804, 2805100, 2862051, 2884410, 2866850, 2899589, 2900337, 2859976, 2736668, 2721171, 2760097, 2804349, 2856219, 2862228, 2883378, 2818611, 2825154, 2815472, 2915731, 2915414]
6024B915414L0381K3623O4791l2041q2356N0409K5236J0547O1025O7057K4422
6013C158508k1377k0669O222j24045J03668r1581L2395L4450k674n9888k5827
6002B989182P5051J39863m260q5787Q3335P671o6549M044L3433N2418m5312L8215
5990C221304K7690q158j5360m3202N0455P7853J0358r501o5296M3627N632k3195
5978C272207Q8033m1998j2022M1033P0320O9496n2680k687R89L8030R3927K2706
5966C587354j24854J2976P5293P0275O1902k5181p772n740K4707k472N167j415
5954C670240N2153P2450n4519Q2240o521q2075k4825r6983p6373j726K6397l8185
5942C522273r4036J531M3285R6317j0666r9371k3786k6584p6976m0913K0510j6863
$$ y = [2915414, 2945795, 2969418, 3034209, 3002168, 2919812, 2970221, 2995457, 3006004, 3067029, 3134086, 3158508, 3137131, 3116462, 3122684, 2998639, 3102307, 3010726, 3043121, 3077571, 3074897, 3015009, 2989182, 3064233, 3204096, 3199836, 3114049, 3197384, 3205055, 3138506, 3142550, 3175983, 3228401, 3183089, 3221304, 3248994, 3240836, 3225476, 3182274, 3232729, 3310582, 3320940, 3311439, 3246143, 3289770, 3295402, 3272207, 3360240, 3318242, 3306220, 3347253, 3417573, 3487069, 3434389, 3431702, 3432691, 3470721, 3564648, 3587354, 3462500, 3475476, 3550769, 3621044, 3682946, 3657765, 3649993, 3644253, 3668960, 3666488, 3671655, 3670240, 3722393, 3794843, 3740324, 3822564, 3816043, 3733968, 3709143, 3612160, 3535787, 3534061, 3560458, 3522273, 3428237, 3429768, 3473053, 3569370, 3558704, 3459333, 3435547, 3408963, 3331987, 3291074, 3311584, 3294721]
5930C294721j2944n0990R6371l6094N5793J07265o6856M4455M140j003l3891J09133
5918C510100P276J0416J3002J3970k2640n4505j2954k8296Q252m1450m5932j7289
5906C339950K4947r0655r6534p4510m3038n6478J3387k1042k1353M0000p9162
5895B935512q3096M292j0499M6644L8674k5006q5773n9491M2884J18540r4307
5884B828374n7055L6792P6933l1415k4637M3795k4943n1709K6562l7947j6509
5873B768241Q9661N4836m7978r0029P4328K2861j05961m7656o3872J4917M4743
5862B714091j9968r3711R5824m5802R7189q6773m3735j593n9504R803j249O8949
5850B633521j125P7080k9222k1918Q9120M1021m1364n7126P1759J8787l5254n682
$$ y = [3294721, 3281777, 3230787, 3327158, 3291064, 3346857, 3454122, 3387266, 3431721, 3435861, 3434858, 3400967, 3510100, 3517376, 3527792, 3540794, 3554764, 3532124, 3477619, 3464665, 3436369, 3444621, 3403171, 3357239, 3339950, 3364897, 3274242, 3177708, 3103198, 3060160, 3003682, 3017069, 2996027, 2974674, 3014674, 2935512, 2852416, 2856708, 2846209, 2892853, 2931527, 2906521, 2820748, 2761257, 2804141, 2922681, 2828374, 2771319, 2808111, 2885044, 2853629, 2828992, 2872787, 2847844, 2796135, 2822697, 2784750, 2768241, 2857902, 2912738, 2864760, 2774731, 2849059, 2871920, 2765959, 2718303, 2654431, 2669348, 2714091, 2694123, 2600412, 2696236, 2650434, 2747623, 2660850, 2617115, 2615522, 2556018, 2565821, 2564572, 2633521, 2632396, 2709476, 2680254, 2658336, 2747456, 2788477, 2747113, 2689987, 2761746, 2780533, 2745279, 2739597]
5838B739597q858P2994K2505m9983o9726r2256o3831k7644q3965J9740J2467n6965
5826B414075K403j02282Q5207q1536j66640L1999r8573n2506m6500r0820j8081
5815A876746k1581J9305M3726k6374q8300r2411J09188r3510k9192L7090l662
5804A731025j79010J2969Q6621J3108m3036L7501L4975o9220M5596r8242p1498
5793A500789L3507M5963M5848J13050K9873j21661n1822Q8833K2041J8450J1680
5782A736551l896K4499m9317m2388k624J06083j14369O3678k8653o5946k1104
5771A602514l6661p3929O6240K0412r6728o3834R2335N6329r0363L3203N9557
5760A569075O719o2482O3306o6683r323L8535l0533M845k0994N2177O1530K0603
$$ y = [2739597, 2730739, 2803733, 2826238, 2776255, 2706529, 2614273, 2550442, 2522798, 2438833, 2458573, 2471040, 2414075, 2416478, 2314196, 2399403, 2317867, 2151227, 2183226, 2084653, 2032147, 1985647, 1894827, 1876746, 1855165, 1874470, 1918196, 1891822, 1803522, 1711111, 1820299, 1726789, 1697597, 1734687, 1731025, 1552015, 1564984, 1651605, 1664713, 1621677, 1659178, 1694153, 1624933, 1670529, 1572287, 1500789, 1534296, 1580259, 1626107, 1739157, 1769030, 1647369, 1595547, 1684380, 1706421, 1724871, 1736551, 1732655, 1757154, 1707837, 1665449, 1662825, 1768908, 1654539, 1718217, 1689564, 1623618, 1602514, 1565853, 1491924, 1558164, 1578576, 1481848, 1418014, 1510349, 1566678, 1476315, 1509518, 1569075, 1575794, 1513312, 1576618, 1509935, 1500612, 1539147, 1508614, 1513459, 1492465, 1544642, 1606172, 1626775]
5748A626775L259l2900Q961J8664l9295N6193o6660j36236N0559J3589l6491K776
5736A469194J7663j4602m9548m1302M715L6635M1704q29J9543m1185j51423J58203
5724A448768r0945L1987R455l1172P1961k5496Q9974j1215o2890p445k1089m3357
5712A358536r895J8189p2745O3907L4281k3442Q6791l1581m4696j20117J05107
5701A364335O9723q755m2622O8689o0698P1247l3691Q292P823m4965K1397m5192
5689A375583K5597k158m2630l72N1612o1044N669M1628Q4179k2561M3226M7288
5677A546017j07152N7439m3352J34494q7674N150O488j2928J8237K0041Q125J0101
5665A554986l5705l5868K3961N0288O6126l9846N92J6366J5370k8808K2079L9668
$$ y = [1626775, 1630034, 1597134, 1606095, 1624759, 1585464, 1641657, 1574997, 1438761, 1489320, 1502909, 1466418, 1469194, 1486857, 1472255, 1422707, 1381405, 1386120, 1422755, 1464459, 1463630, 1483173, 1441988, 1290565, 1448768, 1357823, 1389810, 1399265, 1368093, 1440054, 1414558, 1504532, 1493317, 1430427, 1422982, 1401893, 1358536, 1348641, 1366830, 1294085, 1357992, 1392273, 1368831, 1455622, 1424041, 1379345, 1259228, 1364335, 1434058, 1425303, 1382681, 1451370, 1390672, 1461919, 1428228, 1436520, 1444343, 1399378, 1420775, 1375583, 1401180, 1399022, 1356392, 1356020, 1407632, 1346588, 1352257, 1393885, 1478064, 1455503, 1498729, 1546017, 1438865, 1496304, 1452952, 1587446, 1499772, 1504922, 1511410, 1498482, 1516719, 1536760, 1544885, 1554986, 1519281, 1483413, 1507374, 1557662, 1623788, 1583942, 1584534, 1600900, 1616270, 1587462, 1609541, 1649209]
5653A649209K6554O824o021q7170Q3108k8344L8326J15400K2203l8727k4064M5634
5641A802932K0796J0111j5074L2717p5633N7283k377l9539N028M6688R4243o497
5629A930678N5784l0428K1901j1047p511M06L4443N3035j01747K0914N9336K087
5617B027851J00892N4103K772j4041Q2431n8388M050O5811j2631J841P7735Q7114
5605B419540k07308J3523O9726P1843O0106k5579l044J5558j5007N5713l5440
5594B419631J501J7817k5937O6417K5354Q2345k7292n546N1491l0300J8917J02050
5582B696448M4558J1015L8619n6118k5875k4075k6320K2373M7494J18991J2565
5571B859675K3405O53N7129J9118q8904R6351J02490n7401n7163n4266M770P6575
$$ y = [1649209, 1675763, 1682587, 1676566, 1589396, 1672504, 1644160, 1682486, 1797886, 1820089, 1781362, 1757298, 1802932, 1823728, 1833839, 1818765, 1851482, 1775849, 1833132, 1830755, 1791216, 1796244, 1842932, 1937175, 1930678, 1986462, 1956034, 1977935, 1966888, 1959377, 1959783, 1994226, 2047261, 1945514, 1966428, 2025764, 2027851, 2128743, 2182846, 2185618, 2171577, 2254008, 2195620, 2199670, 2265481, 2252850, 2254691, 2332426, 2419540, 2212232, 2225755, 2295481, 2367324, 2427430, 2401851, 2398807, 2414365, 2399358, 2455071, 2419631, 2421132, 2438949, 2413012, 2479429, 2504783, 2587128, 2559836, 2554290, 2605781, 2575481, 2594398, 2696448, 2741006, 2752021, 2790640, 2734522, 2708647, 2684572, 2658252, 2680625, 2728119, 2847110, 2859675, 2883080, 2883733, 2940862, 2959980, 2871076, 2967427, 3069917, 3012516, 2955353, 2901087, 2905857, 2982432]
5559B982432J2849N3272Q3363K0369R8453p194j8505m7492P9618K4050J6216o9193
5547C228238J83915P859r727n250O6818n4060j6167J49959K1727J39032l9039
5536C673305P3028J24922J09502n4945k8070j235N5008R0607N1553M5424J06435
5525D245534m7489j03407L2459k4982N4861K3128Q7120K0559m1911Q3344O5362
5514D394578L4390j6434O8573P1511K2190J02525k2749l29J02974k7784n2019
5503D677426J9047M5449Q7092L3490j12859R6357R7866p4088J70076K0935L7821
5492E098612L2035K3328L94N216K2439J22784L3571j9201r028K080J05591k7947
5480E389874N3163j6233P2658N9628O1769N0301J34853j6200J00930P8584j19756
$$ y = [2982432, 2995281, 3048553, 3131916, 3152285, 3250738, 3243544, 3225039, 3177547, 3257165, 3281215, 3297431, 3228238, 3412153, 3420012, 3410285, 3405035, 3471853, 3417793, 3401626, 3551585, 3573312, 3712344, 3673305, 3746333, 3871255, 3980757, 3925812, 3897742, 3896507, 3951515, 4042122, 4093675, 4139099, 4245534, 4198045, 4094638, 4127097, 4102115, 4156976, 4180104, 4267224, 4287783, 4245872, 4329216, 4394578, 4428968, 4412534, 4481107, 4552618, 4574808, 4677333, 4654584, 4654255, 4757229, 4729445, 4677426, 4696473, 4741922, 4829014, 4862504, 4749645, 4846002, 4943868, 4869780, 5039856, 5060791, 5098612, 5130647, 5153975, 5154369, 5159585, 5182024, 5304808, 5338379, 5319178, 5310150, 5312230, 5417821, 5389874, 5443037, 5426804, 5499462, 5559090, 5620859, 5671160, 5806013, 5789813, 5890743, 5969327, 5849571]
5469E849571J46458m4793m5469N4751R5669J35299L5168m6178P6185O7167l726
5458F320102M4022J07605Q5167p6394J43809J39699n1680l2416J18682J06054
5448F904650R4191Q3306O1718j3232J23208O5819j9150P7717m931J4318J03717
5437G491331N9165J6609r3729J12441J48815O7175O8599Q5135q1677P6635P7784
5426H028283J43353k9772q55O1433M5293R1190Q3947l3126J22147j5290P3240
5415H569843N9610J62458J3496N3320Q5439L7681J7158J18578J76255M2989J07438
5404I444265J16701J69941r269M3614R0870J97846P9460J40972N8265J15710J83610
5393A0631985J15179J04599P4823J17740J70701J86052J78329j3987K03472Q8170
$$ y = [5849571, 5996029, 5951236, 5905767, 5960518, 6056187, 6191486, 6226654, 6180476, 6256661, 6323828, 6320102, 6364124, 6471729, 6556896, 6480502, 6624311, 6764010, 6712330, 6679914, 6798596, 6904650, 6998841, 7082147, 7143865, 7130633, 7253841, 7319660, 7300510, 7378227, 7373296, 7387614, 7491331, 7550496, 7567105, 7473376, 7585817, 7734632, 7801807, 7870406, 7955541, 7873864, 7950499, 8028283, 8171636, 8141864, 8141009, 8202442, 8247735, 8338925, 8422872, 8389746, 8511893, 8496603, 8569843, 8629453, 8791911, 8805407, 8858727, 8944166, 8981847, 8999005, 9117583, 9293838, 9336827, 9444265, 9560966, 9730907, 9721638, 9765252, 9856122, 10053968, 10133428, 10274400, 10332665, 10448375, 10631985, 10747164, 10851763, 10926586, 11044326, 11215027, 11401079, 11579408, 11565421, 11768893, 11857063]
5383A1857063J98603j4657J15960K00618Q5643Q5151J45744J30241J61448K47541
5373A3213355J59225J05070J58365J61637J62481J27257J62792J63698K78660
5364A4692540J82323K16926K25834J70989R1699K99789K96430K09010L12695K43716
5354A6941951J97674K54154L03214L11073K81350K73232L79224L01892L38375
5345A9582139L20528K97971L67394L89524L13342L79952L84505L01175M31927
5336B2768457L67264L53865M22667M12889N26917M66160M36629N28126M85018
5327B6767992M79958L84443L66251N42967N65498M88096O46795N12176N35652
5318C1289828N78710O05594O03534N55544O74262P16590N10536O71326P78155
$$ y = [11857063, 12055666, 12041009, 12156969, 12357587, 12443230, 12528381, 12674125, 12804366, 12965814, 13213355, 13372580, 13477650, 13636015, 13797652, 13960133, 14087390, 14250182, 14413880, 14692540, 14874863, 15091789, 15317623, 15488612, 15580311, 15880100, 16176530, 16385540, 16698235, 16941951, 17139625, 17393779, 17696993, 18008066, 18289416, 18562648, 18941872, 19243764, 19582139, 19902667, 20200638, 20568032, 20957556, 21270898, 21650850, 22035355, 22336530, 22768457, 23135721, 23489586, 23912253, 24325142, 24852059, 25318219, 25754848, 26282974, 26767992, 27247950, 27632393, 27998644, 28541611, 29107109, 29595205, 30242000, 30754176, 31289828, 31868538, 32474132, 33077666, 33633210, 34307472, 35024062, 35534598, 36205924, 36984079]
5309C6984079O83477P24128P13052P78624Q14862R05020R68241Q90795Q78906
5300D4341184R45458R93715J110110R94155J080227J305061J215294J302599J370671
5291E4658474J375060J502240J490909J609245J633360J764482J842007J999248
5283F7875025J928017K014325K162312K324506K378744K435500K486976K756367
5275H6361772K842777K980098L104241L237915L450565L502505L714438L985799
5267A13180110M167174M296148M585452M938556N166768N495298N775191O214520
5259A53819217O539369O919437P485026Q031639Q553727R105693R716888J0265667
5251B20436663J0770232J1456021J2076175J2673615J2873839J3217196J3329411
$$ y = [36984079, 37667556, 38391684, 39104736, 39883360, 40698222, 41603242, 42571483, 43462278, 44341184, 45286642, 46280357, 47390467, 48384622, 49464849, 50769910, 51985204, 53287803, 54658474, 56033534, 57535774, 59026683, 60635928, 62269288, 64033770, 65875777, 67875025, 69803042, 71817367, 73979679, 76304185, 78682929, 81118429, 83605405, 86361772, 89204549, 92184647, 95288888, 98526803, 101977368, 105479873, 109194311, 113180110, 117347284, 121643432, 126228884, 131167440, 136334208, 141829506, 147604697, 153819217, 160358586, 167278023, 174763049, 182794688, 191348415, 200454108, 210170996, 220436663, 231206895, 242662916, 254739091, 267412706, 280286545, 293503741, 306833152]
5244C06833152J3107517J2705440J1958834J0803033R221566P171769M918639
5237C76719950K386070m64775l126139n774226q271595j0303049j1766707j2959321
5229C26440208j3766535j4100988j4216228j4138207j3780713j3169482j2573087
5222B30694968j2085211j1284997j0713544j0026363r376531q882593q227910
5215A60097819p601842p229914o705107o332231n960756n627679n283085m903239
5207A10453966m537282m230176m109413l868923l687568l370402l144544l118564
5199H0387094k951999k666801k522670k472287k279626k361685k245530j981481
5191F0905015j996523j781382j796076j607713j609969j521107j394266j321688
$$ y = [306833152, 319940669, 332646109, 344604943, 355407976, 364629542, 371801311, 376719950, 379106020, 378641245, 375515106, 369740880, 361469285, 351166236, 339399529, 326440208, 312673673, 298572685, 284356457, 270218250, 256437537, 243268055, 230694968, 218609757, 207324760, 196611216, 186584853, 177208322, 168325729, 160097819, 152495977, 145266063, 138560956, 132228725, 126267969, 120640290, 115357205, 110453966, 105916684, 101686508, 97577095, 93708172, 90020604, 86650202, 83505658, 80387094, 77435095, 74768294, 72245624, 69773337, 67493711, 65132026, 62886496, 60905015, 58908492, 57127110, 55331034, 53723321, 52113352, 50592245, 49197979, 47876291]
5183D7876291j370036j241143j280957j241285j028771j059203j087520j015929
5175C8551447j011939q60565q91221j003641p73419q50971q26863q87458o13671
5166C0831699p64475n88052o36401o80054o22950o46565n96256n33712n42002
5157B5221232n88467n43128n02038m85784n25574n20823n27797l70971l15305
5148B0841345m40730l72771l79104l71190m48371l87286l59413l65943l40388
5139A7376149l15563k80566l45274k72139k65990l01648k71388k45770j95716
5130A4882095l12719j41536l13695k63855k75566j17226j90675j89782j84100
5121A2892941j90570j70935k23905j58657j97048m4617j81555j55328j91396q768
$$ y = [47876291, 46506255, 45265112, 43984155, 42742870, 41714099, 40654896, 39567376, 38551447, 37539508, 36678943, 35787722, 34784081, 34010662, 33159691, 32332828, 31445370, 30831699, 30067224, 29479172, 28842771, 28162717, 27539767, 26893202, 26296946, 25763234, 25221232, 24632765, 24089637, 23587599, 23101815, 22576241, 22055418, 21527621, 21156650, 20841345, 20400615, 20027844, 19648740, 19277550, 18829179, 18441893, 18082480, 17716537, 17376149, 17060586, 16780020, 16434746, 16162607, 15896617, 15594969, 15323581, 15077811, 14882095, 14569376, 14427840, 14114145, 13850290, 13574724, 13457498, 13266823, 13077041, 12892941, 12702371, 12531436, 12307531, 12148874, 11951826, 11907209, 11725654, 11570326, 11378930, 11370162]
5111A1370162j51827j58045l8312j55024j19801q6627j60479m9618j92551j26376
5101A0131502m9337n7496j39029j52666o6267j57517j43005p7508j33813j84106
5091H970758l2205j19898q4038o1955r7512k0565o4053K3293k9575p5024p3033
5080H336193L310q5917j11995k1430m8505j20183o444L7992n3185m747J5763j01750
5068G839102k5607O3257q1266j82812P3993k5212q6663j7164k0010o7555j03381
5057G366682n7634Q6885j8901q6910j08172k3258j4549l3760m8518L8j7584n42
5045G043777L9731n0023L8993M3536R777j10284o8730N998J39117L3477o9657
5034G055712r606n8399K1960N2154P9179q159j02114k7155m863O0041P2823n4167
$$ y = [11370162, 11218335, 11060290, 11021978, 10866954, 10747153, 10660526, 10500047, 10450429, 10257878, 10131502, 10082165, 10024669, 9885640, 9732974, 9666707, 9509190, 9366185, 9288677, 9154864, 8970758, 8938553, 8818655, 8734617, 8672662, 8575150, 8554585, 8490532, 8513825, 8484250, 8409226, 8336193, 8339503, 8253586, 8141591, 8120161, 8071656, 7951473, 7945029, 7983021, 7929836, 7925089, 7940852, 7839102, 7813495, 7876752, 7795486, 7612674, 7686667, 7661455, 7574792, 7557628, 7537618, 7470063, 7366682, 7309048, 7395933, 7377032, 7290122, 7181950, 7158692, 7144143, 7110383, 7061865, 7061903, 7044319, 7043777, 7083508, 7033485, 7072478, 7116014, 7125791, 7015507, 6946777, 6952775, 7091892, 7125369, 7055712, 7046106, 6987707, 7009667, 7061821, 7141000, 7132841, 7030727, 7003572, 6998709, 7058750, 7131573, 7077406]
5022G077406J112P3086m8806r8965R134K6067L6866P7854r062m482n9945O44M76
5009G081385J237R546j6248q7313o6818O1222o1341j13711n8020M896J03714p7670
4997F780879k1661L2025O682m0328M4036j9861o7309n8506q6216P3798J31828
4986F775367p8691j36999m1287M5795n7356m9126o2237p9597P3554J9911k3903
4975F385431l9595l2252n9765J2681k8575p5383r0989n8585K7246p2033l0196
4964E937985n8311J011J9917n0450k9145k4504o6389n0113Q2814n0646o8741j40031
4952E503397p9113j8490j765M852j10482n453Q2632j7299k4066l7545K024n7447
4940E241245P548n58r3000k5952N202r2695j9379l4387j33920K4935k5725k535
$$ y = [7077406, 7078518, 7151604, 7102798, 7003833, 7012967, 7039034, 7075900, 7153754, 7144692, 7140210, 7080265, 7080909, 7081385, 7082622, 7092168, 7075920, 6988607, 6921789, 6983011, 6921670, 6807959, 6749939, 6754835, 6858549, 6780879, 6759218, 6791243, 6797925, 6757597, 6801633, 6781772, 6714463, 6655957, 6569741, 6643539, 6775367, 6696676, 6559677, 6518390, 6564185, 6506829, 6457703, 6395466, 6315869, 6389423, 6409334, 6385431, 6345836, 6313584, 6253819, 6266500, 6237925, 6162542, 6071553, 6012968, 6040214, 5968181, 5937985, 5879674, 5880685, 5900602, 5850152, 5821007, 5796503, 5730114, 5680001, 5762815, 5712169, 5643428, 5503397, 5424284, 5405794, 5404029, 5408881, 5298399, 5292946, 5375578, 5358279, 5334213, 5296668, 5298692, 5241245, 5248793, 5248235, 5155235, 5129283, 5134485, 5041790, 5022411, 4988024, 4854104, 4879039, 4853314, 4850779]
4928D850779n0931K6470L1941l9553O0756k3258R502n836n9786L5829j6715P2049
4916D891247J07567l6228K5679p923m6318m2342j52657p3359j12148K6618K2489
4905D602625J3660p8146N830N3171L0547j30584l9035L8517o3407q0743o8931
4894D283504k7944q5231j7071l9816K4667k8887m792m3343k8164j6485o0245K1724
4882C977917j9554o4905K4805O285J2791l9654k2612j52015N5827J00703P010
4871C886598k2123m4174j3625J3991l0255j1357q540K4571q6595j6967P8884K4716
4859C795124l1209k1512o8480Q4793K1623r8964P0987m2598P4292L0079p5551
4848C738584O2160J51935l3848O7712r3692l6087K788l5449J8869P6472l1495
$$ y = [4850779, 4799848, 4826318, 4858259, 4818706, 4879462, 4856204, 4865706, 4859870, 4800084, 4835913, 4819198, 4891247, 4998814, 4962586, 4988265, 4980342, 4934024, 4891682, 4739025, 4665666, 4553518, 4580136, 4602625, 4616285, 4538139, 4543969, 4597140, 4627687, 4497103, 4458068, 4496585, 4433178, 4352435, 4283504, 4255560, 4170329, 4153258, 4113442, 4138109, 4109222, 4104430, 4061087, 4032923, 4016438, 3956193, 3977917, 3958363, 3893458, 3918263, 3924548, 3937339, 3897685, 3875073, 3723058, 3778885, 3879588, 3886598, 3864475, 3820301, 3806676, 3820667, 3790412, 3779055, 3770515, 3795086, 3708491, 3691524, 3770408, 3795124, 3763915, 3742403, 3673923, 3758716, 3780339, 3681375, 3752362, 3709764, 3784056, 3814135, 3738584, 3800744, 3952679, 3918831, 3986543, 3892851, 3856764, 3859552, 3824103, 3842972, 3919444, 3887949]
4837C887949l1805K3744m4530n5909M9507R1431l1615M3199Q0635J1777j61007
4826C863376L1071Q2040q261N9771K4921Q116l5429O0335o1352N7691M8572M2911
4814D173762Q1191N2772M2237N4118O7005l5786l0360R0271J51549N1590O5612
4803D763961J3163Q2004L4216N9048K7576k3591J80955Q5859N2174R5872J2373
4792E383610J90242P7085J45996O1590j3569J75084J74712j2362J86537J76220
4782F545145J32609J99357K19972R3735J29401K18138K23795J80388J65363J87037
4772H294940K08427J90007J81891J77789J89439J43104J62577J13091m3042J9966
4762I638189J263l2344j19784o8622r4558m8838m77j15119K9800M7657j25869
$$ y = [3887949, 3856144, 3879888, 3835358, 3779449, 3828956, 3920387, 3888772, 3931971, 4012606, 4024383, 3863376, 3894447, 3976487, 3968226, 4027997, 4052918, 4061034, 4025605, 4085940, 4024588, 4082279, 4130851, 4173762, 4254953, 4307725, 4349962, 4404080, 4471085, 4435299, 4404939, 4495210, 4646759, 4698349, 4763961, 4777124, 4859128, 4893344, 4952392, 4979968, 4956377, 5137332, 5223191, 5275365, 5371237, 5383610, 5573852, 5650937, 5796933, 5858523, 5844954, 6020038, 6194750, 6182388, 6368925, 6545145, 6677754, 6877111, 7097083, 7190818, 7320219, 7538357, 7762152, 7942540, 8107903, 8294940, 8503367, 8693374, 8875265, 9053054, 9242493, 9385597, 9548174, 9661265, 9618223, 9638189, 9639452, 9607108, 9487324, 9418702, 9324144, 9275306, 9274829, 9159710, 9189510, 9237167, 9111298]
4751I111298n9356j8011K1048j21108j39778n2219j75176j87726p0357j04340
4741H204275k00337k41293j84495k74616j21055j18152k29007j90380q9445k12902
4731F342593j85711j21080j01103m0561q9317j99147j11769j9289o5966j25530
4721E283120j61o3365j52563P2405N5776k08191M460r4805j5099p9305l6052j9263
4709D746957l1149m9130p3951p8714l0877R8667j11700j3020r2972Q038l0804
4698D341345K0084l090j27958L1192N3727K9747j03406j80665J37942L592L2610
4687D235120l1217m4963k5447Q2124k550O3086K6776R3268o3295m4123J07139
4676D395918k4468l605M2413K1983N9252k160J06448N8527m5995P8334q3864l8940
$$ y = [9111298, 9051942, 9033931, 9054979, 8933871, 8794093, 8741874, 8566698, 8378972, 8308615, 8204275, 8003938, 7762645, 7578150, 7303534, 7182479, 7064327, 6835320, 6644940, 6555495, 6342593, 6156882, 6035802, 5934699, 5894138, 5804821, 5605674, 5493905, 5474616, 5408650, 5283120, 5282959, 5219594, 5067031, 5139436, 5195212, 4987021, 4991481, 4896676, 4881577, 4802272, 4766220, 4746957, 4715808, 4666678, 4592727, 4514013, 4483136, 4581803, 4470103, 4457083, 4364111, 4372149, 4341345, 4361429, 4358339, 4230381, 4261573, 4315300, 4345047, 4241641, 4060976, 4198918, 4202510, 4235120, 4203903, 4158940, 4133493, 4215617, 4213067, 4276153, 4302929, 4396197, 4332902, 4288779, 4395918, 4371450, 4367845, 4410258, 4432241, 4491493, 4489333, 4595781, 4654308, 4608313, 4686647, 4602783, 4563843]
4664D563843L1049J29796J6301R8506p3277p1851K4774O7352J06837K7417J0188
4653D930935M5027M6545k0993N3621O618O5098m5138m470Q7505N1928k6004O5358
4641E256030M5255n1484M9988m0108Q09o4764m8847o0525p9492r6726J2312R759
4629D932207N628n7085J5213j3805o6774k3822J9536m4004R8967L1044o3706j52642
4617D680757n790M1049j00535l3238K8701L1028o1337q471j09931j50807q2992
4606D228434N3857O6373M4797j03039j5196l8081l2398o7229N1806M2208o4383
4595D167149n0806R8020m4307j6240l502m1835Q3352n5697l255q2697j00856l4568
4583C914758m6321q927m9722n4734o743m0235m9124r0519k0072q8389j04207Q9940
$$ y = [4563843, 4594892, 4724688, 4740989, 4839495, 4766218, 4694367, 4719141, 4786493, 4893330, 4920747, 4930935, 4975962, 5022507, 5001514, 5055135, 5061753, 5126851, 5081713, 5077243, 5164748, 5216676, 5190672, 5256030, 5301285, 5249801, 5299789, 5259681, 5260490, 5195726, 5146879, 5086354, 5006862, 4910136, 4922448, 4932207, 4937835, 4880750, 4895963, 4882158, 4815384, 4791562, 4811098, 4767094, 4866061, 4897105, 4833399, 4680757, 4674967, 4716016, 4615481, 4582243, 4610944, 4641972, 4580635, 4572164, 4462233, 4311426, 4228434, 4282291, 4348664, 4393461, 4290422, 4275226, 4237145, 4204747, 4137518, 4189324, 4231532, 4167149, 4116343, 4214363, 4170056, 4153816, 4150314, 4108479, 4191831, 4136134, 4132879, 4050182, 3949326, 3914758, 3868437, 3859510, 3809788, 3755054, 3748311, 3708076, 3658952, 3568433, 3548361, 3459972, 3355765, 3445705]
4571C445705L4325q4819m1753q4810k9930o2748P5471m8563j42714q0992K0027
4560B999199j89003L414P4465j04858p5494j05816R460R676j26723n5413k7280
4549B411627j8046l5111j24762m4642j15492q579P6195L9655m5977m5506j23944
4538A965418k5327r1654O3995L6496M126l4291r6326k1906k2179j34535l4883
4527A608934q2200J8039P7845j3158N1942m1549j49549q3407P1598L253o3109
4516A398639p448O9202k2369o5086Q3676j4825k5754m2627l1973k3209p1077M5799
4504A292948L7307L2356Q3802j11493j01887j1378J02270P9351m0250l6766j03090
4493A223170K0513l6676L1341P873n4561l0852M6133j978Q7279L1992K796L6642
$$ y = [3445705, 3480030, 3395211, 3353458, 3268648, 3238718, 3175970, 3251441, 3202878, 3060164, 2979172, 2999199, 2810196, 2813610, 2888075, 2783217, 2707723, 2601907, 2611367, 2621043, 2494320, 2438907, 2411627, 2393581, 2358470, 2233708, 2189066, 2073574, 2064995, 2141190, 2180845, 2134868, 2089362, 1965418, 1940091, 1848437, 1912432, 1948928, 1953054, 1918763, 1822437, 1800531, 1778352, 1643817, 1608934, 1526734, 1544773, 1622618, 1609460, 1661402, 1619853, 1470304, 1386897, 1458495, 1461748, 1398639, 1391191, 1460393, 1438024, 1372938, 1456614, 1441789, 1416035, 1373408, 1341435, 1318226, 1247149, 1292948, 1330255, 1362611, 1446413, 1334920, 1233033, 1221655, 1323925, 1403276, 1363026, 1326260, 1223170, 1243683, 1207007, 1238348, 1246221, 1191660, 1160808, 1206941, 1204963, 1292242, 1324234, 1327030, 1363672]
4481A363672n7746N535L934O1637l0156L6230J0216j9442N6022M9954J37504k5193
4469A592167r6922J1391K6954O7690J22122o4175l9826Q106j03096n475N6936
4458A575872l4715O6452K323q269K9256m0264K1989O0300L6516M619Q9721J10932
4446A914732K619l1977J869Q2304l2800K0593L8267p28R9179m1102k1417j1999
4434B019540N4937P6332L3115Q8844L9049k7594k3529J23418J75171O116k9996
4423B535403N1641L4685J62469M3495N8227J6846J0118Q8464O9037J42739J12467
4412C325591R622J62811J69633J06771J78580Q8273n50Q3046J79378K67890K16865
4401D787910J50345K60478K18515K25593J02490J64738K03408K18370J01120K84510
$$ y = [1363672, 1305926, 1311461, 1315395, 1377032, 1346876, 1383106, 1393322, 1373880, 1429902, 1479856, 1617360, 1592167, 1495245, 1506636, 1533590, 1601280, 1723402, 1659227, 1619401, 1627507, 1524411, 1518936, 1575872, 1541157, 1607609, 1609932, 1601663, 1630919, 1590655, 1612644, 1672944, 1709460, 1714079, 1803800, 1914732, 1917351, 1885374, 1887243, 1969547, 1936747, 1957340, 1995607, 1994879, 2094058, 2052956, 2031539, 2019540, 2074477, 2150809, 2183924, 2272768, 2311817, 2284223, 2260694, 2384112, 2559283, 2565399, 2535403, 2587044, 2621729, 2784198, 2827693, 2885920, 2902766, 2912884, 3001348, 3070385, 3213124, 3325591, 3335213, 3498024, 3667657, 3774428, 3953008, 4041281, 4040731, 4123777, 4303155, 4571045, 4787910, 4938255, 5198733, 5417248, 5642841, 5745331, 5910069, 6113477, 6331847, 6432967, 6717477]
4391F717477L23541K58269M64667N50788N51424N84809P32702R17141R54476J020408
4381A3075702R91407R94665R76166R28693J028617R75961J128760J200662J376417
4372B2677050J218571R39649O83268L93299L87927M94272P16109Q29609P18731
4363B9058485L74600j30688o59927r89652r07935q22027m83108m21618n76022
4354B4442108p49663j071768j205281j392211j209831r97700q71865o20656p95214
4345A5527919q19963p09497r04737p46107p00958p82160o29468m99451q06773
4336H928805p56191n84856o78064n18949m46489m39384l65802l74445k70001q4717
4326D409907j88244k41638k51848j35096j41125l23893J749q9356j14352j5770
$$ y = [6717477, 7041018, 7299287, 7763954, 8314742, 8866166, 9450975, 10183677, 11100818, 12055294, 13075702, 14067109, 15061774, 16037940, 16966633, 17995250, 18971211, 20099971, 21300633, 22677050, 23895621, 24835270, 25518538, 25911837, 26299764, 26794036, 27510145, 28339754, 29058485, 29433085, 29302397, 28642470, 27652818, 26744883, 25922856, 25439748, 25018130, 24442108, 23692445, 22620677, 21415396, 20023185, 18813354, 17815654, 16943789, 16323133, 15527919, 14707956, 13998459, 13093722, 12347615, 11646657, 10864497, 10235029, 9735578, 8928805, 8172614, 7587758, 6909694, 6390745, 5944256, 5504872, 5139070, 4764625, 4494624, 4409907, 4221663, 3980025, 3728177, 3593081, 3451956, 3128063, 3129812, 3040456, 2926104, 2910334]
4316B910334r1039j81537j31376K0829j46964m6026m710l0121j16588l8078l7840
4305B106884o0297l9740o3739k1387r921l0118k4844p3673q1424k830l8298j25574
4293A535039j12181k1566K6496L5270m5102o139l9363l8300p1617p8350l9381
4282A144806P7969J8465M0027r3066K2461j17323M7573M3123n1184k9803O05L9431
4270A143084m5587p7578n4293J6321p96o8539r2580L3845O4542P6282j35224r2450
4258G67027k5534J8146m6000K997M0037M8100l304p5698m9470N9216n780K2932
4246G52669N327O0074k6377j5846k3841O4994p0344J2496J9649n0004N2858j36982
4234F44673n228P0850K047J9886M6632j36963J2906p4412n841r647M1389j545
$$ y = [2910334, 2819295, 2637758, 2506382, 2527211, 2380247, 2334221, 2329511, 2299390, 2182802, 2144724, 2106884, 2046587, 2006847, 1943108, 1921721, 1911800, 1881682, 1856838, 1783165, 1701741, 1698911, 1660613, 1535039, 1422858, 1401292, 1427788, 1463058, 1417956, 1411817, 1372454, 1334154, 1262537, 1184187, 1144806, 1222775, 1241240, 1281267, 1188201, 1210662, 1093339, 1140912, 1184035, 1132851, 1103048, 1103653, 1143084, 1097497, 1019919, 965626, 981947, 981151, 912612, 820032, 853877, 918419, 994701, 859477, 767027, 741493, 759639, 713639, 716636, 756673, 804773, 801469, 725771, 676301, 735517, 729737, 752669, 757996, 818070, 791693, 775847, 752006, 817000, 746656, 759152, 778801, 728797, 781655, 644673, 639445, 710295, 712342, 732228, 778860, 641897, 654803, 580391, 574550, 564903, 606292, 604747]
4222F04747N4543J6829j6926j6556J1396R1438p2342o507k3669o905k1653J30833
4210G45228l1446N6379p2110j9198J0759J10969n2467m4261j27828o8183J00394
4199F08236J03605M5l4110l5756m6364M0624N0649M6481O226k565J13194l0085
4187H20180k3816Q4644m4821O2777k3356K3369L5386N9974k1232L6570M8762J22722
4175A181159L2124p6108N542J51072k3048L0810p3654j9095o3260k9979q0160
4164A035403J6374J6366r8951N9164J15478l3198r9851K0064n3138J27820M611
4153A110142J06990m6235J6407N5741L1966M0301r2679m4629O0668o4387Q3945
4142A258230L4413M8530k6854K7592P8714p5042L2410J06715J04372j9159J28766
$$ y = [604747, 659290, 676119, 659193, 642637, 654033, 745471, 673129, 666622, 642953, 636048, 614395, 745228, 713782, 770161, 698051, 678853, 689612, 800581, 748114, 703853, 576025, 507842, 608236, 711841, 711886, 677776, 642020, 595656, 636280, 686929, 733410, 739636, 737071, 850265, 820180, 796364, 881008, 836187, 898964, 875608, 898977, 934363, 994337, 973105, 1009675, 1058437, 1181159, 1213283, 1137175, 1142717, 1293789, 1270741, 1301551, 1227897, 1208802, 1145542, 1115563, 1035403, 1051777, 1068143, 969192, 1028356, 1143834, 1110636, 1010785, 1030849, 977711, 1105531, 1110142, 1217132, 1170897, 1187304, 1243045, 1275011, 1315312, 1222633, 1178004, 1238672, 1174285, 1258230, 1292643, 1341173, 1314319, 1341911, 1420625, 1345583, 1377993, 1484708, 1589080, 1569921, 1698687]
4131A698687m3450l4106R5140O0481M0130N5944n1968N9911J23491N817Q2998
4120B093075P5985n280k7957Q6783J87672J14376R0275r879J52293R6001R9943
4109B953287J0407J81656J34225K1631Q9793K22486J78967K11876J68981J94587
4099D367896J85837J84781K29062K58124K47415R0853M30078N34926O19384N41207
4089G689563N78883L67275N5716k00027l70445m46572l88605k28201j76722l3197
4079F847668r7081K7708K1771n2011M1430k052n0091R5856N8228J17916M5971
4068G055313p6243j07143J60j04088m9242l6137o0938o8559J5213j7653j53909
4057F396774L5661l2099o9307k2169M086n3387j44094n3807q2884k51039j57613
$$ y = [1698687, 1655237, 1621131, 1716271, 1776752, 1816882, 1872826, 1820858, 1880769, 2004260, 2010077, 2093075, 2169060, 2163780, 2135823, 2222606, 2410278, 2524654, 2614929, 2605050, 2757343, 2853344, 2953287, 2963694, 3145350, 3279575, 3301206, 3390999, 3613485, 3792452, 4004328, 4173309, 4367896, 4553733, 4738514, 4967576, 5225700, 5473115, 5563968, 5994046, 6528972, 7148356, 7689563, 8268446, 8635721, 8691437, 8491410, 8120965, 7674393, 7285788, 7057587, 6880865, 6847668, 6750587, 6778295, 6800066, 6748055, 6789485, 6787433, 6737342, 6833198, 6891426, 7009342, 7055313, 6979070, 6871927, 6872087, 6767999, 6718757, 6682620, 6621682, 6553123, 6568336, 6550683, 6396774, 6432435, 6400336, 6331029, 6308860, 6312946, 6259559, 6115465, 6061658, 5978774, 5727735, 5570122]
4046E570122r9083o8236j52990j94066j02640l7762j26299j86449l8259L7621
4036D601959j03315j43589p4892N1159p6950j20844r4259o1013j6724K1817j47051
4025C836298J2647n7769O5007K9389P741J21501P5926Q8250J55620J30213K28869
4014D693692K30673L72834M52317N57165M42374L29127R6520k65366m45770n63585
4004E899981m14707m61988l84200q3568j85168j03131l2361P9424K91113K59906
3994D865301K74899M41368N43133M08321Q7721q5060l14725m16174j86963k05080
3984E412741M0500K13688L22895M28558K10990l45091n74489o30054o70270n60454
3974C849014k23862k55001j82546k37264k02357j13005k9186r8004n4700l6807
$$ y = [5570122, 5471039, 5402803, 5249813, 5055747, 4953107, 4915345, 4789046, 4602597, 4564338, 4601959, 4498644, 4355055, 4280163, 4331322, 4254372, 4133528, 4039269, 3978256, 3961532, 3983349, 3836298, 3848945, 3791176, 3856183, 3885572, 3893313, 4014814, 4090740, 4178990, 4334610, 4464823, 4693692, 4924365, 5297199, 5749516, 6306681, 6749055, 7078182, 7174702, 6909336, 6463566, 5899981, 5485274, 5023286, 4639086, 4555518, 4370350, 4267219, 4234858, 4314282, 4605395, 4865301, 5140200, 5581568, 6124701, 6533022, 6620743, 6535683, 6220958, 5804784, 5617821, 5412741, 5453241, 5666929, 5989824, 6418382, 6629372, 6284281, 5709792, 5079738, 4409468, 3849014, 3625152, 3370151, 3187605, 2950341, 2747984, 2634979, 2605793, 2507789, 2453089, 2416282]
3964B416282j5285k20279j66467L1707n0504K6498O4468J00148m8176o0968M3659
3953B121083J1577M8833J06749J31284J73411J50341K52506K98654K21348J93497
3943C709283J06660N3927o8276l4392r785p8785j98278k62107j97638k73629j97332
3932B549648l04979j49548j13299j69073j63730o2019o4567n1539j3159j58463
3922A299272J0505p2144j0892n1690o774J05565J7283m9996o9341j932m4171m102
3910A121583p7560r8093m5699M1855L9184J42668j6498o8662q0902k2072k6641
3899I09163k4325O4695J12923k6298k7660p2273j32225J48048Q959L21M469j1761
3887I54036r2601L6151J7063P9525m4419K6285O5587M8630l5120j02622L6131
$$ y = [2416282, 2400997, 2180718, 2014251, 2045958, 1995454, 2021952, 2086420, 2186568, 2138392, 2077424, 2121083, 2132660, 2181493, 2288242, 2419526, 2592937, 2743278, 2995784, 3294438, 3515786, 3709283, 3815943, 3869870, 3801594, 3767202, 3757417, 3678632, 3480354, 3218247, 3020609, 2746980, 2549648, 2244669, 2095121, 1981822, 1812749, 1649019, 1587000, 1522433, 1470894, 1457735, 1299272, 1309777, 1237633, 1226741, 1175051, 1168277, 1273842, 1291125, 1241129, 1171788, 1169856, 1125685, 1121583, 1044023, 945930, 900231, 942086, 981270, 1123938, 1107440, 1038778, 957876, 935804, 909163, 884838, 949533, 1062456, 1036158, 1008498, 936225, 804000, 952048, 961007, 961328, 965797, 954036, 861435, 897586, 914649, 994174, 949755, 976040, 1041627, 1090257, 1055137, 952515, 988646]
3876I88646L6382O4550K4824j01172O3752L7104k5071J8129L7751n5143p9018
3865A010734O3168L1706R9428L0571j33935k0193L6547L1077N9460m0832J4847
3854A182578m9049L0250j7390j7954j8480J4792R4775r301P0194Q8185M7698k0836
3842A395462j2231J09785j2790o6506j2971K1484J02372k6872j8261k2080L0712
3831A488104J4380N8891J23916J5352O8790N4766J21724R7320J17743J87051J73603
3820B521640l3572j14116j61380j23122j13743j24646l7587k2027o0689j0043
3810A720715O8019J5912k7224J0091p4775r428N5628L4853M0864P844n6247Q1554
3798A867806O6491J5581N5718k9826j7407N4829j8384J04764J6221J0350J11955
$$ y = [988646, 1025028, 1089578, 1114402, 1013230, 1076982, 1114086, 1089015, 1107144, 1144895, 1089752, 1010734, 1073902, 1105608, 1205036, 1235607, 1101672, 1081479, 1118026, 1149103, 1208563, 1167731, 1182578, 1133529, 1163779, 1146389, 1128435, 1109955, 1124747, 1219522, 1210221, 1280415, 1368600, 1416298, 1395462, 1383231, 1493016, 1480226, 1413720, 1400749, 1422233, 1524605, 1497733, 1479472, 1457392, 1488104, 1502484, 1561375, 1685291, 1700643, 1769433, 1824199, 1945923, 2043243, 2160986, 2348037, 2521640, 2488068, 2373952, 2212572, 2089450, 1975707, 1851061, 1813474, 1791447, 1730758, 1720715, 1788734, 1804646, 1777422, 1787513, 1712738, 1703310, 1758938, 1793791, 1834655, 1842499, 1786252, 1867806, 1934297, 1949878, 2005596, 1975770, 1958363, 2013192, 1994808, 2099572, 2115793, 2126143, 2238098]
3787B238098j1356N085Q7383K7105L4669J50864J76164l7459Q3171k9132P5299
3776B799891J45632P8295J10689M4677P7435K02572L75763K60425L43132K12681
3766D651192K29365J32737K19080O3716j33611j5990n0105j60989o9477k79992
3756D585926l04225p9435k67252q9998K4646r9882J2684n6383o9803O8286L4466
3745C759030k723l4601q761M784Q9967N6718O1660J0203J7030Q6023N5896O3317
3733D158543J4910N267o586Q4731M6821N4927O5505J1982K8763L8394Q5257Q2715
3721D671229P2751L4788P9459J7858K7693R4893J21975J56750M7521J82459J3823
3710E521199N7189P9599O2907J04202J25849M4807J23805K41164N0493J18706
$$ y = [2238098, 2226742, 2231827, 2319210, 2346315, 2380984, 2531848, 2708012, 2670553, 2753724, 2724592, 2799891, 2945523, 3023818, 3134507, 3179184, 3256619, 3459191, 3834954, 4095379, 4438511, 4651192, 4880557, 5013294, 5232374, 5296090, 5162479, 5146489, 5096384, 4935395, 4865918, 4585926, 4281701, 4202266, 3935014, 3845016, 3869662, 3769780, 3782464, 3726081, 3656278, 3724564, 3759030, 3756307, 3721706, 3712945, 3717729, 3807696, 3864414, 3926074, 3936277, 3953307, 4039330, 4095226, 4158543, 4173453, 4178720, 4172134, 4256865, 4303686, 4358613, 4424118, 4436100, 4464863, 4503257, 4588514, 4671229, 4743980, 4778768, 4858227, 4876085, 4903778, 4998671, 5120646, 5277396, 5324917, 5507376, 5521199, 5578388, 5657987, 5720894, 5825096, 5950945, 5995752, 6119557, 6360721, 6411214, 6529920]
3700F529920J60778J31447J34761R0996J95789J80256O4394N6823K24315J67572
3690G937051N3425Q8793M4801J30615N3307J41108P6237p1755Q5586M1875M0197
3679H621240J4885J34226j1757o3185m3518L8807K9696O21M3766j33620k9113
3668H602048m994o681j79264j6063r1094j79294n3132q6337p2684j12497r6897
3657G703111j10593j54223k903j24075o0495o4099p5140l6709k44808j30850j208
3646F698008l6056k46343j74463j9338j10279P396m4694j66676r1478L1236r3544
3635E753769j17053j39852j47201K7751j20818n6996l1057L482j0660R477j29828
3624E041014k7035K237j60780p5161J42088K0107o9398N4964l6956j14888J1727
$$ y = [6529920, 6690698, 6822145, 6956906, 7047902, 7243691, 7423947, 7488341, 7545164, 7769479, 7937051, 7990476, 8079269, 8124070, 8254685, 8307992, 8449100, 8525337, 8453582, 8539168, 8581043, 8621240, 8636125, 8770351, 8758594, 8695409, 8651891, 8690698, 8720394, 8721015, 8764781, 8631161, 8602048, 8597054, 8590373, 8411109, 8395046, 8303952, 8124658, 8071526, 7985189, 7912505, 7800008, 7703111, 7592518, 7438295, 7435392, 7311317, 7250822, 7186723, 7111583, 7074874, 6830066, 6699216, 6698008, 6661952, 6415609, 6241146, 6221808, 6111529, 6118925, 6074231, 5907555, 5816077, 5847313, 5753769, 5636716, 5496864, 5349663, 5377414, 5256596, 5199600, 5168543, 5172025, 5161365, 5170842, 5041014, 5013979, 5016216, 4855436, 4780275, 4922363, 4942470, 4873072, 4928036, 4891080, 4776192, 4787919]
3613D787919k5455J05302N1320N0493M7629n8712L883k4030P1803j1970J0409
3602E008591O9603J13856p9652j4164J48046J39213p5011J4120M5781J95010J02883
3591E668276m4324K1512N9361R4296Q2048Q3512Q6577L2925J10706J27764R9537
3580F422190N8675K6830J24374J79291J82050R4290J05649r065K5699q6162o2514
3569G061307Q4521K6542R317K4379m8059r1241J05038Q5642J13800J23233K2828
3558G517307n8908P4416P4030R7554K6608Q1086N6575R2510M6925L7764J62211
3547H208078J83517J53497J37107P4579Q1046R4947J19022K08246J50061N5795
3537I465895J85250L10026J37714J84288J50259J88809K24162K68695J57953K43273
$$ y = [4787919, 4762464, 4867766, 4919086, 4969579, 5017208, 4958496, 4962379, 4938349, 5010152, 4998182, 5008591, 5078194, 5192050, 5112398, 5098234, 5246280, 5385493, 5310482, 5324602, 5370383, 5565393, 5668276, 5623952, 5645464, 5704825, 5799121, 5881169, 5964681, 6051258, 6084183, 6194889, 6322653, 6422190, 6480865, 6507695, 6632069, 6811360, 6993410, 7087700, 7193349, 7184284, 7209983, 7123821, 7061307, 7145828, 7172370, 7181687, 7206066, 7158007, 7066766, 7171804, 7257446, 7371246, 7494479, 7517307, 7458399, 7532815, 7606845, 7704399, 7731007, 7812093, 7868668, 7961178, 8008103, 8045867, 8208078, 8391595, 8545092, 8682199, 8756778, 8837824, 8932771, 9051793, 9260039, 9410100, 9465895, 9651145, 9961171, 10098885, 10283173, 10433432, 10622241, 10846403, 11115098, 11273051, 11516324]
3527A1516324J37272J74360K58777L03797J80999J08504J84212J39806K55402
3518A3259453K52371J48233J94536O4350M0063J97689J58303K4025J50851J68031
3508A4657905J37830O5747Q7666K21351O0498J25295P8690P282R9313m6261l9874
3497A5455442j1936m0085j24703o4588q3345r6502j34822k06718j58833j68478
3487A4365432j58120j81057k00932k31486k03477k10336k01661j09543j88716
3478A2680104k11177j75160k35302k18172k87052j89373j00922k60318k08879
3469A0793749k50494k02508j26481k47802j65919j94764j03351j32164j75797
3460I194469k47069k49988j22449n0347j53845j39737j38656l04491j04218j2390
$$ y = [11516324, 11653596, 11827956, 12086733, 12390530, 12571529, 12680033, 12864245, 13004051, 13259453, 13511824, 13660057, 13854593, 13918943, 13959006, 14156695, 14314998, 14339023, 14489874, 14657905, 14795735, 14861482, 14949148, 15170499, 15230997, 15356292, 15434982, 15442264, 15541577, 15495316, 15455442, 15443506, 15403421, 15278718, 15214130, 15130785, 15034283, 14899461, 14692743, 14533910, 14365432, 14207312, 14026255, 13825323, 13593837, 13390360, 13180024, 12978363, 12868820, 12680104, 12468927, 12293767, 12058465, 11840293, 11553241, 11363868, 11262946, 11002628, 10793749, 10543255, 10340747, 10214266, 9966464, 9800545, 9605781, 9502430, 9370266, 9194469, 8947400, 8697412, 8574963, 8524616, 8370771, 8231034, 8092378, 7787887, 7683669, 7671279]
3450G671279k06216j84643k2565j19670j19129j58028o3733q1435k44391j08991
3440F362478Q727o1368j52670p7884q944L1319p7289j63746q6764l7242n7738
3429E678879j79729o022j1316m8335m7051m7218j21812j38358O4493r2105n6296
3418D995130K7573K0923o7514J327o3944j01456j3948j8996j47765m1348N3900
3407D643882p1220J8401M3477j08451q3090o2822L7475l8514j15191n5481p1992
3396D136474o1955K1731O5256q3743K6817m3534m5186k4607l6539j13127r303
3385C832284M7972n7688n2650M5721K1221o738J055m6635l0083j1245j9603q1934
3373C641677N4806M531J0746o0522O6956Q6328J2076K5011j10061p6441M5451
$$ y = [7671279, 7465063, 7280420, 7257855, 7138185, 7019056, 6861028, 6797295, 6715860, 6471469, 6362478, 6371205, 6309837, 6157167, 6079283, 6070339, 6101658, 6024369, 5860623, 5773859, 5736617, 5678879, 5499150, 5493128, 5481812, 5433477, 5386426, 5339208, 5217396, 5079038, 5143531, 5051426, 4995130, 5022703, 5043626, 4976112, 4977439, 4913495, 4812039, 4798091, 4779095, 4631330, 4589982, 4643882, 4572662, 4591063, 4634540, 4526089, 4442999, 4380177, 4417652, 4379138, 4263947, 4208466, 4136474, 4074519, 4096250, 4161506, 4077763, 4104580, 4061046, 4015860, 3991253, 3954714, 3841587, 3832284, 3880256, 3822568, 3769918, 3815639, 3836860, 3830122, 3831177, 3784542, 3754459, 3743214, 3723611, 3641677, 3696483, 3701014, 3711760, 3651238, 3718194, 3804522, 3816598, 3841609, 3731548, 3655107, 3700558]
3362C700558J33207O7343m393p8408K2166J17960L4874O1585K7514O4173N9045
3351D205624Q3436l8105n344K7904O1880J16779Q9201j0574M5658L377n4298K2848
3339D548386O9631J15333R7524R3199J07090Q3827k6260J51597K12784O5073R6594
3328E614778O7758J4728Q8198J10345J35141J20827J21394R8457J35623J96392
3318F703641J79634J88669J27203J71172K92721J36175J78753J88275J86240K75760
3308H628243K73530K96849K90347K97597K63630K48929M44483L93195M04853L30380
3298A1872036M86212M28649L96393M49067O40798N58147M68376N51330N61346
3289A6412354N68458N44383O19519O00732N75108O06053P03291N83126N63905
$$ y = [3700558, 3833765, 3901108, 3896715, 3818307, 3840473, 3958433, 3993307, 4054892, 4082406, 4146579, 4205624, 4289060, 4250955, 4245611, 4273515, 4335395, 4452174, 4541375, 4530801, 4576459, 4579836, 4525538, 4548386, 4618017, 4733350, 4830874, 4924073, 5031163, 5114990, 5088730, 5240327, 5453111, 5518184, 5614778, 5682536, 5697264, 5785462, 5895807, 6030948, 6151775, 6273169, 6371626, 6507249, 6703641, 6883275, 7071944, 7199147, 7370319, 7663040, 7799215, 7977968, 8166243, 8352483, 8628243, 8901773, 9198622, 9488969, 9786566, 10050196, 10299125, 10743608, 11136803, 11541656, 11872036, 12358248, 12786897, 13183290, 13632357, 14273155, 14831302, 15299678, 15851008, 16412354, 16980812, 17525195, 18144714, 18745446, 19320554, 19926607, 20629898, 21213024, 21776929]
3280B1776929M03847M10105N01808L77867K96492K91746L15410J47744J15920
3271B4637868R0513r10J4192r2162k36270k09299j56270k40805l44447l77245
3261B3085165m88508m79556l74530m81497m47663n06947n28239o32513m94176
3252A8651536m67048n77322n60716l30270l70629m92002m78120m46213m20216
3243A4509000m77717l51355l11809l49727l77309l07095k83553k65878k32926
3234A1551631k20897l37302j54536j15568j66426j46849j49039o8902m9191r9996
3224A0042925j13632K9014L2833j0779M187R1306Q9309J27804K49048J34487J09950
3213A0786452K74874L40996M65542M95814M30303N16430P11449O93470N63978
$$ y = [21776929, 22180776, 22590881, 23092689, 23470556, 23767048, 24058794, 24374204, 24521948, 24637868, 24728381, 24727471, 24741663, 24649501, 24413231, 24203932, 24047662, 23806857, 23462410, 23085165, 22596657, 22117101, 21742571, 21261074, 20813411, 20306464, 19778225, 19145712, 18651536, 18184488, 17607166, 17046450, 16716180, 16345551, 15853549, 15375429, 14929216, 14509000, 14031283, 13679928, 13368119, 13018392, 12641083, 12333988, 12050435, 11784557, 11551631, 11330734, 10993432, 10838896, 10723328, 10556902, 10410053, 10261014, 10192112, 10142921, 10042925, 9929293, 9958307, 9991140, 9980361, 9984548, 10075854, 10165163, 10292967, 10542015, 10676502, 10786452, 11061326, 11402322, 11867864, 12363678, 12793981, 13310411, 14021860, 14715330, 15279308]
3204A5279308L91174N8102k90841m69916o33531p41107q00863p46251o75905m40838
3194A0929332m56435m43231m25159l45637j54653l46577j84604k33642j54984
3185H184410j16974j94524j43549j66190j02007p7024j30011p3215l6505j73145
3175F971266k8885j8771P6743n0775j13353l88Q567j3978M4019l9526N8249R4813
3163F987981M9230J54941o5556l2882J78036Q0799J49526J01916J71232J01509
3153G876732J76239J98487R6088K84584J78976J60243J16861L23896K06994K15711
3143I834811K06643L13619L43782L47414L13787K60835K16958K54927L74617L18122
3133A2785515M41690L76290K25429L15186L91418N39867N34253O55706O69321
$$ y = [15279308, 15670482, 15728584, 15437743, 14967827, 14334296, 13593189, 12792326, 12046075, 11370170, 10929332, 10472897, 10029666, 9604507, 9258870, 9104217, 8757640, 8573036, 8339394, 8184410, 8067436, 7872912, 7729363, 7563173, 7461166, 7384142, 7254131, 7180916, 7144411, 6971266, 6942381, 6923610, 7000353, 6949578, 6836225, 6835837, 6844404, 6830426, 6874445, 6834919, 6893168, 6987981, 7037211, 7192152, 7126596, 7093714, 7271750, 7352549, 7502075, 7603991, 7775223, 7876732, 8052971, 8251458, 8347546, 8632130, 8811106, 8971349, 9088210, 9412106, 9619100, 9834811, 10041454, 10355073, 10698855, 11046269, 11360056, 11620891, 11837849, 12092776, 12467393, 12785515, 13227205, 13603495, 13828924, 14144110, 14535528, 15075395, 15609648, 16265354, 16934675]
3124A6934675O86154Q33631J009309R98411O28174O0209p08168j201471j350684
3115A7890240j243477r60911p92934p39805n43803m31254m66580n19918m03482
3106A1788076m14684l78931l34804m48709k60947k93345l46808k96458k77805
3097H735585l17196k56239l17143k09530k17186l47359q7617j22489j91837k39876
3087F429113q2663k03002k89550p6521j15893j55351j49290j37278o9342j10777
3077E039446j11115j26757j11529j10690k5354l0206q6235j35380j23975N2158
3067D230363j0098o3376j02304j1419q730m2688Q500r7915k0515j36715o3929
3056C681174j0288P491P3220j18777k6676K990m5534o8120j09821n2668m2266
$$ y = [16934675, 17620829, 18454460, 19463769, 20462180, 21090354, 21150563, 20442395, 19240924, 17890240, 16646763, 15685852, 14892918, 14153113, 13609310, 13178056, 12711476, 12191558, 11788076, 11373392, 10994461, 10659657, 10210948, 9950001, 9656656, 9309848, 9013390, 8735585, 8418389, 8162150, 7845007, 7635477, 7418291, 7070932, 6983315, 6860826, 6668989, 6429113, 6346450, 6143448, 5853898, 5777377, 5661484, 5506133, 5356843, 5219565, 5150223, 5039446, 4928331, 4801574, 4690045, 4579355, 4554001, 4523795, 4437560, 4302180, 4178205, 4230363, 4220265, 4156889, 4054585, 4043166, 4034436, 3991748, 4000248, 3902333, 3881818, 3745103, 3681174, 3670886, 3678377, 3751597, 3632820, 3606144, 3609134, 3563600, 3495480, 3385659, 3332991, 3290725]
3045C290725j04597r9983j6874j338m2299n3523o5397L4521q4224o8281l2752
3034B755978j7074N4242l7967j09934j8314O1730m5029j00941m6309r571L2007
3023B518818j992j84628J40440m6623p9404l1422r132k0178J23720L74o9277q842
3011B331854m8996o147J12024j3148j0543L141m0812R9621q2434o2294J12553
3000B394819Q9131j57j47425j67O7306m9757P9298n1832K5312q3803n810L5359
2988B352274q346M2930L1683O6802J81536O2406Q651k2275l5685K9205J025M5898
2976B756104J8731k8539J5340N4579J51130j70430J14839J14904P8460l0744k4092
2965C050282P9382L9429Q6916j0904R7946m6700R1874M1952p3642J50532N7449
$$ y = [3290725, 3186128, 3086145, 3069271, 3067933, 3025634, 2972111, 2906714, 2941235, 2857011, 2788730, 2755978, 2738904, 2793146, 2755179, 2645245, 2626931, 2688661, 2643632, 2542691, 2496382, 2486811, 2518818, 2516826, 2332198, 2472638, 2426015, 2346611, 2315189, 2306057, 2285879, 2409599, 2409973, 2340696, 2331854, 2282858, 2276711, 2388735, 2375587, 2365044, 2368185, 2327373, 2426994, 2344560, 2282266, 2394819, 2483950, 2483793, 2336368, 2336201, 2403507, 2353750, 2433048, 2381216, 2406528, 2322725, 2316915, 2352274, 2343928, 2386858, 2418541, 2485343, 2666879, 2729285, 2737936, 2715661, 2679976, 2709181, 2710206, 2756104, 2774835, 2746296, 2761636, 2816215, 2967345, 2796915, 2911754, 3026658, 3105118, 3074374, 3050282, 3129664, 3169093, 3256009, 3245105, 3343051, 3296351, 3388225, 3430177, 3356535, 3507067, 3564516]
2954C564516L9782P4051P2663R5097K7567K7630J52313N9714o8411J57309N5048
2943D257279Q3689J39594J523N5891J94004k2848M1912J10807J44931Q6037O5644
2932E158463J01398J10026J54151J63958J20242N6633K34615K67024J71792J59673
2922F697975K04249J59205K96205K03807O3915K34232L19780L02977L38936K17510
2912I038791K93715L04686L89399K81006M28076L49164L63070M38729M81301M29117
2902A2797054M12472N74994O14862N83003N11113O65514P25467O67384Q79055
2893A8430918R26258Q86073J047424J098134J173097J221081J518258J513810
2885B7815053J445138J591067J799555J793293K012925J944599J918211J958626
$$ y = [3564516, 3604298, 3678349, 3751012, 3846109, 3873676, 3901306, 4053619, 4113333, 4044922, 4202231, 4257279, 4340968, 4480562, 4482085, 4537976, 4731980, 4709132, 4751044, 4861851, 5006782, 5092819, 5158463, 5259861, 5369887, 5524038, 5687996, 5808238, 5864871, 6099486, 6366510, 6538302, 6697975, 6902224, 7061429, 7357634, 7561441, 7625356, 7859588, 8179368, 8482345, 8821281, 9038791, 9332506, 9637192, 10026591, 10307597, 10735673, 11084837, 11447907, 11886636, 12367937, 12797054, 13209526, 13784520, 14399382, 14982385, 15493498, 16159012, 16884479, 17551863, 18430918, 19357176, 20243249, 21290673, 22388807, 23561904, 24782985, 26301243, 27815053, 29260191, 30851258, 32650813, 34444106, 36457031, 38401630, 40319841, 42278467]
2877D2278467J798153J479643J323716R46787M34136J08434j73574n06038q35221
2868D6854503j133251j279742j237727j372002j400953j453993j461581j463247
2860C6052007j478717j391651j548773j397550j381502j279041j174707j183655
2852B5216411j157473j038665j054761j019320j009951q36893q22242p56300o27247
2843A6893559o78232n96641n25054o40424n18057l30800m92460m68626m41745
2834A2201520m75436m61295m30421l30931l60346l32314k49049l65375l60074
2825H836279k76495k34752k39044l30567k41387k36334l21241j96686j88783k12326
2815F358664k01762p5536j44779j25189j86202j61937j24820j88498j69166j06920
$$ y = [42278467, 44076620, 45556263, 46879979, 47826766, 48260902, 48369336, 48195762, 47689724, 46854503, 45721252, 44441510, 43203783, 41831781, 40430828, 38976835, 37515254, 36052007, 34573290, 33181639, 31632866, 30235316, 28853814, 27574773, 26400066, 25216411, 24058938, 23020273, 21965512, 20946192, 19936241, 19099348, 18277106, 17520806, 16893559, 16215327, 15618686, 15093632, 14453208, 13935151, 13604351, 13111891, 12643265, 12201520, 11726084, 11264789, 10834368, 10503437, 10143091, 9810777, 9561728, 9196353, 8836279, 8559784, 8325032, 8085988, 7755421, 7514034, 7277700, 6956459, 6759773, 6570990, 6358664, 6156902, 6081366, 5936587, 5811398, 5625196, 5463259, 5338439, 5149941, 4980775, 4873855]
2805D873855j49431q3253j09753j18994k5436j51030j78761r6248j19213m6934
2795C794802m2616j72932j21875k4643j894j51335k7227L2412j09899j56069q7215
2784B931509Q0197r6978q5739m2682M8949j15110N889n8267j29028n6883M2696
2773B524553o0125p7512l7001j06583k2741j831p5158r3691n7792J10514m9278
2762B053355q5245J9673o5440q4431n8679L4800p5842o8440l1195m5133k0545
2751A572878Q343k1816k5080M3021k3652j24964m5654m6328q741n81J3355n182
2739A335599l4469q183P2118J1142q1594O210n5356l2961O8804N315q0652r4843
2727A111130k2333K6988L7142o6017k4333m1705k5045J10725n9540j2325q1421
$$ y = [4873855, 4724424, 4641171, 4531418, 4412424, 4386988, 4235958, 4057197, 3960949, 3841736, 3794802, 3752186, 3579254, 3457379, 3432736, 3430842, 3279507, 3252280, 3284692, 3174793, 3018724, 2931509, 3011706, 2914728, 2828989, 2786307, 2835256, 2720146, 2726035, 2667768, 2538740, 2481857, 2524553, 2464428, 2386916, 2349915, 2243332, 2220591, 2218760, 2143602, 2049911, 1992119, 2102633, 2053355, 1968110, 1987783, 1922343, 1837912, 1779233, 1814033, 1738191, 1669751, 1638556, 1593423, 1572878, 1581221, 1559405, 1534325, 1577346, 1553694, 1428730, 1383076, 1336748, 1328007, 1327426, 1340781, 1335599, 1301130, 1292947, 1365065, 1376207, 1294613, 1300823, 1245467, 1212506, 1281310, 1286625, 1205973, 1111130, 1088797, 1115785, 1152927, 1086910, 1062577, 1020872, 995827, 1106552, 1047012, 1034687, 953266]
2716I53266n7227J08176M607j9316r2706K549N0843n8536m1016P8984j05814n2898
2704G70912O1515l6583m1467o3193O0303O7877N200J2691m8808N0479j1676p7442
2692G49808k3505M7499M7506L3826m6639l8106n5952N2197l1468m105K5269P6042
2680H32372J2722j42880o0330O4743N260R186R8802r1710q4121Q9705L9289J654
2668G74692j17669o3481K5911q0321j4462j9162k927j7557r1602k7549J03343
2657D69216K9188J2634p9772M2131N224N2631k8128j39889J4578r338J7277N5272
2645D41024k4762j7031j4458l8789N8135k5361r175L975j7230J0711O1537l4291
2633C94285P8071l7891K3626j23169q367J13677M6657j32161Q06J19523j3820
$$ y = [953266, 896039, 1004215, 1008822, 989506, 896800, 899349, 950192, 891656, 850640, 929624, 823810, 770912, 832427, 795844, 754377, 691184, 751487, 819364, 824564, 837255, 788447, 838926, 827250, 749808, 726303, 773802, 821308, 855134, 808495, 770389, 714437, 766634, 735166, 731061, 756330, 832372, 845094, 702214, 641884, 706627, 711887, 721073, 819875, 728165, 644044, 733749, 773038, 774692, 657023, 593542, 619453, 539132, 524670, 505508, 502581, 485024, 393422, 365873, 469216, 498404, 511038, 431266, 473397, 478621, 531252, 503124, 363235, 377813, 368475, 385752, 441024, 416262, 399231, 384773, 345984, 404119, 378758, 369583, 373558, 356328, 367039, 428576, 394285, 472356, 434465, 458091, 334922, 326555, 440232, 486889, 354728, 355534, 475057, 461237]
2622D61237n4958k5486R512K0798l8790n6957J26550p854J7257m7680R315R0405
2610E03349k1627n8501p8836N0099M5557j03941R4755J1067p5025O4262L6121
2599D67280p192L2641j01496O6717K8493M085M9190p1497m5782M1122j1262n4773
2587C97526j810Q0413k5144J26404l4608m7210q4085J4045K9112m8850o4012Q621
2575C50402K1263k1839k5226M9893p2437N1347q0357q886M085r9038Q644M6425
2563B24276R0562q6361J2900O2589r5885j7741L7899k3715O0033j6982j2095M8351
2551B83831k8032j35699J6048L1796p4079J6750R5884Q848J1727l4677L723m6617
2539A49503M1624m8811n818M8120l9535l7154m0885Q1398N4819q6535k222j2900
$$ y = [461237, 406279, 380793, 390305, 411103, 372313, 315356, 441906, 434052, 451309, 403629, 412944, 503349, 481722, 423221, 344385, 394484, 440041, 336100, 430855, 441922, 366897, 431159, 467280, 460088, 492729, 391233, 457950, 486443, 490528, 539718, 468221, 422439, 463561, 452299, 397526, 395716, 476129, 450985, 577389, 542781, 495571, 411486, 425531, 454643, 405793, 341781, 350402, 371665, 349826, 324600, 374493, 302056, 353403, 273046, 264160, 268245, 169207, 177851, 224276, 314838, 228477, 241377, 303966, 208081, 190340, 228239, 204524, 264557, 247575, 235480, 283831, 255799, 120100, 136148, 167944, 93865, 110615, 206499, 215347, 227074, 192397, 196120, 149503, 191127, 142316, 136498, 184618, 145083, 107929, 67044, 148442, 203261, 116726, 114504, 101604]
2527A01604K4742L1113J9156l8537j31844K2675J19534q107P804j2927K8666l4133
2515A29746L1051n0073m1884K4085J2579r301K7185R9353m8397j8779O1661K1915
2503B39141l7585q8900n6313M6188K9224n515N3434j2597k8780n9724L8331k2560
2491I4344N0002p445k0511L9269M1051j01676N2327O1275j26704P1155M7372L330
2479B03789j1459p0916n8381N7783k6768J1904n764M3780N717q7287n237r4681
2467c7520M75Q2003J03054k2839l4191m2826N1468O0305k9573N199l6460j6178
2455H2917l0151k6505M7715l9359o6715N3059J12950N961r4724K669L8318M5302
2443A31437q7671Q680k6451P9380p0110j886N7123M1889o2468P2881J19681p1546
$$ y = [101604, 126346, 157459, 176615, 138078, 6234, 28909, 148443, 140336, 148140, 135213, 163879, 129746, 160797, 110724, 68840, 92925, 105504, 96203, 123388, 222741, 174344, 155565, 217226, 239141, 201556, 112656, 56343, 102531, 131755, 126240, 179674, 167077, 138297, 78573, 116904, 94344, 144346, 136901, 116390, 155659, 196710, 95034, 147361, 208636, 81932, 153087, 200459, 203789, 192330, 121414, 63033, 120816, 94048, 105952, 100188, 143968, 149685, 62398, 57161, -37520, -37045, 44958, 148012, 125173, 90982, 48156, 99624, 159929, 130356, 135555, 99095, 82917, 52766, 26261, 73976, 34617, -32098, 20961, 133911, 139872, 45148, 47817, 86135, 131437, 43766, 52446, 25995, 105375, 35265, 33379, 90502, 132391, 69923, 142804, 262485, 190939]
2431A90939j4096J2003j06340m5433N2540M0729j3770K4280j01662J8464j3488
2420D4166o6513m4692J14475J5581m8170O7219q8007K1359P5012l2695j044r604
2408D7087j5052R6410L0771n5228j32553R501J3814O6691j4147l0430J5882K7711
2396F0457L9825L3001n3807m292K3110j23714l5324L1937K878K8834M1279m9490
2384e306N0721J9813m5658M980M8841o494j37992J0557P4009J7395L28M7319K0232
2371I8745J32260j07338o7885o1786N0094l1998j4497N3090l0292J28029o6585
2360H1837n8880p3119n2620J34169N4532l9843p8650M9597K2925J12725k5223
2349A27450q6066k3180K005M0918P653n8262j06174Q5719K9744J2161R436N8019
$$ y = [190939, 176843, 188846, 82506, 37073, 89613, 130342, 116572, 140852, 39190, 57654, 44166, -22347, -67039, 47436, 63017, 14847, 82066, -5941, 15418, 90430, 57735, 56691, 47087, 32035, 128445, 159216, 103988, -28565, -19064, -5250, 61441, 47294, 16864, 32746, 60457, 100282, 133283, 79476, 75184, 98294, -25420, -60744, -28807, -25929, 2905, 44184, -5306, 45415, 65228, 19570, 24550, 73391, 66897, -71095, -60538, 13471, 30866, 31194, 78513, 98745, 231005, 123667, 55782, -6004, 44090, 12092, -2405, 50685, 20393, 148422, 81837, 22957, -50162, -102782, 31387, 85919, 46076, -32574, 17023, 39948, 152673, 127450, 41384, 18204, 20209, 61127, 68780, 10518, -95656, -9937, 19807, 31968, 41404, 99423]
2337I9423J387K3959n3912J1809j5727m2134k2559q7392k1337Q9194N1383l4803
2325g09l7606p432P6816L9835m3758n8070m2198M4829J3026p2425M7900N2484
2313A2692p6116L9096J06654k1044o5423o7756J28246Q5093j9851j45908j09180
2302a33497P0706J14247k8235p2945J16464n0397L8433K893o985n7990j31343
2291a38649J06698J21160r0517j6983N4426L4387o3770l170O6665l0111m4821
2280d685j2740j2826l1415J16940M9601J00500j66991j01638Q7120n2087k6212
2269e4433M7367M0412L7562J817j25355M1141P9346l4550p8192K0606M9760n3911
2257b8430N9154k874N5488n1302o2585N7854j03115R4720L2838M3887J0162K2045
$$ y = [99423, 100810, 124769, 70857, 82666, 66939, 24805, 2246, -85146, -106483, -17289, 34094, -709, -38315, -45747, 31069, 70904, 27146, -30924, -73122, -28293, -15267, -87692, -39792, 12692, -63424, -24328, 82326, 61282, -4141, -71897, 56349, 141442, 121591, -24317, -133497, -62791, 51456, 23221, -49724, 66740, 16343, 54776, 57669, 50684, -7306, -138649, -31951, 89209, -1308, -18291, 36135, 70522, 6752, 3582, 70247, 40136, -4685, -17425, -30251, -61666, 55274, 104875, 205375, 38384, -63254, 23866, -28221, -54433, -7066, 33346, 70908, 72725, -52630, -11489, 67857, 33307, -44885, -24279, 25481, -28430, 30724, 27850, 83338, 32036, -30549, 27305, -75810, 18910, 51748, 95635, 105797, 127842]
2245A27842q4965k4678j6803L9454J9213o8361l813P7477l1247k9800L179j9324
2233a1826m1640m2461Q7845q0529N3206P7301J9455p3263k0872q23K9195O90n3920
2220e7642k4059Q1831M2870p3901o4293J71319K2045p1915p887Q0041J9075k4455
2208I3029n8079q1340N9207J903k986r7050R139L7106L8892O21N1958Q550o4534
$$ y = [127842, 42877, 18199, 1396, 40850, 60063, -8298, -12111, 65366, 34119, 4319, 7498, -11826, -53466, -95927, -8082, -88611, -35405, 41896, 61351, -11912, -32784, -33607, -4412, -3722, -57642, -81701, 130, 43000, -30901, -95194, 76125, 98170, 26255, 18368, 98409, 117484, 93029, 34950, -46390, 12817, 14720, 11734, -85316, -76177, -39071, -179, 442, 52400, 60950, -3584]
$$ [...]
##END NTUPLES=NMR SPECTRUM
##END=
